lucene-dev mailing list archives

Site index · List index
Message view « Date » · « Thread »
Top « Date » · « Thread »
From Shalin Shekhar Mangar <shalinman...@gmail.com>
Subject Re: [JENKINS-EA] Lucene-Solr-5.x-Linux (64bit/jdk1.9.0-ea-b60) - Build # 13606 - Failure!
Date Wed, 12 Aug 2015 13:24:39 GMT
I'll dig.

On Wed, Aug 12, 2015 at 6:06 PM, Policeman Jenkins Server
<jenkins@thetaphi.de> wrote:
> Build: http://jenkins.thetaphi.de/job/Lucene-Solr-5.x-Linux/13606/
> Java: 64bit/jdk1.9.0-ea-b60 -XX:+UseCompressedOops -XX:+UseG1GC -Djava.locale.providers=JRE,SPI
>
> 1 tests failed.
> FAILED:  org.apache.solr.cloud.TestRandomRequestDistribution.testRequestTracking
>
> Error Message:
> Shard a1x2_shard1_replica2 received all 10 requests
>
> Stack Trace:
> java.lang.AssertionError: Shard a1x2_shard1_replica2 received all 10 requests
>         at __randomizedtesting.SeedInfo.seed([22A970802826A759:6A952940DC2DB6CF]:0)
>         at org.junit.Assert.fail(Assert.java:93)
>         at org.junit.Assert.assertTrue(Assert.java:43)
>         at org.apache.solr.cloud.TestRandomRequestDistribution.testRequestTracking(TestRandomRequestDistribution.java:109)
>         at sun.reflect.NativeMethodAccessorImpl.invoke0(Native Method)
>         at sun.reflect.NativeMethodAccessorImpl.invoke(NativeMethodAccessorImpl.java:62)
>         at sun.reflect.DelegatingMethodAccessorImpl.invoke(DelegatingMethodAccessorImpl.java:43)
>         at java.lang.reflect.Method.invoke(Method.java:502)
>         at com.carrotsearch.randomizedtesting.RandomizedRunner.invoke(RandomizedRunner.java:1627)
>         at com.carrotsearch.randomizedtesting.RandomizedRunner$6.evaluate(RandomizedRunner.java:836)
>         at com.carrotsearch.randomizedtesting.RandomizedRunner$7.evaluate(RandomizedRunner.java:872)
>         at com.carrotsearch.randomizedtesting.RandomizedRunner$8.evaluate(RandomizedRunner.java:886)
>         at org.apache.solr.BaseDistributedSearchTestCase$ShardsRepeatRule$ShardsFixedStatement.callStatement(BaseDistributedSearchTestCase.java:963)
>         at org.apache.solr.BaseDistributedSearchTestCase$ShardsRepeatRule$ShardsStatement.evaluate(BaseDistributedSearchTestCase.java:938)
>         at com.carrotsearch.randomizedtesting.rules.SystemPropertiesRestoreRule$1.evaluate(SystemPropertiesRestoreRule.java:57)
>         at org.apache.lucene.util.TestRuleSetupTeardownChained$1.evaluate(TestRuleSetupTeardownChained.java:50)
>         at org.apache.lucene.util.AbstractBeforeAfterRule$1.evaluate(AbstractBeforeAfterRule.java:46)
>         at org.apache.lucene.util.TestRuleThreadAndTestName$1.evaluate(TestRuleThreadAndTestName.java:49)
>         at org.apache.lucene.util.TestRuleIgnoreAfterMaxFailures$1.evaluate(TestRuleIgnoreAfterMaxFailures.java:65)
>         at org.apache.lucene.util.TestRuleMarkFailure$1.evaluate(TestRuleMarkFailure.java:48)
>         at com.carrotsearch.randomizedtesting.rules.StatementAdapter.evaluate(StatementAdapter.java:36)
>         at com.carrotsearch.randomizedtesting.ThreadLeakControl$StatementRunner.run(ThreadLeakControl.java:365)
>         at com.carrotsearch.randomizedtesting.ThreadLeakControl.forkTimeoutingTask(ThreadLeakControl.java:798)
>         at com.carrotsearch.randomizedtesting.ThreadLeakControl$3.evaluate(ThreadLeakControl.java:458)
>         at com.carrotsearch.randomizedtesting.RandomizedRunner.runSingleTest(RandomizedRunner.java:845)
>         at com.carrotsearch.randomizedtesting.RandomizedRunner$3.evaluate(RandomizedRunner.java:747)
>         at com.carrotsearch.randomizedtesting.RandomizedRunner$4.evaluate(RandomizedRunner.java:781)
>         at com.carrotsearch.randomizedtesting.RandomizedRunner$5.evaluate(RandomizedRunner.java:792)
>         at com.carrotsearch.randomizedtesting.rules.StatementAdapter.evaluate(StatementAdapter.java:36)
>         at com.carrotsearch.randomizedtesting.rules.SystemPropertiesRestoreRule$1.evaluate(SystemPropertiesRestoreRule.java:57)
>         at org.apache.lucene.util.AbstractBeforeAfterRule$1.evaluate(AbstractBeforeAfterRule.java:46)
>         at com.carrotsearch.randomizedtesting.rules.StatementAdapter.evaluate(StatementAdapter.java:36)
>         at org.apache.lucene.util.TestRuleStoreClassName$1.evaluate(TestRuleStoreClassName.java:42)
>         at com.carrotsearch.randomizedtesting.rules.NoShadowingOrOverridesOnMethodsRule$1.evaluate(NoShadowingOrOverridesOnMethodsRule.java:39)
>         at com.carrotsearch.randomizedtesting.rules.NoShadowingOrOverridesOnMethodsRule$1.evaluate(NoShadowingOrOverridesOnMethodsRule.java:39)
>         at com.carrotsearch.randomizedtesting.rules.StatementAdapter.evaluate(StatementAdapter.java:36)
>         at com.carrotsearch.randomizedtesting.rules.StatementAdapter.evaluate(StatementAdapter.java:36)
>         at com.carrotsearch.randomizedtesting.rules.StatementAdapter.evaluate(StatementAdapter.java:36)
>         at org.apache.lucene.util.TestRuleAssertionsRequired$1.evaluate(TestRuleAssertionsRequired.java:54)
>         at org.apache.lucene.util.TestRuleMarkFailure$1.evaluate(TestRuleMarkFailure.java:48)
>         at org.apache.lucene.util.TestRuleIgnoreAfterMaxFailures$1.evaluate(TestRuleIgnoreAfterMaxFailures.java:65)
>         at org.apache.lucene.util.TestRuleIgnoreTestSuites$1.evaluate(TestRuleIgnoreTestSuites.java:55)
>         at com.carrotsearch.randomizedtesting.rules.StatementAdapter.evaluate(StatementAdapter.java:36)
>         at com.carrotsearch.randomizedtesting.ThreadLeakControl$StatementRunner.run(ThreadLeakControl.java:365)
>         at java.lang.Thread.run(Thread.java:745)
>
>
>
>
> Build Log:
> [...truncated 10559 lines...]
>    [junit4] Suite: org.apache.solr.cloud.TestRandomRequestDistribution
>    [junit4]   2> Creating dataDir: /home/jenkins/workspace/Lucene-Solr-5.x-Linux/solr/build/solr-core/test/J1/temp/solr.cloud.TestRandomRequestDistribution_22A970802826A759-001/init-core-data-001
>    [junit4]   2> 503128 INFO  (SUITE-TestRandomRequestDistribution-seed#[22A970802826A759]-worker) [    ] o.a.s.BaseDistributedSearchTestCase Setting hostContext system property: /
>    [junit4]   2> 503146 INFO  (TEST-TestRandomRequestDistribution.testRequestTracking-seed#[22A970802826A759]) [    ] o.a.s.c.ZkTestServer STARTING ZK TEST SERVER
>    [junit4]   2> 503147 INFO  (Thread-1804) [    ] o.a.s.c.ZkTestServer client port:0.0.0.0/0.0.0.0:0
>    [junit4]   2> 503147 INFO  (Thread-1804) [    ] o.a.s.c.ZkTestServer Starting server
>    [junit4]   2> 503247 INFO  (TEST-TestRandomRequestDistribution.testRequestTracking-seed#[22A970802826A759]) [    ] o.a.s.c.ZkTestServer start zk server on port:41772
>    [junit4]   2> 503247 INFO  (TEST-TestRandomRequestDistribution.testRequestTracking-seed#[22A970802826A759]) [    ] o.a.s.c.c.SolrZkClient Using default ZkCredentialsProvider
>    [junit4]   2> 503249 INFO  (TEST-TestRandomRequestDistribution.testRequestTracking-seed#[22A970802826A759]) [    ] o.a.s.c.c.ConnectionManager Waiting for client to connect to ZooKeeper
>    [junit4]   2> 503253 INFO  (zkCallback-1479-thread-1) [    ] o.a.s.c.c.ConnectionManager Watcher org.apache.solr.common.cloud.ConnectionManager@50141423 name:ZooKeeperConnection Watcher:127.0.0.1:41772 got event WatchedEvent state:SyncConnected type:None path:null path:null type:None
>    [junit4]   2> 503253 INFO  (TEST-TestRandomRequestDistribution.testRequestTracking-seed#[22A970802826A759]) [    ] o.a.s.c.c.ConnectionManager Client is connected to ZooKeeper
>    [junit4]   2> 503253 INFO  (TEST-TestRandomRequestDistribution.testRequestTracking-seed#[22A970802826A759]) [    ] o.a.s.c.c.SolrZkClient Using default ZkACLProvider
>    [junit4]   2> 503253 INFO  (TEST-TestRandomRequestDistribution.testRequestTracking-seed#[22A970802826A759]) [    ] o.a.s.c.c.SolrZkClient makePath: /solr
>    [junit4]   2> 503255 WARN  (NIOServerCxn.Factory:0.0.0.0/0.0.0.0:0) [    ] o.a.z.s.NIOServerCnxn caught end of stream exception
>    [junit4]   2> EndOfStreamException: Unable to read additional data from client sessionid 0x14f21da708a0000, likely client has closed socket
>    [junit4]   2>        at org.apache.zookeeper.server.NIOServerCnxn.doIO(NIOServerCnxn.java:228)
>    [junit4]   2>        at org.apache.zookeeper.server.NIOServerCnxnFactory.run(NIOServerCnxnFactory.java:208)
>    [junit4]   2>        at java.lang.Thread.run(Thread.java:745)
>    [junit4]   2> 503258 INFO  (TEST-TestRandomRequestDistribution.testRequestTracking-seed#[22A970802826A759]) [    ] o.a.s.c.c.SolrZkClient Using default ZkCredentialsProvider
>    [junit4]   2> 503275 INFO  (TEST-TestRandomRequestDistribution.testRequestTracking-seed#[22A970802826A759]) [    ] o.a.s.c.c.ConnectionManager Waiting for client to connect to ZooKeeper
>    [junit4]   2> 503275 INFO  (zkCallback-1480-thread-1) [    ] o.a.s.c.c.ConnectionManager Watcher org.apache.solr.common.cloud.ConnectionManager@1a609025 name:ZooKeeperConnection Watcher:127.0.0.1:41772/solr got event WatchedEvent state:SyncConnected type:None path:null path:null type:None
>    [junit4]   2> 503275 INFO  (TEST-TestRandomRequestDistribution.testRequestTracking-seed#[22A970802826A759]) [    ] o.a.s.c.c.ConnectionManager Client is connected to ZooKeeper
>    [junit4]   2> 503276 INFO  (TEST-TestRandomRequestDistribution.testRequestTracking-seed#[22A970802826A759]) [    ] o.a.s.c.c.SolrZkClient Using default ZkACLProvider
>    [junit4]   2> 503276 INFO  (TEST-TestRandomRequestDistribution.testRequestTracking-seed#[22A970802826A759]) [    ] o.a.s.c.c.SolrZkClient makePath: /collections/collection1
>    [junit4]   2> 503277 INFO  (TEST-TestRandomRequestDistribution.testRequestTracking-seed#[22A970802826A759]) [    ] o.a.s.c.c.SolrZkClient makePath: /collections/collection1/shards
>    [junit4]   2> 503278 INFO  (TEST-TestRandomRequestDistribution.testRequestTracking-seed#[22A970802826A759]) [    ] o.a.s.c.c.SolrZkClient makePath: /collections/control_collection
>    [junit4]   2> 503279 INFO  (TEST-TestRandomRequestDistribution.testRequestTracking-seed#[22A970802826A759]) [    ] o.a.s.c.c.SolrZkClient makePath: /collections/control_collection/shards
>    [junit4]   2> 503281 INFO  (TEST-TestRandomRequestDistribution.testRequestTracking-seed#[22A970802826A759]) [    ] o.a.s.c.AbstractZkTestCase put /home/jenkins/workspace/Lucene-Solr-5.x-Linux/solr/core/src/test-files/solr/collection1/conf/solrconfig-tlog.xml to /configs/conf1/solrconfig.xml
>    [junit4]   2> 503281 INFO  (TEST-TestRandomRequestDistribution.testRequestTracking-seed#[22A970802826A759]) [    ] o.a.s.c.c.SolrZkClient makePath: /configs/conf1/solrconfig.xml
>    [junit4]   2> 503283 INFO  (TEST-TestRandomRequestDistribution.testRequestTracking-seed#[22A970802826A759]) [    ] o.a.s.c.AbstractZkTestCase put /home/jenkins/workspace/Lucene-Solr-5.x-Linux/solr/core/src/test-files/solr/collection1/conf/schema.xml to /configs/conf1/schema.xml
>    [junit4]   2> 503283 INFO  (TEST-TestRandomRequestDistribution.testRequestTracking-seed#[22A970802826A759]) [    ] o.a.s.c.c.SolrZkClient makePath: /configs/conf1/schema.xml
>    [junit4]   2> 503284 INFO  (TEST-TestRandomRequestDistribution.testRequestTracking-seed#[22A970802826A759]) [    ] o.a.s.c.AbstractZkTestCase put /home/jenkins/workspace/Lucene-Solr-5.x-Linux/solr/core/src/test-files/solr/collection1/conf/solrconfig.snippet.randomindexconfig.xml to /configs/conf1/solrconfig.snippet.randomindexconfig.xml
>    [junit4]   2> 503284 INFO  (TEST-TestRandomRequestDistribution.testRequestTracking-seed#[22A970802826A759]) [    ] o.a.s.c.c.SolrZkClient makePath: /configs/conf1/solrconfig.snippet.randomindexconfig.xml
>    [junit4]   2> 503285 INFO  (TEST-TestRandomRequestDistribution.testRequestTracking-seed#[22A970802826A759]) [    ] o.a.s.c.AbstractZkTestCase put /home/jenkins/workspace/Lucene-Solr-5.x-Linux/solr/core/src/test-files/solr/collection1/conf/stopwords.txt to /configs/conf1/stopwords.txt
>    [junit4]   2> 503285 INFO  (TEST-TestRandomRequestDistribution.testRequestTracking-seed#[22A970802826A759]) [    ] o.a.s.c.c.SolrZkClient makePath: /configs/conf1/stopwords.txt
>    [junit4]   2> 503286 INFO  (TEST-TestRandomRequestDistribution.testRequestTracking-seed#[22A970802826A759]) [    ] o.a.s.c.AbstractZkTestCase put /home/jenkins/workspace/Lucene-Solr-5.x-Linux/solr/core/src/test-files/solr/collection1/conf/protwords.txt to /configs/conf1/protwords.txt
>    [junit4]   2> 503286 INFO  (TEST-TestRandomRequestDistribution.testRequestTracking-seed#[22A970802826A759]) [    ] o.a.s.c.c.SolrZkClient makePath: /configs/conf1/protwords.txt
>    [junit4]   2> 503286 INFO  (TEST-TestRandomRequestDistribution.testRequestTracking-seed#[22A970802826A759]) [    ] o.a.s.c.AbstractZkTestCase put /home/jenkins/workspace/Lucene-Solr-5.x-Linux/solr/core/src/test-files/solr/collection1/conf/currency.xml to /configs/conf1/currency.xml
>    [junit4]   2> 503287 INFO  (TEST-TestRandomRequestDistribution.testRequestTracking-seed#[22A970802826A759]) [    ] o.a.s.c.c.SolrZkClient makePath: /configs/conf1/currency.xml
>    [junit4]   2> 503287 INFO  (TEST-TestRandomRequestDistribution.testRequestTracking-seed#[22A970802826A759]) [    ] o.a.s.c.AbstractZkTestCase put /home/jenkins/workspace/Lucene-Solr-5.x-Linux/solr/core/src/test-files/solr/collection1/conf/enumsConfig.xml to /configs/conf1/enumsConfig.xml
>    [junit4]   2> 503287 INFO  (TEST-TestRandomRequestDistribution.testRequestTracking-seed#[22A970802826A759]) [    ] o.a.s.c.c.SolrZkClient makePath: /configs/conf1/enumsConfig.xml
>    [junit4]   2> 503288 INFO  (TEST-TestRandomRequestDistribution.testRequestTracking-seed#[22A970802826A759]) [    ] o.a.s.c.AbstractZkTestCase put /home/jenkins/workspace/Lucene-Solr-5.x-Linux/solr/core/src/test-files/solr/collection1/conf/open-exchange-rates.json to /configs/conf1/open-exchange-rates.json
>    [junit4]   2> 503288 INFO  (TEST-TestRandomRequestDistribution.testRequestTracking-seed#[22A970802826A759]) [    ] o.a.s.c.c.SolrZkClient makePath: /configs/conf1/open-exchange-rates.json
>    [junit4]   2> 503289 INFO  (TEST-TestRandomRequestDistribution.testRequestTracking-seed#[22A970802826A759]) [    ] o.a.s.c.AbstractZkTestCase put /home/jenkins/workspace/Lucene-Solr-5.x-Linux/solr/core/src/test-files/solr/collection1/conf/mapping-ISOLatin1Accent.txt to /configs/conf1/mapping-ISOLatin1Accent.txt
>    [junit4]   2> 503289 INFO  (TEST-TestRandomRequestDistribution.testRequestTracking-seed#[22A970802826A759]) [    ] o.a.s.c.c.SolrZkClient makePath: /configs/conf1/mapping-ISOLatin1Accent.txt
>    [junit4]   2> 503290 INFO  (TEST-TestRandomRequestDistribution.testRequestTracking-seed#[22A970802826A759]) [    ] o.a.s.c.AbstractZkTestCase put /home/jenkins/workspace/Lucene-Solr-5.x-Linux/solr/core/src/test-files/solr/collection1/conf/old_synonyms.txt to /configs/conf1/old_synonyms.txt
>    [junit4]   2> 503290 INFO  (TEST-TestRandomRequestDistribution.testRequestTracking-seed#[22A970802826A759]) [    ] o.a.s.c.c.SolrZkClient makePath: /configs/conf1/old_synonyms.txt
>    [junit4]   2> 503291 INFO  (TEST-TestRandomRequestDistribution.testRequestTracking-seed#[22A970802826A759]) [    ] o.a.s.c.AbstractZkTestCase put /home/jenkins/workspace/Lucene-Solr-5.x-Linux/solr/core/src/test-files/solr/collection1/conf/synonyms.txt to /configs/conf1/synonyms.txt
>    [junit4]   2> 503291 INFO  (TEST-TestRandomRequestDistribution.testRequestTracking-seed#[22A970802826A759]) [    ] o.a.s.c.c.SolrZkClient makePath: /configs/conf1/synonyms.txt
>    [junit4]   2> 503355 INFO  (TEST-TestRandomRequestDistribution.testRequestTracking-seed#[22A970802826A759]) [    ] o.a.s.SolrTestCaseJ4 Writing core.properties file to /home/jenkins/workspace/Lucene-Solr-5.x-Linux/solr/build/solr-core/test/J1/temp/solr.cloud.TestRandomRequestDistribution_22A970802826A759-001/control-001/cores/collection1
>    [junit4]   2> 503358 INFO  (TEST-TestRandomRequestDistribution.testRequestTracking-seed#[22A970802826A759]) [    ] o.e.j.s.Server jetty-9.2.11.v20150529
>    [junit4]   2> 503359 INFO  (TEST-TestRandomRequestDistribution.testRequestTracking-seed#[22A970802826A759]) [    ] o.e.j.s.h.ContextHandler Started o.e.j.s.ServletContextHandler@168fe16b{/,null,AVAILABLE}
>    [junit4]   2> 503362 INFO  (TEST-TestRandomRequestDistribution.testRequestTracking-seed#[22A970802826A759]) [    ] o.e.j.s.ServerConnector Started ServerConnector@3eeb9903{HTTP/1.1}{127.0.0.1:46421}
>    [junit4]   2> 503363 INFO  (TEST-TestRandomRequestDistribution.testRequestTracking-seed#[22A970802826A759]) [    ] o.e.j.s.Server Started @505352ms
>    [junit4]   2> 503363 INFO  (TEST-TestRandomRequestDistribution.testRequestTracking-seed#[22A970802826A759]) [    ] o.a.s.c.s.e.JettySolrRunner Jetty properties: {solr.data.dir=/home/jenkins/workspace/Lucene-Solr-5.x-Linux/solr/build/solr-core/test/J1/temp/solr.cloud.TestRandomRequestDistribution_22A970802826A759-001/tempDir-001/control/data, hostContext=/, hostPort=46421, coreRootDirectory=/home/jenkins/workspace/Lucene-Solr-5.x-Linux/solr/build/solr-core/test/J1/../../../../../../../../../home/jenkins/workspace/Lucene-Solr-5.x-Linux/solr/build/solr-core/test/J1/temp/solr.cloud.TestRandomRequestDistribution_22A970802826A759-001/control-001/cores}
>    [junit4]   2> 503363 INFO  (TEST-TestRandomRequestDistribution.testRequestTracking-seed#[22A970802826A759]) [    ] o.a.s.s.SolrDispatchFilter SolrDispatchFilter.init(): sun.misc.Launcher$AppClassLoader@45fe3ee3
>    [junit4]   2> 503363 INFO  (TEST-TestRandomRequestDistribution.testRequestTracking-seed#[22A970802826A759]) [    ] o.a.s.c.SolrResourceLoader new SolrResourceLoader for directory: '/home/jenkins/workspace/Lucene-Solr-5.x-Linux/solr/build/solr-core/test/J1/../../../../../../../../../home/jenkins/workspace/Lucene-Solr-5.x-Linux/solr/build/solr-core/test/J1/temp/solr.cloud.TestRandomRequestDistribution_22A970802826A759-001/control-001/'
>    [junit4]   2> 503376 INFO  (TEST-TestRandomRequestDistribution.testRequestTracking-seed#[22A970802826A759]) [    ] o.a.s.c.c.SolrZkClient Using default ZkCredentialsProvider
>    [junit4]   2> 503376 INFO  (TEST-TestRandomRequestDistribution.testRequestTracking-seed#[22A970802826A759]) [    ] o.a.s.c.c.ConnectionManager Waiting for client to connect to ZooKeeper
>    [junit4]   2> 503377 INFO  (zkCallback-1481-thread-1) [    ] o.a.s.c.c.ConnectionManager Watcher org.apache.solr.common.cloud.ConnectionManager@e1f320f name:ZooKeeperConnection Watcher:127.0.0.1:41772/solr got event WatchedEvent state:SyncConnected type:None path:null path:null type:None
>    [junit4]   2> 503377 INFO  (TEST-TestRandomRequestDistribution.testRequestTracking-seed#[22A970802826A759]) [    ] o.a.s.c.c.ConnectionManager Client is connected to ZooKeeper
>    [junit4]   2> 503378 INFO  (TEST-TestRandomRequestDistribution.testRequestTracking-seed#[22A970802826A759]) [    ] o.a.s.c.c.SolrZkClient Using default ZkACLProvider
>    [junit4]   2> 503379 INFO  (TEST-TestRandomRequestDistribution.testRequestTracking-seed#[22A970802826A759]) [    ] o.a.s.s.SolrDispatchFilter Loading solr.xml from SolrHome (not found in ZooKeeper)
>    [junit4]   2> 503379 INFO  (TEST-TestRandomRequestDistribution.testRequestTracking-seed#[22A970802826A759]) [    ] o.a.s.c.SolrXmlConfig Loading container configuration from /home/jenkins/workspace/Lucene-Solr-5.x-Linux/solr/build/solr-core/test/J1/../../../../../../../../../home/jenkins/workspace/Lucene-Solr-5.x-Linux/solr/build/solr-core/test/J1/temp/solr.cloud.TestRandomRequestDistribution_22A970802826A759-001/control-001/solr.xml
>    [junit4]   2> 503382 INFO  (TEST-TestRandomRequestDistribution.testRequestTracking-seed#[22A970802826A759]) [    ] o.a.s.c.CoresLocator Config-defined core root directory: /home/jenkins/workspace/Lucene-Solr-5.x-Linux/solr/build/solr-core/test/J1/../../../../../../../../../home/jenkins/workspace/Lucene-Solr-5.x-Linux/solr/build/solr-core/test/J1/temp/solr.cloud.TestRandomRequestDistribution_22A970802826A759-001/control-001/cores
>    [junit4]   2> 503383 INFO  (TEST-TestRandomRequestDistribution.testRequestTracking-seed#[22A970802826A759]) [    ] o.a.s.c.CoreContainer New CoreContainer 1788015739
>    [junit4]   2> 503383 INFO  (TEST-TestRandomRequestDistribution.testRequestTracking-seed#[22A970802826A759]) [    ] o.a.s.c.CoreContainer Loading cores into CoreContainer [instanceDir=/home/jenkins/workspace/Lucene-Solr-5.x-Linux/solr/build/solr-core/test/J1/../../../../../../../../../home/jenkins/workspace/Lucene-Solr-5.x-Linux/solr/build/solr-core/test/J1/temp/solr.cloud.TestRandomRequestDistribution_22A970802826A759-001/control-001/]
>    [junit4]   2> 503383 INFO  (TEST-TestRandomRequestDistribution.testRequestTracking-seed#[22A970802826A759]) [    ] o.a.s.c.CoreContainer loading shared library: /home/jenkins/workspace/Lucene-Solr-5.x-Linux/solr/build/solr-core/test/J1/../../../../../../../../../home/jenkins/workspace/Lucene-Solr-5.x-Linux/solr/build/solr-core/test/J1/temp/solr.cloud.TestRandomRequestDistribution_22A970802826A759-001/control-001/lib
>    [junit4]   2> 503383 WARN  (TEST-TestRandomRequestDistribution.testRequestTracking-seed#[22A970802826A759]) [    ] o.a.s.c.SolrResourceLoader Can't find (or read) directory to add to classloader: lib (resolved as: /home/jenkins/workspace/Lucene-Solr-5.x-Linux/solr/build/solr-core/test/J1/../../../../../../../../../home/jenkins/workspace/Lucene-Solr-5.x-Linux/solr/build/solr-core/test/J1/temp/solr.cloud.TestRandomRequestDistribution_22A970802826A759-001/control-001/lib).
>    [junit4]   2> 503388 INFO  (TEST-TestRandomRequestDistribution.testRequestTracking-seed#[22A970802826A759]) [    ] o.a.s.h.c.HttpShardHandlerFactory created with socketTimeout : 90000,urlScheme : ,connTimeout : 15000,maxConnectionsPerHost : 20,maxConnections : 10000,corePoolSize : 0,maximumPoolSize : 2147483647,maxThreadIdleTime : 5,sizeOfQueue : -1,fairnessPolicy : false,useRetries : false,
>    [junit4]   2> 503388 INFO  (TEST-TestRandomRequestDistribution.testRequestTracking-seed#[22A970802826A759]) [    ] o.a.s.u.UpdateShardHandler Creating UpdateShardHandler HTTP client with params: socketTimeout=340000&connTimeout=45000&retry=true
>    [junit4]   2> 503389 INFO  (TEST-TestRandomRequestDistribution.testRequestTracking-seed#[22A970802826A759]) [    ] o.a.s.l.LogWatcher SLF4J impl is org.slf4j.impl.Log4jLoggerFactory
>    [junit4]   2> 503389 INFO  (TEST-TestRandomRequestDistribution.testRequestTracking-seed#[22A970802826A759]) [    ] o.a.s.l.LogWatcher Registering Log Listener [Log4j (org.slf4j.impl.Log4jLoggerFactory)]
>    [junit4]   2> 503389 INFO  (TEST-TestRandomRequestDistribution.testRequestTracking-seed#[22A970802826A759]) [    ] o.a.s.c.ZkContainer Zookeeper client=127.0.0.1:41772/solr
>    [junit4]   2> 503389 INFO  (TEST-TestRandomRequestDistribution.testRequestTracking-seed#[22A970802826A759]) [    ] o.a.s.c.ZkController zkHost includes chroot
>    [junit4]   2> 503389 INFO  (TEST-TestRandomRequestDistribution.testRequestTracking-seed#[22A970802826A759]) [    ] o.a.s.c.c.SolrZkClient Using default ZkCredentialsProvider
>    [junit4]   2> 503392 INFO  (TEST-TestRandomRequestDistribution.testRequestTracking-seed#[22A970802826A759]) [    ] o.a.s.c.c.ConnectionManager Waiting for client to connect to ZooKeeper
>    [junit4]   2> 503392 INFO  (zkCallback-1483-thread-1) [    ] o.a.s.c.c.ConnectionManager Watcher org.apache.solr.common.cloud.ConnectionManager@69ec93f7 name:ZooKeeperConnection Watcher:127.0.0.1:41772 got event WatchedEvent state:SyncConnected type:None path:null path:null type:None
>    [junit4]   2> 503392 INFO  (TEST-TestRandomRequestDistribution.testRequestTracking-seed#[22A970802826A759]) [    ] o.a.s.c.c.ConnectionManager Client is connected to ZooKeeper
>    [junit4]   2> 503393 INFO  (TEST-TestRandomRequestDistribution.testRequestTracking-seed#[22A970802826A759]) [    ] o.a.s.c.c.SolrZkClient Using default ZkACLProvider
>    [junit4]   2> 503405 INFO  (TEST-TestRandomRequestDistribution.testRequestTracking-seed#[22A970802826A759]) [n:127.0.0.1:46421_    ] o.a.s.c.c.ConnectionManager Waiting for client to connect to ZooKeeper
>    [junit4]   2> 503406 INFO  (zkCallback-1484-thread-1-processing-n:127.0.0.1:46421_) [n:127.0.0.1:46421_    ] o.a.s.c.c.ConnectionManager Watcher org.apache.solr.common.cloud.ConnectionManager@5a1277e2 name:ZooKeeperConnection Watcher:127.0.0.1:41772/solr got event WatchedEvent state:SyncConnected type:None path:null path:null type:None
>    [junit4]   2> 503407 INFO  (TEST-TestRandomRequestDistribution.testRequestTracking-seed#[22A970802826A759]) [n:127.0.0.1:46421_    ] o.a.s.c.c.ConnectionManager Client is connected to ZooKeeper
>    [junit4]   2> 503407 INFO  (TEST-TestRandomRequestDistribution.testRequestTracking-seed#[22A970802826A759]) [n:127.0.0.1:46421_    ] o.a.s.c.c.SolrZkClient makePath: /overseer/queue
>    [junit4]   2> 503408 INFO  (TEST-TestRandomRequestDistribution.testRequestTracking-seed#[22A970802826A759]) [n:127.0.0.1:46421_    ] o.a.s.c.c.SolrZkClient makePath: /overseer/collection-queue-work
>    [junit4]   2> 503409 INFO  (TEST-TestRandomRequestDistribution.testRequestTracking-seed#[22A970802826A759]) [n:127.0.0.1:46421_    ] o.a.s.c.c.SolrZkClient makePath: /overseer/collection-map-running
>    [junit4]   2> 503410 INFO  (TEST-TestRandomRequestDistribution.testRequestTracking-seed#[22A970802826A759]) [n:127.0.0.1:46421_    ] o.a.s.c.c.SolrZkClient makePath: /overseer/collection-map-completed
>    [junit4]   2> 503411 INFO  (TEST-TestRandomRequestDistribution.testRequestTracking-seed#[22A970802826A759]) [n:127.0.0.1:46421_    ] o.a.s.c.c.SolrZkClient makePath: /overseer/collection-map-failure
>    [junit4]   2> 503412 INFO  (TEST-TestRandomRequestDistribution.testRequestTracking-seed#[22A970802826A759]) [n:127.0.0.1:46421_    ] o.a.s.c.c.SolrZkClient makePath: /live_nodes
>    [junit4]   2> 503413 INFO  (TEST-TestRandomRequestDistribution.testRequestTracking-seed#[22A970802826A759]) [n:127.0.0.1:46421_    ] o.a.s.c.c.SolrZkClient makePath: /aliases.json
>    [junit4]   2> 503413 INFO  (TEST-TestRandomRequestDistribution.testRequestTracking-seed#[22A970802826A759]) [n:127.0.0.1:46421_    ] o.a.s.c.c.SolrZkClient makePath: /clusterstate.json
>    [junit4]   2> 503414 INFO  (TEST-TestRandomRequestDistribution.testRequestTracking-seed#[22A970802826A759]) [n:127.0.0.1:46421_    ] o.a.s.c.c.SolrZkClient makePath: /security.json
>    [junit4]   2> 503415 INFO  (TEST-TestRandomRequestDistribution.testRequestTracking-seed#[22A970802826A759]) [n:127.0.0.1:46421_    ] o.a.s.c.ZkController Register node as live in ZooKeeper:/live_nodes/127.0.0.1:46421_
>    [junit4]   2> 503415 INFO  (TEST-TestRandomRequestDistribution.testRequestTracking-seed#[22A970802826A759]) [n:127.0.0.1:46421_    ] o.a.s.c.c.SolrZkClient makePath: /live_nodes/127.0.0.1:46421_
>    [junit4]   2> 503416 INFO  (TEST-TestRandomRequestDistribution.testRequestTracking-seed#[22A970802826A759]) [n:127.0.0.1:46421_    ] o.a.s.c.c.SolrZkClient makePath: /overseer_elect
>    [junit4]   2> 503416 INFO  (TEST-TestRandomRequestDistribution.testRequestTracking-seed#[22A970802826A759]) [n:127.0.0.1:46421_    ] o.a.s.c.c.SolrZkClient makePath: /overseer_elect/election
>    [junit4]   2> 503417 INFO  (TEST-TestRandomRequestDistribution.testRequestTracking-seed#[22A970802826A759]) [n:127.0.0.1:46421_    ] o.a.s.c.Overseer Overseer (id=null) closing
>    [junit4]   2> 503417 INFO  (TEST-TestRandomRequestDistribution.testRequestTracking-seed#[22A970802826A759]) [n:127.0.0.1:46421_    ] o.a.s.c.LeaderElector Joined leadership election with path: /overseer_elect/election/94331339272749060-127.0.0.1:46421_-n_0000000000
>    [junit4]   2> 503418 INFO  (TEST-TestRandomRequestDistribution.testRequestTracking-seed#[22A970802826A759]) [n:127.0.0.1:46421_    ] o.a.s.c.OverseerElectionContext I am going to be the leader 127.0.0.1:46421_
>    [junit4]   2> 503418 INFO  (TEST-TestRandomRequestDistribution.testRequestTracking-seed#[22A970802826A759]) [n:127.0.0.1:46421_    ] o.a.s.c.c.SolrZkClient makePath: /overseer_elect/leader
>    [junit4]   2> 503419 INFO  (TEST-TestRandomRequestDistribution.testRequestTracking-seed#[22A970802826A759]) [n:127.0.0.1:46421_    ] o.a.s.c.Overseer Overseer (id=94331339272749060-127.0.0.1:46421_-n_0000000000) starting
>    [junit4]   2> 503419 INFO  (TEST-TestRandomRequestDistribution.testRequestTracking-seed#[22A970802826A759]) [n:127.0.0.1:46421_    ] o.a.s.c.c.SolrZkClient makePath: /overseer/queue-work
>    [junit4]   2> 503422 INFO  (TEST-TestRandomRequestDistribution.testRequestTracking-seed#[22A970802826A759]) [n:127.0.0.1:46421_    ] o.a.s.c.OverseerAutoReplicaFailoverThread Starting OverseerAutoReplicaFailoverThread autoReplicaFailoverWorkLoopDelay=10000 autoReplicaFailoverWaitAfterExpiration=30000 autoReplicaFailoverBadNodeExpiration=60000
>    [junit4]   2> 503423 INFO  (TEST-TestRandomRequestDistribution.testRequestTracking-seed#[22A970802826A759]) [n:127.0.0.1:46421_    ] o.a.s.c.c.ZkStateReader Updating cluster state from ZooKeeper...
>    [junit4]   2> 503423 INFO  (OverseerCollectionProcessor-94331339272749060-127.0.0.1:46421_-n_0000000000) [n:127.0.0.1:46421_    ] o.a.s.c.OverseerProcessor Process current queue of overseer operations
>    [junit4]   2> 503423 INFO  (OverseerStateUpdate-94331339272749060-127.0.0.1:46421_-n_0000000000) [n:127.0.0.1:46421_    ] o.a.s.c.Overseer Starting to work on the main queue
>    [junit4]   2> 503448 INFO  (TEST-TestRandomRequestDistribution.testRequestTracking-seed#[22A970802826A759]) [n:127.0.0.1:46421_    ] o.a.s.c.CoreContainer Security conf doesn't exist. Skipping setup for authorization module.
>    [junit4]   2> 503448 INFO  (TEST-TestRandomRequestDistribution.testRequestTracking-seed#[22A970802826A759]) [n:127.0.0.1:46421_    ] o.a.s.c.CoreContainer No authentication plugin used.
>    [junit4]   2> 503448 INFO  (TEST-TestRandomRequestDistribution.testRequestTracking-seed#[22A970802826A759]) [n:127.0.0.1:46421_    ] o.a.s.c.CoresLocator Looking for core definitions underneath /home/jenkins/workspace/Lucene-Solr-5.x-Linux/solr/build/solr-core/test/J1/../../../../../../../../../home/jenkins/workspace/Lucene-Solr-5.x-Linux/solr/build/solr-core/test/J1/temp/solr.cloud.TestRandomRequestDistribution_22A970802826A759-001/control-001/cores
>    [junit4]   2> 503449 INFO  (TEST-TestRandomRequestDistribution.testRequestTracking-seed#[22A970802826A759]) [n:127.0.0.1:46421_    ] o.a.s.c.SolrCore Created CoreDescriptor: {name=collection1, config=solrconfig.xml, transient=false, schema=schema.xml, loadOnStartup=true, configSetProperties=configsetprops.json, instanceDir=/home/jenkins/workspace/Lucene-Solr-5.x-Linux/solr/build/solr-core/test/J1/../../../../../../../../../home/jenkins/workspace/Lucene-Solr-5.x-Linux/solr/build/solr-core/test/J1/temp/solr.cloud.TestRandomRequestDistribution_22A970802826A759-001/control-001/cores/collection1, collection=control_collection, absoluteInstDir=/home/jenkins/workspace/Lucene-Solr-5.x-Linux/solr/build/solr-core/test/J1/../../../../../../../../../home/jenkins/workspace/Lucene-Solr-5.x-Linux/solr/build/solr-core/test/J1/temp/solr.cloud.TestRandomRequestDistribution_22A970802826A759-001/control-001/cores/collection1/, coreNodeName=, dataDir=data/, shard=}
>    [junit4]   2> 503450 INFO  (TEST-TestRandomRequestDistribution.testRequestTracking-seed#[22A970802826A759]) [n:127.0.0.1:46421_    ] o.a.s.c.CoresLocator Found core collection1 in /home/jenkins/workspace/Lucene-Solr-5.x-Linux/solr/build/solr-core/test/J1/../../../../../../../../../home/jenkins/workspace/Lucene-Solr-5.x-Linux/solr/build/solr-core/test/J1/temp/solr.cloud.TestRandomRequestDistribution_22A970802826A759-001/control-001/cores/collection1/
>    [junit4]   2> 503450 INFO  (TEST-TestRandomRequestDistribution.testRequestTracking-seed#[22A970802826A759]) [n:127.0.0.1:46421_    ] o.a.s.c.CoresLocator Found 1 core definitions
>    [junit4]   2> 503451 INFO  (TEST-TestRandomRequestDistribution.testRequestTracking-seed#[22A970802826A759]) [n:127.0.0.1:46421_    ] o.a.s.s.SolrDispatchFilter user.dir=/home/jenkins/workspace/Lucene-Solr-5.x-Linux/solr/build/solr-core/test/J1
>    [junit4]   2> 503451 INFO  (TEST-TestRandomRequestDistribution.testRequestTracking-seed#[22A970802826A759]) [n:127.0.0.1:46421_    ] o.a.s.s.SolrDispatchFilter SolrDispatchFilter.init() done
>    [junit4]   2> 503451 INFO  (coreLoadExecutor-2018-thread-1-processing-n:127.0.0.1:46421_) [n:127.0.0.1:46421_ c:control_collection   x:collection1] o.a.s.c.ZkController publishing state=down
>    [junit4]   2> 503451 INFO  (coreLoadExecutor-2018-thread-1-processing-n:127.0.0.1:46421_) [n:127.0.0.1:46421_ c:control_collection   x:collection1] o.a.s.c.ZkController numShards not found on descriptor - reading it from system property
>    [junit4]   2> 503452 INFO  (coreLoadExecutor-2018-thread-1-processing-n:127.0.0.1:46421_) [n:127.0.0.1:46421_ c:control_collection   x:collection1] o.a.s.c.ZkController look for our core node name
>    [junit4]   2> 503452 INFO  (zkCallback-1484-thread-1-processing-n:127.0.0.1:46421_) [n:127.0.0.1:46421_    ] o.a.s.c.DistributedQueue NodeChildrenChanged fired on path /overseer/queue state SyncConnected
>    [junit4]   2> 503452 INFO  (OverseerStateUpdate-94331339272749060-127.0.0.1:46421_-n_0000000000) [n:127.0.0.1:46421_    ] o.a.s.c.Overseer processMessage: queueSize: 1, message = {
>    [junit4]   2>   "core":"collection1",
>    [junit4]   2>   "roles":null,
>    [junit4]   2>   "base_url":"http://127.0.0.1:46421",
>    [junit4]   2>   "node_name":"127.0.0.1:46421_",
>    [junit4]   2>   "numShards":"1",
>    [junit4]   2>   "state":"down",
>    [junit4]   2>   "shard":null,
>    [junit4]   2>   "collection":"control_collection",
>    [junit4]   2>   "operation":"state"} current state version: 0
>    [junit4]   2> 503453 INFO  (OverseerStateUpdate-94331339272749060-127.0.0.1:46421_-n_0000000000) [n:127.0.0.1:46421_    ] o.a.s.c.o.ReplicaMutator Update state numShards=1 message={
>    [junit4]   2>   "core":"collection1",
>    [junit4]   2>   "roles":null,
>    [junit4]   2>   "base_url":"http://127.0.0.1:46421",
>    [junit4]   2>   "node_name":"127.0.0.1:46421_",
>    [junit4]   2>   "numShards":"1",
>    [junit4]   2>   "state":"down",
>    [junit4]   2>   "shard":null,
>    [junit4]   2>   "collection":"control_collection",
>    [junit4]   2>   "operation":"state"}
>    [junit4]   2> 503453 INFO  (OverseerStateUpdate-94331339272749060-127.0.0.1:46421_-n_0000000000) [n:127.0.0.1:46421_    ] o.a.s.c.o.ClusterStateMutator building a new cName: control_collection
>    [junit4]   2> 503453 INFO  (OverseerStateUpdate-94331339272749060-127.0.0.1:46421_-n_0000000000) [n:127.0.0.1:46421_    ] o.a.s.c.o.ReplicaMutator Assigning new node to shard shard=shard1
>    [junit4]   2> 503454 INFO  (zkCallback-1484-thread-1-processing-n:127.0.0.1:46421_) [n:127.0.0.1:46421_    ] o.a.s.c.c.ZkStateReader A cluster state change: WatchedEvent state:SyncConnected type:NodeDataChanged path:/clusterstate.json, has occurred - updating... (live nodes size: 1)
>    [junit4]   2> 504452 INFO  (coreLoadExecutor-2018-thread-1-processing-n:127.0.0.1:46421_) [n:127.0.0.1:46421_ c:control_collection   x:collection1] o.a.s.c.ZkController waiting to find shard id in clusterstate for collection1
>    [junit4]   2> 504452 INFO  (coreLoadExecutor-2018-thread-1-processing-n:127.0.0.1:46421_) [n:127.0.0.1:46421_ c:control_collection   x:collection1] o.a.s.c.ZkController Check for collection zkNode:control_collection
>    [junit4]   2> 504452 INFO  (coreLoadExecutor-2018-thread-1-processing-n:127.0.0.1:46421_) [n:127.0.0.1:46421_ c:control_collection   x:collection1] o.a.s.c.ZkController Collection zkNode exists
>    [junit4]   2> 504453 INFO  (coreLoadExecutor-2018-thread-1-processing-n:127.0.0.1:46421_) [n:127.0.0.1:46421_ c:control_collection   x:collection1] o.a.s.c.c.ZkStateReader Load collection config from:/collections/control_collection
>    [junit4]   2> 504453 INFO  (coreLoadExecutor-2018-thread-1-processing-n:127.0.0.1:46421_) [n:127.0.0.1:46421_ c:control_collection   x:collection1] o.a.s.c.c.ZkStateReader path=/collections/control_collection configName=conf1 specified config exists in ZooKeeper
>    [junit4]   2> 504453 INFO  (coreLoadExecutor-2018-thread-1-processing-n:127.0.0.1:46421_) [n:127.0.0.1:46421_ c:control_collection   x:collection1] o.a.s.c.SolrResourceLoader new SolrResourceLoader for directory: '/home/jenkins/workspace/Lucene-Solr-5.x-Linux/solr/build/solr-core/test/J1/../../../../../../../../../home/jenkins/workspace/Lucene-Solr-5.x-Linux/solr/build/solr-core/test/J1/temp/solr.cloud.TestRandomRequestDistribution_22A970802826A759-001/control-001/cores/collection1/'
>    [junit4]   2> 504465 INFO  (coreLoadExecutor-2018-thread-1-processing-n:127.0.0.1:46421_) [n:127.0.0.1:46421_ c:control_collection   x:collection1] o.a.s.c.Config loaded config solrconfig.xml with version 0
>    [junit4]   2> 504468 INFO  (coreLoadExecutor-2018-thread-1-processing-n:127.0.0.1:46421_) [n:127.0.0.1:46421_ c:control_collection   x:collection1] o.a.s.c.SolrConfig current version of requestparams : -1
>    [junit4]   2> 504471 INFO  (coreLoadExecutor-2018-thread-1-processing-n:127.0.0.1:46421_) [n:127.0.0.1:46421_ c:control_collection   x:collection1] o.a.s.c.SolrConfig Using Lucene MatchVersion: 5.4.0
>    [junit4]   2> 504475 INFO  (coreLoadExecutor-2018-thread-1-processing-n:127.0.0.1:46421_) [n:127.0.0.1:46421_ c:control_collection   x:collection1] o.a.s.c.Config Loaded SolrConfig: solrconfig.xml
>    [junit4]   2> 504476 INFO  (coreLoadExecutor-2018-thread-1-processing-n:127.0.0.1:46421_) [n:127.0.0.1:46421_ c:control_collection   x:collection1] o.a.s.s.IndexSchema Reading Solr Schema from /configs/conf1/schema.xml
>    [junit4]   2> 504480 INFO  (coreLoadExecutor-2018-thread-1-processing-n:127.0.0.1:46421_) [n:127.0.0.1:46421_ c:control_collection   x:collection1] o.a.s.s.IndexSchema [collection1] Schema name=test
>    [junit4]   2> 504527 INFO  (coreLoadExecutor-2018-thread-1-processing-n:127.0.0.1:46421_) [n:127.0.0.1:46421_ c:control_collection   x:collection1] o.a.s.s.OpenExchangeRatesOrgProvider Initialized with rates=open-exchange-rates.json, refreshInterval=1440.
>    [junit4]   2> 504530 INFO  (coreLoadExecutor-2018-thread-1-processing-n:127.0.0.1:46421_) [n:127.0.0.1:46421_ c:control_collection   x:collection1] o.a.s.s.IndexSchema default search field in schema is text
>    [junit4]   2> 504531 INFO  (coreLoadExecutor-2018-thread-1-processing-n:127.0.0.1:46421_) [n:127.0.0.1:46421_ c:control_collection   x:collection1] o.a.s.s.IndexSchema unique key field: id
>    [junit4]   2> 504534 INFO  (coreLoadExecutor-2018-thread-1-processing-n:127.0.0.1:46421_) [n:127.0.0.1:46421_ c:control_collection   x:collection1] o.a.s.s.FileExchangeRateProvider Reloading exchange rates from file currency.xml
>    [junit4]   2> 504535 INFO  (coreLoadExecutor-2018-thread-1-processing-n:127.0.0.1:46421_) [n:127.0.0.1:46421_ c:control_collection   x:collection1] o.a.s.s.FileExchangeRateProvider Reloading exchange rates from file currency.xml
>    [junit4]   2> 504536 INFO  (coreLoadExecutor-2018-thread-1-processing-n:127.0.0.1:46421_) [n:127.0.0.1:46421_ c:control_collection   x:collection1] o.a.s.s.OpenExchangeRatesOrgProvider Reloading exchange rates from open-exchange-rates.json
>    [junit4]   2> 504537 WARN  (coreLoadExecutor-2018-thread-1-processing-n:127.0.0.1:46421_) [n:127.0.0.1:46421_ c:control_collection   x:collection1] o.a.s.s.OpenExchangeRatesOrgProvider Unknown key IMPORTANT NOTE
>    [junit4]   2> 504537 WARN  (coreLoadExecutor-2018-thread-1-processing-n:127.0.0.1:46421_) [n:127.0.0.1:46421_ c:control_collection   x:collection1] o.a.s.s.OpenExchangeRatesOrgProvider Expected key, got STRING
>    [junit4]   2> 504537 INFO  (coreLoadExecutor-2018-thread-1-processing-n:127.0.0.1:46421_) [n:127.0.0.1:46421_ c:control_collection   x:collection1] o.a.s.s.OpenExchangeRatesOrgProvider Reloading exchange rates from open-exchange-rates.json
>    [junit4]   2> 504537 WARN  (coreLoadExecutor-2018-thread-1-processing-n:127.0.0.1:46421_) [n:127.0.0.1:46421_ c:control_collection   x:collection1] o.a.s.s.OpenExchangeRatesOrgProvider Unknown key IMPORTANT NOTE
>    [junit4]   2> 504537 WARN  (coreLoadExecutor-2018-thread-1-processing-n:127.0.0.1:46421_) [n:127.0.0.1:46421_ c:control_collection   x:collection1] o.a.s.s.OpenExchangeRatesOrgProvider Expected key, got STRING
>    [junit4]   2> 504538 INFO  (coreLoadExecutor-2018-thread-1-processing-n:127.0.0.1:46421_) [n:127.0.0.1:46421_ c:control_collection   x:collection1] o.a.s.c.ConfigSetProperties Did not find ConfigSet properties, assuming default properties: Can't find resource 'configsetprops.json' in classpath or '/configs/conf1', cwd=/home/jenkins/workspace/Lucene-Solr-5.x-Linux/solr/build/solr-core/test/J1
>    [junit4]   2> 504538 INFO  (coreLoadExecutor-2018-thread-1-processing-n:127.0.0.1:46421_) [n:127.0.0.1:46421_ c:control_collection   x:collection1] o.a.s.c.CoreContainer Creating SolrCore 'collection1' using configuration from collection control_collection
>    [junit4]   2> 504538 INFO  (coreLoadExecutor-2018-thread-1-processing-n:127.0.0.1:46421_) [n:127.0.0.1:46421_ c:control_collection s:shard1 r:core_node1 x:collection1] o.a.s.c.SolrCore org.apache.solr.core.MockDirectoryFactory
>    [junit4]   2> 504538 INFO  (coreLoadExecutor-2018-thread-1-processing-n:127.0.0.1:46421_) [n:127.0.0.1:46421_ c:control_collection s:shard1 r:core_node1 x:collection1] o.a.s.c.SolrCore [[collection1] ] Opening new SolrCore at [/home/jenkins/workspace/Lucene-Solr-5.x-Linux/solr/build/solr-core/test/J1/../../../../../../../../../home/jenkins/workspace/Lucene-Solr-5.x-Linux/solr/build/solr-core/test/J1/temp/solr.cloud.TestRandomRequestDistribution_22A970802826A759-001/control-001/cores/collection1/], dataDir=[null]
>    [junit4]   2> 504538 INFO  (coreLoadExecutor-2018-thread-1-processing-n:127.0.0.1:46421_) [n:127.0.0.1:46421_ c:control_collection s:shard1 r:core_node1 x:collection1] o.a.s.c.JmxMonitoredMap JMX monitoring is enabled. Adding Solr mbeans to JMX Server: com.sun.jmx.mbeanserver.JmxMBeanServer@6e3e2c5f
>    [junit4]   2> 504539 INFO  (coreLoadExecutor-2018-thread-1-processing-n:127.0.0.1:46421_) [n:127.0.0.1:46421_ c:control_collection s:shard1 r:core_node1 x:collection1] o.a.s.c.CachingDirectoryFactory return new directory for /home/jenkins/workspace/Lucene-Solr-5.x-Linux/solr/build/solr-core/test/J1/../../../../../../../../../home/jenkins/workspace/Lucene-Solr-5.x-Linux/solr/build/solr-core/test/J1/temp/solr.cloud.TestRandomRequestDistribution_22A970802826A759-001/control-001/cores/collection1/data
>    [junit4]   2> 504539 INFO  (coreLoadExecutor-2018-thread-1-processing-n:127.0.0.1:46421_) [n:127.0.0.1:46421_ c:control_collection s:shard1 r:core_node1 x:collection1] o.a.s.c.SolrCore New index directory detected: old=null new=/home/jenkins/workspace/Lucene-Solr-5.x-Linux/solr/build/solr-core/test/J1/../../../../../../../../../home/jenkins/workspace/Lucene-Solr-5.x-Linux/solr/build/solr-core/test/J1/temp/solr.cloud.TestRandomRequestDistribution_22A970802826A759-001/control-001/cores/collection1/data/index/
>    [junit4]   2> 504539 WARN  (coreLoadExecutor-2018-thread-1-processing-n:127.0.0.1:46421_) [n:127.0.0.1:46421_ c:control_collection s:shard1 r:core_node1 x:collection1] o.a.s.c.SolrCore [collection1] Solr index directory '/home/jenkins/workspace/Lucene-Solr-5.x-Linux/solr/build/solr-core/test/J1/../../../../../../../../../home/jenkins/workspace/Lucene-Solr-5.x-Linux/solr/build/solr-core/test/J1/temp/solr.cloud.TestRandomRequestDistribution_22A970802826A759-001/control-001/cores/collection1/data/index' doesn't exist. Creating new index...
>    [junit4]   2> 504539 INFO  (coreLoadExecutor-2018-thread-1-processing-n:127.0.0.1:46421_) [n:127.0.0.1:46421_ c:control_collection s:shard1 r:core_node1 x:collection1] o.a.s.c.CachingDirectoryFactory return new directory for /home/jenkins/workspace/Lucene-Solr-5.x-Linux/solr/build/solr-core/test/J1/../../../../../../../../../home/jenkins/workspace/Lucene-Solr-5.x-Linux/solr/build/solr-core/test/J1/temp/solr.cloud.TestRandomRequestDistribution_22A970802826A759-001/control-001/cores/collection1/data/index
>    [junit4]   2> 504539 INFO  (coreLoadExecutor-2018-thread-1-processing-n:127.0.0.1:46421_) [n:127.0.0.1:46421_ c:control_collection s:shard1 r:core_node1 x:collection1] o.a.s.u.RandomMergePolicy RandomMergePolicy wrapping class org.apache.lucene.index.TieredMergePolicy: [TieredMergePolicy: maxMergeAtOnce=10, maxMergeAtOnceExplicit=46, maxMergedSegmentMB=44.51171875, floorSegmentMB=1.505859375, forceMergeDeletesPctAllowed=10.539144636991653, segmentsPerTier=29.0, maxCFSSegmentSizeMB=8.796093022207999E12, noCFSRatio=0.14750998967572526
>    [junit4]   2> 504540 INFO  (coreLoadExecutor-2018-thread-1-processing-n:127.0.0.1:46421_) [n:127.0.0.1:46421_ c:control_collection s:shard1 r:core_node1 x:collection1] o.a.s.c.SolrCore SolrDeletionPolicy.onCommit: commits: num=1
>    [junit4]   2>        commit{dir=MockDirectoryWrapper(RAMDirectory@364c50eb lockFactory=org.apache.lucene.store.SingleInstanceLockFactory@6b8ead56),segFN=segments_1,generation=1}
>    [junit4]   2> 504540 INFO  (coreLoadExecutor-2018-thread-1-processing-n:127.0.0.1:46421_) [n:127.0.0.1:46421_ c:control_collection s:shard1 r:core_node1 x:collection1] o.a.s.c.SolrCore newest commit generation = 1
>    [junit4]   2> 504540 INFO  (OldIndexDirectoryCleanupThreadForCore-collection1) [n:127.0.0.1:46421_ c:control_collection s:shard1 r:core_node1 x:collection1] o.a.s.c.SolrCore Looking for old index directories to cleanup for core collection1 in /home/jenkins/workspace/Lucene-Solr-5.x-Linux/solr/build/solr-core/test/J1/../../../../../../../../../home/jenkins/workspace/Lucene-Solr-5.x-Linux/solr/build/solr-core/test/J1/temp/solr.cloud.TestRandomRequestDistribution_22A970802826A759-001/control-001/cores/collection1/data/
>    [junit4]   2> 504540 WARN  (OldIndexDirectoryCleanupThreadForCore-collection1) [n:127.0.0.1:46421_ c:control_collection s:shard1 r:core_node1 x:collection1] o.a.s.c.DirectoryFactory /home/jenkins/workspace/Lucene-Solr-5.x-Linux/solr/build/solr-core/test/J1/../../../../../../../../../home/jenkins/workspace/Lucene-Solr-5.x-Linux/solr/build/solr-core/test/J1/temp/solr.cloud.TestRandomRequestDistribution_22A970802826A759-001/control-001/cores/collection1/data/ does not point to a valid data directory; skipping clean-up of old index directories.
>    [junit4]   2> 504542 INFO  (coreLoadExecutor-2018-thread-1-processing-n:127.0.0.1:46421_) [n:127.0.0.1:46421_ c:control_collection s:shard1 r:core_node1 x:collection1] o.a.s.u.p.UpdateRequestProcessorChain creating updateRequestProcessorChain "nodistrib"
>    [junit4]   2> 504542 INFO  (coreLoadExecutor-2018-thread-1-processing-n:127.0.0.1:46421_) [n:127.0.0.1:46421_ c:control_collection s:shard1 r:core_node1 x:collection1] o.a.s.u.p.UpdateRequestProcessorChain creating updateRequestProcessorChain "dedupe"
>    [junit4]   2> 504542 INFO  (coreLoadExecutor-2018-thread-1-processing-n:127.0.0.1:46421_) [n:127.0.0.1:46421_ c:control_collection s:shard1 r:core_node1 x:collection1] o.a.s.u.p.UpdateRequestProcessorChain inserting DistributedUpdateProcessorFactory into updateRequestProcessorChain "dedupe"
>    [junit4]   2> 504542 INFO  (coreLoadExecutor-2018-thread-1-processing-n:127.0.0.1:46421_) [n:127.0.0.1:46421_ c:control_collection s:shard1 r:core_node1 x:collection1] o.a.s.u.p.UpdateRequestProcessorChain creating updateRequestProcessorChain "stored_sig"
>    [junit4]   2> 504542 INFO  (coreLoadExecutor-2018-thread-1-processing-n:127.0.0.1:46421_) [n:127.0.0.1:46421_ c:control_collection s:shard1 r:core_node1 x:collection1] o.a.s.u.p.UpdateRequestProcessorChain inserting DistributedUpdateProcessorFactory into updateRequestProcessorChain "stored_sig"
>    [junit4]   2> 504543 INFO  (coreLoadExecutor-2018-thread-1-processing-n:127.0.0.1:46421_) [n:127.0.0.1:46421_ c:control_collection s:shard1 r:core_node1 x:collection1] o.a.s.u.p.UpdateRequestProcessorChain creating updateRequestProcessorChain "distrib-dup-test-chain-explicit"
>    [junit4]   2> 504543 INFO  (coreLoadExecutor-2018-thread-1-processing-n:127.0.0.1:46421_) [n:127.0.0.1:46421_ c:control_collection s:shard1 r:core_node1 x:collection1] o.a.s.u.p.UpdateRequestProcessorChain creating updateRequestProcessorChain "distrib-dup-test-chain-implicit"
>    [junit4]   2> 504543 INFO  (coreLoadExecutor-2018-thread-1-processing-n:127.0.0.1:46421_) [n:127.0.0.1:46421_ c:control_collection s:shard1 r:core_node1 x:collection1] o.a.s.u.p.UpdateRequestProcessorChain inserting DistributedUpdateProcessorFactory into updateRequestProcessorChain "distrib-dup-test-chain-implicit"
>    [junit4]   2> 504543 INFO  (coreLoadExecutor-2018-thread-1-processing-n:127.0.0.1:46421_) [n:127.0.0.1:46421_ c:control_collection s:shard1 r:core_node1 x:collection1] o.a.s.c.SolrCore no updateRequestProcessorChain defined as default, creating implicit default
>    [junit4]   2> 504544 INFO  (coreLoadExecutor-2018-thread-1-processing-n:127.0.0.1:46421_) [n:127.0.0.1:46421_ c:control_collection s:shard1 r:core_node1 x:collection1] o.a.s.h.l.XMLLoader xsltCacheLifetimeSeconds=60
>    [junit4]   2> 504545 INFO  (coreLoadExecutor-2018-thread-1-processing-n:127.0.0.1:46421_) [n:127.0.0.1:46421_ c:control_collection s:shard1 r:core_node1 x:collection1] o.a.s.h.l.XMLLoader xsltCacheLifetimeSeconds=60
>    [junit4]   2> 504545 INFO  (coreLoadExecutor-2018-thread-1-processing-n:127.0.0.1:46421_) [n:127.0.0.1:46421_ c:control_collection s:shard1 r:core_node1 x:collection1] o.a.s.h.l.XMLLoader xsltCacheLifetimeSeconds=60
>    [junit4]   2> 504546 INFO  (coreLoadExecutor-2018-thread-1-processing-n:127.0.0.1:46421_) [n:127.0.0.1:46421_ c:control_collection s:shard1 r:core_node1 x:collection1] o.a.s.h.l.XMLLoader xsltCacheLifetimeSeconds=60
>    [junit4]   2> 504547 INFO  (coreLoadExecutor-2018-thread-1-processing-n:127.0.0.1:46421_) [n:127.0.0.1:46421_ c:control_collection s:shard1 r:core_node1 x:collection1] o.a.s.c.RequestHandlers Registered paths: /admin/mbeans,standard,/update/csv,/update/json/docs,/admin/luke,/admin/segments,/get,/admin/system,/replication,/admin/properties,/config,/schema,/admin/plugins,/admin/logging,/update/json,/admin/threads,/admin/ping,/update,/admin/file
>    [junit4]   2> 504548 INFO  (coreLoadExecutor-2018-thread-1-processing-n:127.0.0.1:46421_) [n:127.0.0.1:46421_ c:control_collection s:shard1 r:core_node1 x:collection1] o.a.s.c.SolrCore Using default statsCache cache: org.apache.solr.search.stats.LocalStatsCache
>    [junit4]   2> 504548 INFO  (coreLoadExecutor-2018-thread-1-processing-n:127.0.0.1:46421_) [n:127.0.0.1:46421_ c:control_collection s:shard1 r:core_node1 x:collection1] o.a.s.u.UpdateHandler Using UpdateLog implementation: org.apache.solr.update.UpdateLog
>    [junit4]   2> 504548 INFO  (coreLoadExecutor-2018-thread-1-processing-n:127.0.0.1:46421_) [n:127.0.0.1:46421_ c:control_collection s:shard1 r:core_node1 x:collection1] o.a.s.u.UpdateLog Initializing UpdateLog: dataDir= defaultSyncLevel=FLUSH numRecordsToKeep=100 maxNumLogsToKeep=10 numVersionBuckets=65536
>    [junit4]   2> 504549 INFO  (coreLoadExecutor-2018-thread-1-processing-n:127.0.0.1:46421_) [n:127.0.0.1:46421_ c:control_collection s:shard1 r:core_node1 x:collection1] o.a.s.c.SolrCore Hard AutoCommit: disabled
>    [junit4]   2> 504549 INFO  (coreLoadExecutor-2018-thread-1-processing-n:127.0.0.1:46421_) [n:127.0.0.1:46421_ c:control_collection s:shard1 r:core_node1 x:collection1] o.a.s.c.SolrCore Soft AutoCommit: disabled
>    [junit4]   2> 504549 INFO  (coreLoadExecutor-2018-thread-1-processing-n:127.0.0.1:46421_) [n:127.0.0.1:46421_ c:control_collection s:shard1 r:core_node1 x:collection1] o.a.s.u.RandomMergePolicy RandomMergePolicy wrapping class org.apache.lucene.index.LogDocMergePolicy: [LogDocMergePolicy: minMergeSize=1000, mergeFactor=28, maxMergeSize=9223372036854775807, maxMergeSizeForForcedMerge=9223372036854775807, calibrateSizeByDeletes=false, maxMergeDocs=2147483647, maxCFSSegmentSizeMB=8.796093022207999E12, noCFSRatio=0.1042184761596972]
>    [junit4]   2> 504550 INFO  (coreLoadExecutor-2018-thread-1-processing-n:127.0.0.1:46421_) [n:127.0.0.1:46421_ c:control_collection s:shard1 r:core_node1 x:collection1] o.a.s.c.SolrCore SolrDeletionPolicy.onInit: commits: num=1
>    [junit4]   2>        commit{dir=MockDirectoryWrapper(RAMDirectory@364c50eb lockFactory=org.apache.lucene.store.SingleInstanceLockFactory@6b8ead56),segFN=segments_1,generation=1}
>    [junit4]   2> 504550 INFO  (coreLoadExecutor-2018-thread-1-processing-n:127.0.0.1:46421_) [n:127.0.0.1:46421_ c:control_collection s:shard1 r:core_node1 x:collection1] o.a.s.c.SolrCore newest commit generation = 1
>    [junit4]   2> 504550 INFO  (coreLoadExecutor-2018-thread-1-processing-n:127.0.0.1:46421_) [n:127.0.0.1:46421_ c:control_collection s:shard1 r:core_node1 x:collection1] o.a.s.s.SolrIndexSearcher Opening Searcher@206cff40[collection1] main
>    [junit4]   2> 504550 INFO  (coreLoadExecutor-2018-thread-1-processing-n:127.0.0.1:46421_) [n:127.0.0.1:46421_ c:control_collection s:shard1 r:core_node1 x:collection1] o.a.s.c.c.ZkStateReader Load collection config from:/collections/control_collection
>    [junit4]   2> 504550 INFO  (coreLoadExecutor-2018-thread-1-processing-n:127.0.0.1:46421_) [n:127.0.0.1:46421_ c:control_collection s:shard1 r:core_node1 x:collection1] o.a.s.c.c.ZkStateReader path=/collections/control_collection configName=conf1 specified config exists in ZooKeeper
>    [junit4]   2> 504550 INFO  (coreLoadExecutor-2018-thread-1-processing-n:127.0.0.1:46421_) [n:127.0.0.1:46421_ c:control_collection s:shard1 r:core_node1 x:collection1] o.a.s.r.ManagedResourceStorage Setting up ZooKeeper-based storage for the RestManager with znodeBase: /configs/conf1
>    [junit4]   2> 504551 INFO  (coreLoadExecutor-2018-thread-1-processing-n:127.0.0.1:46421_) [n:127.0.0.1:46421_ c:control_collection s:shard1 r:core_node1 x:collection1] o.a.s.r.ManagedResourceStorage Configured ZooKeeperStorageIO with znodeBase: /configs/conf1
>    [junit4]   2> 504551 INFO  (coreLoadExecutor-2018-thread-1-processing-n:127.0.0.1:46421_) [n:127.0.0.1:46421_ c:control_collection s:shard1 r:core_node1 x:collection1] o.a.s.r.RestManager Initializing RestManager with initArgs: {}
>    [junit4]   2> 504551 INFO  (coreLoadExecutor-2018-thread-1-processing-n:127.0.0.1:46421_) [n:127.0.0.1:46421_ c:control_collection s:shard1 r:core_node1 x:collection1] o.a.s.r.ManagedResourceStorage Reading _rest_managed.json using ZooKeeperStorageIO:path=/configs/conf1
>    [junit4]   2> 504551 INFO  (coreLoadExecutor-2018-thread-1-processing-n:127.0.0.1:46421_) [n:127.0.0.1:46421_ c:control_collection s:shard1 r:core_node1 x:collection1] o.a.s.r.ManagedResourceStorage No data found for znode /configs/conf1/_rest_managed.json
>    [junit4]   2> 504551 INFO  (coreLoadExecutor-2018-thread-1-processing-n:127.0.0.1:46421_) [n:127.0.0.1:46421_ c:control_collection s:shard1 r:core_node1 x:collection1] o.a.s.r.ManagedResourceStorage Loaded null at path _rest_managed.json using ZooKeeperStorageIO:path=/configs/conf1
>    [junit4]   2> 504551 INFO  (coreLoadExecutor-2018-thread-1-processing-n:127.0.0.1:46421_) [n:127.0.0.1:46421_ c:control_collection s:shard1 r:core_node1 x:collection1] o.a.s.r.RestManager Initializing 0 registered ManagedResources
>    [junit4]   2> 504551 INFO  (coreLoadExecutor-2018-thread-1-processing-n:127.0.0.1:46421_) [n:127.0.0.1:46421_ c:control_collection s:shard1 r:core_node1 x:collection1] o.a.s.h.ReplicationHandler Commits will be reserved for  10000
>    [junit4]   2> 504552 INFO  (searcherExecutor-2019-thread-1-processing-n:127.0.0.1:46421_ x:collection1 s:shard1 c:control_collection r:core_node1) [n:127.0.0.1:46421_ c:control_collection s:shard1 r:core_node1 x:collection1] o.a.s.c.SolrCore [collection1] Registered new searcher Searcher@206cff40[collection1] main{ExitableDirectoryReader(UninvertingDirectoryReader())}
>    [junit4]   2> 504552 INFO  (coreLoadExecutor-2018-thread-1-processing-n:127.0.0.1:46421_) [n:127.0.0.1:46421_ c:control_collection s:shard1 r:core_node1 x:collection1] o.a.s.u.UpdateLog Looking up max value of version field to seed version buckets
>    [junit4]   2> 504552 INFO  (coreLoadExecutor-2018-thread-1-processing-n:127.0.0.1:46421_) [n:127.0.0.1:46421_ c:control_collection s:shard1 r:core_node1 x:collection1] o.a.s.u.VersionInfo Refreshing highest value of _version_ for 65536 version buckets from index
>    [junit4]   2> 504552 INFO  (coreLoadExecutor-2018-thread-1-processing-n:127.0.0.1:46421_) [n:127.0.0.1:46421_ c:control_collection s:shard1 r:core_node1 x:collection1] o.a.s.u.VersionInfo No terms found for _version_, cannot seed version bucket highest value from index
>    [junit4]   2> 504552 INFO  (coreLoadExecutor-2018-thread-1-processing-n:127.0.0.1:46421_) [n:127.0.0.1:46421_ c:control_collection s:shard1 r:core_node1 x:collection1] o.a.s.u.UpdateLog Could not find max version in index or recent updates, using new clock 1509301429826748416
>    [junit4]   2> 504554 INFO  (coreLoadExecutor-2018-thread-1-processing-n:127.0.0.1:46421_) [n:127.0.0.1:46421_ c:control_collection s:shard1 r:core_node1 x:collection1] o.a.s.u.UpdateLog Took 2 ms to seed version buckets with highest version 1509301429826748416
>    [junit4]   2> 504554 INFO  (coreLoadExecutor-2018-thread-1-processing-n:127.0.0.1:46421_) [n:127.0.0.1:46421_ c:control_collection s:shard1 r:core_node1 x:collection1] o.a.s.c.ZkController watch zkdir /configs/conf1
>    [junit4]   2> 504554 INFO  (coreLoadExecutor-2018-thread-1-processing-n:127.0.0.1:46421_) [n:127.0.0.1:46421_ c:control_collection s:shard1 r:core_node1 x:collection1] o.a.s.c.CoreContainer registering core: collection1
>    [junit4]   2> 504554 INFO  (coreZkRegister-2012-thread-1-processing-n:127.0.0.1:46421_ x:collection1 s:shard1 c:control_collection r:core_node1) [n:127.0.0.1:46421_ c:control_collection s:shard1 r:core_node1 x:collection1] o.a.s.c.ZkController Register replica - core:collection1 address:http://127.0.0.1:46421 collection:control_collection shard:shard1
>    [junit4]   2> 504555 INFO  (coreZkRegister-2012-thread-1-processing-n:127.0.0.1:46421_ x:collection1 s:shard1 c:control_collection r:core_node1) [n:127.0.0.1:46421_ c:control_collection s:shard1 r:core_node1 x:collection1] o.a.s.c.c.SolrZkClient makePath: /collections/control_collection/leader_elect/shard1/election
>    [junit4]   2> 504571 INFO  (coreZkRegister-2012-thread-1-processing-n:127.0.0.1:46421_ x:collection1 s:shard1 c:control_collection r:core_node1) [n:127.0.0.1:46421_ c:control_collection s:shard1 r:core_node1 x:collection1] o.a.s.c.LeaderElector Joined leadership election with path: /collections/control_collection/leader_elect/shard1/election/94331339272749060-core_node1-n_0000000000
>    [junit4]   2> 504572 INFO  (coreZkRegister-2012-thread-1-processing-n:127.0.0.1:46421_ x:collection1 s:shard1 c:control_collection r:core_node1) [n:127.0.0.1:46421_ c:control_collection s:shard1 r:core_node1 x:collection1] o.a.s.c.ShardLeaderElectionContext Running the leader process for shard shard1
>    [junit4]   2> 504572 INFO  (zkCallback-1484-thread-1-processing-n:127.0.0.1:46421_) [n:127.0.0.1:46421_    ] o.a.s.c.DistributedQueue NodeChildrenChanged fired on path /overseer/queue state SyncConnected
>    [junit4]   2> 504572 INFO  (coreZkRegister-2012-thread-1-processing-n:127.0.0.1:46421_ x:collection1 s:shard1 c:control_collection r:core_node1) [n:127.0.0.1:46421_ c:control_collection s:shard1 r:core_node1 x:collection1] o.a.s.c.ShardLeaderElectionContext Enough replicas found to continue.
>    [junit4]   2> 504572 INFO  (coreZkRegister-2012-thread-1-processing-n:127.0.0.1:46421_ x:collection1 s:shard1 c:control_collection r:core_node1) [n:127.0.0.1:46421_ c:control_collection s:shard1 r:core_node1 x:collection1] o.a.s.c.ShardLeaderElectionContext I may be the new leader - try and sync
>    [junit4]   2> 504572 INFO  (coreZkRegister-2012-thread-1-processing-n:127.0.0.1:46421_ x:collection1 s:shard1 c:control_collection r:core_node1) [n:127.0.0.1:46421_ c:control_collection s:shard1 r:core_node1 x:collection1] o.a.s.c.SyncStrategy Sync replicas to http://127.0.0.1:46421/collection1/
>    [junit4]   2> 504572 INFO  (OverseerStateUpdate-94331339272749060-127.0.0.1:46421_-n_0000000000) [n:127.0.0.1:46421_    ] o.a.s.c.Overseer processMessage: queueSize: 1, message = {
>    [junit4]   2>   "operation":"leader",
>    [junit4]   2>   "shard":"shard1",
>    [junit4]   2>   "collection":"control_collection"} current state version: 1
>    [junit4]   2> 504572 INFO  (coreZkRegister-2012-thread-1-processing-n:127.0.0.1:46421_ x:collection1 s:shard1 c:control_collection r:core_node1) [n:127.0.0.1:46421_ c:control_collection s:shard1 r:core_node1 x:collection1] o.a.s.c.SyncStrategy Sync Success - now sync replicas to me
>    [junit4]   2> 504573 INFO  (coreZkRegister-2012-thread-1-processing-n:127.0.0.1:46421_ x:collection1 s:shard1 c:control_collection r:core_node1) [n:127.0.0.1:46421_ c:control_collection s:shard1 r:core_node1 x:collection1] o.a.s.c.SyncStrategy http://127.0.0.1:46421/collection1/ has no replicas
>    [junit4]   2> 504573 INFO  (coreZkRegister-2012-thread-1-processing-n:127.0.0.1:46421_ x:collection1 s:shard1 c:control_collection r:core_node1) [n:127.0.0.1:46421_ c:control_collection s:shard1 r:core_node1 x:collection1] o.a.s.c.ShardLeaderElectionContext I am the new leader: http://127.0.0.1:46421/collection1/ shard1
>    [junit4]   2> 504573 INFO  (coreZkRegister-2012-thread-1-processing-n:127.0.0.1:46421_ x:collection1 s:shard1 c:control_collection r:core_node1) [n:127.0.0.1:46421_ c:control_collection s:shard1 r:core_node1 x:collection1] o.a.s.c.c.SolrZkClient makePath: /collections/control_collection/leaders/shard1
>    [junit4]   2> 504574 INFO  (zkCallback-1484-thread-1-processing-n:127.0.0.1:46421_) [n:127.0.0.1:46421_    ] o.a.s.c.DistributedQueue NodeChildrenChanged fired on path /overseer/queue state SyncConnected
>    [junit4]   2> 504574 INFO  (OverseerStateUpdate-94331339272749060-127.0.0.1:46421_-n_0000000000) [n:127.0.0.1:46421_    ] o.a.s.c.Overseer processMessage: queueSize: 1, message = {
>    [junit4]   2>   "operation":"leader",
>    [junit4]   2>   "shard":"shard1",
>    [junit4]   2>   "collection":"control_collection",
>    [junit4]   2>   "base_url":"http://127.0.0.1:46421",
>    [junit4]   2>   "core":"collection1",
>    [junit4]   2>   "state":"active"} current state version: 1
>    [junit4]   2> 504675 INFO  (zkCallback-1484-thread-1-processing-n:127.0.0.1:46421_) [n:127.0.0.1:46421_    ] o.a.s.c.c.ZkStateReader A cluster state change: WatchedEvent state:SyncConnected type:NodeDataChanged path:/clusterstate.json, has occurred - updating... (live nodes size: 1)
>    [junit4]   2> 504724 INFO  (coreZkRegister-2012-thread-1-processing-n:127.0.0.1:46421_ x:collection1 s:shard1 c:control_collection r:core_node1) [n:127.0.0.1:46421_ c:control_collection s:shard1 r:core_node1 x:collection1] o.a.s.c.ZkController We are http://127.0.0.1:46421/collection1/ and leader is http://127.0.0.1:46421/collection1/
>    [junit4]   2> 504725 INFO  (coreZkRegister-2012-thread-1-processing-n:127.0.0.1:46421_ x:collection1 s:shard1 c:control_collection r:core_node1) [n:127.0.0.1:46421_ c:control_collection s:shard1 r:core_node1 x:collection1] o.a.s.c.ZkController No LogReplay needed for core=collection1 baseURL=http://127.0.0.1:46421
>    [junit4]   2> 504725 INFO  (coreZkRegister-2012-thread-1-processing-n:127.0.0.1:46421_ x:collection1 s:shard1 c:control_collection r:core_node1) [n:127.0.0.1:46421_ c:control_collection s:shard1 r:core_node1 x:collection1] o.a.s.c.ZkController I am the leader, no recovery necessary
>    [junit4]   2> 504725 INFO  (coreZkRegister-2012-thread-1-processing-n:127.0.0.1:46421_ x:collection1 s:shard1 c:control_collection r:core_node1) [n:127.0.0.1:46421_ c:control_collection s:shard1 r:core_node1 x:collection1] o.a.s.c.ZkController publishing state=active
>    [junit4]   2> 504725 INFO  (coreZkRegister-2012-thread-1-processing-n:127.0.0.1:46421_ x:collection1 s:shard1 c:control_collection r:core_node1) [n:127.0.0.1:46421_ c:control_collection s:shard1 r:core_node1 x:collection1] o.a.s.c.ZkController numShards not found on descriptor - reading it from system property
>    [junit4]   2> 504726 INFO  (zkCallback-1484-thread-1-processing-n:127.0.0.1:46421_) [n:127.0.0.1:46421_    ] o.a.s.c.DistributedQueue NodeChildrenChanged fired on path /overseer/queue state SyncConnected
>    [junit4]   2> 504726 INFO  (OverseerStateUpdate-94331339272749060-127.0.0.1:46421_-n_0000000000) [n:127.0.0.1:46421_    ] o.a.s.c.Overseer processMessage: queueSize: 1, message = {
>    [junit4]   2>   "core":"collection1",
>    [junit4]   2>   "core_node_name":"core_node1",
>    [junit4]   2>   "roles":null,
>    [junit4]   2>   "base_url":"http://127.0.0.1:46421",
>    [junit4]   2>   "node_name":"127.0.0.1:46421_",
>    [junit4]   2>   "numShards":"1",
>    [junit4]   2>   "state":"active",
>    [junit4]   2>   "shard":"shard1",
>    [junit4]   2>   "collection":"control_collection",
>    [junit4]   2>   "operation":"state"} current state version: 2
>    [junit4]   2> 504726 INFO  (OverseerStateUpdate-94331339272749060-127.0.0.1:46421_-n_0000000000) [n:127.0.0.1:46421_    ] o.a.s.c.o.ReplicaMutator Update state numShards=1 message={
>    [junit4]   2>   "core":"collection1",
>    [junit4]   2>   "core_node_name":"core_node1",
>    [junit4]   2>   "roles":null,
>    [junit4]   2>   "base_url":"http://127.0.0.1:46421",
>    [junit4]   2>   "node_name":"127.0.0.1:46421_",
>    [junit4]   2>   "numShards":"1",
>    [junit4]   2>   "state":"active",
>    [junit4]   2>   "shard":"shard1",
>    [junit4]   2>   "collection":"control_collection",
>    [junit4]   2>   "operation":"state"}
>    [junit4]   2> 504836 INFO  (zkCallback-1484-thread-1-processing-n:127.0.0.1:46421_) [n:127.0.0.1:46421_    ] o.a.s.c.c.ZkStateReader A cluster state change: WatchedEvent state:SyncConnected type:NodeDataChanged path:/clusterstate.json, has occurred - updating... (live nodes size: 1)
>    [junit4]   2> 504953 INFO  (TEST-TestRandomRequestDistribution.testRequestTracking-seed#[22A970802826A759]) [    ] o.a.s.c.c.SolrZkClient Using default ZkCredentialsProvider
>    [junit4]   2> 504953 INFO  (TEST-TestRandomRequestDistribution.testRequestTracking-seed#[22A970802826A759]) [    ] o.a.s.c.c.ConnectionManager Waiting for client to connect to ZooKeeper
>    [junit4]   2> 504955 INFO  (zkCallback-1486-thread-1) [    ] o.a.s.c.c.ConnectionManager Watcher org.apache.solr.common.cloud.ConnectionManager@3e928804 name:ZooKeeperConnection Watcher:127.0.0.1:41772/solr got event WatchedEvent state:SyncConnected type:None path:null path:null type:None
>    [junit4]   2> 504955 INFO  (TEST-TestRandomRequestDistribution.testRequestTracking-seed#[22A970802826A759]) [    ] o.a.s.c.c.ConnectionManager Client is connected to ZooKeeper
>    [junit4]   2> 504955 INFO  (TEST-TestRandomRequestDistribution.testRequestTracking-seed#[22A970802826A759]) [    ] o.a.s.c.c.SolrZkClient Using default ZkACLProvider
>    [junit4]   2> 504955 INFO  (TEST-TestRandomRequestDistribution.testRequestTracking-seed#[22A970802826A759]) [    ] o.a.s.c.c.ZkStateReader Updating cluster state from ZooKeeper...
>    [junit4]   2> 504957 INFO  (TEST-TestRandomRequestDistribution.testRequestTracking-seed#[22A970802826A759]) [    ] o.a.s.c.ChaosMonkey monkey: init - expire sessions:false cause connection loss:false
>    [junit4]   2> 505002 INFO  (TEST-TestRandomRequestDistribution.testRequestTracking-seed#[22A970802826A759]) [    ] o.a.s.SolrTestCaseJ4 Writing core.properties file to /home/jenkins/workspace/Lucene-Solr-5.x-Linux/solr/build/solr-core/test/J1/temp/solr.cloud.TestRandomRequestDistribution_22A970802826A759-001/shard-1-001/cores/collection1
>    [junit4]   2> 505003 INFO  (TEST-TestRandomRequestDistribution.testRequestTracking-seed#[22A970802826A759]) [    ] o.a.s.c.AbstractFullDistribZkTestBase create jetty 1 in directory /home/jenkins/workspace/Lucene-Solr-5.x-Linux/solr/build/solr-core/test/J1/temp/solr.cloud.TestRandomRequestDistribution_22A970802826A759-001/shard-1-001
>    [junit4]   2> 505004 INFO  (TEST-TestRandomRequestDistribution.testRequestTracking-seed#[22A970802826A759]) [    ] o.e.j.s.Server jetty-9.2.11.v20150529
>    [junit4]   2> 505004 INFO  (TEST-TestRandomRequestDistribution.testRequestTracking-seed#[22A970802826A759]) [    ] o.e.j.s.h.ContextHandler Started o.e.j.s.ServletContextHandler@27f264fd{/,null,AVAILABLE}
>    [junit4]   2> 505005 INFO  (TEST-TestRandomRequestDistribution.testRequestTracking-seed#[22A970802826A759]) [    ] o.e.j.s.ServerConnector Started ServerConnector@58de2d9e{HTTP/1.1}{127.0.0.1:49334}
>    [junit4]   2> 505005 INFO  (TEST-TestRandomRequestDistribution.testRequestTracking-seed#[22A970802826A759]) [    ] o.e.j.s.Server Started @506994ms
>    [junit4]   2> 505005 INFO  (TEST-TestRandomRequestDistribution.testRequestTracking-seed#[22A970802826A759]) [    ] o.a.s.c.s.e.JettySolrRunner Jetty properties: {solr.data.dir=/home/jenkins/workspace/Lucene-Solr-5.x-Linux/solr/build/solr-core/test/J1/temp/solr.cloud.TestRandomRequestDistribution_22A970802826A759-001/tempDir-001/jetty1, solrconfig=solrconfig.xml, hostContext=/, hostPort=49334, coreRootDirectory=/home/jenkins/workspace/Lucene-Solr-5.x-Linux/solr/build/solr-core/test/J1/../../../../../../../../../home/jenkins/workspace/Lucene-Solr-5.x-Linux/solr/build/solr-core/test/J1/temp/solr.cloud.TestRandomRequestDistribution_22A970802826A759-001/shard-1-001/cores}
>    [junit4]   2> 505005 INFO  (TEST-TestRandomRequestDistribution.testRequestTracking-seed#[22A970802826A759]) [    ] o.a.s.s.SolrDispatchFilter SolrDispatchFilter.init(): sun.misc.Launcher$AppClassLoader@45fe3ee3
>    [junit4]   2> 505005 INFO  (TEST-TestRandomRequestDistribution.testRequestTracking-seed#[22A970802826A759]) [    ] o.a.s.c.SolrResourceLoader new SolrResourceLoader for directory: '/home/jenkins/workspace/Lucene-Solr-5.x-Linux/solr/build/solr-core/test/J1/../../../../../../../../../home/jenkins/workspace/Lucene-Solr-5.x-Linux/solr/build/solr-core/test/J1/temp/solr.cloud.TestRandomRequestDistribution_22A970802826A759-001/shard-1-001/'
>    [junit4]   2> 505014 INFO  (TEST-TestRandomRequestDistribution.testRequestTracking-seed#[22A970802826A759]) [    ] o.a.s.c.c.SolrZkClient Using default ZkCredentialsProvider
>    [junit4]   2> 505014 INFO  (TEST-TestRandomRequestDistribution.testRequestTracking-seed#[22A970802826A759]) [    ] o.a.s.c.c.ConnectionManager Waiting for client to connect to ZooKeeper
>    [junit4]   2> 505015 INFO  (zkCallback-1487-thread-1) [    ] o.a.s.c.c.ConnectionManager Watcher org.apache.solr.common.cloud.ConnectionManager@3d7cf927 name:ZooKeeperConnection Watcher:127.0.0.1:41772/solr got event WatchedEvent state:SyncConnected type:None path:null path:null type:None
>    [junit4]   2> 505015 INFO  (TEST-TestRandomRequestDistribution.testRequestTracking-seed#[22A970802826A759]) [    ] o.a.s.c.c.ConnectionManager Client is connected to ZooKeeper
>    [junit4]   2> 505015 INFO  (TEST-TestRandomRequestDistribution.testRequestTracking-seed#[22A970802826A759]) [    ] o.a.s.c.c.SolrZkClient Using default ZkACLProvider
>    [junit4]   2> 505016 INFO  (TEST-TestRandomRequestDistribution.testRequestTracking-seed#[22A970802826A759]) [    ] o.a.s.s.SolrDispatchFilter Loading solr.xml from SolrHome (not found in ZooKeeper)
>    [junit4]   2> 505016 INFO  (TEST-TestRandomRequestDistribution.testRequestTracking-seed#[22A970802826A759]) [    ] o.a.s.c.SolrXmlConfig Loading container configuration from /home/jenkins/workspace/Lucene-Solr-5.x-Linux/solr/build/solr-core/test/J1/../../../../../../../../../home/jenkins/workspace/Lucene-Solr-5.x-Linux/solr/build/solr-core/test/J1/temp/solr.cloud.TestRandomRequestDistribution_22A970802826A759-001/shard-1-001/solr.xml
>    [junit4]   2> 505018 INFO  (TEST-TestRandomRequestDistribution.testRequestTracking-seed#[22A970802826A759]) [    ] o.a.s.c.CoresLocator Config-defined core root directory: /home/jenkins/workspace/Lucene-Solr-5.x-Linux/solr/build/solr-core/test/J1/../../../../../../../../../home/jenkins/workspace/Lucene-Solr-5.x-Linux/solr/build/solr-core/test/J1/temp/solr.cloud.TestRandomRequestDistribution_22A970802826A759-001/shard-1-001/cores
>    [junit4]   2> 505019 INFO  (TEST-TestRandomRequestDistribution.testRequestTracking-seed#[22A970802826A759]) [    ] o.a.s.c.CoreContainer New CoreContainer 438358459
>    [junit4]   2> 505019 INFO  (TEST-TestRandomRequestDistribution.testRequestTracking-seed#[22A970802826A759]) [    ] o.a.s.c.CoreContainer Loading cores into CoreContainer [instanceDir=/home/jenkins/workspace/Lucene-Solr-5.x-Linux/solr/build/solr-core/test/J1/../../../../../../../../../home/jenkins/workspace/Lucene-Solr-5.x-Linux/solr/build/solr-core/test/J1/temp/solr.cloud.TestRandomRequestDistribution_22A970802826A759-001/shard-1-001/]
>    [junit4]   2> 505019 INFO  (TEST-TestRandomRequestDistribution.testRequestTracking-seed#[22A970802826A759]) [    ] o.a.s.c.CoreContainer loading shared library: /home/jenkins/workspace/Lucene-Solr-5.x-Linux/solr/build/solr-core/test/J1/../../../../../../../../../home/jenkins/workspace/Lucene-Solr-5.x-Linux/solr/build/solr-core/test/J1/temp/solr.cloud.TestRandomRequestDistribution_22A970802826A759-001/shard-1-001/lib
>    [junit4]   2> 505019 WARN  (TEST-TestRandomRequestDistribution.testRequestTracking-seed#[22A970802826A759]) [    ] o.a.s.c.SolrResourceLoader Can't find (or read) directory to add to classloader: lib (resolved as: /home/jenkins/workspace/Lucene-Solr-5.x-Linux/solr/build/solr-core/test/J1/../../../../../../../../../home/jenkins/workspace/Lucene-Solr-5.x-Linux/solr/build/solr-core/test/J1/temp/solr.cloud.TestRandomRequestDistribution_22A970802826A759-001/shard-1-001/lib).
>    [junit4]   2> 505023 INFO  (TEST-TestRandomRequestDistribution.testRequestTracking-seed#[22A970802826A759]) [    ] o.a.s.h.c.HttpShardHandlerFactory created with socketTimeout : 90000,urlScheme : ,connTimeout : 15000,maxConnectionsPerHost : 20,maxConnections : 10000,corePoolSize : 0,maximumPoolSize : 2147483647,maxThreadIdleTime : 5,sizeOfQueue : -1,fairnessPolicy : false,useRetries : false,
>    [junit4]   2> 505024 INFO  (TEST-TestRandomRequestDistribution.testRequestTracking-seed#[22A970802826A759]) [    ] o.a.s.u.UpdateShardHandler Creating UpdateShardHandler HTTP client with params: socketTimeout=340000&connTimeout=45000&retry=true
>    [junit4]   2> 505024 INFO  (TEST-TestRandomRequestDistribution.testRequestTracking-seed#[22A970802826A759]) [    ] o.a.s.l.LogWatcher SLF4J impl is org.slf4j.impl.Log4jLoggerFactory
>    [junit4]   2> 505024 INFO  (TEST-TestRandomRequestDistribution.testRequestTracking-seed#[22A970802826A759]) [    ] o.a.s.l.LogWatcher Registering Log Listener [Log4j (org.slf4j.impl.Log4jLoggerFactory)]
>    [junit4]   2> 505024 INFO  (TEST-TestRandomRequestDistribution.testRequestTracking-seed#[22A970802826A759]) [    ] o.a.s.c.ZkContainer Zookeeper client=127.0.0.1:41772/solr
>    [junit4]   2> 505024 INFO  (TEST-TestRandomRequestDistribution.testRequestTracking-seed#[22A970802826A759]) [    ] o.a.s.c.ZkController zkHost includes chroot
>    [junit4]   2> 505024 INFO  (TEST-TestRandomRequestDistribution.testRequestTracking-seed#[22A970802826A759]) [    ] o.a.s.c.c.SolrZkClient Using default ZkCredentialsProvider
>    [junit4]   2> 505024 INFO  (TEST-TestRandomRequestDistribution.testRequestTracking-seed#[22A970802826A759]) [    ] o.a.s.c.c.ConnectionManager Waiting for client to connect to ZooKeeper
>    [junit4]   2> 505025 INFO  (zkCallback-1489-thread-1) [    ] o.a.s.c.c.ConnectionManager Watcher org.apache.solr.common.cloud.ConnectionManager@304f2eb4 name:ZooKeeperConnection Watcher:127.0.0.1:41772 got event WatchedEvent state:SyncConnected type:None path:null path:null type:None
>    [junit4]   2> 505025 INFO  (TEST-TestRandomRequestDistribution.testRequestTracking-seed#[22A970802826A759]) [    ] o.a.s.c.c.ConnectionManager Client is connected to ZooKeeper
>    [junit4]   2> 505026 INFO  (TEST-TestRandomRequestDistribution.testRequestTracking-seed#[22A970802826A759]) [    ] o.a.s.c.c.SolrZkClient Using default ZkACLProvider
>    [junit4]   2> 505026 INFO  (TEST-TestRandomRequestDistribution.testRequestTracking-seed#[22A970802826A759]) [n:127.0.0.1:49334_    ] o.a.s.c.c.ConnectionManager Waiting for client to connect to ZooKeeper
>    [junit4]   2> 505027 INFO  (zkCallback-1490-thread-1-processing-n:127.0.0.1:49334_) [n:127.0.0.1:49334_    ] o.a.s.c.c.ConnectionManager Watcher org.apache.solr.common.cloud.ConnectionManager@513ab5d7 name:ZooKeeperConnection Watcher:127.0.0.1:41772/solr got event WatchedEvent state:SyncConnected type:None path:null path:null type:None
>    [junit4]   2> 505027 INFO  (TEST-TestRandomRequestDistribution.testRequestTracking-seed#[22A970802826A759]) [n:127.0.0.1:49334_    ] o.a.s.c.c.ConnectionManager Client is connected to ZooKeeper
>    [junit4]   2> 505029 INFO  (TEST-TestRandomRequestDistribution.testRequestTracking-seed#[22A970802826A759]) [n:127.0.0.1:49334_    ] o.a.s.c.c.ZkStateReader Updating cluster state from ZooKeeper...
>    [junit4]   2> 506031 INFO  (TEST-TestRandomRequestDistribution.testRequestTracking-seed#[22A970802826A759]) [n:127.0.0.1:49334_    ] o.a.s.c.ZkController Register node as live in ZooKeeper:/live_nodes/127.0.0.1:49334_
>    [junit4]   2> 506031 INFO  (TEST-TestRandomRequestDistribution.testRequestTracking-seed#[22A970802826A759]) [n:127.0.0.1:49334_    ] o.a.s.c.c.SolrZkClient makePath: /live_nodes/127.0.0.1:49334_
>    [junit4]   2> 506032 INFO  (zkCallback-1486-thread-1) [    ] o.a.s.c.c.ZkStateReader A live node change: WatchedEvent state:SyncConnected type:NodeChildrenChanged path:/live_nodes, has occurred - updating... (live nodes size: 1)
>    [junit4]   2> 506032 INFO  (zkCallback-1484-thread-1-processing-n:127.0.0.1:46421_) [n:127.0.0.1:46421_    ] o.a.s.c.c.ZkStateReader A live node change: WatchedEvent state:SyncConnected type:NodeChildrenChanged path:/live_nodes, has occurred - updating... (live nodes size: 1)
>    [junit4]   2> 506032 INFO  (TEST-TestRandomRequestDistribution.testRequestTracking-seed#[22A970802826A759]) [n:127.0.0.1:49334_    ] o.a.s.c.Overseer Overseer (id=null) closing
>    [junit4]   2> 506034 INFO  (TEST-TestRandomRequestDistribution.testRequestTracking-seed#[22A970802826A759]) [n:127.0.0.1:49334_    ] o.a.s.c.LeaderElector Joined leadership election with path: /overseer_elect/election/94331339272749064-127.0.0.1:49334_-n_0000000001
>    [junit4]   2> 506034 INFO  (TEST-TestRandomRequestDistribution.testRequestTracking-seed#[22A970802826A759]) [n:127.0.0.1:49334_    ] o.a.s.c.LeaderElector Watching path /overseer_elect/election/94331339272749060-127.0.0.1:46421_-n_0000000000 to know if I could be the leader
>    [junit4]   2> 506037 INFO  (zkCallback-1490-thread-1-processing-n:127.0.0.1:49334_) [n:127.0.0.1:49334_    ] o.a.s.c.c.ZkStateReader A live node change: WatchedEvent state:SyncConnected type:NodeChildrenChanged path:/live_nodes, has occurred - updating... (live nodes size: 1)
>    [junit4]   2> 506044 INFO  (TEST-TestRandomRequestDistribution.testRequestTracking-seed#[22A970802826A759]) [n:127.0.0.1:49334_    ] o.a.s.c.CoreContainer Security conf doesn't exist. Skipping setup for authorization module.
>    [junit4]   2> 506045 INFO  (TEST-TestRandomRequestDistribution.testRequestTracking-seed#[22A970802826A759]) [n:127.0.0.1:49334_    ] o.a.s.c.CoreContainer No authentication plugin used.
>    [junit4]   2> 506045 INFO  (TEST-TestRandomRequestDistribution.testRequestTracking-seed#[22A970802826A759]) [n:127.0.0.1:49334_    ] o.a.s.c.CoresLocator Looking for core definitions underneath /home/jenkins/workspace/Lucene-Solr-5.x-Linux/solr/build/solr-core/test/J1/../../../../../../../../../home/jenkins/workspace/Lucene-Solr-5.x-Linux/solr/build/solr-core/test/J1/temp/solr.cloud.TestRandomRequestDistribution_22A970802826A759-001/shard-1-001/cores
>    [junit4]   2> 506046 INFO  (TEST-TestRandomRequestDistribution.testRequestTracking-seed#[22A970802826A759]) [n:127.0.0.1:49334_    ] o.a.s.c.SolrCore Created CoreDescriptor: {name=collection1, config=solrconfig.xml, transient=false, schema=schema.xml, loadOnStartup=true, configSetProperties=configsetprops.json, instanceDir=/home/jenkins/workspace/Lucene-Solr-5.x-Linux/solr/build/solr-core/test/J1/../../../../../../../../../home/jenkins/workspace/Lucene-Solr-5.x-Linux/solr/build/solr-core/test/J1/temp/solr.cloud.TestRandomRequestDistribution_22A970802826A759-001/shard-1-001/cores/collection1, collection=collection1, absoluteInstDir=/home/jenkins/workspace/Lucene-Solr-5.x-Linux/solr/build/solr-core/test/J1/../../../../../../../../../home/jenkins/workspace/Lucene-Solr-5.x-Linux/solr/build/solr-core/test/J1/temp/solr.cloud.TestRandomRequestDistribution_22A970802826A759-001/shard-1-001/cores/collection1/, coreNodeName=, dataDir=data/, shard=}
>    [junit4]   2> 506046 INFO  (TEST-TestRandomRequestDistribution.testRequestTracking-seed#[22A970802826A759]) [n:127.0.0.1:49334_    ] o.a.s.c.CoresLocator Found core collection1 in /home/jenkins/workspace/Lucene-Solr-5.x-Linux/solr/build/solr-core/test/J1/../../../../../../../../../home/jenkins/workspace/Lucene-Solr-5.x-Linux/solr/build/solr-core/test/J1/temp/solr.cloud.TestRandomRequestDistribution_22A970802826A759-001/shard-1-001/cores/collection1/
>    [junit4]   2> 506046 INFO  (TEST-TestRandomRequestDistribution.testRequestTracking-seed#[22A970802826A759]) [n:127.0.0.1:49334_    ] o.a.s.c.CoresLocator Found 1 core definitions
>    [junit4]   2> 506046 INFO  (TEST-TestRandomRequestDistribution.testRequestTracking-seed#[22A970802826A759]) [n:127.0.0.1:49334_    ] o.a.s.s.SolrDispatchFilter user.dir=/home/jenkins/workspace/Lucene-Solr-5.x-Linux/solr/build/solr-core/test/J1
>    [junit4]   2> 506047 INFO  (TEST-TestRandomRequestDistribution.testRequestTracking-seed#[22A970802826A759]) [n:127.0.0.1:49334_    ] o.a.s.s.SolrDispatchFilter SolrDispatchFilter.init() done
>    [junit4]   2> 506047 INFO  (coreLoadExecutor-2029-thread-1-processing-n:127.0.0.1:49334_) [n:127.0.0.1:49334_ c:collection1   x:collection1] o.a.s.c.ZkController publishing state=down
>    [junit4]   2> 506047 INFO  (coreLoadExecutor-2029-thread-1-processing-n:127.0.0.1:49334_) [n:127.0.0.1:49334_ c:collection1   x:collection1] o.a.s.c.ZkController numShards not found on descriptor - reading it from system property
>    [junit4]   2> 506047 INFO  (coreLoadExecutor-2029-thread-1-processing-n:127.0.0.1:49334_) [n:127.0.0.1:49334_ c:collection1   x:collection1] o.a.s.c.ZkController look for our core node name
>    [junit4]   2> 506047 INFO  (zkCallback-1484-thread-1-processing-n:127.0.0.1:46421_) [n:127.0.0.1:46421_    ] o.a.s.c.DistributedQueue NodeChildrenChanged fired on path /overseer/queue state SyncConnected
>    [junit4]   2> 506048 INFO  (OverseerStateUpdate-94331339272749060-127.0.0.1:46421_-n_0000000000) [n:127.0.0.1:46421_    ] o.a.s.c.Overseer processMessage: queueSize: 1, message = {
>    [junit4]   2>   "core":"collection1",
>    [junit4]   2>   "roles":null,
>    [junit4]   2>   "base_url":"http://127.0.0.1:49334",
>    [junit4]   2>   "node_name":"127.0.0.1:49334_",
>    [junit4]   2>   "numShards":"2",
>    [junit4]   2>   "state":"down",
>    [junit4]   2>   "shard":null,
>    [junit4]   2>   "collection":"collection1",
>    [junit4]   2>   "operation":"state"} current state version: 3
>    [junit4]   2> 506048 INFO  (OverseerStateUpdate-94331339272749060-127.0.0.1:46421_-n_0000000000) [n:127.0.0.1:46421_    ] o.a.s.c.o.ReplicaMutator Update state numShards=2 message={
>    [junit4]   2>   "core":"collection1",
>    [junit4]   2>   "roles":null,
>    [junit4]   2>   "base_url":"http://127.0.0.1:49334",
>    [junit4]   2>   "node_name":"127.0.0.1:49334_",
>    [junit4]   2>   "numShards":"2",
>    [junit4]   2>   "state":"down",
>    [junit4]   2>   "shard":null,
>    [junit4]   2>   "collection":"collection1",
>    [junit4]   2>   "operation":"state"}
>    [junit4]   2> 506048 INFO  (OverseerStateUpdate-94331339272749060-127.0.0.1:46421_-n_0000000000) [n:127.0.0.1:46421_    ] o.a.s.c.o.ClusterStateMutator building a new cName: collection1
>    [junit4]   2> 506048 INFO  (OverseerStateUpdate-94331339272749060-127.0.0.1:46421_-n_0000000000) [n:127.0.0.1:46421_    ] o.a.s.c.o.ReplicaMutator Assigning new node to shard shard=shard2
>    [junit4]   2> 506150 INFO  (zkCallback-1486-thread-1) [    ] o.a.s.c.c.ZkStateReader A cluster state change: WatchedEvent state:SyncConnected type:NodeDataChanged path:/clusterstate.json, has occurred - updating... (live nodes size: 2)
>    [junit4]   2> 506151 INFO  (zkCallback-1484-thread-1-processing-n:127.0.0.1:46421_) [n:127.0.0.1:46421_    ] o.a.s.c.c.ZkStateReader A cluster state change: WatchedEvent state:SyncConnected type:NodeDataChanged path:/clusterstate.json, has occurred - updating... (live nodes size: 2)
>    [junit4]   2> 506151 INFO  (zkCallback-1490-thread-1-processing-n:127.0.0.1:49334_) [n:127.0.0.1:49334_    ] o.a.s.c.c.ZkStateReader A cluster state change: WatchedEvent state:SyncConnected type:NodeDataChanged path:/clusterstate.json, has occurred - updating... (live nodes size: 2)
>    [junit4]   2> 507047 INFO  (coreLoadExecutor-2029-thread-1-processing-n:127.0.0.1:49334_) [n:127.0.0.1:49334_ c:collection1   x:collection1] o.a.s.c.ZkController waiting to find shard id in clusterstate for collection1
>    [junit4]   2> 507048 INFO  (coreLoadExecutor-2029-thread-1-processing-n:127.0.0.1:49334_) [n:127.0.0.1:49334_ c:collection1   x:collection1] o.a.s.c.ZkController Check for collection zkNode:collection1
>    [junit4]   2> 507048 INFO  (coreLoadExecutor-2029-thread-1-processing-n:127.0.0.1:49334_) [n:127.0.0.1:49334_ c:collection1   x:collection1] o.a.s.c.ZkController Collection zkNode exists
>    [junit4]   2> 507048 INFO  (coreLoadExecutor-2029-thread-1-processing-n:127.0.0.1:49334_) [n:127.0.0.1:49334_ c:collection1   x:collection1] o.a.s.c.c.ZkStateReader Load collection config from:/collections/collection1
>    [junit4]   2> 507048 INFO  (coreLoadExecutor-2029-thread-1-processing-n:127.0.0.1:49334_) [n:127.0.0.1:49334_ c:collection1   x:collection1] o.a.s.c.c.ZkStateReader path=/collections/collection1 configName=conf1 specified config exists in ZooKeeper
>    [junit4]   2> 507048 INFO  (coreLoadExecutor-2029-thread-1-processing-n:127.0.0.1:49334_) [n:127.0.0.1:49334_ c:collection1   x:collection1] o.a.s.c.SolrResourceLoader new SolrResourceLoader for directory: '/home/jenkins/workspace/Lucene-Solr-5.x-Linux/solr/build/solr-core/test/J1/../../../../../../../../../home/jenkins/workspace/Lucene-Solr-5.x-Linux/solr/build/solr-core/test/J1/temp/solr.cloud.TestRandomRequestDistribution_22A970802826A759-001/shard-1-001/cores/collection1/'
>    [junit4]   2> 507060 INFO  (coreLoadExecutor-2029-thread-1-processing-n:127.0.0.1:49334_) [n:127.0.0.1:49334_ c:collection1   x:collection1] o.a.s.c.Config loaded config solrconfig.xml with version 0
>    [junit4]   2> 507065 INFO  (coreLoadExecutor-2029-thread-1-processing-n:127.0.0.1:49334_) [n:127.0.0.1:49334_ c:collection1   x:collection1] o.a.s.c.SolrConfig current version of requestparams : -1
>    [junit4]   2> 507068 INFO  (coreLoadExecutor-2029-thread-1-processing-n:127.0.0.1:49334_) [n:127.0.0.1:49334_ c:collection1   x:collection1] o.a.s.c.SolrConfig Using Lucene MatchVersion: 5.4.0
>    [junit4]   2> 507075 INFO  (coreLoadExecutor-2029-thread-1-processing-n:127.0.0.1:49334_) [n:127.0.0.1:49334_ c:collection1   x:collection1] o.a.s.c.Config Loaded SolrConfig: solrconfig.xml
>    [junit4]   2> 507076 INFO  (coreLoadExecutor-2029-thread-1-processing-n:127.0.0.1:49334_) [n:127.0.0.1:49334_ c:collection1   x:collection1] o.a.s.s.IndexSchema Reading Solr Schema from /configs/conf1/schema.xml
>    [junit4]   2> 507081 INFO  (coreLoadExecutor-2029-thread-1-processing-n:127.0.0.1:49334_) [n:127.0.0.1:49334_ c:collection1   x:collection1] o.a.s.s.IndexSchema [collection1] Schema name=test
>    [junit4]   2> 507161 INFO  (coreLoadExecutor-2029-thread-1-processing-n:127.0.0.1:49334_) [n:127.0.0.1:49334_ c:collection1   x:collection1] o.a.s.s.OpenExchangeRatesOrgProvider Initialized with rates=open-exchange-rates.json, refreshInterval=1440.
>    [junit4]   2> 507166 INFO  (coreLoadExecutor-2029-thread-1-processing-n:127.0.0.1:49334_) [n:127.0.0.1:49334_ c:collection1   x:collection1] o.a.s.s.IndexSchema default search field in schema is text
>    [junit4]   2> 507167 INFO  (coreLoadExecutor-2029-thread-1-processing-n:127.0.0.1:49334_) [n:127.0.0.1:49334_ c:collection1   x:collection1] o.a.s.s.IndexSchema unique key field: id
>    [junit4]   2> 507172 INFO  (coreLoadExecutor-2029-thread-1-processing-n:127.0.0.1:49334_) [n:127.0.0.1:49334_ c:collection1   x:collection1] o.a.s.s.FileExchangeRateProvider Reloading exchange rates from file currency.xml
>    [junit4]   2> 507174 INFO  (coreLoadExecutor-2029-thread-1-processing-n:127.0.0.1:49334_) [n:127.0.0.1:49334_ c:collection1   x:collection1] o.a.s.s.FileExchangeRateProvider Reloading exchange rates from file currency.xml
>    [junit4]   2> 507175 INFO  (coreLoadExecutor-2029-thread-1-processing-n:127.0.0.1:49334_) [n:127.0.0.1:49334_ c:collection1   x:collection1] o.a.s.s.OpenExchangeRatesOrgProvider Reloading exchange rates from open-exchange-rates.json
>    [junit4]   2> 507176 WARN  (coreLoadExecutor-2029-thread-1-processing-n:127.0.0.1:49334_) [n:127.0.0.1:49334_ c:collection1   x:collection1] o.a.s.s.OpenExchangeRatesOrgProvider Unknown key IMPORTANT NOTE
>    [junit4]   2> 507176 WARN  (coreLoadExecutor-2029-thread-1-processing-n:127.0.0.1:49334_) [n:127.0.0.1:49334_ c:collection1   x:collection1] o.a.s.s.OpenExchangeRatesOrgProvider Expected key, got STRING
>    [junit4]   2> 507176 INFO  (coreLoadExecutor-2029-thread-1-processing-n:127.0.0.1:49334_) [n:127.0.0.1:49334_ c:collection1   x:collection1] o.a.s.s.OpenExchangeRatesOrgProvider Reloading exchange rates from open-exchange-rates.json
>    [junit4]   2> 507176 WARN  (coreLoadExecutor-2029-thread-1-processing-n:127.0.0.1:49334_) [n:127.0.0.1:49334_ c:collection1   x:collection1] o.a.s.s.OpenExchangeRatesOrgProvider Unknown key IMPORTANT NOTE
>    [junit4]   2> 507176 WARN  (coreLoadExecutor-2029-thread-1-processing-n:127.0.0.1:49334_) [n:127.0.0.1:49334_ c:collection1   x:collection1] o.a.s.s.OpenExchangeRatesOrgProvider Expected key, got STRING
>    [junit4]   2> 507177 INFO  (coreLoadExecutor-2029-thread-1-processing-n:127.0.0.1:49334_) [n:127.0.0.1:49334_ c:collection1   x:collection1] o.a.s.c.ConfigSetProperties Did not find ConfigSet properties, assuming default properties: Can't find resource 'configsetprops.json' in classpath or '/configs/conf1', cwd=/home/jenkins/workspace/Lucene-Solr-5.x-Linux/solr/build/solr-core/test/J1
>    [junit4]   2> 507177 INFO  (coreLoadExecutor-2029-thread-1-processing-n:127.0.0.1:49334_) [n:127.0.0.1:49334_ c:collection1   x:collection1] o.a.s.c.CoreContainer Creating SolrCore 'collection1' using configuration from collection collection1
>    [junit4]   2> 507178 INFO  (coreLoadExecutor-2029-thread-1-processing-n:127.0.0.1:49334_) [n:127.0.0.1:49334_ c:collection1 s:shard2 r:core_node1 x:collection1] o.a.s.c.SolrCore org.apache.solr.core.MockDirectoryFactory
>    [junit4]   2> 507178 INFO  (coreLoadExecutor-2029-thread-1-processing-n:127.0.
>
> [...truncated too long message...]
>
> uestDistribution.testRequestTracking-seed#[22A970802826A759]) [n:127.0.0.1:58251_ c:b1x1 s:shard1 r:core_node1 x:b1x1_shard1_replica1] o.a.s.c.SolrCore [b1x1_shard1_replica1] Closing main searcher on request.
>    [junit4]   2> 536059 INFO  (TEST-TestRandomRequestDistribution.testRequestTracking-seed#[22A970802826A759]) [n:127.0.0.1:58251_ c:b1x1 s:shard1 r:core_node1 x:b1x1_shard1_replica1] o.a.s.c.CachingDirectoryFactory Closing MockDirectoryFactory - 2 directories currently being tracked
>    [junit4]   2> 536060 INFO  (TEST-TestRandomRequestDistribution.testRequestTracking-seed#[22A970802826A759]) [n:127.0.0.1:58251_ c:b1x1 s:shard1 r:core_node1 x:b1x1_shard1_replica1] o.a.s.c.CachingDirectoryFactory looking to close /home/jenkins/workspace/Lucene-Solr-5.x-Linux/solr/build/solr-core/test/J1/../../../../../../../../../home/jenkins/workspace/Lucene-Solr-5.x-Linux/solr/build/solr-core/test/J1/temp/solr.cloud.TestRandomRequestDistribution_22A970802826A759-001/shard-3-001/cores/b1x1_shard1_replica1/data/index [CachedDir<<refCount=0;path=/home/jenkins/workspace/Lucene-Solr-5.x-Linux/solr/build/solr-core/test/J1/../../../../../../../../../home/jenkins/workspace/Lucene-Solr-5.x-Linux/solr/build/solr-core/test/J1/temp/solr.cloud.TestRandomRequestDistribution_22A970802826A759-001/shard-3-001/cores/b1x1_shard1_replica1/data/index;done=false>>]
>    [junit4]   2> 536060 INFO  (TEST-TestRandomRequestDistribution.testRequestTracking-seed#[22A970802826A759]) [n:127.0.0.1:58251_ c:b1x1 s:shard1 r:core_node1 x:b1x1_shard1_replica1] o.a.s.c.CachingDirectoryFactory Closing directory: /home/jenkins/workspace/Lucene-Solr-5.x-Linux/solr/build/solr-core/test/J1/../../../../../../../../../home/jenkins/workspace/Lucene-Solr-5.x-Linux/solr/build/solr-core/test/J1/temp/solr.cloud.TestRandomRequestDistribution_22A970802826A759-001/shard-3-001/cores/b1x1_shard1_replica1/data/index
>    [junit4]   2> 536060 INFO  (TEST-TestRandomRequestDistribution.testRequestTracking-seed#[22A970802826A759]) [n:127.0.0.1:58251_ c:b1x1 s:shard1 r:core_node1 x:b1x1_shard1_replica1] o.a.s.c.CachingDirectoryFactory looking to close /home/jenkins/workspace/Lucene-Solr-5.x-Linux/solr/build/solr-core/test/J1/../../../../../../../../../home/jenkins/workspace/Lucene-Solr-5.x-Linux/solr/build/solr-core/test/J1/temp/solr.cloud.TestRandomRequestDistribution_22A970802826A759-001/shard-3-001/cores/b1x1_shard1_replica1/data [CachedDir<<refCount=0;path=/home/jenkins/workspace/Lucene-Solr-5.x-Linux/solr/build/solr-core/test/J1/../../../../../../../../../home/jenkins/workspace/Lucene-Solr-5.x-Linux/solr/build/solr-core/test/J1/temp/solr.cloud.TestRandomRequestDistribution_22A970802826A759-001/shard-3-001/cores/b1x1_shard1_replica1/data;done=false>>]
>    [junit4]   2> 536060 INFO  (TEST-TestRandomRequestDistribution.testRequestTracking-seed#[22A970802826A759]) [n:127.0.0.1:58251_ c:b1x1 s:shard1 r:core_node1 x:b1x1_shard1_replica1] o.a.s.c.CachingDirectoryFactory Closing directory: /home/jenkins/workspace/Lucene-Solr-5.x-Linux/solr/build/solr-core/test/J1/../../../../../../../../../home/jenkins/workspace/Lucene-Solr-5.x-Linux/solr/build/solr-core/test/J1/temp/solr.cloud.TestRandomRequestDistribution_22A970802826A759-001/shard-3-001/cores/b1x1_shard1_replica1/data
>    [junit4]   2> 536061 INFO  (TEST-TestRandomRequestDistribution.testRequestTracking-seed#[22A970802826A759]) [n:127.0.0.1:58251_ c:b1x1 s:shard1 r:core_node1 x:b1x1_shard1_replica1] o.a.s.c.Overseer Overseer (id=94331339272749070-127.0.0.1:58251_-n_0000000003) closing
>    [junit4]   2> 536062 INFO  (OverseerStateUpdate-94331339272749070-127.0.0.1:58251_-n_0000000003) [n:127.0.0.1:58251_    ] o.a.s.c.Overseer Overseer Loop exiting : 127.0.0.1:58251_
>    [junit4]   2> 536064 INFO  (zkCallback-1498-thread-1-processing-n:127.0.0.1:58251_) [n:127.0.0.1:58251_    ] o.a.s.c.c.ZkStateReader A live node change: WatchedEvent state:SyncConnected type:NodeChildrenChanged path:/live_nodes, has occurred - updating... (live nodes size: 1)
>    [junit4]   2> 536064 WARN  (zkCallback-1498-thread-1-processing-n:127.0.0.1:58251_) [n:127.0.0.1:58251_    ] o.a.s.c.c.ZkStateReader ZooKeeper watch triggered, but Solr cannot talk to ZK
>    [junit4]   2> 536065 INFO  (TEST-TestRandomRequestDistribution.testRequestTracking-seed#[22A970802826A759]) [    ] o.e.j.s.ServerConnector Stopped ServerConnector@793b99c2{HTTP/1.1}{127.0.0.1:0}
>    [junit4]   2> 536066 INFO  (TEST-TestRandomRequestDistribution.testRequestTracking-seed#[22A970802826A759]) [    ] o.e.j.s.h.ContextHandler Stopped o.e.j.s.ServletContextHandler@5a170044{/,null,UNAVAILABLE}
>    [junit4]   2> 536067 INFO  (TEST-TestRandomRequestDistribution.testRequestTracking-seed#[22A970802826A759]) [n:127.0.0.1:58251_ c:b1x1 s:shard1 r:core_node1 x:b1x1_shard1_replica1] o.a.s.c.ZkTestServer connecting to 127.0.0.1:41772 41772
>    [junit4]   2> 536079 INFO  (Thread-1804) [    ] o.a.s.c.ZkTestServer connecting to 127.0.0.1:41772 41772
>    [junit4]   2> 536083 WARN  (Thread-1804) [    ] o.a.s.c.ZkTestServer Watch limit violations:
>    [junit4]   2> Maximum concurrent create/delete watches above limit:
>    [junit4]   2>
>    [junit4]   2>        5       /solr/aliases.json
>    [junit4]   2>        4       /solr/security.json
>    [junit4]   2>        4       /solr/configs/conf1
>    [junit4]   2>
>    [junit4]   2> Maximum concurrent data watches above limit:
>    [junit4]   2>
>    [junit4]   2>        5       /solr/clusterstate.json
>    [junit4]   2>        2       /solr/collections/a1x2/state.json
>    [junit4]   2>
>    [junit4]   2> Maximum concurrent children watches above limit:
>    [junit4]   2>
>    [junit4]   2>        5       /solr/live_nodes
>    [junit4]   2>        4       /solr/overseer/queue
>    [junit4]   2>        4       /solr/overseer/collection-queue-work
>    [junit4]   2>
>    [junit4]   2> NOTE: reproduce with: ant test  -Dtestcase=TestRandomRequestDistribution -Dtests.method=testRequestTracking -Dtests.seed=22A970802826A759 -Dtests.multiplier=3 -Dtests.slow=true -Dtests.locale=sr_RS -Dtests.timezone=Africa/Kinshasa -Dtests.asserts=true -Dtests.file.encoding=US-ASCII
>    [junit4] FAILURE 33.0s J1 | TestRandomRequestDistribution.testRequestTracking <<<
>    [junit4]    > Throwable #1: java.lang.AssertionError: Shard a1x2_shard1_replica2 received all 10 requests
>    [junit4]    >        at __randomizedtesting.SeedInfo.seed([22A970802826A759:6A952940DC2DB6CF]:0)
>    [junit4]    >        at org.apache.solr.cloud.TestRandomRequestDistribution.testRequestTracking(TestRandomRequestDistribution.java:109)
>    [junit4]    >        at org.apache.solr.BaseDistributedSearchTestCase$ShardsRepeatRule$ShardsFixedStatement.callStatement(BaseDistributedSearchTestCase.java:963)
>    [junit4]    >        at org.apache.solr.BaseDistributedSearchTestCase$ShardsRepeatRule$ShardsStatement.evaluate(BaseDistributedSearchTestCase.java:938)
>    [junit4]    >        at java.lang.Thread.run(Thread.java:745)
>    [junit4]   2> 536088 INFO  (SUITE-TestRandomRequestDistribution-seed#[22A970802826A759]-worker) [n:127.0.0.1:58251_ c:b1x1 s:shard1 r:core_node1 x:b1x1_shard1_replica1] o.a.s.SolrTestCaseJ4 ###deleteCore
>    [junit4]   2> NOTE: leaving temporary files on disk at: /home/jenkins/workspace/Lucene-Solr-5.x-Linux/solr/build/solr-core/test/J1/temp/solr.cloud.TestRandomRequestDistribution_22A970802826A759-001
>    [junit4]   2> Aug 12, 2015 12:20:40 PM com.carrotsearch.randomizedtesting.ThreadLeakControl checkThreadLeaks
>    [junit4]   2> WARNING: Will linger awaiting termination of 2 leaked thread(s).
>    [junit4]   2> NOTE: test params are: codec=Asserting(Lucene53): {}, docValues:{}, sim=DefaultSimilarity, locale=sr_RS, timezone=Africa/Kinshasa
>    [junit4]   2> NOTE: Linux 3.16.0-44-generic amd64/Oracle Corporation 1.9.0-ea (64-bit)/cpus=12,threads=1,free=222696944,total=536870912
>    [junit4]   2> NOTE: All tests run in this JVM: [BadComponentTest, TestScoreJoinQPScore, ShardRoutingTest, TestRemoveLastDynamicCopyField, AddSchemaFieldsUpdateProcessorFactoryTest, ZkSolrClientTest, TestFieldSortValues, CloudExitableDirectoryReaderTest, ChaosMonkeySafeLeaderTest, TestBulkSchemaAPI, LeaderFailoverAfterPartitionTest, AsyncCallRequestStatusResponseTest, TestReplicaProperties, TestHashPartitioner, TestDistribDocBasedVersion, ConvertedLegacyTest, OpenCloseCoreStressTest, TestLRUCache, DocValuesMultiTest, TestAuthenticationFramework, TestElisionMultitermQuery, TestCloudManagedSchemaConcurrent, DistributedFacetPivotSmallAdvancedTest, ShowFileRequestHandlerTest, ZkControllerTest, MergeStrategyTest, CollectionsAPIAsyncDistributedZkTest, TestExceedMaxTermLength, TestCustomSort, TestReqParamsAPI, HdfsRecoveryZkTest, TestConfigSets, TestSortingResponseWriter, TestCollationFieldDocValues, TestSolrConfigHandlerCloud, ReplicationFactorTest, DistributedFacetPivotLongTailTest, UpdateParamsTest, TestRandomRequestDistribution]
>    [junit4] Completed [161/533] on J1 in 33.26s, 1 test, 1 failure <<< FAILURES!
>
> [...truncated 1153 lines...]
> BUILD FAILED
> /home/jenkins/workspace/Lucene-Solr-5.x-Linux/build.xml:769: The following error occurred while executing this line:
> /home/jenkins/workspace/Lucene-Solr-5.x-Linux/build.xml:713: The following error occurred while executing this line:
> /home/jenkins/workspace/Lucene-Solr-5.x-Linux/build.xml:59: The following error occurred while executing this line:
> /home/jenkins/workspace/Lucene-Solr-5.x-Linux/solr/build.xml:230: The following error occurred while executing this line:
> /home/jenkins/workspace/Lucene-Solr-5.x-Linux/solr/common-build.xml:524: The following error occurred while executing this line:
> /home/jenkins/workspace/Lucene-Solr-5.x-Linux/lucene/common-build.xml:1449: The following error occurred while executing this line:
> /home/jenkins/workspace/Lucene-Solr-5.x-Linux/lucene/common-build.xml:1003: There were test failures: 533 suites, 2111 tests, 1 failure, 67 ignored (31 assumptions)
>
> Total time: 45 minutes 17 seconds
> Build step 'Invoke Ant' marked build as failure
> Archiving artifacts
> [WARNINGS] Skipping publisher since build result is FAILURE
> Recording test results
> Email was triggered for: Failure - Any
> Sending email for trigger: Failure - Any
>
>
>
>
> ---------------------------------------------------------------------
> To unsubscribe, e-mail: dev-unsubscribe@lucene.apache.org
> For additional commands, e-mail: dev-help@lucene.apache.org



-- 
Regards,
Shalin Shekhar Mangar.

---------------------------------------------------------------------
To unsubscribe, e-mail: dev-unsubscribe@lucene.apache.org
For additional commands, e-mail: dev-help@lucene.apache.org


Mime
View raw message