lucene-dev mailing list archives

Site index · List index
Message view « Date » · « Thread »
Top « Date » · « Thread »
From Steve Rowe <sar...@gmail.com>
Subject Re: [JENKINS] Lucene-Solr-trunk-MacOSX (64bit/jdk1.8.0) - Build # 2649 - Failure!
Date Thu, 20 Aug 2015 15:21:15 GMT
https://issues.apache.org/jira/browse/LUCENE-6750

> On Aug 19, 2015, at 11:08 PM, Policeman Jenkins Server <jenkins@thetaphi.de> wrote:
> 
> Build: http://jenkins.thetaphi.de/job/Lucene-Solr-trunk-MacOSX/2649/
> Java: 64bit/jdk1.8.0 -XX:-UseCompressedOops -XX:+UseConcMarkSweepGC
> 
> 1 tests failed.
> FAILED:  org.apache.lucene.TestMergeSchedulerExternal.testSubclassConcurrentMergeScheduler
> 
> Error Message:
> 
> 
> Stack Trace:
> java.lang.AssertionError
> 	at __randomizedtesting.SeedInfo.seed([3AF868F9E00E5EBA:BD79D554E42E24BE]:0)
> 	at org.junit.Assert.fail(Assert.java:92)
> 	at org.junit.Assert.assertTrue(Assert.java:43)
> 	at org.junit.Assert.assertTrue(Assert.java:54)
> 	at org.apache.lucene.TestMergeSchedulerExternal.testSubclassConcurrentMergeScheduler(TestMergeSchedulerExternal.java:116)
> 	at sun.reflect.NativeMethodAccessorImpl.invoke0(Native Method)
> 	at sun.reflect.NativeMethodAccessorImpl.invoke(NativeMethodAccessorImpl.java:62)
> 	at sun.reflect.DelegatingMethodAccessorImpl.invoke(DelegatingMethodAccessorImpl.java:43)
> 	at java.lang.reflect.Method.invoke(Method.java:497)
> 	at com.carrotsearch.randomizedtesting.RandomizedRunner.invoke(RandomizedRunner.java:1627)
> 	at com.carrotsearch.randomizedtesting.RandomizedRunner$6.evaluate(RandomizedRunner.java:836)
> 	at com.carrotsearch.randomizedtesting.RandomizedRunner$7.evaluate(RandomizedRunner.java:872)
> 	at com.carrotsearch.randomizedtesting.RandomizedRunner$8.evaluate(RandomizedRunner.java:886)
> 	at org.apache.lucene.util.TestRuleSetupTeardownChained$1.evaluate(TestRuleSetupTeardownChained.java:50)
> 	at org.apache.lucene.util.AbstractBeforeAfterRule$1.evaluate(AbstractBeforeAfterRule.java:46)
> 	at org.apache.lucene.util.TestRuleThreadAndTestName$1.evaluate(TestRuleThreadAndTestName.java:49)
> 	at org.apache.lucene.util.TestRuleIgnoreAfterMaxFailures$1.evaluate(TestRuleIgnoreAfterMaxFailures.java:65)
> 	at org.apache.lucene.util.TestRuleMarkFailure$1.evaluate(TestRuleMarkFailure.java:48)
> 	at com.carrotsearch.randomizedtesting.rules.StatementAdapter.evaluate(StatementAdapter.java:36)
> 	at com.carrotsearch.randomizedtesting.ThreadLeakControl$StatementRunner.run(ThreadLeakControl.java:365)
> 	at com.carrotsearch.randomizedtesting.ThreadLeakControl.forkTimeoutingTask(ThreadLeakControl.java:798)
> 	at com.carrotsearch.randomizedtesting.ThreadLeakControl$3.evaluate(ThreadLeakControl.java:458)
> 	at com.carrotsearch.randomizedtesting.RandomizedRunner.runSingleTest(RandomizedRunner.java:845)
> 	at com.carrotsearch.randomizedtesting.RandomizedRunner$3.evaluate(RandomizedRunner.java:747)
> 	at com.carrotsearch.randomizedtesting.RandomizedRunner$4.evaluate(RandomizedRunner.java:781)
> 	at com.carrotsearch.randomizedtesting.RandomizedRunner$5.evaluate(RandomizedRunner.java:792)
> 	at org.apache.lucene.util.AbstractBeforeAfterRule$1.evaluate(AbstractBeforeAfterRule.java:46)
> 	at com.carrotsearch.randomizedtesting.rules.StatementAdapter.evaluate(StatementAdapter.java:36)
> 	at org.apache.lucene.util.TestRuleStoreClassName$1.evaluate(TestRuleStoreClassName.java:42)
> 	at com.carrotsearch.randomizedtesting.rules.NoShadowingOrOverridesOnMethodsRule$1.evaluate(NoShadowingOrOverridesOnMethodsRule.java:39)
> 	at com.carrotsearch.randomizedtesting.rules.NoShadowingOrOverridesOnMethodsRule$1.evaluate(NoShadowingOrOverridesOnMethodsRule.java:39)
> 	at com.carrotsearch.randomizedtesting.rules.StatementAdapter.evaluate(StatementAdapter.java:36)
> 	at com.carrotsearch.randomizedtesting.rules.StatementAdapter.evaluate(StatementAdapter.java:36)
> 	at com.carrotsearch.randomizedtesting.rules.StatementAdapter.evaluate(StatementAdapter.java:36)
> 	at org.apache.lucene.util.TestRuleAssertionsRequired$1.evaluate(TestRuleAssertionsRequired.java:54)
> 	at org.apache.lucene.util.TestRuleMarkFailure$1.evaluate(TestRuleMarkFailure.java:48)
> 	at org.apache.lucene.util.TestRuleIgnoreAfterMaxFailures$1.evaluate(TestRuleIgnoreAfterMaxFailures.java:65)
> 	at org.apache.lucene.util.TestRuleIgnoreTestSuites$1.evaluate(TestRuleIgnoreTestSuites.java:55)
> 	at com.carrotsearch.randomizedtesting.rules.StatementAdapter.evaluate(StatementAdapter.java:36)
> 	at com.carrotsearch.randomizedtesting.ThreadLeakControl$StatementRunner.run(ThreadLeakControl.java:365)
> 	at java.lang.Thread.run(Thread.java:745)
> 
> 
> 
> 
> Build Log:
> [...truncated 586 lines...]
>   [junit4] Suite: org.apache.lucene.TestMergeSchedulerExternal
>   [junit4]   2> NOTE: reproduce with: ant test  -Dtestcase=TestMergeSchedulerExternal
-Dtests.method=testSubclassConcurrentMergeScheduler -Dtests.seed=3AF868F9E00E5EBA -Dtests.slow=true
-Dtests.locale=ru -Dtests.timezone=Europe/London -Dtests.asserts=true -Dtests.file.encoding=ISO-8859-1
>   [junit4] FAILURE 0.37s J1 | TestMergeSchedulerExternal.testSubclassConcurrentMergeScheduler
<<<
>   [junit4]    > Throwable #1: java.lang.AssertionError
>   [junit4]    > 	at __randomizedtesting.SeedInfo.seed([3AF868F9E00E5EBA:BD79D554E42E24BE]:0)
>   [junit4]    > 	at org.apache.lucene.TestMergeSchedulerExternal.testSubclassConcurrentMergeScheduler(TestMergeSchedulerExternal.java:116)
>   [junit4]    > 	at java.lang.Thread.run(Thread.java:745)
>   [junit4]   2> NOTE: test params are: codec=Asserting(Lucene53): {id=PostingsFormat(name=Memory
doPackFST= true)}, docValues:{}, sim=DefaultSimilarity, locale=ru, timezone=Europe/London
>   [junit4]   2> NOTE: Mac OS X 10.8.5 x86_64/Oracle Corporation 1.8.0_51 (64-bit)/cpus=3,threads=1,free=16232544,total=54853632
>   [junit4]   2> NOTE: All tests run in this JVM: [TestDateSort, TestWildcardRandom,
TestIndexWriterMergePolicy, TestPackedInts, TestSpansAdvanced, TestBooleanOr, TestParallelReaderEmptyIndex,
TestFixedBitDocIdSet, TestIndexWriterDeleteByQuery, Test4GBStoredFields, TestMultiThreadTermVectors,
TestIndexWriterConfig, TestToken, TestMergeSchedulerExternal]
>   [junit4] Completed [21/401] on J1 in 0.39s, 2 tests, 1 failure <<< FAILURES!
> 
> [...truncated 1233 lines...]
> BUILD FAILED
> /Users/jenkins/workspace/Lucene-Solr-trunk-MacOSX/build.xml:775: The following error
occurred while executing this line:
> /Users/jenkins/workspace/Lucene-Solr-trunk-MacOSX/build.xml:719: The following error
occurred while executing this line:
> /Users/jenkins/workspace/Lucene-Solr-trunk-MacOSX/build.xml:59: The following error occurred
while executing this line:
> /Users/jenkins/workspace/Lucene-Solr-trunk-MacOSX/lucene/build.xml:50: The following
error occurred while executing this line:
> /Users/jenkins/workspace/Lucene-Solr-trunk-MacOSX/lucene/common-build.xml:1431: The following
error occurred while executing this line:
> /Users/jenkins/workspace/Lucene-Solr-trunk-MacOSX/lucene/common-build.xml:986: There
were test failures: 401 suites, 3226 tests, 1 failure, 51 ignored (47 assumptions)
> 
> Total time: 5 minutes 34 seconds
> Build step 'Invoke Ant' marked build as failure
> Archiving artifacts
> [WARNINGS] Skipping publisher since build result is FAILURE
> Recording test results
> Email was triggered for: Failure - Any
> Sending email for trigger: Failure - Any
> 
> 
> 
> ---------------------------------------------------------------------
> To unsubscribe, e-mail: dev-unsubscribe@lucene.apache.org
> For additional commands, e-mail: dev-help@lucene.apache.org


---------------------------------------------------------------------
To unsubscribe, e-mail: dev-unsubscribe@lucene.apache.org
For additional commands, e-mail: dev-help@lucene.apache.org


Mime
View raw message