lucene-dev mailing list archives

Site index · List index
Message view « Date » · « Thread »
Top « Date » · « Thread »
From Policeman Jenkins Server <jenk...@thetaphi.de>
Subject [JENKINS] Lucene-Solr-5.x-MacOSX (64bit/jdk1.8.0) - Build # 2715 - Failure!
Date Thu, 01 Oct 2015 12:45:28 GMT
Build: http://jenkins.thetaphi.de/job/Lucene-Solr-5.x-MacOSX/2715/
Java: 64bit/jdk1.8.0 -XX:-UseCompressedOops -XX:+UseSerialGC

3 tests failed.
FAILED:  org.apache.solr.cloud.ChaosMonkeyNothingIsSafeTest.test

Error Message:
Could not find a healthy node to handle the request.

Stack Trace:
org.apache.solr.common.SolrException: Could not find a healthy node to handle the request.
	at __randomizedtesting.SeedInfo.seed([19E656938EF54EA7:91B269492009235F]:0)
	at org.apache.solr.client.solrj.impl.CloudSolrClient.sendRequest(CloudSolrClient.java:1084)
	at org.apache.solr.client.solrj.impl.CloudSolrClient.requestWithRetryOnStaleState(CloudSolrClient.java:870)
	at org.apache.solr.client.solrj.impl.CloudSolrClient.request(CloudSolrClient.java:806)
	at org.apache.solr.client.solrj.SolrRequest.process(SolrRequest.java:150)
	at org.apache.solr.client.solrj.SolrClient.commit(SolrClient.java:485)
	at org.apache.solr.client.solrj.SolrClient.commit(SolrClient.java:464)
	at org.apache.solr.cloud.AbstractFullDistribZkTestBase.commit(AbstractFullDistribZkTestBase.java:1505)
	at org.apache.solr.cloud.ChaosMonkeyNothingIsSafeTest.test(ChaosMonkeyNothingIsSafeTest.java:211)
	at sun.reflect.NativeMethodAccessorImpl.invoke0(Native Method)
	at sun.reflect.NativeMethodAccessorImpl.invoke(NativeMethodAccessorImpl.java:62)
	at sun.reflect.DelegatingMethodAccessorImpl.invoke(DelegatingMethodAccessorImpl.java:43)
	at java.lang.reflect.Method.invoke(Method.java:497)
	at com.carrotsearch.randomizedtesting.RandomizedRunner.invoke(RandomizedRunner.java:1665)
	at com.carrotsearch.randomizedtesting.RandomizedRunner$8.evaluate(RandomizedRunner.java:864)
	at com.carrotsearch.randomizedtesting.RandomizedRunner$9.evaluate(RandomizedRunner.java:900)
	at com.carrotsearch.randomizedtesting.RandomizedRunner$10.evaluate(RandomizedRunner.java:914)
	at org.apache.solr.BaseDistributedSearchTestCase$ShardsRepeatRule$ShardsFixedStatement.callStatement(BaseDistributedSearchTestCase.java:963)
	at org.apache.solr.BaseDistributedSearchTestCase$ShardsRepeatRule$ShardsStatement.evaluate(BaseDistributedSearchTestCase.java:938)
	at com.carrotsearch.randomizedtesting.rules.SystemPropertiesRestoreRule$1.evaluate(SystemPropertiesRestoreRule.java:57)
	at org.apache.lucene.util.TestRuleSetupTeardownChained$1.evaluate(TestRuleSetupTeardownChained.java:50)
	at org.apache.lucene.util.AbstractBeforeAfterRule$1.evaluate(AbstractBeforeAfterRule.java:46)
	at org.apache.lucene.util.TestRuleThreadAndTestName$1.evaluate(TestRuleThreadAndTestName.java:49)
	at org.apache.lucene.util.TestRuleIgnoreAfterMaxFailures$1.evaluate(TestRuleIgnoreAfterMaxFailures.java:65)
	at org.apache.lucene.util.TestRuleMarkFailure$1.evaluate(TestRuleMarkFailure.java:48)
	at com.carrotsearch.randomizedtesting.rules.StatementAdapter.evaluate(StatementAdapter.java:36)
	at com.carrotsearch.randomizedtesting.ThreadLeakControl$StatementRunner.run(ThreadLeakControl.java:367)
	at com.carrotsearch.randomizedtesting.ThreadLeakControl.forkTimeoutingTask(ThreadLeakControl.java:809)
	at com.carrotsearch.randomizedtesting.ThreadLeakControl$3.evaluate(ThreadLeakControl.java:460)
	at com.carrotsearch.randomizedtesting.RandomizedRunner.runSingleTest(RandomizedRunner.java:873)
	at com.carrotsearch.randomizedtesting.RandomizedRunner$5.evaluate(RandomizedRunner.java:775)
	at com.carrotsearch.randomizedtesting.RandomizedRunner$6.evaluate(RandomizedRunner.java:809)
	at com.carrotsearch.randomizedtesting.RandomizedRunner$7.evaluate(RandomizedRunner.java:820)
	at com.carrotsearch.randomizedtesting.rules.StatementAdapter.evaluate(StatementAdapter.java:36)
	at com.carrotsearch.randomizedtesting.rules.SystemPropertiesRestoreRule$1.evaluate(SystemPropertiesRestoreRule.java:57)
	at org.apache.lucene.util.AbstractBeforeAfterRule$1.evaluate(AbstractBeforeAfterRule.java:46)
	at com.carrotsearch.randomizedtesting.rules.StatementAdapter.evaluate(StatementAdapter.java:36)
	at org.apache.lucene.util.TestRuleStoreClassName$1.evaluate(TestRuleStoreClassName.java:42)
	at com.carrotsearch.randomizedtesting.rules.NoShadowingOrOverridesOnMethodsRule$1.evaluate(NoShadowingOrOverridesOnMethodsRule.java:39)
	at com.carrotsearch.randomizedtesting.rules.NoShadowingOrOverridesOnMethodsRule$1.evaluate(NoShadowingOrOverridesOnMethodsRule.java:39)
	at com.carrotsearch.randomizedtesting.rules.StatementAdapter.evaluate(StatementAdapter.java:36)
	at com.carrotsearch.randomizedtesting.rules.StatementAdapter.evaluate(StatementAdapter.java:36)
	at com.carrotsearch.randomizedtesting.rules.StatementAdapter.evaluate(StatementAdapter.java:36)
	at org.apache.lucene.util.TestRuleAssertionsRequired$1.evaluate(TestRuleAssertionsRequired.java:54)
	at org.apache.lucene.util.TestRuleMarkFailure$1.evaluate(TestRuleMarkFailure.java:48)
	at org.apache.lucene.util.TestRuleIgnoreAfterMaxFailures$1.evaluate(TestRuleIgnoreAfterMaxFailures.java:65)
	at org.apache.lucene.util.TestRuleIgnoreTestSuites$1.evaluate(TestRuleIgnoreTestSuites.java:55)
	at com.carrotsearch.randomizedtesting.rules.StatementAdapter.evaluate(StatementAdapter.java:36)
	at com.carrotsearch.randomizedtesting.ThreadLeakControl$StatementRunner.run(ThreadLeakControl.java:367)
	at java.lang.Thread.run(Thread.java:745)


FAILED:  org.apache.solr.cloud.DistribJoinFromCollectionTest.test

Error Message:
Error from server at https://127.0.0.1:53138: KeeperErrorCode = NoNode for /overseer/collection-queue-work/qnr-0000000000

Stack Trace:
org.apache.solr.client.solrj.impl.HttpSolrClient$RemoteSolrException: Error from server at https://127.0.0.1:53138: KeeperErrorCode = NoNode for /overseer/collection-queue-work/qnr-0000000000
	at __randomizedtesting.SeedInfo.seed([19E656938EF54EA7:91B269492009235F]:0)
	at org.apache.solr.client.solrj.impl.HttpSolrClient.executeMethod(HttpSolrClient.java:575)
	at org.apache.solr.client.solrj.impl.HttpSolrClient.request(HttpSolrClient.java:241)
	at org.apache.solr.client.solrj.impl.HttpSolrClient.request(HttpSolrClient.java:230)
	at org.apache.solr.client.solrj.SolrClient.request(SolrClient.java:1220)
	at org.apache.solr.cloud.AbstractFullDistribZkTestBase.createCollection(AbstractFullDistribZkTestBase.java:1571)
	at org.apache.solr.cloud.AbstractFullDistribZkTestBase.createCollection(AbstractFullDistribZkTestBase.java:1528)
	at org.apache.solr.cloud.AbstractFullDistribZkTestBase.createCollection(AbstractFullDistribZkTestBase.java:1583)
	at org.apache.solr.cloud.AbstractFullDistribZkTestBase.createCollection(AbstractFullDistribZkTestBase.java:1524)
	at org.apache.solr.cloud.DistribJoinFromCollectionTest.test(DistribJoinFromCollectionTest.java:73)
	at sun.reflect.NativeMethodAccessorImpl.invoke0(Native Method)
	at sun.reflect.NativeMethodAccessorImpl.invoke(NativeMethodAccessorImpl.java:62)
	at sun.reflect.DelegatingMethodAccessorImpl.invoke(DelegatingMethodAccessorImpl.java:43)
	at java.lang.reflect.Method.invoke(Method.java:497)
	at com.carrotsearch.randomizedtesting.RandomizedRunner.invoke(RandomizedRunner.java:1665)
	at com.carrotsearch.randomizedtesting.RandomizedRunner$8.evaluate(RandomizedRunner.java:864)
	at com.carrotsearch.randomizedtesting.RandomizedRunner$9.evaluate(RandomizedRunner.java:900)
	at com.carrotsearch.randomizedtesting.RandomizedRunner$10.evaluate(RandomizedRunner.java:914)
	at org.apache.solr.BaseDistributedSearchTestCase$ShardsRepeatRule$ShardsFixedStatement.callStatement(BaseDistributedSearchTestCase.java:963)
	at org.apache.solr.BaseDistributedSearchTestCase$ShardsRepeatRule$ShardsStatement.evaluate(BaseDistributedSearchTestCase.java:938)
	at com.carrotsearch.randomizedtesting.rules.SystemPropertiesRestoreRule$1.evaluate(SystemPropertiesRestoreRule.java:57)
	at org.apache.lucene.util.TestRuleSetupTeardownChained$1.evaluate(TestRuleSetupTeardownChained.java:50)
	at org.apache.lucene.util.AbstractBeforeAfterRule$1.evaluate(AbstractBeforeAfterRule.java:46)
	at org.apache.lucene.util.TestRuleThreadAndTestName$1.evaluate(TestRuleThreadAndTestName.java:49)
	at org.apache.lucene.util.TestRuleIgnoreAfterMaxFailures$1.evaluate(TestRuleIgnoreAfterMaxFailures.java:65)
	at org.apache.lucene.util.TestRuleMarkFailure$1.evaluate(TestRuleMarkFailure.java:48)
	at com.carrotsearch.randomizedtesting.rules.StatementAdapter.evaluate(StatementAdapter.java:36)
	at com.carrotsearch.randomizedtesting.ThreadLeakControl$StatementRunner.run(ThreadLeakControl.java:367)
	at com.carrotsearch.randomizedtesting.ThreadLeakControl.forkTimeoutingTask(ThreadLeakControl.java:809)
	at com.carrotsearch.randomizedtesting.ThreadLeakControl$3.evaluate(ThreadLeakControl.java:460)
	at com.carrotsearch.randomizedtesting.RandomizedRunner.runSingleTest(RandomizedRunner.java:873)
	at com.carrotsearch.randomizedtesting.RandomizedRunner$5.evaluate(RandomizedRunner.java:775)
	at com.carrotsearch.randomizedtesting.RandomizedRunner$6.evaluate(RandomizedRunner.java:809)
	at com.carrotsearch.randomizedtesting.RandomizedRunner$7.evaluate(RandomizedRunner.java:820)
	at com.carrotsearch.randomizedtesting.rules.StatementAdapter.evaluate(StatementAdapter.java:36)
	at com.carrotsearch.randomizedtesting.rules.SystemPropertiesRestoreRule$1.evaluate(SystemPropertiesRestoreRule.java:57)
	at org.apache.lucene.util.AbstractBeforeAfterRule$1.evaluate(AbstractBeforeAfterRule.java:46)
	at com.carrotsearch.randomizedtesting.rules.StatementAdapter.evaluate(StatementAdapter.java:36)
	at org.apache.lucene.util.TestRuleStoreClassName$1.evaluate(TestRuleStoreClassName.java:42)
	at com.carrotsearch.randomizedtesting.rules.NoShadowingOrOverridesOnMethodsRule$1.evaluate(NoShadowingOrOverridesOnMethodsRule.java:39)
	at com.carrotsearch.randomizedtesting.rules.NoShadowingOrOverridesOnMethodsRule$1.evaluate(NoShadowingOrOverridesOnMethodsRule.java:39)
	at com.carrotsearch.randomizedtesting.rules.StatementAdapter.evaluate(StatementAdapter.java:36)
	at com.carrotsearch.randomizedtesting.rules.StatementAdapter.evaluate(StatementAdapter.java:36)
	at com.carrotsearch.randomizedtesting.rules.StatementAdapter.evaluate(StatementAdapter.java:36)
	at org.apache.lucene.util.TestRuleAssertionsRequired$1.evaluate(TestRuleAssertionsRequired.java:54)
	at org.apache.lucene.util.TestRuleMarkFailure$1.evaluate(TestRuleMarkFailure.java:48)
	at org.apache.lucene.util.TestRuleIgnoreAfterMaxFailures$1.evaluate(TestRuleIgnoreAfterMaxFailures.java:65)
	at org.apache.lucene.util.TestRuleIgnoreTestSuites$1.evaluate(TestRuleIgnoreTestSuites.java:55)
	at com.carrotsearch.randomizedtesting.rules.StatementAdapter.evaluate(StatementAdapter.java:36)
	at com.carrotsearch.randomizedtesting.ThreadLeakControl$StatementRunner.run(ThreadLeakControl.java:367)
	at java.lang.Thread.run(Thread.java:745)


FAILED:  org.apache.solr.cloud.SyncSliceTest.test

Error Message:
expected:<5> but was:<4>

Stack Trace:
java.lang.AssertionError: expected:<5> but was:<4>
	at __randomizedtesting.SeedInfo.seed([19E656938EF54EA7:91B269492009235F]:0)
	at org.junit.Assert.fail(Assert.java:93)
	at org.junit.Assert.failNotEquals(Assert.java:647)
	at org.junit.Assert.assertEquals(Assert.java:128)
	at org.junit.Assert.assertEquals(Assert.java:472)
	at org.junit.Assert.assertEquals(Assert.java:456)
	at org.apache.solr.cloud.SyncSliceTest.test(SyncSliceTest.java:154)
	at sun.reflect.NativeMethodAccessorImpl.invoke0(Native Method)
	at sun.reflect.NativeMethodAccessorImpl.invoke(NativeMethodAccessorImpl.java:62)
	at sun.reflect.DelegatingMethodAccessorImpl.invoke(DelegatingMethodAccessorImpl.java:43)
	at java.lang.reflect.Method.invoke(Method.java:497)
	at com.carrotsearch.randomizedtesting.RandomizedRunner.invoke(RandomizedRunner.java:1665)
	at com.carrotsearch.randomizedtesting.RandomizedRunner$8.evaluate(RandomizedRunner.java:864)
	at com.carrotsearch.randomizedtesting.RandomizedRunner$9.evaluate(RandomizedRunner.java:900)
	at com.carrotsearch.randomizedtesting.RandomizedRunner$10.evaluate(RandomizedRunner.java:914)
	at org.apache.solr.BaseDistributedSearchTestCase$ShardsRepeatRule$ShardsFixedStatement.callStatement(BaseDistributedSearchTestCase.java:963)
	at org.apache.solr.BaseDistributedSearchTestCase$ShardsRepeatRule$ShardsStatement.evaluate(BaseDistributedSearchTestCase.java:938)
	at com.carrotsearch.randomizedtesting.rules.SystemPropertiesRestoreRule$1.evaluate(SystemPropertiesRestoreRule.java:57)
	at org.apache.lucene.util.TestRuleSetupTeardownChained$1.evaluate(TestRuleSetupTeardownChained.java:50)
	at org.apache.lucene.util.AbstractBeforeAfterRule$1.evaluate(AbstractBeforeAfterRule.java:46)
	at org.apache.lucene.util.TestRuleThreadAndTestName$1.evaluate(TestRuleThreadAndTestName.java:49)
	at org.apache.lucene.util.TestRuleIgnoreAfterMaxFailures$1.evaluate(TestRuleIgnoreAfterMaxFailures.java:65)
	at org.apache.lucene.util.TestRuleMarkFailure$1.evaluate(TestRuleMarkFailure.java:48)
	at com.carrotsearch.randomizedtesting.rules.StatementAdapter.evaluate(StatementAdapter.java:36)
	at com.carrotsearch.randomizedtesting.ThreadLeakControl$StatementRunner.run(ThreadLeakControl.java:367)
	at com.carrotsearch.randomizedtesting.ThreadLeakControl.forkTimeoutingTask(ThreadLeakControl.java:809)
	at com.carrotsearch.randomizedtesting.ThreadLeakControl$3.evaluate(ThreadLeakControl.java:460)
	at com.carrotsearch.randomizedtesting.RandomizedRunner.runSingleTest(RandomizedRunner.java:873)
	at com.carrotsearch.randomizedtesting.RandomizedRunner$5.evaluate(RandomizedRunner.java:775)
	at com.carrotsearch.randomizedtesting.RandomizedRunner$6.evaluate(RandomizedRunner.java:809)
	at com.carrotsearch.randomizedtesting.RandomizedRunner$7.evaluate(RandomizedRunner.java:820)
	at com.carrotsearch.randomizedtesting.rules.StatementAdapter.evaluate(StatementAdapter.java:36)
	at com.carrotsearch.randomizedtesting.rules.SystemPropertiesRestoreRule$1.evaluate(SystemPropertiesRestoreRule.java:57)
	at org.apache.lucene.util.AbstractBeforeAfterRule$1.evaluate(AbstractBeforeAfterRule.java:46)
	at com.carrotsearch.randomizedtesting.rules.StatementAdapter.evaluate(StatementAdapter.java:36)
	at org.apache.lucene.util.TestRuleStoreClassName$1.evaluate(TestRuleStoreClassName.java:42)
	at com.carrotsearch.randomizedtesting.rules.NoShadowingOrOverridesOnMethodsRule$1.evaluate(NoShadowingOrOverridesOnMethodsRule.java:39)
	at com.carrotsearch.randomizedtesting.rules.NoShadowingOrOverridesOnMethodsRule$1.evaluate(NoShadowingOrOverridesOnMethodsRule.java:39)
	at com.carrotsearch.randomizedtesting.rules.StatementAdapter.evaluate(StatementAdapter.java:36)
	at com.carrotsearch.randomizedtesting.rules.StatementAdapter.evaluate(StatementAdapter.java:36)
	at com.carrotsearch.randomizedtesting.rules.StatementAdapter.evaluate(StatementAdapter.java:36)
	at org.apache.lucene.util.TestRuleAssertionsRequired$1.evaluate(TestRuleAssertionsRequired.java:54)
	at org.apache.lucene.util.TestRuleMarkFailure$1.evaluate(TestRuleMarkFailure.java:48)
	at org.apache.lucene.util.TestRuleIgnoreAfterMaxFailures$1.evaluate(TestRuleIgnoreAfterMaxFailures.java:65)
	at org.apache.lucene.util.TestRuleIgnoreTestSuites$1.evaluate(TestRuleIgnoreTestSuites.java:55)
	at com.carrotsearch.randomizedtesting.rules.StatementAdapter.evaluate(StatementAdapter.java:36)
	at com.carrotsearch.randomizedtesting.ThreadLeakControl$StatementRunner.run(ThreadLeakControl.java:367)
	at java.lang.Thread.run(Thread.java:745)




Build Log:
[...truncated 10107 lines...]
   [junit4] Suite: org.apache.solr.cloud.DistribJoinFromCollectionTest
   [junit4]   2> Creating dataDir: /Users/jenkins/workspace/Lucene-Solr-5.x-MacOSX/solr/build/solr-core/test/J1/temp/solr.cloud.DistribJoinFromCollectionTest_19E656938EF54EA7-001/init-core-data-001
   [junit4]   2> 1016297 INFO  (SUITE-DistribJoinFromCollectionTest-seed#[19E656938EF54EA7]-worker) [    ] o.a.s.SolrTestCaseJ4 Randomized ssl (true) and clientAuth (false)
   [junit4]   2> 1016297 INFO  (SUITE-DistribJoinFromCollectionTest-seed#[19E656938EF54EA7]-worker) [    ] o.a.s.BaseDistributedSearchTestCase Setting hostContext system property: /
   [junit4]   2> 1016300 INFO  (TEST-DistribJoinFromCollectionTest.test-seed#[19E656938EF54EA7]) [    ] o.a.s.c.ZkTestServer STARTING ZK TEST SERVER
   [junit4]   2> 1016301 INFO  (Thread-2365) [    ] o.a.s.c.ZkTestServer client port:0.0.0.0/0.0.0.0:0
   [junit4]   2> 1016301 INFO  (Thread-2365) [    ] o.a.s.c.ZkTestServer Starting server
   [junit4]   2> 1016406 INFO  (TEST-DistribJoinFromCollectionTest.test-seed#[19E656938EF54EA7]) [    ] o.a.s.c.ZkTestServer start zk server on port:53125
   [junit4]   2> 1016408 INFO  (TEST-DistribJoinFromCollectionTest.test-seed#[19E656938EF54EA7]) [    ] o.a.s.c.c.SolrZkClient Using default ZkCredentialsProvider
   [junit4]   2> 1016409 INFO  (TEST-DistribJoinFromCollectionTest.test-seed#[19E656938EF54EA7]) [    ] o.a.s.c.c.ConnectionManager Waiting for client to connect to ZooKeeper
   [junit4]   2> 1016416 INFO  (zkCallback-680-thread-1) [    ] o.a.s.c.c.ConnectionManager Watcher org.apache.solr.common.cloud.ConnectionManager@30c68409 name:ZooKeeperConnection Watcher:127.0.0.1:53125 got event WatchedEvent state:SyncConnected type:None path:null path:null type:None
   [junit4]   2> 1016416 INFO  (TEST-DistribJoinFromCollectionTest.test-seed#[19E656938EF54EA7]) [    ] o.a.s.c.c.ConnectionManager Client is connected to ZooKeeper
   [junit4]   2> 1016416 INFO  (TEST-DistribJoinFromCollectionTest.test-seed#[19E656938EF54EA7]) [    ] o.a.s.c.c.SolrZkClient Using default ZkACLProvider
   [junit4]   2> 1016416 INFO  (TEST-DistribJoinFromCollectionTest.test-seed#[19E656938EF54EA7]) [    ] o.a.s.c.c.SolrZkClient makePath: /solr
   [junit4]   2> 1016432 INFO  (TEST-DistribJoinFromCollectionTest.test-seed#[19E656938EF54EA7]) [    ] o.a.s.c.c.SolrZkClient Using default ZkCredentialsProvider
   [junit4]   2> 1016433 INFO  (TEST-DistribJoinFromCollectionTest.test-seed#[19E656938EF54EA7]) [    ] o.a.s.c.c.ConnectionManager Waiting for client to connect to ZooKeeper
   [junit4]   2> 1016434 INFO  (zkCallback-681-thread-1) [    ] o.a.s.c.c.ConnectionManager Watcher org.apache.solr.common.cloud.ConnectionManager@7f3c1b3e name:ZooKeeperConnection Watcher:127.0.0.1:53125/solr got event WatchedEvent state:SyncConnected type:None path:null path:null type:None
   [junit4]   2> 1016434 INFO  (TEST-DistribJoinFromCollectionTest.test-seed#[19E656938EF54EA7]) [    ] o.a.s.c.c.ConnectionManager Client is connected to ZooKeeper
   [junit4]   2> 1016434 INFO  (TEST-DistribJoinFromCollectionTest.test-seed#[19E656938EF54EA7]) [    ] o.a.s.c.c.SolrZkClient Using default ZkACLProvider
   [junit4]   2> 1016434 INFO  (TEST-DistribJoinFromCollectionTest.test-seed#[19E656938EF54EA7]) [    ] o.a.s.c.c.SolrZkClient makePath: /collections/collection1
   [junit4]   2> 1016449 INFO  (TEST-DistribJoinFromCollectionTest.test-seed#[19E656938EF54EA7]) [    ] o.a.s.c.c.SolrZkClient makePath: /collections/collection1/shards
   [junit4]   2> 1016451 INFO  (TEST-DistribJoinFromCollectionTest.test-seed#[19E656938EF54EA7]) [    ] o.a.s.c.c.SolrZkClient makePath: /collections/control_collection
   [junit4]   2> 1016453 INFO  (TEST-DistribJoinFromCollectionTest.test-seed#[19E656938EF54EA7]) [    ] o.a.s.c.c.SolrZkClient makePath: /collections/control_collection/shards
   [junit4]   2> 1016467 INFO  (TEST-DistribJoinFromCollectionTest.test-seed#[19E656938EF54EA7]) [    ] o.a.s.c.AbstractZkTestCase put /Users/jenkins/workspace/Lucene-Solr-5.x-MacOSX/solr/core/src/test-files/solr/collection1/conf/solrconfig-tlog.xml to /configs/conf1/solrconfig.xml
   [junit4]   2> 1016470 INFO  (TEST-DistribJoinFromCollectionTest.test-seed#[19E656938EF54EA7]) [    ] o.a.s.c.c.SolrZkClient makePath: /configs/conf1/solrconfig.xml
   [junit4]   2> 1016475 INFO  (TEST-DistribJoinFromCollectionTest.test-seed#[19E656938EF54EA7]) [    ] o.a.s.c.AbstractZkTestCase put /Users/jenkins/workspace/Lucene-Solr-5.x-MacOSX/solr/core/src/test-files/solr/collection1/conf/schema.xml to /configs/conf1/schema.xml
   [junit4]   2> 1016475 INFO  (TEST-DistribJoinFromCollectionTest.test-seed#[19E656938EF54EA7]) [    ] o.a.s.c.c.SolrZkClient makePath: /configs/conf1/schema.xml
   [junit4]   2> 1016491 INFO  (TEST-DistribJoinFromCollectionTest.test-seed#[19E656938EF54EA7]) [    ] o.a.s.c.AbstractZkTestCase put /Users/jenkins/workspace/Lucene-Solr-5.x-MacOSX/solr/core/src/test-files/solr/collection1/conf/solrconfig.snippet.randomindexconfig.xml to /configs/conf1/solrconfig.snippet.randomindexconfig.xml
   [junit4]   2> 1016491 INFO  (TEST-DistribJoinFromCollectionTest.test-seed#[19E656938EF54EA7]) [    ] o.a.s.c.c.SolrZkClient makePath: /configs/conf1/solrconfig.snippet.randomindexconfig.xml
   [junit4]   2> 1016494 INFO  (TEST-DistribJoinFromCollectionTest.test-seed#[19E656938EF54EA7]) [    ] o.a.s.c.AbstractZkTestCase put /Users/jenkins/workspace/Lucene-Solr-5.x-MacOSX/solr/core/src/test-files/solr/collection1/conf/stopwords.txt to /configs/conf1/stopwords.txt
   [junit4]   2> 1016494 INFO  (TEST-DistribJoinFromCollectionTest.test-seed#[19E656938EF54EA7]) [    ] o.a.s.c.c.SolrZkClient makePath: /configs/conf1/stopwords.txt
   [junit4]   2> 1016512 INFO  (TEST-DistribJoinFromCollectionTest.test-seed#[19E656938EF54EA7]) [    ] o.a.s.c.AbstractZkTestCase put /Users/jenkins/workspace/Lucene-Solr-5.x-MacOSX/solr/core/src/test-files/solr/collection1/conf/protwords.txt to /configs/conf1/protwords.txt
   [junit4]   2> 1016512 INFO  (TEST-DistribJoinFromCollectionTest.test-seed#[19E656938EF54EA7]) [    ] o.a.s.c.c.SolrZkClient makePath: /configs/conf1/protwords.txt
   [junit4]   2> 1016515 INFO  (TEST-DistribJoinFromCollectionTest.test-seed#[19E656938EF54EA7]) [    ] o.a.s.c.AbstractZkTestCase put /Users/jenkins/workspace/Lucene-Solr-5.x-MacOSX/solr/core/src/test-files/solr/collection1/conf/currency.xml to /configs/conf1/currency.xml
   [junit4]   2> 1016515 INFO  (TEST-DistribJoinFromCollectionTest.test-seed#[19E656938EF54EA7]) [    ] o.a.s.c.c.SolrZkClient makePath: /configs/conf1/currency.xml
   [junit4]   2> 1016518 INFO  (TEST-DistribJoinFromCollectionTest.test-seed#[19E656938EF54EA7]) [    ] o.a.s.c.AbstractZkTestCase put /Users/jenkins/workspace/Lucene-Solr-5.x-MacOSX/solr/core/src/test-files/solr/collection1/conf/enumsConfig.xml to /configs/conf1/enumsConfig.xml
   [junit4]   2> 1016518 INFO  (TEST-DistribJoinFromCollectionTest.test-seed#[19E656938EF54EA7]) [    ] o.a.s.c.c.SolrZkClient makePath: /configs/conf1/enumsConfig.xml
   [junit4]   2> 1016535 INFO  (TEST-DistribJoinFromCollectionTest.test-seed#[19E656938EF54EA7]) [    ] o.a.s.c.AbstractZkTestCase put /Users/jenkins/workspace/Lucene-Solr-5.x-MacOSX/solr/core/src/test-files/solr/collection1/conf/open-exchange-rates.json to /configs/conf1/open-exchange-rates.json
   [junit4]   2> 1016535 INFO  (TEST-DistribJoinFromCollectionTest.test-seed#[19E656938EF54EA7]) [    ] o.a.s.c.c.SolrZkClient makePath: /configs/conf1/open-exchange-rates.json
   [junit4]   2> 1016537 INFO  (TEST-DistribJoinFromCollectionTest.test-seed#[19E656938EF54EA7]) [    ] o.a.s.c.AbstractZkTestCase put /Users/jenkins/workspace/Lucene-Solr-5.x-MacOSX/solr/core/src/test-files/solr/collection1/conf/mapping-ISOLatin1Accent.txt to /configs/conf1/mapping-ISOLatin1Accent.txt
   [junit4]   2> 1016538 INFO  (TEST-DistribJoinFromCollectionTest.test-seed#[19E656938EF54EA7]) [    ] o.a.s.c.c.SolrZkClient makePath: /configs/conf1/mapping-ISOLatin1Accent.txt
   [junit4]   2> 1016556 INFO  (TEST-DistribJoinFromCollectionTest.test-seed#[19E656938EF54EA7]) [    ] o.a.s.c.AbstractZkTestCase put /Users/jenkins/workspace/Lucene-Solr-5.x-MacOSX/solr/core/src/test-files/solr/collection1/conf/old_synonyms.txt to /configs/conf1/old_synonyms.txt
   [junit4]   2> 1016556 INFO  (TEST-DistribJoinFromCollectionTest.test-seed#[19E656938EF54EA7]) [    ] o.a.s.c.c.SolrZkClient makePath: /configs/conf1/old_synonyms.txt
   [junit4]   2> 1016559 INFO  (TEST-DistribJoinFromCollectionTest.test-seed#[19E656938EF54EA7]) [    ] o.a.s.c.AbstractZkTestCase put /Users/jenkins/workspace/Lucene-Solr-5.x-MacOSX/solr/core/src/test-files/solr/collection1/conf/synonyms.txt to /configs/conf1/synonyms.txt
   [junit4]   2> 1016559 INFO  (TEST-DistribJoinFromCollectionTest.test-seed#[19E656938EF54EA7]) [    ] o.a.s.c.c.SolrZkClient makePath: /configs/conf1/synonyms.txt
   [junit4]   2> 1016575 INFO  (TEST-DistribJoinFromCollectionTest.test-seed#[19E656938EF54EA7]) [    ] o.a.s.c.c.SolrZkClient Using default ZkCredentialsProvider
   [junit4]   2> 1016576 INFO  (TEST-DistribJoinFromCollectionTest.test-seed#[19E656938EF54EA7]) [    ] o.a.s.c.c.ConnectionManager Waiting for client to connect to ZooKeeper
   [junit4]   2> 1016577 INFO  (zkCallback-682-thread-1) [    ] o.a.s.c.c.ConnectionManager Watcher org.apache.solr.common.cloud.ConnectionManager@3603b80f name:ZooKeeperConnection Watcher:127.0.0.1:53125/solr got event WatchedEvent state:SyncConnected type:None path:null path:null type:None
   [junit4]   2> 1016578 INFO  (TEST-DistribJoinFromCollectionTest.test-seed#[19E656938EF54EA7]) [    ] o.a.s.c.c.ConnectionManager Client is connected to ZooKeeper
   [junit4]   2> 1016578 INFO  (TEST-DistribJoinFromCollectionTest.test-seed#[19E656938EF54EA7]) [    ] o.a.s.c.c.SolrZkClient Using default ZkACLProvider
   [junit4]   2> 1018351 INFO  (TEST-DistribJoinFromCollectionTest.test-seed#[19E656938EF54EA7]) [    ] o.a.s.SolrTestCaseJ4 Writing core.properties file to /Users/jenkins/workspace/Lucene-Solr-5.x-MacOSX/solr/build/solr-core/test/J1/temp/solr.cloud.DistribJoinFromCollectionTest_19E656938EF54EA7-001/control-001/cores/collection1
   [junit4]   2> 1018356 INFO  (TEST-DistribJoinFromCollectionTest.test-seed#[19E656938EF54EA7]) [    ] o.e.j.s.Server jetty-9.2.13.v20150730
   [junit4]   2> 1018359 INFO  (TEST-DistribJoinFromCollectionTest.test-seed#[19E656938EF54EA7]) [    ] o.e.j.s.h.ContextHandler Started o.e.j.s.ServletContextHandler@2e9c9c9e{/,null,AVAILABLE}
   [junit4]   2> 1018394 INFO  (TEST-DistribJoinFromCollectionTest.test-seed#[19E656938EF54EA7]) [    ] o.e.j.s.ServerConnector Started ServerConnector@1f26efc{SSL-http/1.1}{127.0.0.1:53129}
   [junit4]   2> 1018394 INFO  (TEST-DistribJoinFromCollectionTest.test-seed#[19E656938EF54EA7]) [    ] o.e.j.s.Server Started @1022170ms
   [junit4]   2> 1018394 INFO  (TEST-DistribJoinFromCollectionTest.test-seed#[19E656938EF54EA7]) [    ] o.a.s.c.s.e.JettySolrRunner Jetty properties: {solr.data.dir=/Users/jenkins/workspace/Lucene-Solr-5.x-MacOSX/solr/build/solr-core/test/J1/temp/solr.cloud.DistribJoinFromCollectionTest_19E656938EF54EA7-001/tempDir-001/control/data, hostContext=/, hostPort=53129, coreRootDirectory=/Users/jenkins/workspace/Lucene-Solr-5.x-MacOSX/solr/build/solr-core/test/J1/../../../../../../../../../Users/jenkins/workspace/Lucene-Solr-5.x-MacOSX/solr/build/solr-core/test/J1/temp/solr.cloud.DistribJoinFromCollectionTest_19E656938EF54EA7-001/control-001/cores}
   [junit4]   2> 1018394 INFO  (TEST-DistribJoinFromCollectionTest.test-seed#[19E656938EF54EA7]) [    ] o.a.s.s.SolrDispatchFilter SolrDispatchFilter.init(): sun.misc.Launcher$AppClassLoader@74a14482
   [junit4]   2> 1018395 INFO  (TEST-DistribJoinFromCollectionTest.test-seed#[19E656938EF54EA7]) [    ] o.a.s.c.SolrResourceLoader new SolrResourceLoader for directory: '/Users/jenkins/workspace/Lucene-Solr-5.x-MacOSX/solr/build/solr-core/test/J1/../../../../../../../../../Users/jenkins/workspace/Lucene-Solr-5.x-MacOSX/solr/build/solr-core/test/J1/temp/solr.cloud.DistribJoinFromCollectionTest_19E656938EF54EA7-001/control-001/'
   [junit4]   2> 1018424 INFO  (TEST-DistribJoinFromCollectionTest.test-seed#[19E656938EF54EA7]) [    ] o.a.s.c.c.SolrZkClient Using default ZkCredentialsProvider
   [junit4]   2> 1018427 INFO  (TEST-DistribJoinFromCollectionTest.test-seed#[19E656938EF54EA7]) [    ] o.a.s.c.c.ConnectionManager Waiting for client to connect to ZooKeeper
   [junit4]   2> 1018428 INFO  (zkCallback-683-thread-1) [    ] o.a.s.c.c.ConnectionManager Watcher org.apache.solr.common.cloud.ConnectionManager@594fab9b name:ZooKeeperConnection Watcher:127.0.0.1:53125/solr got event WatchedEvent state:SyncConnected type:None path:null path:null type:None
   [junit4]   2> 1018428 INFO  (TEST-DistribJoinFromCollectionTest.test-seed#[19E656938EF54EA7]) [    ] o.a.s.c.c.ConnectionManager Client is connected to ZooKeeper
   [junit4]   2> 1018428 INFO  (TEST-DistribJoinFromCollectionTest.test-seed#[19E656938EF54EA7]) [    ] o.a.s.c.c.SolrZkClient Using default ZkACLProvider
   [junit4]   2> 1018430 INFO  (TEST-DistribJoinFromCollectionTest.test-seed#[19E656938EF54EA7]) [    ] o.a.s.s.SolrDispatchFilter Loading solr.xml from SolrHome (not found in ZooKeeper)
   [junit4]   2> 1018430 INFO  (TEST-DistribJoinFromCollectionTest.test-seed#[19E656938EF54EA7]) [    ] o.a.s.c.SolrXmlConfig Loading container configuration from /Users/jenkins/workspace/Lucene-Solr-5.x-MacOSX/solr/build/solr-core/test/J1/../../../../../../../../../Users/jenkins/workspace/Lucene-Solr-5.x-MacOSX/solr/build/solr-core/test/J1/temp/solr.cloud.DistribJoinFromCollectionTest_19E656938EF54EA7-001/control-001/solr.xml
   [junit4]   2> 1018437 INFO  (TEST-DistribJoinFromCollectionTest.test-seed#[19E656938EF54EA7]) [    ] o.a.s.c.CoresLocator Config-defined core root directory: /Users/jenkins/workspace/Lucene-Solr-5.x-MacOSX/solr/build/solr-core/test/J1/../../../../../../../../../Users/jenkins/workspace/Lucene-Solr-5.x-MacOSX/solr/build/solr-core/test/J1/temp/solr.cloud.DistribJoinFromCollectionTest_19E656938EF54EA7-001/control-001/cores
   [junit4]   2> 1018437 INFO  (TEST-DistribJoinFromCollectionTest.test-seed#[19E656938EF54EA7]) [    ] o.a.s.c.CoreContainer New CoreContainer 172979014
   [junit4]   2> 1018437 INFO  (TEST-DistribJoinFromCollectionTest.test-seed#[19E656938EF54EA7]) [    ] o.a.s.c.CoreContainer Loading cores into CoreContainer [instanceDir=/Users/jenkins/workspace/Lucene-Solr-5.x-MacOSX/solr/build/solr-core/test/J1/../../../../../../../../../Users/jenkins/workspace/Lucene-Solr-5.x-MacOSX/solr/build/solr-core/test/J1/temp/solr.cloud.DistribJoinFromCollectionTest_19E656938EF54EA7-001/control-001/]
   [junit4]   2> 1018437 INFO  (TEST-DistribJoinFromCollectionTest.test-seed#[19E656938EF54EA7]) [    ] o.a.s.c.CoreContainer loading shared library: /Users/jenkins/workspace/Lucene-Solr-5.x-MacOSX/solr/build/solr-core/test/J1/../../../../../../../../../Users/jenkins/workspace/Lucene-Solr-5.x-MacOSX/solr/build/solr-core/test/J1/temp/solr.cloud.DistribJoinFromCollectionTest_19E656938EF54EA7-001/control-001/lib
   [junit4]   2> 1018437 WARN  (TEST-DistribJoinFromCollectionTest.test-seed#[19E656938EF54EA7]) [    ] o.a.s.c.SolrResourceLoader Can't find (or read) directory to add to classloader: lib (resolved as: /Users/jenkins/workspace/Lucene-Solr-5.x-MacOSX/solr/build/solr-core/test/J1/../../../../../../../../../Users/jenkins/workspace/Lucene-Solr-5.x-MacOSX/solr/build/solr-core/test/J1/temp/solr.cloud.DistribJoinFromCollectionTest_19E656938EF54EA7-001/control-001/lib).
   [junit4]   2> 1018472 INFO  (TEST-DistribJoinFromCollectionTest.test-seed#[19E656938EF54EA7]) [    ] o.a.s.h.c.HttpShardHandlerFactory created with socketTimeout : 90000,urlScheme : ,connTimeout : 15000,maxConnectionsPerHost : 20,maxConnections : 10000,corePoolSize : 0,maximumPoolSize : 2147483647,maxThreadIdleTime : 5,sizeOfQueue : -1,fairnessPolicy : false,useRetries : false,
   [junit4]   2> 1018481 INFO  (TEST-DistribJoinFromCollectionTest.test-seed#[19E656938EF54EA7]) [    ] o.a.s.u.UpdateShardHandler Creating UpdateShardHandler HTTP client with params: socketTimeout=340000&connTimeout=45000&retry=true
   [junit4]   2> 1018484 INFO  (TEST-DistribJoinFromCollectionTest.test-seed#[19E656938EF54EA7]) [    ] o.a.s.l.LogWatcher SLF4J impl is org.slf4j.impl.Log4jLoggerFactory
   [junit4]   2> 1018484 INFO  (TEST-DistribJoinFromCollectionTest.test-seed#[19E656938EF54EA7]) [    ] o.a.s.l.LogWatcher Registering Log Listener [Log4j (org.slf4j.impl.Log4jLoggerFactory)]
   [junit4]   2> 1018484 INFO  (TEST-DistribJoinFromCollectionTest.test-seed#[19E656938EF54EA7]) [    ] o.a.s.c.ZkContainer Zookeeper client=127.0.0.1:53125/solr
   [junit4]   2> 1018484 INFO  (TEST-DistribJoinFromCollectionTest.test-seed#[19E656938EF54EA7]) [    ] o.a.s.c.ZkController zkHost includes chroot
   [junit4]   2> 1018484 INFO  (TEST-DistribJoinFromCollectionTest.test-seed#[19E656938EF54EA7]) [    ] o.a.s.c.c.SolrZkClient Using default ZkCredentialsProvider
   [junit4]   2> 1018485 INFO  (TEST-DistribJoinFromCollectionTest.test-seed#[19E656938EF54EA7]) [    ] o.a.s.c.c.ConnectionManager Waiting for client to connect to ZooKeeper
   [junit4]   2> 1018487 INFO  (zkCallback-685-thread-1) [    ] o.a.s.c.c.ConnectionManager Watcher org.apache.solr.common.cloud.ConnectionManager@6c9966cd name:ZooKeeperConnection Watcher:127.0.0.1:53125 got event WatchedEvent state:SyncConnected type:None path:null path:null type:None
   [junit4]   2> 1018487 INFO  (TEST-DistribJoinFromCollectionTest.test-seed#[19E656938EF54EA7]) [    ] o.a.s.c.c.ConnectionManager Client is connected to ZooKeeper
   [junit4]   2> 1018509 INFO  (TEST-DistribJoinFromCollectionTest.test-seed#[19E656938EF54EA7]) [    ] o.a.s.c.c.SolrZkClient Using default ZkACLProvider
   [junit4]   2> 1018512 INFO  (TEST-DistribJoinFromCollectionTest.test-seed#[19E656938EF54EA7]) [n:127.0.0.1:53129_    ] o.a.s.c.c.ConnectionManager Waiting for client to connect to ZooKeeper
   [junit4]   2> 1018513 INFO  (zkCallback-686-thread-1-processing-n:127.0.0.1:53129_) [n:127.0.0.1:53129_    ] o.a.s.c.c.ConnectionManager Watcher org.apache.solr.common.cloud.ConnectionManager@44bc7bd5 name:ZooKeeperConnection Watcher:127.0.0.1:53125/solr got event WatchedEvent state:SyncConnected type:None path:null path:null type:None
   [junit4]   2> 1018514 INFO  (TEST-DistribJoinFromCollectionTest.test-seed#[19E656938EF54EA7]) [n:127.0.0.1:53129_    ] o.a.s.c.c.ConnectionManager Client is connected to ZooKeeper
   [junit4]   2> 1018516 INFO  (TEST-DistribJoinFromCollectionTest.test-seed#[19E656938EF54EA7]) [n:127.0.0.1:53129_    ] o.a.s.c.c.SolrZkClient makePath: /overseer/queue
   [junit4]   2> 1018520 INFO  (TEST-DistribJoinFromCollectionTest.test-seed#[19E656938EF54EA7]) [n:127.0.0.1:53129_    ] o.a.s.c.c.SolrZkClient makePath: /overseer/collection-queue-work
   [junit4]   2> 1018526 INFO  (TEST-DistribJoinFromCollectionTest.test-seed#[19E656938EF54EA7]) [n:127.0.0.1:53129_    ] o.a.s.c.c.SolrZkClient makePath: /overseer/collection-map-running
   [junit4]   2> 1018529 INFO  (TEST-DistribJoinFromCollectionTest.test-seed#[19E656938EF54EA7]) [n:127.0.0.1:53129_    ] o.a.s.c.c.SolrZkClient makePath: /overseer/collection-map-completed
   [junit4]   2> 1018533 INFO  (TEST-DistribJoinFromCollectionTest.test-seed#[19E656938EF54EA7]) [n:127.0.0.1:53129_    ] o.a.s.c.c.SolrZkClient makePath: /overseer/collection-map-failure
   [junit4]   2> 1018538 INFO  (TEST-DistribJoinFromCollectionTest.test-seed#[19E656938EF54EA7]) [n:127.0.0.1:53129_    ] o.a.s.c.c.SolrZkClient makePath: /live_nodes
   [junit4]   2> 1018541 INFO  (TEST-DistribJoinFromCollectionTest.test-seed#[19E656938EF54EA7]) [n:127.0.0.1:53129_    ] o.a.s.c.c.SolrZkClient makePath: /aliases.json
   [junit4]   2> 1018545 INFO  (TEST-DistribJoinFromCollectionTest.test-seed#[19E656938EF54EA7]) [n:127.0.0.1:53129_    ] o.a.s.c.c.SolrZkClient makePath: /clusterstate.json
   [junit4]   2> 1018547 INFO  (TEST-DistribJoinFromCollectionTest.test-seed#[19E656938EF54EA7]) [n:127.0.0.1:53129_    ] o.a.s.c.c.SolrZkClient makePath: /security.json
   [junit4]   2> 1018550 INFO  (TEST-DistribJoinFromCollectionTest.test-seed#[19E656938EF54EA7]) [n:127.0.0.1:53129_    ] o.a.s.c.ZkController Register node as live in ZooKeeper:/live_nodes/127.0.0.1:53129_
   [junit4]   2> 1018551 INFO  (TEST-DistribJoinFromCollectionTest.test-seed#[19E656938EF54EA7]) [n:127.0.0.1:53129_    ] o.a.s.c.c.SolrZkClient makePath: /live_nodes/127.0.0.1:53129_
   [junit4]   2> 1018555 INFO  (TEST-DistribJoinFromCollectionTest.test-seed#[19E656938EF54EA7]) [n:127.0.0.1:53129_    ] o.a.s.c.c.SolrZkClient makePath: /overseer_elect
   [junit4]   2> 1018558 INFO  (TEST-DistribJoinFromCollectionTest.test-seed#[19E656938EF54EA7]) [n:127.0.0.1:53129_    ] o.a.s.c.c.SolrZkClient makePath: /overseer_elect/election
   [junit4]   2> 1018561 INFO  (TEST-DistribJoinFromCollectionTest.test-seed#[19E656938EF54EA7]) [n:127.0.0.1:53129_    ] o.a.s.c.Overseer Overseer (id=null) closing
   [junit4]   2> 1018562 INFO  (TEST-DistribJoinFromCollectionTest.test-seed#[19E656938EF54EA7]) [n:127.0.0.1:53129_    ] o.a.s.c.LeaderElector Joined leadership election with path: /overseer_elect/election/94614417723555845-127.0.0.1:53129_-n_0000000000
   [junit4]   2> 1018563 INFO  (TEST-DistribJoinFromCollectionTest.test-seed#[19E656938EF54EA7]) [n:127.0.0.1:53129_    ] o.a.s.c.OverseerElectionContext I am going to be the leader 127.0.0.1:53129_
   [junit4]   2> 1018563 INFO  (TEST-DistribJoinFromCollectionTest.test-seed#[19E656938EF54EA7]) [n:127.0.0.1:53129_    ] o.a.s.c.c.SolrZkClient makePath: /overseer_elect/leader
   [junit4]   2> 1018566 INFO  (TEST-DistribJoinFromCollectionTest.test-seed#[19E656938EF54EA7]) [n:127.0.0.1:53129_    ] o.a.s.c.Overseer Overseer (id=94614417723555845-127.0.0.1:53129_-n_0000000000) starting
   [junit4]   2> 1018569 INFO  (TEST-DistribJoinFromCollectionTest.test-seed#[19E656938EF54EA7]) [n:127.0.0.1:53129_    ] o.a.s.c.c.SolrZkClient makePath: /overseer/queue-work
   [junit4]   2> 1018581 INFO  (TEST-DistribJoinFromCollectionTest.test-seed#[19E656938EF54EA7]) [n:127.0.0.1:53129_    ] o.a.s.c.OverseerAutoReplicaFailoverThread Starting OverseerAutoReplicaFailoverThread autoReplicaFailoverWorkLoopDelay=10000 autoReplicaFailoverWaitAfterExpiration=30000 autoReplicaFailoverBadNodeExpiration=60000
   [junit4]   2> 1018582 INFO  (OverseerCollectionConfigSetProcessor-94614417723555845-127.0.0.1:53129_-n_0000000000) [n:127.0.0.1:53129_    ] o.a.s.c.OverseerTaskProcessor Process current queue of overseer operations
   [junit4]   2> 1018583 INFO  (TEST-DistribJoinFromCollectionTest.test-seed#[19E656938EF54EA7]) [n:127.0.0.1:53129_    ] o.a.s.c.c.ZkStateReader Updating cluster state from ZooKeeper... 
   [junit4]   2> 1018583 INFO  (OverseerStateUpdate-94614417723555845-127.0.0.1:53129_-n_0000000000) [n:127.0.0.1:53129_    ] o.a.s.c.Overseer Starting to work on the main queue
   [junit4]   2> 1018603 INFO  (TEST-DistribJoinFromCollectionTest.test-seed#[19E656938EF54EA7]) [n:127.0.0.1:53129_    ] o.a.s.c.CoreContainer Security conf doesn't exist. Skipping setup for authorization module.
   [junit4]   2> 1018603 INFO  (TEST-DistribJoinFromCollectionTest.test-seed#[19E656938EF54EA7]) [n:127.0.0.1:53129_    ] o.a.s.c.CoreContainer No authentication plugin used.
   [junit4]   2> 1018604 INFO  (TEST-DistribJoinFromCollectionTest.test-seed#[19E656938EF54EA7]) [n:127.0.0.1:53129_    ] o.a.s.c.CoresLocator Looking for core definitions underneath /Users/jenkins/workspace/Lucene-Solr-5.x-MacOSX/solr/build/solr-core/test/J1/../../../../../../../../../Users/jenkins/workspace/Lucene-Solr-5.x-MacOSX/solr/build/solr-core/test/J1/temp/solr.cloud.DistribJoinFromCollectionTest_19E656938EF54EA7-001/control-001/cores
   [junit4]   2> 1018605 INFO  (TEST-DistribJoinFromCollectionTest.test-seed#[19E656938EF54EA7]) [n:127.0.0.1:53129_    ] o.a.s.c.SolrCore Created CoreDescriptor: {name=collection1, config=solrconfig.xml, transient=false, schema=schema.xml, loadOnStartup=true, configSetProperties=configsetprops.json, instanceDir=/Users/jenkins/workspace/Lucene-Solr-5.x-MacOSX/solr/build/solr-core/test/J1/../../../../../../../../../Users/jenkins/workspace/Lucene-Solr-5.x-MacOSX/solr/build/solr-core/test/J1/temp/solr.cloud.DistribJoinFromCollectionTest_19E656938EF54EA7-001/control-001/cores/collection1, collection=control_collection, absoluteInstDir=/Users/jenkins/workspace/Lucene-Solr-5.x-MacOSX/solr/build/solr-core/test/J1/../../../../../../../../../Users/jenkins/workspace/Lucene-Solr-5.x-MacOSX/solr/build/solr-core/test/J1/temp/solr.cloud.DistribJoinFromCollectionTest_19E656938EF54EA7-001/control-001/cores/collection1/, coreNodeName=, dataDir=data/, shard=}
   [junit4]   2> 1018605 INFO  (TEST-DistribJoinFromCollectionTest.test-seed#[19E656938EF54EA7]) [n:127.0.0.1:53129_    ] o.a.s.c.CoresLocator Found core collection1 in /Users/jenkins/workspace/Lucene-Solr-5.x-MacOSX/solr/build/solr-core/test/J1/../../../../../../../../../Users/jenkins/workspace/Lucene-Solr-5.x-MacOSX/solr/build/solr-core/test/J1/temp/solr.cloud.DistribJoinFromCollectionTest_19E656938EF54EA7-001/control-001/cores/collection1/
   [junit4]   2> 1018605 INFO  (TEST-DistribJoinFromCollectionTest.test-seed#[19E656938EF54EA7]) [n:127.0.0.1:53129_    ] o.a.s.c.CoresLocator Found 1 core definitions
   [junit4]   2> 1018607 INFO  (TEST-DistribJoinFromCollectionTest.test-seed#[19E656938EF54EA7]) [n:127.0.0.1:53129_    ] o.a.s.s.SolrDispatchFilter user.dir=/Users/jenkins/workspace/Lucene-Solr-5.x-MacOSX/solr/build/solr-core/test/J1
   [junit4]   2> 1018607 INFO  (TEST-DistribJoinFromCollectionTest.test-seed#[19E656938EF54EA7]) [n:127.0.0.1:53129_    ] o.a.s.s.SolrDispatchFilter SolrDispatchFilter.init() done
   [junit4]   2> 1018608 INFO  (coreLoadExecutor-2834-thread-1-processing-n:127.0.0.1:53129_) [n:127.0.0.1:53129_ c:control_collection   x:collection1] o.a.s.c.ZkController publishing state=down
   [junit4]   2> 1018608 INFO  (coreLoadExecutor-2834-thread-1-processing-n:127.0.0.1:53129_) [n:127.0.0.1:53129_ c:control_collection   x:collection1] o.a.s.c.ZkController numShards not found on descriptor - reading it from system property
   [junit4]   2> 1018627 INFO  (OverseerStateUpdate-94614417723555845-127.0.0.1:53129_-n_0000000000) [n:127.0.0.1:53129_    ] o.a.s.c.Overseer processMessage: queueSize: 1, message = {
   [junit4]   2>   "core":"collection1",
   [junit4]   2>   "roles":null,
   [junit4]   2>   "base_url":"https://127.0.0.1:53129",
   [junit4]   2>   "node_name":"127.0.0.1:53129_",
   [junit4]   2>   "numShards":"1",
   [junit4]   2>   "state":"down",
   [junit4]   2>   "shard":null,
   [junit4]   2>   "collection":"control_collection",
   [junit4]   2>   "operation":"state"} current state version: 0
   [junit4]   2> 1018629 INFO  (coreLoadExecutor-2834-thread-1-processing-n:127.0.0.1:53129_) [n:127.0.0.1:53129_ c:control_collection   x:collection1] o.a.s.c.ZkController look for our core node name
   [junit4]   2> 1018629 INFO  (OverseerStateUpdate-94614417723555845-127.0.0.1:53129_-n_0000000000) [n:127.0.0.1:53129_    ] o.a.s.c.o.ReplicaMutator Update state numShards=1 message={
   [junit4]   2>   "core":"collection1",
   [junit4]   2>   "roles":null,
   [junit4]   2>   "base_url":"https://127.0.0.1:53129",
   [junit4]   2>   "node_name":"127.0.0.1:53129_",
   [junit4]   2>   "numShards":"1",
   [junit4]   2>   "state":"down",
   [junit4]   2>   "shard":null,
   [junit4]   2>   "collection":"control_collection",
   [junit4]   2>   "operation":"state"}
   [junit4]   2> 1018630 INFO  (OverseerStateUpdate-94614417723555845-127.0.0.1:53129_-n_0000000000) [n:127.0.0.1:53129_    ] o.a.s.c.o.ClusterStateMutator building a new cName: control_collection
   [junit4]   2> 1018630 INFO  (OverseerStateUpdate-94614417723555845-127.0.0.1:53129_-n_0000000000) [n:127.0.0.1:53129_    ] o.a.s.c.o.ReplicaMutator Assigning new node to shard shard=shard1
   [junit4]   2> 1018632 INFO  (zkCallback-686-thread-1-processing-n:127.0.0.1:53129_) [n:127.0.0.1:53129_    ] o.a.s.c.c.ZkStateReader A cluster state change: WatchedEvent state:SyncConnected type:NodeDataChanged path:/clusterstate.json, has occurred - updating... (live nodes size: 1)
   [junit4]   2> 1019631 INFO  (coreLoadExecutor-2834-thread-1-processing-n:127.0.0.1:53129_) [n:127.0.0.1:53129_ c:control_collection   x:collection1] o.a.s.c.ZkController waiting to find shard id in clusterstate for collection1
   [junit4]   2> 1019631 INFO  (coreLoadExecutor-2834-thread-1-processing-n:127.0.0.1:53129_) [n:127.0.0.1:53129_ c:control_collection   x:collection1] o.a.s.c.ZkController Check for collection zkNode:control_collection
   [junit4]   2> 1019632 INFO  (coreLoadExecutor-2834-thread-1-processing-n:127.0.0.1:53129_) [n:127.0.0.1:53129_ c:control_collection   x:collection1] o.a.s.c.ZkController Collection zkNode exists
   [junit4]   2> 1019632 INFO  (coreLoadExecutor-2834-thread-1-processing-n:127.0.0.1:53129_) [n:127.0.0.1:53129_ c:control_collection   x:collection1] o.a.s.c.c.ZkStateReader Load collection config from:/collections/control_collection
   [junit4]   2> 1019633 INFO  (coreLoadExecutor-2834-thread-1-processing-n:127.0.0.1:53129_) [n:127.0.0.1:53129_ c:control_collection   x:collection1] o.a.s.c.c.ZkStateReader path=/collections/control_collection configName=conf1 specified config exists in ZooKeeper
   [junit4]   2> 1019633 INFO  (coreLoadExecutor-2834-thread-1-processing-n:127.0.0.1:53129_) [n:127.0.0.1:53129_ c:control_collection   x:collection1] o.a.s.c.SolrResourceLoader new SolrResourceLoader for directory: '/Users/jenkins/workspace/Lucene-Solr-5.x-MacOSX/solr/build/solr-core/test/J1/../../../../../../../../../Users/jenkins/workspace/Lucene-Solr-5.x-MacOSX/solr/build/solr-core/test/J1/temp/solr.cloud.DistribJoinFromCollectionTest_19E656938EF54EA7-001/control-001/cores/collection1/'
   [junit4]   2> 1019653 INFO  (coreLoadExecutor-2834-thread-1-processing-n:127.0.0.1:53129_) [n:127.0.0.1:53129_ c:control_collection   x:collection1] o.a.s.c.Config loaded config solrconfig.xml with version 0 
   [junit4]   2> 1019661 INFO  (coreLoadExecutor-2834-thread-1-processing-n:127.0.0.1:53129_) [n:127.0.0.1:53129_ c:control_collection   x:collection1] o.a.s.c.SolrConfig current version of requestparams : -1
   [junit4]   2> 1019666 INFO  (coreLoadExecutor-2834-thread-1-processing-n:127.0.0.1:53129_) [n:127.0.0.1:53129_ c:control_collection   x:collection1] o.a.s.c.SolrConfig Using Lucene MatchVersion: 5.4.0
   [junit4]   2> 1019675 INFO  (coreLoadExecutor-2834-thread-1-processing-n:127.0.0.1:53129_) [n:127.0.0.1:53129_ c:control_collection   x:collection1] o.a.s.c.Config Loaded SolrConfig: solrconfig.xml
   [junit4]   2> 1019676 INFO  (coreLoadExecutor-2834-thread-1-processing-n:127.0.0.1:53129_) [n:127.0.0.1:53129_ c:control_collection   x:collection1] o.a.s.s.IndexSchema Reading Solr Schema from /configs/conf1/schema.xml
   [junit4]   2> 1019681 INFO  (coreLoadExecutor-2834-thread-1-processing-n:127.0.0.1:53129_) [n:127.0.0.1:53129_ c:control_collection   x:collection1] o.a.s.s.IndexSchema [collection1] Schema name=test
   [junit4]   2> 1019816 INFO  (coreLoadExecutor-2834-thread-1-processing-n:127.0.0.1:53129_) [n:127.0.0.1:53129_ c:control_collection   x:collection1] o.a.s.s.OpenExchangeRatesOrgProvider Initialized with rates=open-exchange-rates.json, refreshInterval=1440.
   [junit4]   2> 1019824 INFO  (coreLoadExecutor-2834-thread-1-processing-n:127.0.0.1:53129_) [n:127.0.0.1:53129_ c:control_collection   x:collection1] o.a.s.s.IndexSchema default search field in schema is text
   [junit4]   2> 1019824 INFO  (coreLoadExecutor-2834-thread-1-processing-n:127.0.0.1:53129_) [n:127.0.0.1:53129_ c:control_collection   x:collection1] o.a.s.s.IndexSchema unique key field: id
   [junit4]   2> 1019845 INFO  (coreLoadExecutor-2834-thread-1-processing-n:127.0.0.1:53129_) [n:127.0.0.1:53129_ c:control_collection   x:collection1] o.a.s.s.FileExchangeRateProvider Reloading exchange rates from file currency.xml
   [junit4]   2> 1019848 INFO  (coreLoadExecutor-2834-thread-1-processing-n:127.0.0.1:53129_) [n:127.0.0.1:53129_ c:control_collection   x:collection1] o.a.s.s.FileExchangeRateProvider Reloading exchange rates from file currency.xml
   [junit4]   2> 1019851 INFO  (coreLoadExecutor-2834-thread-1-processing-n:127.0.0.1:53129_) [n:127.0.0.1:53129_ c:control_collection   x:collection1] o.a.s.s.OpenExchangeRatesOrgProvider Reloading exchange rates from open-exchange-rates.json
   [junit4]   2> 1019853 WARN  (coreLoadExecutor-2834-thread-1-processing-n:127.0.0.1:53129_) [n:127.0.0.1:53129_ c:control_collection   x:collection1] o.a.s.s.OpenExchangeRatesOrgProvider Unknown key IMPORTANT NOTE
   [junit4]   2> 1019853 WARN  (coreLoadExecutor-2834-thread-1-processing-n:127.0.0.1:53129_) [n:127.0.0.1:53129_ c:control_collection   x:collection1] o.a.s.s.OpenExchangeRatesOrgProvider Expected key, got STRING
   [junit4]   2> 1019853 INFO  (coreLoadExecutor-2834-thread-1-processing-n:127.0.0.1:53129_) [n:127.0.0.1:53129_ c:control_collection   x:collection1] o.a.s.s.OpenExchangeRatesOrgProvider Reloading exchange rates from open-exchange-rates.json
   [junit4]   2> 1019855 WARN  (coreLoadExecutor-2834-thread-1-processing-n:127.0.0.1:53129_) [n:127.0.0.1:53129_ c:control_collection   x:collection1] o.a.s.s.OpenExchangeRatesOrgProvider Unknown key IMPORTANT NOTE
   [junit4]   2> 1019855 WARN  (coreLoadExecutor-2834-thread-1-processing-n:127.0.0.1:53129_) [n:127.0.0.1:53129_ c:control_collection   x:collection1] o.a.s.s.OpenExchangeRatesOrgProvider Expected key, got STRING
   [junit4]   2> 1019857 INFO  (coreLoadExecutor-2834-thread-1-processing-n:127.0.0.1:53129_) [n:127.0.0.1:53129_ c:control_collection   x:collection1] o.a.s.c.ConfigSetProperties Did not find ConfigSet properties, assuming default properties: Can't find resource 'configsetprops.json' in classpath or '/configs/conf1', cwd=/Users/jenkins/workspace/Lucene-Solr-5.x-MacOSX/solr/build/solr-core/test/J1
   [junit4]   2> 1019858 INFO  (coreLoadExecutor-2834-thread-1-processing-n:127.0.0.1:53129_) [n:127.0.0.1:53129_ c:control_collection   x:collection1] o.a.s.c.CoreContainer Creating SolrCore 'collection1' using configuration from collection control_collection
   [junit4]   2> 1019858 INFO  (coreLoadExecutor-2834-thread-1-processing-n:127.0.0.1:53129_) [n:127.0.0.1:53129_ c:control_collection s:shard1 r:core_node1 x:collection1] o.a.s.c.SolrCore org.apache.solr.core.MockDirectoryFactory
   [junit4]   2> 1019858 INFO  (coreLoadExecutor-2834-thread-1-processing-n:127.0.0.1:53129_) [n:127.0.0.1:53129_ c:control_collection s:shard1 r:core_node1 x:collection1] o.a.s.c.SolrCore [[collection1] ] Opening new SolrCore at [/Users/jenkins/workspace/Lucene-Solr-5.x-MacOSX/solr/build/solr-core/test/J1/../../../../../../../../../Users/jenkins/workspace/Lucene-Solr-5.x-MacOSX/solr/build/solr-core/test/J1/temp/solr.cloud.DistribJoinFromCollectionTest_19E656938EF54EA7-001/control-001/cores/collection1/], dataDir=[null]
   [junit4]   2> 1019858 INFO  (coreLoadExecutor-2834-thread-1-processing-n:127.0.0.1:53129_) [n:127.0.0.1:53129_ c:control_collection s:shard1 r:core_node1 x:collection1] o.a.s.c.JmxMonitoredMap JMX monitoring is enabled. Adding Solr mbeans to JMX Server: com.sun.jmx.mbeanserver.JmxMBeanServer@7dfcd048
   [junit4]   2> 1019859 INFO  (coreLoadExecutor-2834-thread-1-processing-n:127.0.0.1:53129_) [n:127.0.0.1:53129_ c:control_collection s:shard1 r:core_node1 x:collection1] o.a.s.c.CachingDirectoryFactory return new directory for /Users/jenkins/workspace/Lucene-Solr-5.x-MacOSX/solr/build/solr-core/test/J1/../../../../../../../../../Users/jenkins/workspace/Lucene-Solr-5.x-MacOSX/solr/build/solr-core/test/J1/temp/solr.cloud.DistribJoinFromCollectionTest_19E656938EF54EA7-001/control-001/cores/collection1/data
   [junit4]   2> 1019859 INFO  (coreLoadExecutor-2834-thread-1-processing-n:127.0.0.1:53129_) [n:127.0.0.1:53129_ c:control_collection s:shard1 r:core_node1 x:collection1] o.a.s.c.SolrCore New index directory detected: old=null new=/Users/jenkins/workspace/Lucene-Solr-5.x-MacOSX/solr/build/solr-core/test/J1/../../../../../../../../../Users/jenkins/workspace/Lucene-Solr-5.x-MacOSX/solr/build/solr-core/test/J1/temp/solr.cloud.DistribJoinFromCollectionTest_19E656938EF54EA7-001/control-001/cores/collection1/data/index/
   [junit4]   2> 1019859 WARN  (coreLoadExecutor-2834-thread-1-processing-n:127.0.0.1:53129_) [n:127.0.0.1:53129_ c:control_collection s:shard1 r:core_node1 x:collection1] o.a.s.c.SolrCore [collection1] Solr index directory '/Users/jenkins/workspace/Lucene-Solr-5.x-MacOSX/solr/build/solr-core/test/J1/../../../../../../../../../Users/jenkins/workspace/Lucene-Solr-5.x-MacOSX/solr/build/solr-core/test/J1/temp/solr.cloud.DistribJoinFromCollectionTest_19E656938EF54EA7-001/control-001/cores/collection1/data/index' doesn't exist. Creating new index...
   [junit4]   2> 1019860 INFO  (coreLoadExecutor-2834-thread-1-processing-n:127.0.0.1:53129_) [n:127.0.0.1:53129_ c:control_collection s:shard1 r:core_node1 x:collection1] o.a.s.c.CachingDirectoryFactory return new directory for /Users/jenkins/workspace/Lucene-Solr-5.x-MacOSX/solr/build/solr-core/test/J1/../../../../../../../../../Users/jenkins/workspace/Lucene-Solr-5.x-MacOSX/solr/build/solr-core/test/J1/temp/solr.cloud.DistribJoinFromCollectionTest_19E656938EF54EA7-001/control-001/cores/collection1/data/index
   [junit4]   2> 1019860 INFO  (coreLoadExecutor-2834-thread-1-processing-n:127.0.0.1:53129_) [n:127.0.0.1:53129_ c:control_collection s:shard1 r:core_node1 x:collection1] o.a.s.u.RandomMergePolicy RandomMergePolicy wrapping class org.apache.lucene.index.LogByteSizeMergePolicy: [LogByteSizeMergePolicy: minMergeSize=1677721, mergeFactor=28, maxMergeSize=2147483648, maxMergeSizeForForcedMerge=9223372036854775807, calibrateSizeByDeletes=true, maxMergeDocs=2147483647, maxCFSSegmentSizeMB=8.796093022207999E12, noCFSRatio=1.0]
   [junit4]   2> 1019860 INFO  (coreLoadExecutor-2834-thread-1-processing-n:127.0.0.1:53129_) [n:127.0.0.1:53129_ c:control_collection s:shard1 r:core_node1 x:collection1] o.a.s.c.SolrCore SolrDeletionPolicy.onCommit: commits: num=1
   [junit4]   2> 	commit{dir=MockDirectoryWrapper(RAMDirectory@21753f93 lockFactory=org.apache.lucene.store.SingleInstanceLockFactory@22a9909f),segFN=segments_1,generation=1}
   [junit4]   2> 1019860 INFO  (coreLoadExecutor-2834-thread-1-processing-n:127.0.0.1:53129_) [n:127.0.0.1:53129_ c:control_collection s:shard1 r:core_node1 x:collection1] o.a.s.c.SolrCore newest commit generation = 1
   [junit4]   2> 1019861 INFO  (OldIndexDirectoryCleanupThreadForCore-collection1) [n:127.0.0.1:53129_ c:control_collection s:shard1 r:core_node1 x:collection1] o.a.s.c.SolrCore Looking for old index directories to cleanup for core collection1 in /Users/jenkins/workspace/Lucene-Solr-5.x-MacOSX/solr/build/solr-core/test/J1/../../../../../../../../../Users/jenkins/workspace/Lucene-Solr-5.x-MacOSX/solr/build/solr-core/test/J1/temp/solr.cloud.DistribJoinFromCollectionTest_19E656938EF54EA7-001/control-001/cores/collection1/data/
   [junit4]   2> 1019862 WARN  (OldIndexDirectoryCleanupThreadForCore-collection1) [n:127.0.0.1:53129_ c:control_collection s:shard1 r:core_node1 x:collection1] o.a.s.c.DirectoryFactory /Users/jenkins/workspace/Lucene-Solr-5.x-MacOSX/solr/build/solr-core/test/J1/../../../../../../../../../Users/jenkins/workspace/Lucene-Solr-5.x-MacOSX/solr/build/solr-core/test/J1/temp/solr.cloud.DistribJoinFromCollectionTest_19E656938EF54EA7-001/control-001/cores/collection1/data/ does not point to a valid data directory; skipping clean-up of old index directories.
   [junit4]   2> 1019866 INFO  (coreLoadExecutor-2834-thread-1-processing-n:127.0.0.1:53129_) [n:127.0.0.1:53129_ c:control_collection s:shard1 r:core_node1 x:collection1] o.a.s.u.p.UpdateRequestProcessorChain creating updateRequestProcessorChain "nodistrib"
   [junit4]   2> 1019866 INFO  (coreLoadExecutor-2834-thread-1-processing-n:127.0.0.1:53129_) [n:127.0.0.1:53129_ c:control_collection s:shard1 r:core_node1 x:collection1] o.a.s.u.p.UpdateRequestProcessorChain creating updateRequestProcessorChain "dedupe"
   [junit4]   2> 1019866 INFO  (coreLoadExecutor-2834-thread-1-processing-n:127.0.0.1:53129_) [n:127.0.0.1:53129_ c:control_collection s:shard1 r:core_node1 x:collection1] o.a.s.u.p.UpdateRequestProcessorChain inserting DistributedUpdateProcessorFactory into updateRequestProcessorChain "dedupe"
   [junit4]   2> 1019866 INFO  (coreLoadExecutor-2834-thread-1-processing-n:127.0.0.1:53129_) [n:127.0.0.1:53129_ c:control_collection s:shard1 r:core_node1 x:collection1] o.a.s.u.p.UpdateRequestProcessorChain creating updateRequestProcessorChain "stored_sig"
   [junit4]   2> 1019867 INFO  (coreLoadExecutor-2834-thread-1-processing-n:127.0.0.1:53129_) [n:127.0.0.1:53129_ c:control_collection s:shard1 r:core_node1 x:collection1] o.a.s.u.p.UpdateRequestProcessorChain inserting DistributedUpdateProcessorFactory into updateRequestProcessorChain "stored_sig"
   [junit4]   2> 1019867 INFO  (coreLoadExecutor-2834-thread-1-processing-n:127.0.0.1:53129_) [n:127.0.0.1:53129_ c:control_collection s:shard1 r:core_node1 x:collection1] o.a.s.u.p.UpdateRequestProcessorChain creating updateRequestProcessorChain "distrib-dup-test-chain-explicit"
   [junit4]   2> 1019867 INFO  (coreLoadExecutor-2834-thread-1-processing-n:127.0.0.1:53129_) [n:127.0.0.1:53129_ c:control_collection s:shard1 r:core_node1 x:collection1] o.a.s.u.p.UpdateRequestProcessorChain creating updateRequestProcessorChain "distrib-dup-test-chain-implicit"
   [junit4]   2> 1019867 INFO  (coreLoadExecutor-2834-thread-1-processing-n:127.0.0.1:53129_) [n:127.0.0.1:53129_ c:control_collection s:shard1 r:core_node1 x:collection1] o.a.s.u.p.UpdateRequestProcessorChain inserting DistributedUpdateProcessorFactory into updateRequestProcessorChain "distrib-dup-test-chain-implicit"
   [junit4]   2> 1019867 INFO  (coreLoadExecutor-2834-thread-1-processing-n:127.0.0.1:53129_) [n:127.0.0.1:53129_ c:control_collection s:shard1 r:core_node1 x:collection1] o.a.s.c.SolrCore no updateRequestProcessorChain defined as default, creating implicit default
   [junit4]   2> 1019874 INFO  (coreLoadExecutor-2834-thread-1-processing-n:127.0.0.1:53129_) [n:127.0.0.1:53129_ c:control_collection s:shard1 r:core_node1 x:collection1] o.a.s.h.l.XMLLoader xsltCacheLifetimeSeconds=60
   [junit4]   2> 1019875 INFO  (coreLoadExecutor-2834-thread-1-processing-n:127.0.0.1:53129_) [n:127.0.0.1:53129_ c:control_collection s:shard1 r:core_node1 x:collection1] o.a.s.h.l.XMLLoader xsltCacheLifetimeSeconds=60
   [junit4]   2> 1019876 INFO  (coreLoadExecutor-2834-thread-1-processing-n:127.0.0.1:53129_) [n:127.0.0.1:53129_ c:control_collection s:shard1 r:core_node1 x:collection1] o.a.s.h.l.XMLLoader xsltCacheLifetimeSeconds=60
   [junit4]   2> 1019877 INFO  (coreLoadExecutor-2834-thread-1-processing-n:127.0.0.1:53129_) [n:127.0.0.1:53129_ c:control_collection s:shard1 r:core_node1 x:collection1] o.a.s.h.l.XMLLoader xsltCacheLifetimeSeconds=60
   [junit4]   2> 1019881 INFO  (coreLoadExecutor-2834-thread-1-processing-n:127.0.0.1:53129_) [n:127.0.0.1:53129_ c:control_collection s:shard1 r:core_node1 x:collection1] o.a.s.c.RequestHandlers Registered paths: /admin/mbeans,standard,/update/csv,/update/json/docs,/admin/luke,/admin/segments,/get,/admin/system,/replication,/admin/properties,/config,/schema,/admin/plugins,/admin/logging,/update/json,/admin/threads,/admin/ping,/update,/admin/file
   [junit4]   2> 1019881 INFO  (coreLoadExecutor-2834-thread-1-processing-n:127.0.0.1:53129_) [n:127.0.0.1:53129_ c:control_collection s:shard1 r:core_node1 x:collection1] o.a.s.c.SolrCore Using default statsCache cache: org.apache.solr.search.stats.LocalStatsCache
   [junit4]   2> 1019883 INFO  (coreLoadExecutor-2834-thread-1-processing-n:127.0.0.1:53129_) [n:127.0.0.1:53129_ c:control_collection s:shard1 r:core_node1 x:collection1] o.a.s.u.UpdateHandler Using UpdateLog implementation: org.apache.solr.update.UpdateLog
   [junit4]   2> 1019883 INFO  (coreLoadExecutor-2834-thread-1-processing-n:127.0.0.1:53129_) [n:127.0.0.1:53129_ c:control_collection s:shard1 r:core_node1 x:collection1] o.a.s.u.UpdateLog Initializing UpdateLog: dataDir= defaultSyncLevel=FLUSH numRecordsToKeep=100 maxNumLogsToKeep=10 numVersionBuckets=65536
   [junit4]   2> 1019884 INFO  (coreLoadExecutor-2834-thread-1-processing-n:127.0.0.1:53129_) [n:127.0.0.1:53129_ c:control_collection s:shard1 r:core_node1 x:collection1] o.a.s.c.SolrCore Hard AutoCommit: disabled
   [junit4]   2> 1019884 INFO  (coreLoadExecutor-2834-thread-1-processing-n:127.0.0.1:53129_) [n:127.0.0.1:53129_ c:control_collection s:shard1 r:core_node1 x:collection1] o.a.s.c.SolrCore Soft AutoCommit: disabled
   [junit4]   2> 1019884 INFO  (coreLoadExecutor-2834-thread-1-processing-n:127.0.0.1:53129_) [n:127.0.0.1:53129_ c:control_collection s:shard1 r:core_node1 x:collection1] o.a.s.u.RandomMergePolicy RandomMergePolicy wrapping class org.apache.lucene.index.AlcoholicMergePolicy: [AlcoholicMergePolicy: minMergeSize=0, mergeFactor=10, maxMergeSize=307505896, maxMergeSizeForForcedMerge=9223372036854775807, calibrateSizeByDeletes=true, maxMergeDocs=2147483647, maxCFSSegmentSizeMB=8.796093022207999E12, noCFSRatio=0.1]
   [junit4]   2> 1019884 INFO  (coreLoadExecutor-2834-thread-1-processing-n:127.0.0.1:53129_) [n:127.0.0.1:53129_ c:control_collection s:shard1 r:core_node1 x:collection1] o.a.s.c.SolrCore SolrDeletionPolicy.onInit: commits: num=1
   [junit4]   2> 	commit{dir=MockDirectoryWrapper(RAMDirectory@21753f93 lockFactory=org.apache.lucene.store.SingleInstanceLockFactory@22a9909f),segFN=segments_1,generation=1}
   [junit4]   2> 1019884 INFO  (coreLoadExecutor-2834-thread-1-processing-n:127.0.0.1:53129_) [n:127.0.0.1:53129_ c:control_collection s:shard1 r:core_node1 x:collection1] o.a.s.c.SolrCore newest commit generation = 1
   [junit4]   2> 1019885 INFO  (coreLoadExecutor-2834-thread-1-processing-n:127.0.0.1:53129_) [n:127.0.0.1:53129_ c:control_collection s:shard1 r:core_node1 x:collection1] o.a.s.s.SolrIndexSearcher Opening Searcher@412079f1[collection1] main
   [junit4]   2> 1019885 INFO  (coreLoadExecutor-2834-thread-1-processing-n:127.0.0.1:53129_) [n:127.0.0.1:53129_ c:control_collection s:shard1 r:core_node1 x:collection1] o.a.s.c.c.ZkStateReader Load collection config from:/collections/control_collection
   [junit4]   2> 1019886 INFO  (coreLoadExecutor-2834-thread-1-processing-n:127.0.0.1:53129_) [n:127.0.0.1:53129_ c:control_collection s:shard1 r:core_node1 x:collection1] o.a.s.c.c.ZkStateReader path=/collections/control_collection configName=conf1 specified config exists in ZooKeeper
   [junit4]   2> 1019886 INFO  (coreLoadExecutor-2834-thread-1-processing-n:127.0.0.1:53129_) [n:127.0.0.1:53129_ c:control_collection s:shard1 r:core_node1 x:collection1] o.a.s.r.ManagedResourceStorage Setting up ZooKeeper-based storage for the RestManager with znodeBase: /configs/conf1
   [junit4]   2> 1019887 INFO  (coreLoadExecutor-2834-thread-1-processing-n:127.0.0.1:53129_) [n:127.0.0.1:53129_ c:control_collection s:shard1 r:core_node1 x:collection1] o.a.s.r.ManagedResourceStorage Configured ZooKeeperStorageIO with znodeBase: /configs/conf1
   [junit4]   2> 1019887 INFO  (coreLoadExecutor-2834-thread-1-processing-n:127.0.0.1:53129_) [n:127.0.0.1:53129_ c:control_collection s:shard1 r:core_node1 x:collection1] o.a.s.r.RestManager Initializing RestManager with initArgs: {}
   [junit4]   2> 1019887 INFO  (coreLoadExecutor-2834-thread-1-processing-n:127.0.0.1:53129_) [n:127.0.0.1:53129_ c:control_collection s:shard1 r:core_node1 x:collection1] o.a.s.r.ManagedResourceStorage Reading _rest_managed.json using ZooKeeperStorageIO:path=/configs/conf1
   [junit4]   2> 1019888 INFO  (coreLoadExecutor-2834-thread-1-processing-n:127.0.0.1:53129_) [n:127.0.0.1:53129_ c:control_collection s:shard1 r:core_node1 x:collection1] o.a.s.r.ManagedResourceStorage No data found for znode /configs/conf1/_rest_managed.json
   [junit4]   2> 1019888 INFO  (coreLoadExecutor-2834-thread-1-processing-n:127.0.0.1:53129_) [n:127.0.0.1:53129_ c:control_collection s:shard1 r:core_node1 x:collection1] o.a.s.r.ManagedResourceStorage Loaded null at path _rest_managed.json using ZooKeeperStorageIO:path=/configs/conf1
   [junit4]   2> 1019888 INFO  (coreLoadExecutor-2834-thread-1-processing-n:127.0.0.1:53129_) [n:127.0.0.1:53129_ c:control_collection s:shard1 r:core_node1 x:collection1] o.a.s.r.RestManager Initializing 0 registered ManagedResources
   [junit4]   2> 1019888 INFO  (coreLoadExecutor-2834-thread-1-processing-n:127.0.0.1:53129_) [n:127.0.0.1:53129_ c:control_collection s:shard1 r:core_node1 x:collection1] o.a.s.h.ReplicationHandler Commits will be reserved for  10000
   [junit4]   2> 1019889 INFO  (searcherExecutor-2835-thread-1-processing-n:127.0.0.1:53129_ x:collection1 s:shard1 c:control_collection r:core_node1) [n:127.0.0.1:53129_ c:control_collection s:shard1 r:core_node1 x:collection1] o.a.s.c.SolrCore [collection1] Registered new searcher Searcher@412079f1[collection1] main{ExitableDirectoryReader(UninvertingDirectoryReader())}
   [junit4]   2> 1019889 INFO  (coreLoadExecutor-2834-thread-1-processing-n:127.0.0.1:53129_) [n:127.0.0.1:53129_ c:control_collection s:shard1 r:core_node1 x:collection1] o.a.s.u.UpdateLog Looking up max value of version field to seed version buckets
   [junit4]   2> 1019889 INFO  (coreLoadExecutor-2834-thread-1-processing-n:127.0.0.1:53129_) [n:127.0.0.1:53129_ c:control_collection s:shard1 r:core_node1 x:collection1] o.a.s.u.VersionInfo Refreshing highest value of _version_ for 65536 version buckets from index
   [junit4]   2> 1019889 INFO  (coreLoadExecutor-2834-thread-1-processing-n:127.0.0.1:53129_) [n:127.0.0.1:53129_ c:control_collection s:shard1 r:core_node1 x:collection1] o.a.s.u.VersionInfo No terms found for _version_, cannot seed version bucket highest value from index
   [junit4]   2> 1019889 INFO  (coreLoadExecutor-2834-thread-1-processing-n:127.0.0.1:53129_) [n:127.0.0.1:53129_ c:control_collection s:shard1 r:core_node1 x:collection1] o.a.s.u.UpdateLog Could not find max version in index or recent updates, using new clock 1513830687337086976
   [junit4]   2> 1019891 INFO  (coreLoadExecutor-2834-thread-1-processing-n:127.0.0.1:53129_) [n:127.0.0.1:53129_ c:control_collection s:shard1 r:core_node1 x:collection1] o.a.s.u.UpdateLog Took 2.0ms to seed version buckets with highest version 1513830687337086976
   [junit4]   2> 1019892 INFO  (coreLoadExecutor-2834-thread-1-processing-n:127.0.0.1:53129_) [n:127.0.0.1:53129_ c:control_collection s:shard1 r:core_node1 x:collection1] o.a.s.c.ZkController watch zkdir /configs/conf1
   [junit4]   2> 1019893 INFO  (coreLoadExecutor-2834-thread-1-processing-n:127.0.0.1:53129_) [n:127.0.0.1:53129_ c:control_collection s:shard1 r:core_node1 x:collection1] o.a.s.c.CoreContainer registering core: collection1
   [junit4]   2> 1019894 INFO  (coreZkRegister-2828-thread-1-processing-n:127.0.0.1:53129_ x:collection1 s:shard1 c:control_collection r:core_node1) [n:127.0.0.1:53129_ c:control_collection s:shard1 r:core_node1 x:collection1] o.a.s.c.ZkController Register replica - core:collection1 address:https://127.0.0.1:53129 collection:control_collection shard:shard1
   [junit4]   2> 1019895 INFO  (coreZkRegister-2828-thread-1-processing-n:127.0.0.1:53129_ x:collection1 s:shard1 c:control_collection r:core_node1) [n:127.0.0.1:53129_ c:control_collection s:shard1 r:core_node1 x:collection1] o.a.s.c.c.SolrZkClient makePath: /collections/control_collection/leader_elect/shard1/election
   [junit4]   2> 1019901 INFO  (coreZkRegister-2828-thread-1-processing-n:127.0.0.1:53129_ x:collection1 s:shard1 c:control_collection r:core_node1) [n:127.0.0.1:53129_ c:control_collection s:shard1 r:core_node1 x:collection1] o.a.s.c.LeaderElector Joined leadership election with path: /collections/control_collection/leader_elect/shard1/election/94614417723555845-core_node1-n_0000000000
   [junit4]   2> 1019901 INFO  (coreZkRegister-2828-thread-1-processing-n:127.0.0.1:53129_ x:collection1 s:shard1 c:control_collection r:core_node1) [n:127.0.0.1:53129_ c:control_collection s:shard1 r:core_node1 x:collection1] o.a.s.c.ShardLeaderElectionContext Running the leader process for shard shard1
   [junit4]   2> 1019919 INFO  (coreZkRegister-2828-thread-1-processing-n:127.0.0.1:53129_ x:collection1 s:shard1 c:control_collection r:core_node1) [n:127.0.0.1:53129_ c:control_collection s:shard1 r:core_node1 x:collection1] o.a.s.c.ShardLeaderElectionContext Enough replicas found to continue.
   [junit4]   2> 1019919 INFO  (coreZkRegister-2828-thread-1-processing-n:127.0.0.1:53129_ x:collection1 s:shard1 c:control_collection r:core_node1) [n:127.0.0.1:53129_ c:control_collection s:shard1 r:core_node1 x:collection1] o.a.s.c.ShardLeaderElectionContext I may be the new leader - try and sync
   [junit4]   2> 1019920 INFO  (coreZkRegister-2828-thread-1-processing-n:127.0.0.1:53129_ x:collection1 s:shard1 c:control_collection r:core_node1) [n:127.0.0.1:53129_ c:control_collection s:shard1 r:core_node1 x:collection1] o.a.s.c.SyncStrategy Sync replicas to https://127.0.0.1:53129/collection1/
   [junit4]   2> 1019920 INFO  (coreZkRegister-2828-thread-1-processing-n:127.0.0.1:53129_ x:collection1 s:shard1 c:control_collection r:core_node1) [n:127.0.0.1:53129_ c:control_collection s:shard1 r:core_node1 x:collection1] o.a.s.c.SyncStrategy Sync Success - now sync replicas to me
   [junit4]   2> 1019920 INFO  (coreZkRegister-2828-thread-1-processing-n:127.0.0.1:53129_ x:collection1 s:shard1 c:control_collection r:core_node1) [n:127.0.0.1:53129_ c:control_collection s:shard1 r:core_node1 x:collection1] o.a.s.c.SyncStrategy https://127.0.0.1:53129/collection1/ has no replicas
   [junit4]   2> 1019920 INFO  (coreZkRegister-2828-thread-1-processing-n:127.0.0.1:53129_ x:collection1 s:shard1 c:control_collection r:core_node1) [n:127.0.0.1:53129_ c:control_collection s:shard1 r:core_node1 x:collection1] o.a.s.c.ShardLeaderElectionContext I am the new leader: https://127.0.0.1:53129/collection1/ shard1
   [junit4]   2> 1019920 INFO  (OverseerStateUpdate-94614417723555845-127.0.0.1:53129_-n_0000000000) [n:127.0.0.1:53129_    ] o.a.s.c.Overseer processMessage: queueSize: 1, message = {
   [junit4]   2>   "operation":"leader",
   [junit4]   2>   "shard":"shard1",
   [junit4]   2>   "collection":"control_collection"} current state version: 1
   [junit4]   2> 1019921 INFO  (coreZkRegister-2828-thread-1-processing-n:127.0.0.1:53129_ x:collection1 s:shard1 c:control_collection r:core_node1) [n:127.0.0.1:53129_ c:control_collection s:shard1 r:core_node1 x:collection1] o.a.s.c.c.SolrZkClient makePath: /collections/control_collection/leaders/shard1
   [junit4]   2> 1019928 INFO  (coreZkRegister-2828-thread-1-processing-n:127.0.0.1:53129_ x:collection1 s:shard1 c:control_collection r:core_node1) [n:127.0.0.1:53129_ c:control_collection s:shard1 r:core_node1 x:collection1] o.a.s.c.ShardLeaderElectionContextBase Creating leader registration node
   [junit4]   2> 1019932 INFO  (OverseerStateUpdate-94614417723555845-127.0.0.1:53129_-n_0000000000) [n:127.0.0.1:53129_    ] o.a.s.c.Overseer processMessage: queueSize: 1, message = {
   [junit4]   2>   "operation":"leader",
   [junit4]   2>   "shard":"shard1",
   [junit4]   2>   "collection":"control_collection",
   [junit4]   2>   "base_url":"https://127.0.0.1:53129",
   [junit4]   2>   "core":"collection1",
   [junit4]   2>   "state":"active"} current state version: 1
   [junit4]   2> 1020037 INFO  (zkCallback-686-thread-1-processing-n:127.0.0.1:53129_) [n:127.0.0.1:53129_    ] o.a.s.c.c.ZkStateReader A cluster state change: WatchedEvent state:SyncConnected type:NodeDataChanged path:/clusterstate.json, has occurred - updating... (live nodes size: 1)
   [junit4]   2> 1020085 INFO  (coreZkRegister-2828-thread-1-processing-n:127.0.0.1:53129_ x:collection1 s:shard1 c:control_collection r:core_node1) [n:127.0.0.1:53129_ c:control_collection s:shard1 r:core_node1 x:collection1] o.a.s.c.ZkController We are https://127.0.0.1:53129/collection1/ and leader is https://127.0.0.1:53129/collection1/
   [junit4]   2> 1020085 INFO  (coreZkRegister-2828-thread-1-processing-n:127.0.0.1:53129_ x:collection1 s:shard1 c:control_collection r:core_node1) [n:127.0.0.1:53129_ c:control_collection s:shard1 r:core_node1 x:collection1] o.a.s.c.ZkController No LogReplay needed for core=collection1 baseURL=https://127.0.0.1:53129
   [junit4]   2> 1020085 INFO  (coreZkRegister-2828-thread-1-processing-n:127.0.0.1:53129_ x:collection1 s:shard1 c:control_collection r:core_node1) [n:127.0.0.1:53129_ c:control_collection s:shard1 r:core_node1 x:collection1] o.a.s.c.ZkController I am the leader, no recovery necessary
   [junit4]   2> 1020085 INFO  (coreZkRegister-2828-thread-1-processing-n:127.0.0.1:53129_ x:collection1 s:shard1 c:control_collection r:core_node1) [n:127.0.0.1:53129_ c:control_collection s:shard1 r:core_node1 x:collection1] o.a.s.c.ZkController publishing state=active
   [junit4]   2> 1020085 INFO  (coreZkRegister-2828-thread-1-processing-n:127.0.0.1:53129_ x:collection1 s:shard1 c:control_collection r:core_node1) [n:127.0.0.1:53129_ c:control_collection s:shard1 r:core_node1 x:collection1] o.a.s.c.ZkController numShards not found on descriptor - reading it from system property
   [junit4]   2> 1020088 INFO  (OverseerStateUpdate-94614417723555845-127.0.0.1:53129_-n_0000000000) [n:127.0.0.1:53129_    ] o.a.s.c.Overseer processMessage: queueSize: 1, message = {
   [junit4]   2>   "core":"collection1",
   [junit4]   2>   "core_node_name":"core_node1",
   [junit4]   2>   "roles":null,
   [junit4]   2>   "base_url":"https://127.0.0.1:53129",
   [junit4]   2>   "node_name":"127.0.0.1:53129_",
   [junit4]   2>   "numShards":"1",
   [junit4]   2>   "state":"active",
   [junit4]   2>   "shard":"shard1",
   [junit4]   2>   "collection":"control_collection",
   [junit4]   2>   "operation":"state"} current state version: 2
   [junit4]   2> 1020089 INFO  (OverseerStateUpdate-94614417723555845-127.0.0.1:53129_-n_0000000000) [n:127.0.0.1:53129_    ] o.a.s.c.o.ReplicaMutator Update state numShards=1 message={
   [junit4]   2>   "core":"collection1",
   [junit4]   2>   "core_node_name":"core_node1",
   [junit4]   2>   "roles":null,
   [junit4]   2>   "base_url":"https://127.0.0.1:53129",
   [junit4]   2>   "node_name":"127.0.0.1:53129_",
   [junit4]   2>   "numShards":"1",
   [junit4]   2>   "state":"active",
   [junit4]   2>   "shard":"shard1",
   [junit4]   2>   "collection":"control_collection",
   [junit4]   2>   "operation":"state"}
   [junit4]   2> 1020133 INFO  (TEST-DistribJoinFromCollectionTest.test-seed#[19E656938EF54EA7]) [    ] o.a.s.c.c.SolrZkClient Using default ZkCredentialsProvider
   [junit4]   2> 1020134 INFO  (TEST-DistribJoinFromCollectionTest.test-seed#[19E656938EF54EA7]) [    ] o.a.s.c.c.ConnectionManager Waiting for client to connect to ZooKeeper
   [junit4]   2> 1020136 INFO  (zkCallback-688-thread-1) [    ] o.a.s.c.c.ConnectionManager Watcher org.apache.solr.common.cloud.ConnectionManager@60f42b7d name:ZooKeeperConnection Watcher:127.0.0.1:53125/solr got event WatchedEvent state:SyncConnected type:None path:null path:null type:None
   [junit4]   2> 1020137 INFO  (TEST-DistribJoinFromCollectionTest.test-seed#[19E656938EF54EA7]) [    ] o.a.s.c.c.ConnectionManager Client is connected to ZooKeeper
   [junit4]   2> 1020137 INFO  (TEST-DistribJoinFromCollectionTest.test-seed#[19E656938EF54EA7]) [    ] o.a.s.c.c.SolrZkClient Using default ZkACLProvider
   [junit4]   2> 1020137 INFO  (TEST-DistribJoinFromCollectionTest.test-seed#[19E656938EF54EA7]) [    ] o.a.s.c.c.ZkStateReader Updating cluster state from ZooKeeper... 
   [junit4]   2> 1020143 INFO  (TEST-DistribJoinFromCollectionTest.test-seed#[19E656938EF54EA7]) [    ] o.a.s.c.ChaosMonkey monkey: init - expire sessions:false cause connection loss:false
   [junit4]   2> 1020195 INFO  (zkCallback-686-thread-1-processing-n:127.0.0.1:53129_) [n:127.0.0.1:53129_    ] o.a.s.c.c.ZkStateReader A cluster state change: WatchedEvent state:SyncConnected type:NodeDataChanged path:/clusterstate.json, has occurred - updating... (live nodes size: 1)
   [junit4]   2> 1020195 INFO  (zkCallback-688-thread-1) [    ] o.a.s.c.c.ZkStateReader A cluster state change: WatchedEvent state:SyncConnected type:NodeDataChanged path:/clusterstate.json, has occurred - updating... (live nodes size: 1)
   [junit4]   2> 1020437 INFO  (TEST-DistribJoinFromCollectionTest.test-seed#[19E656938EF54EA7]) [    ] o.a.s.SolrTestCaseJ4 Writing core.properties file to /Users/jenkins/workspace/Lucene-Solr-5.x-MacOSX/solr/build/solr-core/test/J1/temp/solr.cloud.DistribJoinFromCollectionTest_19E656938EF54EA7-001/shard-1-001/cores/collection1
   [junit4]   2> 1020439 INFO  (TEST-DistribJoinFromCollectionTest.test-seed#[19E656938EF54EA7]) [    ] o.a.s.c.AbstractFullDistribZkTestBase create jetty 1 in directory /Users/jenkins/workspace/Lucene-Solr-5.x-MacOSX/solr/build/solr-core/test/J1/temp/solr.cloud.DistribJoinFromCollectionTest_19E656938EF54EA7-001/shard-1-001
   [junit4]   2> 1020440 INFO  (TEST-DistribJoinFromCollectionTest.test-seed#[19E656938EF54EA7]) [    ] o.e.j.s.Server jetty-9.2.13.v20150730
   [junit4]   2> 1020444 INFO  (TEST-DistribJoinFromCollectionTest.test-seed#[19E656938EF54EA7]) [    ] o.e.j.s.h.ContextHandler Started o.e.j.s.ServletContextHandler@3d2c0230{/,null,AVAILABLE}
   [junit4]   2> 1020448 INFO  (TEST-DistribJoinFromCollectionTest.test-seed#[19E656938EF54EA7]) [    ] o.e.j.s.ServerConnector Started ServerConnector@6bfb85b9{SSL-http/1.1}{127.0.0.1:53134}
   [junit4]   2> 1020448 INFO  (TEST-DistribJoinFromCollectionTest.test-seed#[19E656938EF54EA7]) [    ] o.e.j.s.Server Started @1024224ms
   [junit4]   2> 1020448 INFO  (TEST-DistribJoinFromCollectionTest.test-seed#[19E656938EF54EA7]) [    ] o.a.s.c.s.e.JettySolrRunner Jetty properties: {solr.data.dir=/Users/jenkins/workspace/Lucene-Solr-5.x-MacOSX/solr/build/solr-core/test/J1/temp/solr.cloud.DistribJoinFromCollectionTest_19E656938EF54EA7-001/tempDir-001/jetty1, solrconfig=solrconfig.xml, hostContext=/, hostPort=53134, coreRootDirectory=/Users/jenkins/workspace/Lucene-Solr-5.x-MacOSX/solr/build/solr-core/test/J1/../../../../../../../../../Users/jenkins/workspace/Lucene-Solr-5.x-MacOSX/solr/build/solr-core/test/J1/temp/solr.cloud.DistribJoinFromCollectionTest_19E656938EF54EA7-001/shard-1-001/cores}
   [junit4]   2> 1020449 INFO  (TEST-DistribJoinFromCollectionTest.test-seed#[19E656938EF54EA7]) [    ] o.a.s.s.SolrDispatchFilter SolrDispatchFilter.init(): sun.misc.Launcher$AppClassLoader@74a14482
   [junit4]   2> 1020449 INFO  (TEST-DistribJoinFromCollectionTest.test-seed#[19E656938EF54EA7]) [    ] o.a.s.c.SolrResourceLoader new SolrResourceLoader for directory: '/Users/jenkins/workspace/Lucene-Solr-5.x-MacOSX/solr/build/solr-core/test/J1/../../../../../../../../../Users/jenkins/workspace/Lucene-Solr-5.x-MacOSX/solr/build/solr-core/test/J1/temp/solr.cloud.DistribJoinFromCollectionTest_19E656938EF54EA7-001/shard-1-001/'
   [junit4]   2> 1020481 INFO  (TEST-DistribJoinFromCollectionTest.test-seed#[19E656938EF54EA7]) [    ] o.a.s.c.c.SolrZkClient Using default ZkCredentialsProvider
   [junit4]   2> 1020481 INFO  (TEST-DistribJoinFromCollectionTest.test-seed#[19E656938EF54EA7]) [    ] o.a.s.c.c.ConnectionManager Waiting for client to connect to ZooKeeper
   [junit4]   2> 1020484 INFO  (zkCallback-689-thread-1) [    ] o.a.s.c.c.ConnectionManager Watcher org.apache.solr.common.cloud.ConnectionManager@7d604f02 name:ZooKeeperConnection Watcher:127.0.0.1:53125/solr got event WatchedEvent state:SyncConnected type:None path:null path:null type:None
   [junit4]   2> 1020484 INFO  (TEST-DistribJoinFromCollectionTest.test-seed#[19E656938EF54EA7]) [    ] o.a.s.c.c.ConnectionManager Client is connected to ZooKeeper
   [junit4]   2> 1020485 INFO  (TEST-DistribJoinFromCollectionTest.test-seed#[19E656938EF54EA7]) [    ] o.a.s.c.c.SolrZkClient Using default ZkACLProvider
   [junit4]   2> 1020487 INFO  (TEST-DistribJoinFromCollectionTest.test-seed#[19E656938EF54EA7]) [    ] o.a.s.s.SolrDispatchFilter Loading solr.xml from SolrHome (not found in ZooKeeper)
   [junit4]   2> 1020488 INFO  (TEST-DistribJoinFromCollectionTest.test-seed#[19E656938EF54EA7]) [    ] o.a.s.c.SolrXmlConfig Loading container configuration from /Users/jenkins/workspace/Lucene-Solr-5.x-MacOSX/solr/build/solr-core/test/J1/../../../../../../../../../Users/jenkins/workspace/Lucene-Solr-5.x-MacOSX/solr/build/solr-core/test/J1/temp/solr.cloud.DistribJoinFromCollectionTest_19E656938EF54EA7-001/shard-1-001/solr.xml
   [junit4]   2> 1020495 INFO  (TEST-DistribJoinFromCollectionTest.test-seed#[19E656938EF54EA7]) [    ] o.a.s.c.CoresLocator Config-defined core root directory: /Users/jenkins/workspace/Lucene-Solr-5.x-MacOSX/solr/build/solr-core/test/J1/../../../../../../../../../Users/jenkins/workspace/Lucene-Solr-5.x-MacOSX/solr/build/solr-core/test/J1/temp/solr.cloud.DistribJoinFromCollectionTest_19E656938EF54EA7-001/shard-1-001/cores
   [junit4]   2> 1020495 INFO  (TEST-DistribJoinFromCollectionTest.test-seed#[19E656938EF54EA7]) [    ] o.a.s.c.CoreContainer New CoreContainer 1959014779
   [junit4]   2> 1020495 INFO  (TEST-DistribJoinFromCollectionTest.test-seed#[19E656938EF54EA7]) [    ] o.a.s.c.CoreContainer Loading cores into CoreContainer [instanceDir=/Users/jenkins/workspace/Lucene-Solr-5.x-MacOSX/solr/build/solr-core/test/J1/../../../../../../../../../Users/jenkins/workspace/Lucene-Solr-5.x-MacOSX/solr/build/solr-core/test/J1/temp/solr.cloud.DistribJoinFromCollectionTest_19E656938EF54EA7-001/shard-1-001/]
   [junit4]   2> 1020495 INFO  (TEST-DistribJoinFromCollectionTest.test-seed#[19E656938EF54EA7]) [    ] o.a.s.c.CoreContainer loading shared library: /Users/jenkins/workspace/Lucene-Solr-5.x-MacOSX/solr/build/solr-core/test/J1/../../../../../../../../../Users/jenkins/workspace/Lucene-Solr-5.x-MacOSX/solr/build/solr-core/test/J1/temp/solr.cloud.DistribJoinFromCollectionTest_19E656938EF54EA7-001/shard-1-001/lib
   [junit4]   2> 1020495 WARN  (TEST-DistribJoinFromCollectionTest.test-seed#[19E656938EF54EA7]) [    ] o.a.s.c.SolrResourceLoader Can't find (or read) directory to add to classloader: lib (resolved as: /Users/jenkins/workspace/Lucene-Solr-5.x-MacOSX/solr/build/solr-core/test/J1/../../../../../../../../../Users/jenkins/workspace/Lucene-Solr-5.x-MacOSX/solr/build/solr-core/test/J1/temp/solr.cloud.DistribJoinFromCollectionTest_19E656938EF54EA7-001/shard-1-001/lib).
   [junit4]   2> 1020505 INFO  (TEST-DistribJoinFromCollectionTest.test-seed#[19E656938EF54EA7]) [    ] o.a.s.h.c.HttpShardHandlerFactory created with socketTimeout : 90000,urlScheme : ,connTimeout : 15000,maxConnectionsPerHost : 20,maxConnections : 10000,corePoolSize : 0,maximumPoolSize : 2147483647,maxThreadIdleTime : 5,sizeOfQueue : -1,fairnessPolicy : false,useRetries : false,
   [junit4]   2> 1020509 INFO  (TEST-DistribJoinFromCollectionTest.test-seed#[19E656938EF54EA7]) [    ] o.a.s.u.UpdateShardHandler Creating UpdateShardHandler HTTP client with params: socketTimeout=340000&connTimeout=45000&retry=true
   [junit4]   2> 1020512 INFO  (TEST-DistribJoinFromCollectionTest.test-seed#[19E656938EF54EA7]) [    ] o.a.s.l.LogWatcher SLF4J impl is org.slf4j.impl.Log4jLoggerFactory
   [junit4]   2> 1020512 INFO  (TEST-DistribJoinFromCollectionTest.test-seed#[19E656938EF54EA7]) [    ] o.a.s.l.LogWatcher Registering Log Listener [Log4j (org.slf4j.impl.Log4jLoggerFactory)]
   [junit4]   2> 1020512 INFO  (TEST-DistribJoinFromCollectionTest.test-seed#[19E656938EF54EA7]) [    ] o.a.s.c.ZkContainer Zookeeper client=127.0.0.1:53125/solr
   [junit4]   2> 1020512 INFO  (TEST-DistribJoinFromCollectionTest.test-seed#[19E656938EF54EA7]) [    ] o.a.s.c.ZkController zkHost includes chroot
   [junit4]   2> 1020512 INFO  (TEST-DistribJoinFromCollectionTest.test-seed#[19E656938EF54EA7]) [    ] o.a.s.c.c.SolrZkClient Using default ZkCredentialsProvider
   [junit4]   2> 1020513 INFO  (TEST-DistribJoinFromCollectionTest.test-seed#[19E656938EF54EA7]) [    ] o.a.s.c.c.ConnectionManager Waiting for client to connect to ZooKeeper
   [junit4]   2> 1020516 INFO  (zkCallback-691-thread-1) [    ] o.a.s.c.c.ConnectionManager Watcher org.apache.solr.common.cloud.ConnectionManager@1a3e759a name:ZooKeeperConnection Watcher:127.0.0.1:53125 got event WatchedEvent state:SyncConnected type:None path:null path:null type:None
   [junit4]   2> 1020516 INFO  (TEST-DistribJoinFromCollectionTest.test-seed#[19E656938EF54EA7]) [    ] o.a.s.c.c.ConnectionManager Client is connected to ZooKeeper
   [junit4]   2> 1020516 INFO  (TEST-DistribJoinFromCollectionTest.test-seed#[19E656938EF54EA7]) [    ] o.a.s.c.c.SolrZkClient Using default ZkACLProvider
   [junit4]   2> 1020519 INFO  (TEST-DistribJoinFromCollectionTest.test-seed#[19E656938EF54EA7]) [n:127.0.0.1:53134_    ] o.a.s.c.c.ConnectionManager Waiting for client to connect to ZooKeeper
   [junit4]   2> 1020521 INFO  (zkCallback-692-thread-1-processing-n:127.0.0.1:53134_) [n:127.0.0.1:53134_    ] o.a.s.c.c.ConnectionManager Watcher org.apache.solr.common.cloud.ConnectionManager@26c221b6 name:ZooKeeperConnection Watcher:127.0.0.1:53125/solr got event WatchedEvent state:SyncConnected type:None path:null path:null type:None
   [junit4]   2> 1020521 INFO  (TEST-DistribJoinFromCollectionTest.test-seed#[19E656938EF54EA7]) [n:127.0.0.1:53134_    ] o.a.s.c.c.ConnectionManager Client is connected to ZooKeeper
   [junit4]   2> 1020536 INFO  (TEST-DistribJoinFromCollectionTest.test-seed#[19E656938EF54EA7]) [n:127.0.0.1:53134_    ] o.a.s.c.c.ZkStateReader Updating cluster state from ZooKeeper... 
   [junit4]   2> 1021565 INFO  (TEST-DistribJoinFromCollectionTest.test-seed#[19E656938EF54EA7]) [n:127.0.0.1:53134_    ] o.a.s.c.ZkController Register node as live in ZooKeeper:/live_nodes/127.0.0.1:53134_
   [junit4]   2> 1021568 INFO  (TEST-DistribJoinFromCollectionTest.test-seed#[19E656938EF54EA7]) [n:127.0.0.1:53134_    ] o.a.s.c.c.SolrZkClient makePath: /live_nodes/127.0.0.1:53134_
   [junit4]   2> 1021575 INFO  (zkCallback-692-thread-1-processing-n:127.0.0.1:53134_) [n:127.0.0.1:53134_    ] o.a.s.c.c.ZkStateReader A live node change: WatchedEvent state:SyncConnected type:NodeChildrenChanged path:/live_nodes, has occurred - updating... (live nodes size: 1)
   [junit4]   2> 1021575 INFO  (zkCallback-686-thread-1-processing-n:127.0.0.1:53129_) [n:127.0.0.1:53129_    ] o.a.s.c.c.ZkStateReader A live node change: WatchedEvent state:SyncConnected type:NodeChildrenChanged path:/live_nodes, has occurred - updating... (live nodes size: 1)
   [junit4]   2> 1021575 INFO  (zkCallback-688-thread-1) [    ] o.a.s.c.c.ZkStateReader A live node change: WatchedEvent state:SyncConnected type:NodeChildrenChanged path:/live_nodes, has occurred - updating... (live nodes size: 1)
   [junit4]   2> 1021586 INFO  (TEST-DistribJoinFromCollectionTest.test-seed#[19E656938EF54EA7]) [n:127.0.0.1:53134_    ] o.a.s.c.Overseer Overseer (id=null) closing
   [junit4]   2> 1021593 INFO  (TEST-DistribJoinFromCollectionTest.test-seed#[19E656938EF54EA7]) [n:127.0.0.1:53134_    ] o.a.s.c.LeaderElector Joined leadership election with path: /overseer_elect/election/94614417723555849-127.0.0.1:53134_-n_0000000001
   [junit4]   2> 1021598 INFO  (TEST-DistribJoinFromCollectionTest.test-seed#[19E656938EF54EA7]) [n:127.0.0.1:53134_    ] o.a.s.c.LeaderElector Watching path /overseer_elect/election/94614417723555845-127.0.0.1:53129_-n_0000000000 to know if I could be the leader
   [junit4]   2> 1021613 INFO  (TEST-DistribJoinFromCollectionTest.test-seed#[19E656938EF54EA7]) [n:127.0.0.1:53134_    ] o.a.s.c.CoreContainer Security conf doesn't exist. Skipping setup for authorization module.
   [junit4]   2> 1021614 INFO  (TEST-DistribJoinFromCollectionTest.test-seed#[19E656938EF54EA7]) [n:127.0.0.1:53134_    ] o.a.s.c.CoreContainer No authentication plugin used.
   [junit4]   2> 1021653 INFO  (TEST-DistribJoinFromCollectionTest.test-seed#[19E656938EF54EA7]) [n:127.0.0.1:53134_    ] o.a.s.c.CoresLocator Looking for core definitions underneath /Users/jenkins/workspace/Lucene-Solr-5.x-MacOSX/solr/build/solr-core/test/J1/../../../../../../../../../Users/jenkins/workspace/Lucene-Solr-5.x-MacOSX/solr/build/solr-core/test/J1/temp/solr.cloud.DistribJoinFromCollectionTest_19E656938EF54EA7-001/shard-1-001/cores
   [junit4]   2> 1021658 INFO  (TEST-DistribJoinFromCollectionTest.test-seed#[19E656938EF54EA7]) [n:127.0.0.1:53134_    ] o.a.s.c.SolrCore Created CoreDescriptor: {name=collection1, config=solrconfig.xml, transient=false, schema=schema.xml, loadOnStartup=true, configSetProperties=configsetprops.json, instanceDir=/Users/jenkins/workspace/Lucene-Solr-5.x-MacOSX/solr/build/solr-core/test/J1/../../../../../../../../../Users/jenkins/workspace/Lucene-Solr-5.x-MacOSX/solr/build/solr-core/test/J1/temp/solr.cloud.DistribJoinFromCollectionTest_19E656938EF54EA7-001/shard-1-001/cores/collection1, collection=collection1, absoluteInstDir=/Users/jenkins/workspace/Lucene-Solr-5.x-MacOSX/solr/build/solr-core/test/J1/../../../../../../../../../Users/jenkins/workspace/Lucene-Solr-5.x-MacOSX/solr/build/solr-core/test/J1/temp/solr.cloud.DistribJoinFromCollectionTest_19E656938EF54EA7-001/shard-1-001/cores/collection1/, coreNodeName=, dataDir=data/, shard=}
   [junit4]   2> 1021658 INFO  (TEST-DistribJoinFromCollectionTest.test-seed#[19E656938EF54EA7]) [n:127.0.0.1:53134_    ] o.a.s.c.CoresLocator Found core collection1 in /Users/jenkins/workspace/Lucene-Solr-5.x-MacOSX/solr/build/solr-core/test/J1/../../../../../../../../../Users/jenkins/workspace/Lucene-Solr-5.x-MacOSX/solr/build/solr-core/test/J1/temp/solr.cloud.DistribJoinFromCollectionTest_19E656938EF54EA7-001/shard-1-001/cores/collection1/
   [junit4]   2> 1021658 INFO  (TEST-DistribJoinFromCollectionTest.test-seed#[19E656938EF54EA7]) [n:127.0.0.1:53134_    ] o.a.s.c.CoresLocator Found 1 core definitions
   [junit4]   2> 1021662 INFO  (TEST-DistribJoinFromCollectionTest.test-seed#[19E656938EF54EA7]) [n:127.0.0.1:53134_    ] o.a.s.s.SolrDispatchFilter user.dir=/Users/jenkins/workspace/Lucene-Solr-5.x-MacOSX/solr/build/solr-core/test/J1
   [junit4]   2> 1021662 INFO  (TEST-DistribJoinFromCollectionTest.test-seed#[19E656938EF54EA7]) [n:127.0.0.1:53134_    ] o.a.s.s.SolrDispatchFilter SolrDispatchFilter.init() done
   [junit4]   2> 1021666 INFO  (coreLoadExecutor-2845-thread-1-processing-n:127.0.0.1:53134_) [n:127.0.0.1:53134_ c:collection1   x:collection1] o.a.s.c.ZkController publishing state=down
   [junit4]   2> 1021666 INFO  (coreLoadExecutor-2845-thread-1-processing-n:127.0.0.1:53134_) [n:127.0.

[...truncated too long message...]

./../../../Users/jenkins/workspace/Lucene-Solr-5.x-MacOSX/solr/build/solr-core/test/J0/temp/solr.cloud.SyncSliceTest_19E656938EF54EA7-001/shard-4-001/cores/collection1/data/index
   [junit4]   2> 1858849 INFO  (zkCallback-2049-thread-3-processing-n:127.0.0.1:55664_) [n:127.0.0.1:55664_ c:collection1 s:shard1 r:core_node4 x:collection1] o.a.s.c.CachingDirectoryFactory looking to close /Users/jenkins/workspace/Lucene-Solr-5.x-MacOSX/solr/build/solr-core/test/J0/../../../../../../../../../Users/jenkins/workspace/Lucene-Solr-5.x-MacOSX/solr/build/solr-core/test/J0/temp/solr.cloud.SyncSliceTest_19E656938EF54EA7-001/shard-4-001/cores/collection1/data [CachedDir<<refCount=0;path=/Users/jenkins/workspace/Lucene-Solr-5.x-MacOSX/solr/build/solr-core/test/J0/../../../../../../../../../Users/jenkins/workspace/Lucene-Solr-5.x-MacOSX/solr/build/solr-core/test/J0/temp/solr.cloud.SyncSliceTest_19E656938EF54EA7-001/shard-4-001/cores/collection1/data;done=false>>]
   [junit4]   2> 1858849 INFO  (zkCallback-2049-thread-3-processing-n:127.0.0.1:55664_) [n:127.0.0.1:55664_ c:collection1 s:shard1 r:core_node4 x:collection1] o.a.s.c.CachingDirectoryFactory Closing directory: /Users/jenkins/workspace/Lucene-Solr-5.x-MacOSX/solr/build/solr-core/test/J0/../../../../../../../../../Users/jenkins/workspace/Lucene-Solr-5.x-MacOSX/solr/build/solr-core/test/J0/temp/solr.cloud.SyncSliceTest_19E656938EF54EA7-001/shard-4-001/cores/collection1/data
   [junit4]   2> 1858851 INFO  (TEST-SyncSliceTest.test-seed#[19E656938EF54EA7]) [    ] o.e.j.s.ServerConnector Stopped ServerConnector@8445cc8{SSL-http/1.1}{127.0.0.1:0}
   [junit4]   2> 1858851 INFO  (TEST-SyncSliceTest.test-seed#[19E656938EF54EA7]) [    ] o.e.j.s.h.ContextHandler Stopped o.e.j.s.ServletContextHandler@4669cb68{/,null,UNAVAILABLE}
   [junit4]   2> 1858853 INFO  (TEST-SyncSliceTest.test-seed#[19E656938EF54EA7]) [n:127.0.0.1:55664_ c:collection1 s:shard1 r:core_node4 x:collection1] o.a.s.c.ZkTestServer connecting to 127.0.0.1:55613 55613
   [junit4]   2> 1858873 INFO  (Thread-4501) [    ] o.a.s.c.ZkTestServer connecting to 127.0.0.1:55613 55613
   [junit4]   2> 1860958 WARN  (Thread-4501) [    ] o.a.s.c.ZkTestServer Watch limit violations: 
   [junit4]   2> Maximum concurrent create/delete watches above limit:
   [junit4]   2> 
   [junit4]   2> 	6	/solr/aliases.json
   [junit4]   2> 	5	/solr/security.json
   [junit4]   2> 	5	/solr/configs/conf1
   [junit4]   2> 
   [junit4]   2> Maximum concurrent data watches above limit:
   [junit4]   2> 
   [junit4]   2> 	6	/solr/clusterstate.json
   [junit4]   2> 	2	/solr/overseer_elect/election/94614469660442629-127.0.0.1:55621_-n_0000000000
   [junit4]   2> 
   [junit4]   2> Maximum concurrent children watches above limit:
   [junit4]   2> 
   [junit4]   2> 	6	/solr/live_nodes
   [junit4]   2> 	6	/solr/collections
   [junit4]   2> 	4	/solr/overseer/collection-queue-work
   [junit4]   2> 	3	/solr/overseer/queue
   [junit4]   2> 	3	/solr/overseer/queue-work
   [junit4]   2> 
   [junit4]   2> NOTE: reproduce with: ant test  -Dtestcase=SyncSliceTest -Dtests.method=test -Dtests.seed=19E656938EF54EA7 -Dtests.slow=true -Dtests.locale=sq_AL -Dtests.timezone=America/Indiana/Tell_City -Dtests.asserts=true -Dtests.file.encoding=UTF-8
   [junit4] FAILURE 52.1s J0 | SyncSliceTest.test <<<
   [junit4]    > Throwable #1: java.lang.AssertionError: expected:<5> but was:<4>
   [junit4]    > 	at __randomizedtesting.SeedInfo.seed([19E656938EF54EA7:91B269492009235F]:0)
   [junit4]    > 	at org.apache.solr.cloud.SyncSliceTest.test(SyncSliceTest.java:154)
   [junit4]    > 	at org.apache.solr.BaseDistributedSearchTestCase$ShardsRepeatRule$ShardsFixedStatement.callStatement(BaseDistributedSearchTestCase.java:963)
   [junit4]    > 	at org.apache.solr.BaseDistributedSearchTestCase$ShardsRepeatRule$ShardsStatement.evaluate(BaseDistributedSearchTestCase.java:938)
   [junit4]    > 	at java.lang.Thread.run(Thread.java:745)
   [junit4]   2> 1860962 INFO  (SUITE-SyncSliceTest-seed#[19E656938EF54EA7]-worker) [n:127.0.0.1:55664_ c:collection1 s:shard1 r:core_node4 x:collection1] o.a.s.SolrTestCaseJ4 ###deleteCore
   [junit4]   2> NOTE: leaving temporary files on disk at: /Users/jenkins/workspace/Lucene-Solr-5.x-MacOSX/solr/build/solr-core/test/J0/temp/solr.cloud.SyncSliceTest_19E656938EF54EA7-001
   [junit4]   2> NOTE: test params are: codec=Asserting(Lucene53): {other_tl1=PostingsFormat(name=LuceneVarGapDocFreqInterval), range_facet_l_dv=PostingsFormat(name=Direct), multiDefault=PostingsFormat(name=LuceneVarGapFixedInterval), intDefault=PostingsFormat(name=LuceneVarGapDocFreqInterval), a_i1=PostingsFormat(name=LuceneVarGapDocFreqInterval), range_facet_l=PostingsFormat(name=LuceneVarGapDocFreqInterval), rnd_b=PostingsFormat(name=Direct), _version_=PostingsFormat(name=LuceneVarGapDocFreqInterval), a_t=PostingsFormat(name=LuceneVarGapDocFreqInterval), id=PostingsFormat(name=Direct), range_facet_i_dv=PostingsFormat(name=LuceneVarGapDocFreqInterval), text=PostingsFormat(name=LuceneFixedGap), timestamp=PostingsFormat(name=LuceneVarGapDocFreqInterval)}, docValues:{range_facet_l_dv=DocValuesFormat(name=Lucene50), range_facet_i_dv=DocValuesFormat(name=Lucene50), timestamp=DocValuesFormat(name=Lucene50)}, sim=RandomSimilarityProvider(queryNorm=false,coord=yes): {}, locale=sq_AL, timezone=America/Indiana/Tell_City
   [junit4]   2> NOTE: Mac OS X 10.8.5 x86_64/Oracle Corporation 1.8.0_60 (64-bit)/cpus=3,threads=1,free=237107288,total=518979584
   [junit4]   2> NOTE: All tests run in this JVM: [TestStressLucene, RegexBoostProcessorTest, HdfsCollectionsAPIDistributedZkTest, SpatialHeatmapFacetsTest, TestCloudSchemaless, HdfsSyncSliceTest, IgnoreCommitOptimizeUpdateProcessorFactoryTest, SolrCoreTest, SchemaVersionSpecificBehaviorTest, TestManagedResourceStorage, ParsingFieldUpdateProcessorsTest, ConcurrentDeleteAndCreateCollectionTest, TestPartialUpdateDeduplication, BJQParserTest, SegmentsInfoRequestHandlerTest, TestRandomMergePolicy, ShardSplitTest, ChangedSchemaMergeTest, QueryEqualityTest, TestScoreJoinQPScore, TestSolrJ, BlockCacheTest, TestMinMaxOnMultiValuedField, TestReplicaProperties, HdfsLockFactoryTest, TestFunctionQuery, TestSolrQueryParserResource, TestStressVersions, FileUtilsTest, TestReplicationHandler, InfoHandlerTest, TestLFUCache, HttpPartitionTest, DocumentAnalysisRequestHandlerTest, AlternateDirectoryTest, TestShardHandlerFactory, ZkControllerTest, DistributedFacetPivotSmallTest, MigrateRouteKeyTest, TestExtendedDismaxParser, AddBlockUpdateTest, CurrencyFieldXmlFileTest, TestDistributedSearch, TestSimpleQParserPlugin, TestGroupingSearch, DistributedDebugComponentTest, DateRangeFieldTest, DistributedExpandComponentTest, TestSolrDeletionPolicy1, TestConfig, TestRawResponseWriter, TestCloudManagedSchemaConcurrent, TestLazyCores, TestLeaderElectionZkExpiry, DOMUtilTest, TestJmxIntegration, ShardRoutingTest, SolrRequestParserTest, DistributedVersionInfoTest, TestPseudoReturnFields, TestAuthenticationFramework, SystemInfoHandlerTest, RecoveryZkTest, SharedFSAutoReplicaFailoverUtilsTest, TestSolrConfigHandlerConcurrent, ExplicitHLLTest, TestLuceneMatchVersion, TestPostingsSolrHighlighter, ChaosMonkeyNothingIsSafeTest, CloudMLTQParserTest, CustomCollectionTest, TestUniqueKeyFieldResource, TestCodecSupport, HdfsRecoveryZkTest, BadComponentTest, TestElisionMultitermQuery, PingRequestHandlerTest, TestAddFieldRealTimeGet, CursorMarkTest, TestIntervalFaceting, DistributedMLTComponentTest, TestCustomSort, ZkCLITest, ResourceLoaderTest, AnalysisAfterCoreReloadTest, TestCollapseQParserPlugin, HdfsWriteToMultipleCollectionsTest, OverseerTaskQueueTest, TestStressReorder, RuleEngineTest, TestImplicitCoreProperties, DistributedQueryComponentOptimizationTest, ExitableDirectoryReaderTest, HLLSerializationTest, SoftAutoCommitTest, OverseerCollectionConfigSetProcessorTest, TestDistributedMissingSort, DirectSolrSpellCheckerTest, UpdateParamsTest, TestCloudInspectUtil, SOLR749Test, TestSerializedLuceneMatchVersion, TestDocumentBuilder, SolrCloudExampleTest, ActionThrottleTest, TestJettySolrRunner, MBeansHandlerTest, CoreAdminRequestStatusTest, TestConfigSetsAPIExclusivity, SharedFSAutoReplicaFailoverTest, TestSchemaSimilarityResource, TestReqParamsAPI, TestRTGBase, TestJmxMonitoredMap, RankQueryTest, TestFieldTypeResource, TestLMDirichletSimilarityFactory, SparseHLLTest, TestInitParams, SpatialRPTFieldTypeTest, TestRestoreCore, PluginInfoTest, TestManagedSchema, XmlUpdateRequestHandlerTest, DistributedSpellCheckComponentTest, TestClusterStateMutator, RollingRestartTest, TestFastWriter, AtomicUpdatesTest, TestSortingResponseWriter, TestNoOpRegenerator, TestSort, SyncSliceTest]
   [junit4] Completed [273/539] on J0 in 52.12s, 1 test, 1 failure <<< FAILURES!

[...truncated 818 lines...]
BUILD FAILED
/Users/jenkins/workspace/Lucene-Solr-5.x-MacOSX/build.xml:785: The following error occurred while executing this line:
/Users/jenkins/workspace/Lucene-Solr-5.x-MacOSX/build.xml:729: The following error occurred while executing this line:
/Users/jenkins/workspace/Lucene-Solr-5.x-MacOSX/build.xml:59: The following error occurred while executing this line:
/Users/jenkins/workspace/Lucene-Solr-5.x-MacOSX/solr/build.xml:233: The following error occurred while executing this line:
/Users/jenkins/workspace/Lucene-Solr-5.x-MacOSX/solr/common-build.xml:526: The following error occurred while executing this line:
/Users/jenkins/workspace/Lucene-Solr-5.x-MacOSX/lucene/common-build.xml:1452: The following error occurred while executing this line:
/Users/jenkins/workspace/Lucene-Solr-5.x-MacOSX/lucene/common-build.xml:1006: There were test failures: 539 suites (7 ignored), 2128 tests, 2 errors, 1 failure, 75 ignored (33 assumptions) [seed: 19E656938EF54EA7]

Total time: 75 minutes 9 seconds
Build step 'Invoke Ant' marked build as failure
Archiving artifacts
[WARNINGS] Skipping publisher since build result is FAILURE
Recording test results
Email was triggered for: Failure - Any
Sending email for trigger: Failure - Any



Mime
View raw message