lucene-dev mailing list archives

Site index · List index
Message view « Date » · « Thread »
Top « Date » · « Thread »
From Policeman Jenkins Server <jenk...@thetaphi.de>
Subject [JENKINS-EA] Lucene-Solr-trunk-Linux (32bit/jdk1.9.0-ea-b78) - Build # 14380 - Still Failing!
Date Fri, 02 Oct 2015 13:21:08 GMT
Build: http://jenkins.thetaphi.de/job/Lucene-Solr-trunk-Linux/14380/
Java: 32bit/jdk1.9.0-ea-b78 -client -XX:+UseConcMarkSweepGC

2 tests failed.
FAILED:  org.apache.solr.cloud.CdcrReplicationHandlerTest.doTest

Error Message:
Captured an uncaught exception in thread: Thread[id=545, name=RecoveryThread-source_collection_shard1_replica2, state=RUNNABLE, group=TGRP-CdcrReplicationHandlerTest]

Stack Trace:
com.carrotsearch.randomizedtesting.UncaughtExceptionError: Captured an uncaught exception in thread: Thread[id=545, name=RecoveryThread-source_collection_shard1_replica2, state=RUNNABLE, group=TGRP-CdcrReplicationHandlerTest]
	at __randomizedtesting.SeedInfo.seed([3FE60AB6FDCBDCC5:98A2B2129070CF7C]:0)
Caused by: org.apache.solr.common.cloud.ZooKeeperException: 
	at __randomizedtesting.SeedInfo.seed([3FE60AB6FDCBDCC5]:0)
	at org.apache.solr.cloud.RecoveryStrategy.run(RecoveryStrategy.java:234)
Caused by: org.apache.solr.common.SolrException: java.io.FileNotFoundException: /home/jenkins/workspace/Lucene-Solr-trunk-Linux/solr/build/solr-core/test/J0/temp/solr.cloud.CdcrReplicationHandlerTest_3FE60AB6FDCBDCC5-001/jetty-002/cores/source_collection_shard1_replica2/data/tlog/tlog.0000000000000000007.1513923944398192640 (No such file or directory)
	at org.apache.solr.update.CdcrTransactionLog.reopenOutputStream(CdcrTransactionLog.java:244)
	at org.apache.solr.update.CdcrTransactionLog.incref(CdcrTransactionLog.java:173)
	at org.apache.solr.update.UpdateLog.getRecentUpdates(UpdateLog.java:1079)
	at org.apache.solr.update.UpdateLog.seedBucketsWithHighestVersion(UpdateLog.java:1579)
	at org.apache.solr.update.UpdateLog.seedBucketsWithHighestVersion(UpdateLog.java:1610)
	at org.apache.solr.core.SolrCore.seedVersionBuckets(SolrCore.java:877)
	at org.apache.solr.cloud.RecoveryStrategy.doRecovery(RecoveryStrategy.java:526)
	at org.apache.solr.cloud.RecoveryStrategy.run(RecoveryStrategy.java:227)
Caused by: java.io.FileNotFoundException: /home/jenkins/workspace/Lucene-Solr-trunk-Linux/solr/build/solr-core/test/J0/temp/solr.cloud.CdcrReplicationHandlerTest_3FE60AB6FDCBDCC5-001/jetty-002/cores/source_collection_shard1_replica2/data/tlog/tlog.0000000000000000007.1513923944398192640 (No such file or directory)
	at java.io.RandomAccessFile.open0(Native Method)
	at java.io.RandomAccessFile.open(RandomAccessFile.java:327)
	at java.io.RandomAccessFile.<init>(RandomAccessFile.java:243)
	at org.apache.solr.update.CdcrTransactionLog.reopenOutputStream(CdcrTransactionLog.java:236)
	... 7 more


FAILED:  org.apache.solr.cloud.TestRandomRequestDistribution.testRequestTracking

Error Message:
Shard a1x2_shard1_replica1 received all 10 requests

Stack Trace:
java.lang.AssertionError: Shard a1x2_shard1_replica1 received all 10 requests
	at __randomizedtesting.SeedInfo.seed([3FE60AB6FDCBDCC5:77DA537609C0CD53]:0)
	at org.junit.Assert.fail(Assert.java:93)
	at org.junit.Assert.assertTrue(Assert.java:43)
	at org.apache.solr.cloud.TestRandomRequestDistribution.testRequestTracking(TestRandomRequestDistribution.java:109)
	at sun.reflect.NativeMethodAccessorImpl.invoke0(Native Method)
	at sun.reflect.NativeMethodAccessorImpl.invoke(NativeMethodAccessorImpl.java:62)
	at sun.reflect.DelegatingMethodAccessorImpl.invoke(DelegatingMethodAccessorImpl.java:43)
	at java.lang.reflect.Method.invoke(Method.java:504)
	at com.carrotsearch.randomizedtesting.RandomizedRunner.invoke(RandomizedRunner.java:1665)
	at com.carrotsearch.randomizedtesting.RandomizedRunner$8.evaluate(RandomizedRunner.java:864)
	at com.carrotsearch.randomizedtesting.RandomizedRunner$9.evaluate(RandomizedRunner.java:900)
	at com.carrotsearch.randomizedtesting.RandomizedRunner$10.evaluate(RandomizedRunner.java:914)
	at org.apache.solr.BaseDistributedSearchTestCase$ShardsRepeatRule$ShardsFixedStatement.callStatement(BaseDistributedSearchTestCase.java:963)
	at org.apache.solr.BaseDistributedSearchTestCase$ShardsRepeatRule$ShardsStatement.evaluate(BaseDistributedSearchTestCase.java:938)
	at com.carrotsearch.randomizedtesting.rules.SystemPropertiesRestoreRule$1.evaluate(SystemPropertiesRestoreRule.java:57)
	at org.apache.lucene.util.TestRuleSetupTeardownChained$1.evaluate(TestRuleSetupTeardownChained.java:50)
	at org.apache.lucene.util.AbstractBeforeAfterRule$1.evaluate(AbstractBeforeAfterRule.java:46)
	at org.apache.lucene.util.TestRuleThreadAndTestName$1.evaluate(TestRuleThreadAndTestName.java:49)
	at org.apache.lucene.util.TestRuleIgnoreAfterMaxFailures$1.evaluate(TestRuleIgnoreAfterMaxFailures.java:65)
	at org.apache.lucene.util.TestRuleMarkFailure$1.evaluate(TestRuleMarkFailure.java:48)
	at com.carrotsearch.randomizedtesting.rules.StatementAdapter.evaluate(StatementAdapter.java:36)
	at com.carrotsearch.randomizedtesting.ThreadLeakControl$StatementRunner.run(ThreadLeakControl.java:367)
	at com.carrotsearch.randomizedtesting.ThreadLeakControl.forkTimeoutingTask(ThreadLeakControl.java:809)
	at com.carrotsearch.randomizedtesting.ThreadLeakControl$3.evaluate(ThreadLeakControl.java:460)
	at com.carrotsearch.randomizedtesting.RandomizedRunner.runSingleTest(RandomizedRunner.java:873)
	at com.carrotsearch.randomizedtesting.RandomizedRunner$5.evaluate(RandomizedRunner.java:775)
	at com.carrotsearch.randomizedtesting.RandomizedRunner$6.evaluate(RandomizedRunner.java:809)
	at com.carrotsearch.randomizedtesting.RandomizedRunner$7.evaluate(RandomizedRunner.java:820)
	at com.carrotsearch.randomizedtesting.rules.StatementAdapter.evaluate(StatementAdapter.java:36)
	at com.carrotsearch.randomizedtesting.rules.SystemPropertiesRestoreRule$1.evaluate(SystemPropertiesRestoreRule.java:57)
	at org.apache.lucene.util.AbstractBeforeAfterRule$1.evaluate(AbstractBeforeAfterRule.java:46)
	at com.carrotsearch.randomizedtesting.rules.StatementAdapter.evaluate(StatementAdapter.java:36)
	at org.apache.lucene.util.TestRuleStoreClassName$1.evaluate(TestRuleStoreClassName.java:42)
	at com.carrotsearch.randomizedtesting.rules.NoShadowingOrOverridesOnMethodsRule$1.evaluate(NoShadowingOrOverridesOnMethodsRule.java:39)
	at com.carrotsearch.randomizedtesting.rules.NoShadowingOrOverridesOnMethodsRule$1.evaluate(NoShadowingOrOverridesOnMethodsRule.java:39)
	at com.carrotsearch.randomizedtesting.rules.StatementAdapter.evaluate(StatementAdapter.java:36)
	at com.carrotsearch.randomizedtesting.rules.StatementAdapter.evaluate(StatementAdapter.java:36)
	at com.carrotsearch.randomizedtesting.rules.StatementAdapter.evaluate(StatementAdapter.java:36)
	at org.apache.lucene.util.TestRuleAssertionsRequired$1.evaluate(TestRuleAssertionsRequired.java:54)
	at org.apache.lucene.util.TestRuleMarkFailure$1.evaluate(TestRuleMarkFailure.java:48)
	at org.apache.lucene.util.TestRuleIgnoreAfterMaxFailures$1.evaluate(TestRuleIgnoreAfterMaxFailures.java:65)
	at org.apache.lucene.util.TestRuleIgnoreTestSuites$1.evaluate(TestRuleIgnoreTestSuites.java:55)
	at com.carrotsearch.randomizedtesting.rules.StatementAdapter.evaluate(StatementAdapter.java:36)
	at com.carrotsearch.randomizedtesting.ThreadLeakControl$StatementRunner.run(ThreadLeakControl.java:367)
	at java.lang.Thread.run(Thread.java:746)




Build Log:
[...truncated 9333 lines...]
   [junit4] Suite: org.apache.solr.cloud.CdcrReplicationHandlerTest
   [junit4]   2> Creating dataDir: /home/jenkins/workspace/Lucene-Solr-trunk-Linux/solr/build/solr-core/test/J0/temp/solr.cloud.CdcrReplicationHandlerTest_3FE60AB6FDCBDCC5-001/init-core-data-001
   [junit4]   2> 62744 INFO  (SUITE-CdcrReplicationHandlerTest-seed#[3FE60AB6FDCBDCC5]-worker) [    ] o.a.s.SolrTestCaseJ4 Randomized ssl (true) and clientAuth (false)
   [junit4]   2> 62744 INFO  (SUITE-CdcrReplicationHandlerTest-seed#[3FE60AB6FDCBDCC5]-worker) [    ] o.a.s.BaseDistributedSearchTestCase Setting hostContext system property: /cbx/
   [junit4]   2> 62745 INFO  (TEST-CdcrReplicationHandlerTest.doTest-seed#[3FE60AB6FDCBDCC5]) [    ] o.a.s.c.ZkTestServer STARTING ZK TEST SERVER
   [junit4]   2> 62747 INFO  (Thread-102) [    ] o.a.s.c.ZkTestServer client port:0.0.0.0/0.0.0.0:0
   [junit4]   2> 62747 INFO  (Thread-102) [    ] o.a.s.c.ZkTestServer Starting server
   [junit4]   2> 62847 INFO  (TEST-CdcrReplicationHandlerTest.doTest-seed#[3FE60AB6FDCBDCC5]) [    ] o.a.s.c.ZkTestServer start zk server on port:35956
   [junit4]   2> 62848 INFO  (TEST-CdcrReplicationHandlerTest.doTest-seed#[3FE60AB6FDCBDCC5]) [    ] o.a.s.c.c.SolrZkClient Using default ZkCredentialsProvider
   [junit4]   2> 62848 INFO  (TEST-CdcrReplicationHandlerTest.doTest-seed#[3FE60AB6FDCBDCC5]) [    ] o.a.s.c.c.ConnectionManager Waiting for client to connect to ZooKeeper
   [junit4]   2> 62851 INFO  (zkCallback-39-thread-1) [    ] o.a.s.c.c.ConnectionManager Watcher org.apache.solr.common.cloud.ConnectionManager@138516d name:ZooKeeperConnection Watcher:127.0.0.1:35956 got event WatchedEvent state:SyncConnected type:None path:null path:null type:None
   [junit4]   2> 62851 INFO  (TEST-CdcrReplicationHandlerTest.doTest-seed#[3FE60AB6FDCBDCC5]) [    ] o.a.s.c.c.ConnectionManager Client is connected to ZooKeeper
   [junit4]   2> 62851 INFO  (TEST-CdcrReplicationHandlerTest.doTest-seed#[3FE60AB6FDCBDCC5]) [    ] o.a.s.c.c.SolrZkClient Using default ZkACLProvider
   [junit4]   2> 62851 INFO  (TEST-CdcrReplicationHandlerTest.doTest-seed#[3FE60AB6FDCBDCC5]) [    ] o.a.s.c.c.SolrZkClient makePath: /solr
   [junit4]   2> 62861 INFO  (TEST-CdcrReplicationHandlerTest.doTest-seed#[3FE60AB6FDCBDCC5]) [    ] o.a.s.c.c.SolrZkClient Using default ZkCredentialsProvider
   [junit4]   2> 62861 INFO  (TEST-CdcrReplicationHandlerTest.doTest-seed#[3FE60AB6FDCBDCC5]) [    ] o.a.s.c.c.ConnectionManager Waiting for client to connect to ZooKeeper
   [junit4]   2> 62863 INFO  (zkCallback-40-thread-1) [    ] o.a.s.c.c.ConnectionManager Watcher org.apache.solr.common.cloud.ConnectionManager@cc0a8f name:ZooKeeperConnection Watcher:127.0.0.1:35956/solr got event WatchedEvent state:SyncConnected type:None path:null path:null type:None
   [junit4]   2> 62863 INFO  (TEST-CdcrReplicationHandlerTest.doTest-seed#[3FE60AB6FDCBDCC5]) [    ] o.a.s.c.c.ConnectionManager Client is connected to ZooKeeper
   [junit4]   2> 62864 INFO  (TEST-CdcrReplicationHandlerTest.doTest-seed#[3FE60AB6FDCBDCC5]) [    ] o.a.s.c.c.SolrZkClient Using default ZkACLProvider
   [junit4]   2> 62864 INFO  (TEST-CdcrReplicationHandlerTest.doTest-seed#[3FE60AB6FDCBDCC5]) [    ] o.a.s.c.c.SolrZkClient makePath: /collections/collection1
   [junit4]   2> 62865 INFO  (TEST-CdcrReplicationHandlerTest.doTest-seed#[3FE60AB6FDCBDCC5]) [    ] o.a.s.c.c.SolrZkClient makePath: /collections/collection1/shards
   [junit4]   2> 62866 INFO  (TEST-CdcrReplicationHandlerTest.doTest-seed#[3FE60AB6FDCBDCC5]) [    ] o.a.s.c.c.SolrZkClient makePath: /collections/control_collection
   [junit4]   2> 62867 INFO  (TEST-CdcrReplicationHandlerTest.doTest-seed#[3FE60AB6FDCBDCC5]) [    ] o.a.s.c.c.SolrZkClient makePath: /collections/control_collection/shards
   [junit4]   2> 62868 INFO  (TEST-CdcrReplicationHandlerTest.doTest-seed#[3FE60AB6FDCBDCC5]) [    ] o.a.s.c.AbstractZkTestCase put /home/jenkins/workspace/Lucene-Solr-trunk-Linux/solr/core/src/test-files/solr/collection1/conf/solrconfig-cdcr.xml to /configs/conf1/solrconfig.xml
   [junit4]   2> 62868 INFO  (TEST-CdcrReplicationHandlerTest.doTest-seed#[3FE60AB6FDCBDCC5]) [    ] o.a.s.c.c.SolrZkClient makePath: /configs/conf1/solrconfig.xml
   [junit4]   2> 62869 INFO  (TEST-CdcrReplicationHandlerTest.doTest-seed#[3FE60AB6FDCBDCC5]) [    ] o.a.s.c.AbstractZkTestCase put /home/jenkins/workspace/Lucene-Solr-trunk-Linux/solr/core/src/test-files/solr/collection1/conf/schema15.xml to /configs/conf1/schema.xml
   [junit4]   2> 62869 INFO  (TEST-CdcrReplicationHandlerTest.doTest-seed#[3FE60AB6FDCBDCC5]) [    ] o.a.s.c.c.SolrZkClient makePath: /configs/conf1/schema.xml
   [junit4]   2> 62870 INFO  (TEST-CdcrReplicationHandlerTest.doTest-seed#[3FE60AB6FDCBDCC5]) [    ] o.a.s.c.AbstractZkTestCase put /home/jenkins/workspace/Lucene-Solr-trunk-Linux/solr/core/src/test-files/solr/collection1/conf/solrconfig.snippet.randomindexconfig.xml to /configs/conf1/solrconfig.snippet.randomindexconfig.xml
   [junit4]   2> 62870 INFO  (TEST-CdcrReplicationHandlerTest.doTest-seed#[3FE60AB6FDCBDCC5]) [    ] o.a.s.c.c.SolrZkClient makePath: /configs/conf1/solrconfig.snippet.randomindexconfig.xml
   [junit4]   2> 62872 INFO  (TEST-CdcrReplicationHandlerTest.doTest-seed#[3FE60AB6FDCBDCC5]) [    ] o.a.s.c.AbstractZkTestCase put /home/jenkins/workspace/Lucene-Solr-trunk-Linux/solr/core/src/test-files/solr/collection1/conf/stopwords.txt to /configs/conf1/stopwords.txt
   [junit4]   2> 62872 INFO  (TEST-CdcrReplicationHandlerTest.doTest-seed#[3FE60AB6FDCBDCC5]) [    ] o.a.s.c.c.SolrZkClient makePath: /configs/conf1/stopwords.txt
   [junit4]   2> 62873 INFO  (TEST-CdcrReplicationHandlerTest.doTest-seed#[3FE60AB6FDCBDCC5]) [    ] o.a.s.c.AbstractZkTestCase put /home/jenkins/workspace/Lucene-Solr-trunk-Linux/solr/core/src/test-files/solr/collection1/conf/protwords.txt to /configs/conf1/protwords.txt
   [junit4]   2> 62873 INFO  (TEST-CdcrReplicationHandlerTest.doTest-seed#[3FE60AB6FDCBDCC5]) [    ] o.a.s.c.c.SolrZkClient makePath: /configs/conf1/protwords.txt
   [junit4]   2> 62874 INFO  (TEST-CdcrReplicationHandlerTest.doTest-seed#[3FE60AB6FDCBDCC5]) [    ] o.a.s.c.AbstractZkTestCase put /home/jenkins/workspace/Lucene-Solr-trunk-Linux/solr/core/src/test-files/solr/collection1/conf/currency.xml to /configs/conf1/currency.xml
   [junit4]   2> 62874 INFO  (TEST-CdcrReplicationHandlerTest.doTest-seed#[3FE60AB6FDCBDCC5]) [    ] o.a.s.c.c.SolrZkClient makePath: /configs/conf1/currency.xml
   [junit4]   2> 62875 INFO  (TEST-CdcrReplicationHandlerTest.doTest-seed#[3FE60AB6FDCBDCC5]) [    ] o.a.s.c.AbstractZkTestCase put /home/jenkins/workspace/Lucene-Solr-trunk-Linux/solr/core/src/test-files/solr/collection1/conf/enumsConfig.xml to /configs/conf1/enumsConfig.xml
   [junit4]   2> 62875 INFO  (TEST-CdcrReplicationHandlerTest.doTest-seed#[3FE60AB6FDCBDCC5]) [    ] o.a.s.c.c.SolrZkClient makePath: /configs/conf1/enumsConfig.xml
   [junit4]   2> 62876 INFO  (TEST-CdcrReplicationHandlerTest.doTest-seed#[3FE60AB6FDCBDCC5]) [    ] o.a.s.c.AbstractZkTestCase put /home/jenkins/workspace/Lucene-Solr-trunk-Linux/solr/core/src/test-files/solr/collection1/conf/open-exchange-rates.json to /configs/conf1/open-exchange-rates.json
   [junit4]   2> 62876 INFO  (TEST-CdcrReplicationHandlerTest.doTest-seed#[3FE60AB6FDCBDCC5]) [    ] o.a.s.c.c.SolrZkClient makePath: /configs/conf1/open-exchange-rates.json
   [junit4]   2> 62877 INFO  (TEST-CdcrReplicationHandlerTest.doTest-seed#[3FE60AB6FDCBDCC5]) [    ] o.a.s.c.AbstractZkTestCase put /home/jenkins/workspace/Lucene-Solr-trunk-Linux/solr/core/src/test-files/solr/collection1/conf/mapping-ISOLatin1Accent.txt to /configs/conf1/mapping-ISOLatin1Accent.txt
   [junit4]   2> 62878 INFO  (TEST-CdcrReplicationHandlerTest.doTest-seed#[3FE60AB6FDCBDCC5]) [    ] o.a.s.c.c.SolrZkClient makePath: /configs/conf1/mapping-ISOLatin1Accent.txt
   [junit4]   2> 62879 INFO  (TEST-CdcrReplicationHandlerTest.doTest-seed#[3FE60AB6FDCBDCC5]) [    ] o.a.s.c.AbstractZkTestCase put /home/jenkins/workspace/Lucene-Solr-trunk-Linux/solr/core/src/test-files/solr/collection1/conf/old_synonyms.txt to /configs/conf1/old_synonyms.txt
   [junit4]   2> 62879 INFO  (TEST-CdcrReplicationHandlerTest.doTest-seed#[3FE60AB6FDCBDCC5]) [    ] o.a.s.c.c.SolrZkClient makePath: /configs/conf1/old_synonyms.txt
   [junit4]   2> 62880 INFO  (TEST-CdcrReplicationHandlerTest.doTest-seed#[3FE60AB6FDCBDCC5]) [    ] o.a.s.c.AbstractZkTestCase put /home/jenkins/workspace/Lucene-Solr-trunk-Linux/solr/core/src/test-files/solr/collection1/conf/synonyms.txt to /configs/conf1/synonyms.txt
   [junit4]   2> 62880 INFO  (TEST-CdcrReplicationHandlerTest.doTest-seed#[3FE60AB6FDCBDCC5]) [    ] o.a.s.c.c.SolrZkClient makePath: /configs/conf1/synonyms.txt
   [junit4]   2> 62882 INFO  (TEST-CdcrReplicationHandlerTest.doTest-seed#[3FE60AB6FDCBDCC5]) [    ] o.a.s.c.c.SolrZkClient Using default ZkCredentialsProvider
   [junit4]   2> 62882 INFO  (TEST-CdcrReplicationHandlerTest.doTest-seed#[3FE60AB6FDCBDCC5]) [    ] o.a.s.c.c.ConnectionManager Waiting for client to connect to ZooKeeper
   [junit4]   2> 62883 INFO  (zkCallback-41-thread-1) [    ] o.a.s.c.c.ConnectionManager Watcher org.apache.solr.common.cloud.ConnectionManager@142746f name:ZooKeeperConnection Watcher:127.0.0.1:35956/solr got event WatchedEvent state:SyncConnected type:None path:null path:null type:None
   [junit4]   2> 62883 INFO  (TEST-CdcrReplicationHandlerTest.doTest-seed#[3FE60AB6FDCBDCC5]) [    ] o.a.s.c.c.ConnectionManager Client is connected to ZooKeeper
   [junit4]   2> 62885 INFO  (TEST-CdcrReplicationHandlerTest.doTest-seed#[3FE60AB6FDCBDCC5]) [    ] o.a.s.c.c.SolrZkClient Using default ZkACLProvider
   [junit4]   2> 62886 INFO  (TEST-CdcrReplicationHandlerTest.doTest-seed#[3FE60AB6FDCBDCC5]) [    ] o.a.s.SolrTestCaseJ4 ###Starting doTest
   [junit4]   2> 62976 INFO  (TEST-CdcrReplicationHandlerTest.doTest-seed#[3FE60AB6FDCBDCC5]) [    ] o.a.s.SolrTestCaseJ4 Writing core.properties file to /home/jenkins/workspace/Lucene-Solr-trunk-Linux/solr/build/solr-core/test/J0/temp/solr.cloud.CdcrReplicationHandlerTest_3FE60AB6FDCBDCC5-001/jetty-001/cores/collection1
   [junit4]   2> 62989 INFO  (TEST-CdcrReplicationHandlerTest.doTest-seed#[3FE60AB6FDCBDCC5]) [    ] o.e.j.s.Server jetty-9.2.13.v20150730
   [junit4]   2> 62990 INFO  (TEST-CdcrReplicationHandlerTest.doTest-seed#[3FE60AB6FDCBDCC5]) [    ] o.e.j.s.h.ContextHandler Started o.e.j.s.ServletContextHandler@17dd932{/cbx,null,AVAILABLE}
   [junit4]   2> 63062 INFO  (TEST-CdcrReplicationHandlerTest.doTest-seed#[3FE60AB6FDCBDCC5]) [    ] o.e.j.s.ServerConnector Started ServerConnector@17f74ff{SSL-http/1.1}{127.0.0.1:46723}
   [junit4]   2> 63062 INFO  (TEST-CdcrReplicationHandlerTest.doTest-seed#[3FE60AB6FDCBDCC5]) [    ] o.e.j.s.Server Started @64503ms
   [junit4]   2> 63062 INFO  (TEST-CdcrReplicationHandlerTest.doTest-seed#[3FE60AB6FDCBDCC5]) [    ] o.a.s.c.s.e.JettySolrRunner Jetty properties: {shards=shard1, hostContext=/cbx, hostPort=46723, coreRootDirectory=/home/jenkins/workspace/Lucene-Solr-trunk-Linux/solr/build/solr-core/test/J0/temp/solr.cloud.CdcrReplicationHandlerTest_3FE60AB6FDCBDCC5-001/jetty-001/cores}
   [junit4]   2> 63063 INFO  (TEST-CdcrReplicationHandlerTest.doTest-seed#[3FE60AB6FDCBDCC5]) [    ] o.a.s.s.SolrDispatchFilter SolrDispatchFilter.init(): sun.misc.Launcher$AppClassLoader@181c5f3
   [junit4]   2> 63063 INFO  (TEST-CdcrReplicationHandlerTest.doTest-seed#[3FE60AB6FDCBDCC5]) [    ] o.a.s.c.SolrResourceLoader new SolrResourceLoader for directory: '/home/jenkins/workspace/Lucene-Solr-trunk-Linux/solr/build/solr-core/test/J0/temp/solr.cloud.CdcrReplicationHandlerTest_3FE60AB6FDCBDCC5-001/jetty-001/'
   [junit4]   2> 63082 INFO  (TEST-CdcrReplicationHandlerTest.doTest-seed#[3FE60AB6FDCBDCC5]) [    ] o.a.s.c.c.SolrZkClient Using default ZkCredentialsProvider
   [junit4]   2> 63082 INFO  (TEST-CdcrReplicationHandlerTest.doTest-seed#[3FE60AB6FDCBDCC5]) [    ] o.a.s.c.c.ConnectionManager Waiting for client to connect to ZooKeeper
   [junit4]   2> 63084 INFO  (zkCallback-42-thread-1) [    ] o.a.s.c.c.ConnectionManager Watcher org.apache.solr.common.cloud.ConnectionManager@dc9e7a name:ZooKeeperConnection Watcher:127.0.0.1:35956/solr got event WatchedEvent state:SyncConnected type:None path:null path:null type:None
   [junit4]   2> 63084 INFO  (TEST-CdcrReplicationHandlerTest.doTest-seed#[3FE60AB6FDCBDCC5]) [    ] o.a.s.c.c.ConnectionManager Client is connected to ZooKeeper
   [junit4]   2> 63084 INFO  (TEST-CdcrReplicationHandlerTest.doTest-seed#[3FE60AB6FDCBDCC5]) [    ] o.a.s.c.c.SolrZkClient Using default ZkACLProvider
   [junit4]   2> 63085 INFO  (TEST-CdcrReplicationHandlerTest.doTest-seed#[3FE60AB6FDCBDCC5]) [    ] o.a.s.s.SolrDispatchFilter Loading solr.xml from SolrHome (not found in ZooKeeper)
   [junit4]   2> 63085 INFO  (TEST-CdcrReplicationHandlerTest.doTest-seed#[3FE60AB6FDCBDCC5]) [    ] o.a.s.c.SolrXmlConfig Loading container configuration from /home/jenkins/workspace/Lucene-Solr-trunk-Linux/solr/build/solr-core/test/J0/temp/solr.cloud.CdcrReplicationHandlerTest_3FE60AB6FDCBDCC5-001/jetty-001/solr.xml
   [junit4]   2> 63116 INFO  (TEST-CdcrReplicationHandlerTest.doTest-seed#[3FE60AB6FDCBDCC5]) [    ] o.a.s.c.CoresLocator Config-defined core root directory: /home/jenkins/workspace/Lucene-Solr-trunk-Linux/solr/build/solr-core/test/J0/temp/solr.cloud.CdcrReplicationHandlerTest_3FE60AB6FDCBDCC5-001/jetty-001/cores
   [junit4]   2> 63117 INFO  (TEST-CdcrReplicationHandlerTest.doTest-seed#[3FE60AB6FDCBDCC5]) [    ] o.a.s.c.CoreContainer New CoreContainer 28136849
   [junit4]   2> 63117 INFO  (TEST-CdcrReplicationHandlerTest.doTest-seed#[3FE60AB6FDCBDCC5]) [    ] o.a.s.c.CoreContainer Loading cores into CoreContainer [instanceDir=/home/jenkins/workspace/Lucene-Solr-trunk-Linux/solr/build/solr-core/test/J0/temp/solr.cloud.CdcrReplicationHandlerTest_3FE60AB6FDCBDCC5-001/jetty-001/]
   [junit4]   2> 63117 INFO  (TEST-CdcrReplicationHandlerTest.doTest-seed#[3FE60AB6FDCBDCC5]) [    ] o.a.s.c.CoreContainer loading shared library: /home/jenkins/workspace/Lucene-Solr-trunk-Linux/solr/build/solr-core/test/J0/temp/solr.cloud.CdcrReplicationHandlerTest_3FE60AB6FDCBDCC5-001/jetty-001/lib
   [junit4]   2> 63117 WARN  (TEST-CdcrReplicationHandlerTest.doTest-seed#[3FE60AB6FDCBDCC5]) [    ] o.a.s.c.SolrResourceLoader Can't find (or read) directory to add to classloader: lib (resolved as: /home/jenkins/workspace/Lucene-Solr-trunk-Linux/solr/build/solr-core/test/J0/temp/solr.cloud.CdcrReplicationHandlerTest_3FE60AB6FDCBDCC5-001/jetty-001/lib).
   [junit4]   2> 63128 INFO  (TEST-CdcrReplicationHandlerTest.doTest-seed#[3FE60AB6FDCBDCC5]) [    ] o.a.s.h.c.HttpShardHandlerFactory created with socketTimeout : 90000,urlScheme : ,connTimeout : 15000,maxConnectionsPerHost : 20,maxConnections : 10000,corePoolSize : 0,maximumPoolSize : 2147483647,maxThreadIdleTime : 5,sizeOfQueue : -1,fairnessPolicy : false,useRetries : false,
   [junit4]   2> 63131 INFO  (TEST-CdcrReplicationHandlerTest.doTest-seed#[3FE60AB6FDCBDCC5]) [    ] o.a.s.u.UpdateShardHandler Creating UpdateShardHandler HTTP client with params: socketTimeout=340000&connTimeout=45000&retry=true
   [junit4]   2> 63141 INFO  (TEST-CdcrReplicationHandlerTest.doTest-seed#[3FE60AB6FDCBDCC5]) [    ] o.a.s.l.LogWatcher SLF4J impl is org.slf4j.impl.Log4jLoggerFactory
   [junit4]   2> 63141 INFO  (TEST-CdcrReplicationHandlerTest.doTest-seed#[3FE60AB6FDCBDCC5]) [    ] o.a.s.l.LogWatcher Registering Log Listener [Log4j (org.slf4j.impl.Log4jLoggerFactory)]
   [junit4]   2> 63141 INFO  (TEST-CdcrReplicationHandlerTest.doTest-seed#[3FE60AB6FDCBDCC5]) [    ] o.a.s.c.ZkContainer Zookeeper client=127.0.0.1:35956/solr
   [junit4]   2> 63141 INFO  (TEST-CdcrReplicationHandlerTest.doTest-seed#[3FE60AB6FDCBDCC5]) [    ] o.a.s.c.ZkController zkHost includes chroot
   [junit4]   2> 63141 INFO  (TEST-CdcrReplicationHandlerTest.doTest-seed#[3FE60AB6FDCBDCC5]) [    ] o.a.s.c.c.SolrZkClient Using default ZkCredentialsProvider
   [junit4]   2> 63143 INFO  (TEST-CdcrReplicationHandlerTest.doTest-seed#[3FE60AB6FDCBDCC5]) [    ] o.a.s.c.c.ConnectionManager Waiting for client to connect to ZooKeeper
   [junit4]   2> 63144 INFO  (zkCallback-44-thread-1) [    ] o.a.s.c.c.ConnectionManager Watcher org.apache.solr.common.cloud.ConnectionManager@1e03330 name:ZooKeeperConnection Watcher:127.0.0.1:35956 got event WatchedEvent state:SyncConnected type:None path:null path:null type:None
   [junit4]   2> 63144 INFO  (TEST-CdcrReplicationHandlerTest.doTest-seed#[3FE60AB6FDCBDCC5]) [    ] o.a.s.c.c.ConnectionManager Client is connected to ZooKeeper
   [junit4]   2> 63145 INFO  (TEST-CdcrReplicationHandlerTest.doTest-seed#[3FE60AB6FDCBDCC5]) [    ] o.a.s.c.c.SolrZkClient Using default ZkACLProvider
   [junit4]   2> 63146 INFO  (TEST-CdcrReplicationHandlerTest.doTest-seed#[3FE60AB6FDCBDCC5]) [n:127.0.0.1:46723_cbx    ] o.a.s.c.c.ConnectionManager Waiting for client to connect to ZooKeeper
   [junit4]   2> 63147 INFO  (zkCallback-45-thread-1-processing-n:127.0.0.1:46723_cbx) [n:127.0.0.1:46723_cbx    ] o.a.s.c.c.ConnectionManager Watcher org.apache.solr.common.cloud.ConnectionManager@14e0fcb name:ZooKeeperConnection Watcher:127.0.0.1:35956/solr got event WatchedEvent state:SyncConnected type:None path:null path:null type:None
   [junit4]   2> 63147 INFO  (TEST-CdcrReplicationHandlerTest.doTest-seed#[3FE60AB6FDCBDCC5]) [n:127.0.0.1:46723_cbx    ] o.a.s.c.c.ConnectionManager Client is connected to ZooKeeper
   [junit4]   2> 63148 INFO  (TEST-CdcrReplicationHandlerTest.doTest-seed#[3FE60AB6FDCBDCC5]) [n:127.0.0.1:46723_cbx    ] o.a.s.c.c.SolrZkClient makePath: /overseer/queue
   [junit4]   2> 63151 INFO  (TEST-CdcrReplicationHandlerTest.doTest-seed#[3FE60AB6FDCBDCC5]) [n:127.0.0.1:46723_cbx    ] o.a.s.c.c.SolrZkClient makePath: /overseer/collection-queue-work
   [junit4]   2> 63153 INFO  (TEST-CdcrReplicationHandlerTest.doTest-seed#[3FE60AB6FDCBDCC5]) [n:127.0.0.1:46723_cbx    ] o.a.s.c.c.SolrZkClient makePath: /overseer/collection-map-running
   [junit4]   2> 63154 INFO  (TEST-CdcrReplicationHandlerTest.doTest-seed#[3FE60AB6FDCBDCC5]) [n:127.0.0.1:46723_cbx    ] o.a.s.c.c.SolrZkClient makePath: /overseer/collection-map-completed
   [junit4]   2> 63155 INFO  (TEST-CdcrReplicationHandlerTest.doTest-seed#[3FE60AB6FDCBDCC5]) [n:127.0.0.1:46723_cbx    ] o.a.s.c.c.SolrZkClient makePath: /overseer/collection-map-failure
   [junit4]   2> 63158 INFO  (TEST-CdcrReplicationHandlerTest.doTest-seed#[3FE60AB6FDCBDCC5]) [n:127.0.0.1:46723_cbx    ] o.a.s.c.c.SolrZkClient makePath: /live_nodes
   [junit4]   2> 63159 INFO  (TEST-CdcrReplicationHandlerTest.doTest-seed#[3FE60AB6FDCBDCC5]) [n:127.0.0.1:46723_cbx    ] o.a.s.c.c.SolrZkClient makePath: /aliases.json
   [junit4]   2> 63160 INFO  (TEST-CdcrReplicationHandlerTest.doTest-seed#[3FE60AB6FDCBDCC5]) [n:127.0.0.1:46723_cbx    ] o.a.s.c.c.SolrZkClient makePath: /clusterstate.json
   [junit4]   2> 63160 INFO  (TEST-CdcrReplicationHandlerTest.doTest-seed#[3FE60AB6FDCBDCC5]) [n:127.0.0.1:46723_cbx    ] o.a.s.c.c.SolrZkClient makePath: /security.json
   [junit4]   2> 63161 INFO  (TEST-CdcrReplicationHandlerTest.doTest-seed#[3FE60AB6FDCBDCC5]) [n:127.0.0.1:46723_cbx    ] o.a.s.c.ZkController Register node as live in ZooKeeper:/live_nodes/127.0.0.1:46723_cbx
   [junit4]   2> 63162 INFO  (TEST-CdcrReplicationHandlerTest.doTest-seed#[3FE60AB6FDCBDCC5]) [n:127.0.0.1:46723_cbx    ] o.a.s.c.c.SolrZkClient makePath: /live_nodes/127.0.0.1:46723_cbx
   [junit4]   2> 63163 INFO  (TEST-CdcrReplicationHandlerTest.doTest-seed#[3FE60AB6FDCBDCC5]) [n:127.0.0.1:46723_cbx    ] o.a.s.c.c.SolrZkClient makePath: /overseer_elect
   [junit4]   2> 63164 INFO  (TEST-CdcrReplicationHandlerTest.doTest-seed#[3FE60AB6FDCBDCC5]) [n:127.0.0.1:46723_cbx    ] o.a.s.c.c.SolrZkClient makePath: /overseer_elect/election
   [junit4]   2> 63165 INFO  (TEST-CdcrReplicationHandlerTest.doTest-seed#[3FE60AB6FDCBDCC5]) [n:127.0.0.1:46723_cbx    ] o.a.s.c.Overseer Overseer (id=null) closing
   [junit4]   2> 63166 INFO  (TEST-CdcrReplicationHandlerTest.doTest-seed#[3FE60AB6FDCBDCC5]) [n:127.0.0.1:46723_cbx    ] o.a.s.c.LeaderElector Joined leadership election with path: /overseer_elect/election/94620244002078725-127.0.0.1:46723_cbx-n_0000000000
   [junit4]   2> 63167 INFO  (TEST-CdcrReplicationHandlerTest.doTest-seed#[3FE60AB6FDCBDCC5]) [n:127.0.0.1:46723_cbx    ] o.a.s.c.OverseerElectionContext I am going to be the leader 127.0.0.1:46723_cbx
   [junit4]   2> 63167 INFO  (TEST-CdcrReplicationHandlerTest.doTest-seed#[3FE60AB6FDCBDCC5]) [n:127.0.0.1:46723_cbx    ] o.a.s.c.c.SolrZkClient makePath: /overseer_elect/leader
   [junit4]   2> 63168 INFO  (TEST-CdcrReplicationHandlerTest.doTest-seed#[3FE60AB6FDCBDCC5]) [n:127.0.0.1:46723_cbx    ] o.a.s.c.Overseer Overseer (id=94620244002078725-127.0.0.1:46723_cbx-n_0000000000) starting
   [junit4]   2> 63169 INFO  (TEST-CdcrReplicationHandlerTest.doTest-seed#[3FE60AB6FDCBDCC5]) [n:127.0.0.1:46723_cbx    ] o.a.s.c.c.SolrZkClient makePath: /overseer/queue-work
   [junit4]   2> 63174 INFO  (TEST-CdcrReplicationHandlerTest.doTest-seed#[3FE60AB6FDCBDCC5]) [n:127.0.0.1:46723_cbx    ] o.a.s.c.OverseerAutoReplicaFailoverThread Starting OverseerAutoReplicaFailoverThread autoReplicaFailoverWorkLoopDelay=10000 autoReplicaFailoverWaitAfterExpiration=30000 autoReplicaFailoverBadNodeExpiration=60000
   [junit4]   2> 63175 INFO  (OverseerCollectionConfigSetProcessor-94620244002078725-127.0.0.1:46723_cbx-n_0000000000) [n:127.0.0.1:46723_cbx    ] o.a.s.c.OverseerTaskProcessor Process current queue of overseer operations
   [junit4]   2> 63175 INFO  (TEST-CdcrReplicationHandlerTest.doTest-seed#[3FE60AB6FDCBDCC5]) [n:127.0.0.1:46723_cbx    ] o.a.s.c.c.ZkStateReader Updating cluster state from ZooKeeper... 
   [junit4]   2> 63175 INFO  (OverseerStateUpdate-94620244002078725-127.0.0.1:46723_cbx-n_0000000000) [n:127.0.0.1:46723_cbx    ] o.a.s.c.Overseer Starting to work on the main queue
   [junit4]   2> 63286 INFO  (TEST-CdcrReplicationHandlerTest.doTest-seed#[3FE60AB6FDCBDCC5]) [n:127.0.0.1:46723_cbx    ] o.a.s.c.CoreContainer Security conf doesn't exist. Skipping setup for authorization module.
   [junit4]   2> 63286 INFO  (TEST-CdcrReplicationHandlerTest.doTest-seed#[3FE60AB6FDCBDCC5]) [n:127.0.0.1:46723_cbx    ] o.a.s.c.CoreContainer No authentication plugin used.
   [junit4]   2> 63287 INFO  (TEST-CdcrReplicationHandlerTest.doTest-seed#[3FE60AB6FDCBDCC5]) [n:127.0.0.1:46723_cbx    ] o.a.s.c.CoresLocator Looking for core definitions underneath /home/jenkins/workspace/Lucene-Solr-trunk-Linux/solr/build/solr-core/test/J0/temp/solr.cloud.CdcrReplicationHandlerTest_3FE60AB6FDCBDCC5-001/jetty-001/cores
   [junit4]   2> 63288 INFO  (TEST-CdcrReplicationHandlerTest.doTest-seed#[3FE60AB6FDCBDCC5]) [n:127.0.0.1:46723_cbx    ] o.a.s.c.SolrCore Created CoreDescriptor: {name=collection1, config=solrconfig.xml, transient=false, schema=schema.xml, loadOnStartup=true, configSetProperties=configsetprops.json, instanceDir=/home/jenkins/workspace/Lucene-Solr-trunk-Linux/solr/build/solr-core/test/J0/temp/solr.cloud.CdcrReplicationHandlerTest_3FE60AB6FDCBDCC5-001/jetty-001/cores/collection1, collection=tmp_collection, absoluteInstDir=/home/jenkins/workspace/Lucene-Solr-trunk-Linux/solr/build/solr-core/test/J0/temp/solr.cloud.CdcrReplicationHandlerTest_3FE60AB6FDCBDCC5-001/jetty-001/cores/collection1/, coreNodeName=, dataDir=data/, shard=}
   [junit4]   2> 63288 INFO  (TEST-CdcrReplicationHandlerTest.doTest-seed#[3FE60AB6FDCBDCC5]) [n:127.0.0.1:46723_cbx    ] o.a.s.c.CoresLocator Found core collection1 in /home/jenkins/workspace/Lucene-Solr-trunk-Linux/solr/build/solr-core/test/J0/temp/solr.cloud.CdcrReplicationHandlerTest_3FE60AB6FDCBDCC5-001/jetty-001/cores/collection1/
   [junit4]   2> 63288 INFO  (TEST-CdcrReplicationHandlerTest.doTest-seed#[3FE60AB6FDCBDCC5]) [n:127.0.0.1:46723_cbx    ] o.a.s.c.CoresLocator Found 1 core definitions
   [junit4]   2> 63292 INFO  (coreLoadExecutor-141-thread-1-processing-n:127.0.0.1:46723_cbx) [n:127.0.0.1:46723_cbx c:tmp_collection   x:collection1] o.a.s.c.ZkController publishing state=down
   [junit4]   2> 63292 INFO  (coreLoadExecutor-141-thread-1-processing-n:127.0.0.1:46723_cbx) [n:127.0.0.1:46723_cbx c:tmp_collection   x:collection1] o.a.s.c.ZkController numShards not found on descriptor - reading it from system property
   [junit4]   2> 63293 INFO  (TEST-CdcrReplicationHandlerTest.doTest-seed#[3FE60AB6FDCBDCC5]) [n:127.0.0.1:46723_cbx    ] o.a.s.s.SolrDispatchFilter user.dir=/home/jenkins/workspace/Lucene-Solr-trunk-Linux/solr/build/solr-core/test/J0
   [junit4]   2> 63293 INFO  (TEST-CdcrReplicationHandlerTest.doTest-seed#[3FE60AB6FDCBDCC5]) [n:127.0.0.1:46723_cbx    ] o.a.s.s.SolrDispatchFilter SolrDispatchFilter.init() done
   [junit4]   2> 63294 INFO  (coreLoadExecutor-141-thread-1-processing-n:127.0.0.1:46723_cbx) [n:127.0.0.1:46723_cbx c:tmp_collection   x:collection1] o.a.s.c.ZkController look for our core node name
   [junit4]   2> 63295 INFO  (OverseerStateUpdate-94620244002078725-127.0.0.1:46723_cbx-n_0000000000) [n:127.0.0.1:46723_cbx    ] o.a.s.c.Overseer processMessage: queueSize: 1, message = {
   [junit4]   2>   "core":"collection1",
   [junit4]   2>   "roles":null,
   [junit4]   2>   "base_url":"https://127.0.0.1:46723/cbx",
   [junit4]   2>   "node_name":"127.0.0.1:46723_cbx",
   [junit4]   2>   "numShards":"1",
   [junit4]   2>   "state":"down",
   [junit4]   2>   "shard":null,
   [junit4]   2>   "collection":"tmp_collection",
   [junit4]   2>   "operation":"state"} current state version: 0
   [junit4]   2> 63295 INFO  (OverseerStateUpdate-94620244002078725-127.0.0.1:46723_cbx-n_0000000000) [n:127.0.0.1:46723_cbx    ] o.a.s.c.o.ReplicaMutator Update state numShards=1 message={
   [junit4]   2>   "core":"collection1",
   [junit4]   2>   "roles":null,
   [junit4]   2>   "base_url":"https://127.0.0.1:46723/cbx",
   [junit4]   2>   "node_name":"127.0.0.1:46723_cbx",
   [junit4]   2>   "numShards":"1",
   [junit4]   2>   "state":"down",
   [junit4]   2>   "shard":null,
   [junit4]   2>   "collection":"tmp_collection",
   [junit4]   2>   "operation":"state"}
   [junit4]   2> 63295 INFO  (OverseerStateUpdate-94620244002078725-127.0.0.1:46723_cbx-n_0000000000) [n:127.0.0.1:46723_cbx    ] o.a.s.c.o.ClusterStateMutator building a new cName: tmp_collection
   [junit4]   2> 63296 INFO  (OverseerStateUpdate-94620244002078725-127.0.0.1:46723_cbx-n_0000000000) [n:127.0.0.1:46723_cbx    ] o.a.s.c.o.ReplicaMutator Assigning new node to shard shard=shard1
   [junit4]   2> 63297 INFO  (zkCallback-45-thread-1-processing-n:127.0.0.1:46723_cbx) [n:127.0.0.1:46723_cbx    ] o.a.s.c.c.ZkStateReader A cluster state change: WatchedEvent state:SyncConnected type:NodeDataChanged path:/clusterstate.json, has occurred - updating... (live nodes size: 1)
   [junit4]   2> 64295 INFO  (coreLoadExecutor-141-thread-1-processing-n:127.0.0.1:46723_cbx) [n:127.0.0.1:46723_cbx c:tmp_collection   x:collection1] o.a.s.c.ZkController waiting to find shard id in clusterstate for collection1
   [junit4]   2> 64295 INFO  (coreLoadExecutor-141-thread-1-processing-n:127.0.0.1:46723_cbx) [n:127.0.0.1:46723_cbx c:tmp_collection   x:collection1] o.a.s.c.ZkController Check for collection zkNode:tmp_collection
   [junit4]   2> 64295 INFO  (coreLoadExecutor-141-thread-1-processing-n:127.0.0.1:46723_cbx) [n:127.0.0.1:46723_cbx c:tmp_collection   x:collection1] o.a.s.c.ZkController Creating collection in ZooKeeper:tmp_collection
   [junit4]   2> 64295 INFO  (coreLoadExecutor-141-thread-1-processing-n:127.0.0.1:46723_cbx) [n:127.0.0.1:46723_cbx c:tmp_collection   x:collection1] o.a.s.c.ZkController Looking for collection configName
   [junit4]   2> 64296 INFO  (coreLoadExecutor-141-thread-1-processing-n:127.0.0.1:46723_cbx) [n:127.0.0.1:46723_cbx c:tmp_collection   x:collection1] o.a.s.c.ZkController Only one config set found in zk - using it:conf1
   [junit4]   2> 64296 INFO  (coreLoadExecutor-141-thread-1-processing-n:127.0.0.1:46723_cbx) [n:127.0.0.1:46723_cbx c:tmp_collection   x:collection1] o.a.s.c.c.SolrZkClient makePath: /collections/tmp_collection
   [junit4]   2> 64297 INFO  (zkCallback-45-thread-1-processing-n:127.0.0.1:46723_cbx) [n:127.0.0.1:46723_cbx    ] o.a.s.c.c.ZkStateReader A collections change: WatchedEvent state:SyncConnected type:NodeChildrenChanged path:/collections, has occurred - updating...
   [junit4]   2> 64297 INFO  (coreLoadExecutor-141-thread-1-processing-n:127.0.0.1:46723_cbx) [n:127.0.0.1:46723_cbx c:tmp_collection   x:collection1] o.a.s.c.c.ZkStateReader Load collection config from:/collections/tmp_collection
   [junit4]   2> 64297 INFO  (coreLoadExecutor-141-thread-1-processing-n:127.0.0.1:46723_cbx) [n:127.0.0.1:46723_cbx c:tmp_collection   x:collection1] o.a.s.c.c.ZkStateReader path=/collections/tmp_collection configName=conf1 specified config exists in ZooKeeper
   [junit4]   2> 64297 INFO  (coreLoadExecutor-141-thread-1-processing-n:127.0.0.1:46723_cbx) [n:127.0.0.1:46723_cbx c:tmp_collection   x:collection1] o.a.s.c.SolrResourceLoader new SolrResourceLoader for directory: '/home/jenkins/workspace/Lucene-Solr-trunk-Linux/solr/build/solr-core/test/J0/temp/solr.cloud.CdcrReplicationHandlerTest_3FE60AB6FDCBDCC5-001/jetty-001/cores/collection1/'
   [junit4]   2> 64312 INFO  (coreLoadExecutor-141-thread-1-processing-n:127.0.0.1:46723_cbx) [n:127.0.0.1:46723_cbx c:tmp_collection   x:collection1] o.a.s.c.Config loaded config solrconfig.xml with version 0 
   [junit4]   2> 64321 INFO  (coreLoadExecutor-141-thread-1-processing-n:127.0.0.1:46723_cbx) [n:127.0.0.1:46723_cbx c:tmp_collection   x:collection1] o.a.s.c.SolrConfig current version of requestparams : -1
   [junit4]   2> 64330 INFO  (coreLoadExecutor-141-thread-1-processing-n:127.0.0.1:46723_cbx) [n:127.0.0.1:46723_cbx c:tmp_collection   x:collection1] o.a.s.c.SolrConfig Using Lucene MatchVersion: 6.0.0
   [junit4]   2> 64365 INFO  (coreLoadExecutor-141-thread-1-processing-n:127.0.0.1:46723_cbx) [n:127.0.0.1:46723_cbx c:tmp_collection   x:collection1] o.a.s.c.Config Loaded SolrConfig: solrconfig.xml
   [junit4]   2> 64366 INFO  (coreLoadExecutor-141-thread-1-processing-n:127.0.0.1:46723_cbx) [n:127.0.0.1:46723_cbx c:tmp_collection   x:collection1] o.a.s.s.IndexSchema Reading Solr Schema from /configs/conf1/schema.xml
   [junit4]   2> 64379 INFO  (coreLoadExecutor-141-thread-1-processing-n:127.0.0.1:46723_cbx) [n:127.0.0.1:46723_cbx c:tmp_collection   x:collection1] o.a.s.s.IndexSchema [collection1] Schema name=test
   [junit4]   2> 64602 INFO  (coreLoadExecutor-141-thread-1-processing-n:127.0.0.1:46723_cbx) [n:127.0.0.1:46723_cbx c:tmp_collection   x:collection1] o.a.s.s.IndexSchema default search field in schema is text
   [junit4]   2> 64603 INFO  (coreLoadExecutor-141-thread-1-processing-n:127.0.0.1:46723_cbx) [n:127.0.0.1:46723_cbx c:tmp_collection   x:collection1] o.a.s.s.IndexSchema unique key field: id
   [junit4]   2> 64604 INFO  (coreLoadExecutor-141-thread-1-processing-n:127.0.0.1:46723_cbx) [n:127.0.0.1:46723_cbx c:tmp_collection   x:collection1] o.a.s.s.FileExchangeRateProvider Reloading exchange rates from file currency.xml
   [junit4]   2> 64608 INFO  (coreLoadExecutor-141-thread-1-processing-n:127.0.0.1:46723_cbx) [n:127.0.0.1:46723_cbx c:tmp_collection   x:collection1] o.a.s.s.FileExchangeRateProvider Reloading exchange rates from file currency.xml
   [junit4]   2> 64627 INFO  (coreLoadExecutor-141-thread-1-processing-n:127.0.0.1:46723_cbx) [n:127.0.0.1:46723_cbx c:tmp_collection   x:collection1] o.a.s.c.ConfigSetProperties Did not find ConfigSet properties, assuming default properties: Can't find resource 'configsetprops.json' in classpath or '/configs/conf1', cwd=/home/jenkins/workspace/Lucene-Solr-trunk-Linux/solr/build/solr-core/test/J0
   [junit4]   2> 64628 INFO  (coreLoadExecutor-141-thread-1-processing-n:127.0.0.1:46723_cbx) [n:127.0.0.1:46723_cbx c:tmp_collection   x:collection1] o.a.s.c.CoreContainer Creating SolrCore 'collection1' using configuration from collection tmp_collection
   [junit4]   2> 64628 INFO  (coreLoadExecutor-141-thread-1-processing-n:127.0.0.1:46723_cbx) [n:127.0.0.1:46723_cbx c:tmp_collection s:shard1 r:core_node1 x:collection1] o.a.s.c.SolrCore solr.StandardDirectoryFactory
   [junit4]   2> 64660 INFO  (coreLoadExecutor-141-thread-1-processing-n:127.0.0.1:46723_cbx) [n:127.0.0.1:46723_cbx c:tmp_collection s:shard1 r:core_node1 x:collection1] o.a.s.c.SolrCore [[collection1] ] Opening new SolrCore at [/home/jenkins/workspace/Lucene-Solr-trunk-Linux/solr/build/solr-core/test/J0/temp/solr.cloud.CdcrReplicationHandlerTest_3FE60AB6FDCBDCC5-001/jetty-001/cores/collection1/], dataDir=[null]
   [junit4]   2> 64661 INFO  (coreLoadExecutor-141-thread-1-processing-n:127.0.0.1:46723_cbx) [n:127.0.0.1:46723_cbx c:tmp_collection s:shard1 r:core_node1 x:collection1] o.a.s.c.JmxMonitoredMap JMX monitoring is enabled. Adding Solr mbeans to JMX Server: com.sun.jmx.mbeanserver.JmxMBeanServer@17cabef
   [junit4]   2> 64662 INFO  (coreLoadExecutor-141-thread-1-processing-n:127.0.0.1:46723_cbx) [n:127.0.0.1:46723_cbx c:tmp_collection s:shard1 r:core_node1 x:collection1] o.a.s.c.CachingDirectoryFactory return new directory for /home/jenkins/workspace/Lucene-Solr-trunk-Linux/solr/build/solr-core/test/J0/temp/solr.cloud.CdcrReplicationHandlerTest_3FE60AB6FDCBDCC5-001/jetty-001/cores/collection1/data
   [junit4]   2> 64663 INFO  (coreLoadExecutor-141-thread-1-processing-n:127.0.0.1:46723_cbx) [n:127.0.0.1:46723_cbx c:tmp_collection s:shard1 r:core_node1 x:collection1] o.a.s.c.SolrCore New index directory detected: old=null new=/home/jenkins/workspace/Lucene-Solr-trunk-Linux/solr/build/solr-core/test/J0/temp/solr.cloud.CdcrReplicationHandlerTest_3FE60AB6FDCBDCC5-001/jetty-001/cores/collection1/data/index/
   [junit4]   2> 64663 WARN  (coreLoadExecutor-141-thread-1-processing-n:127.0.0.1:46723_cbx) [n:127.0.0.1:46723_cbx c:tmp_collection s:shard1 r:core_node1 x:collection1] o.a.s.c.SolrCore [collection1] Solr index directory '/home/jenkins/workspace/Lucene-Solr-trunk-Linux/solr/build/solr-core/test/J0/temp/solr.cloud.CdcrReplicationHandlerTest_3FE60AB6FDCBDCC5-001/jetty-001/cores/collection1/data/index' doesn't exist. Creating new index...
   [junit4]   2> 64663 INFO  (coreLoadExecutor-141-thread-1-processing-n:127.0.0.1:46723_cbx) [n:127.0.0.1:46723_cbx c:tmp_collection s:shard1 r:core_node1 x:collection1] o.a.s.c.CachingDirectoryFactory return new directory for /home/jenkins/workspace/Lucene-Solr-trunk-Linux/solr/build/solr-core/test/J0/temp/solr.cloud.CdcrReplicationHandlerTest_3FE60AB6FDCBDCC5-001/jetty-001/cores/collection1/data/index
   [junit4]   2> 64663 INFO  (coreLoadExecutor-141-thread-1-processing-n:127.0.0.1:46723_cbx) [n:127.0.0.1:46723_cbx c:tmp_collection s:shard1 r:core_node1 x:collection1] o.a.s.u.RandomMergePolicy RandomMergePolicy wrapping class org.apache.lucene.index.TieredMergePolicy: [TieredMergePolicy: maxMergeAtOnce=49, maxMergeAtOnceExplicit=14, maxMergedSegmentMB=68.5380859375, floorSegmentMB=1.4423828125, forceMergeDeletesPctAllowed=24.781438663173272, segmentsPerTier=10.0, maxCFSSegmentSizeMB=8.796093022207999E12, noCFSRatio=0.723360172283442
   [junit4]   2> 64719 INFO  (coreLoadExecutor-141-thread-1-processing-n:127.0.0.1:46723_cbx) [n:127.0.0.1:46723_cbx c:tmp_collection s:shard1 r:core_node1 x:collection1] o.a.s.c.SolrCore SolrDeletionPolicy.onCommit: commits: num=1
   [junit4]   2> 	commit{dir=/home/jenkins/workspace/Lucene-Solr-trunk-Linux/solr/build/solr-core/test/J0/temp/solr.cloud.CdcrReplicationHandlerTest_3FE60AB6FDCBDCC5-001/jetty-001/cores/collection1/data/index,segFN=segments_1,generation=1}
   [junit4]   2> 64719 INFO  (coreLoadExecutor-141-thread-1-processing-n:127.0.0.1:46723_cbx) [n:127.0.0.1:46723_cbx c:tmp_collection s:shard1 r:core_node1 x:collection1] o.a.s.c.SolrCore newest commit generation = 1
   [junit4]   2> 64722 INFO  (OldIndexDirectoryCleanupThreadForCore-collection1) [n:127.0.0.1:46723_cbx c:tmp_collection s:shard1 r:core_node1 x:collection1] o.a.s.c.SolrCore Looking for old index directories to cleanup for core collection1 in /home/jenkins/workspace/Lucene-Solr-trunk-Linux/solr/build/solr-core/test/J0/temp/solr.cloud.CdcrReplicationHandlerTest_3FE60AB6FDCBDCC5-001/jetty-001/cores/collection1/data/
   [junit4]   2> 64737 INFO  (coreLoadExecutor-141-thread-1-processing-n:127.0.0.1:46723_cbx) [n:127.0.0.1:46723_cbx c:tmp_collection s:shard1 r:core_node1 x:collection1] o.a.s.u.p.UpdateRequestProcessorChain creating updateRequestProcessorChain "cdcr-processor-chain"
   [junit4]   2> 64749 INFO  (coreLoadExecutor-141-thread-1-processing-n:127.0.0.1:46723_cbx) [n:127.0.0.1:46723_cbx c:tmp_collection s:shard1 r:core_node1 x:collection1] o.a.s.c.SolrCore no updateRequestProcessorChain defined as default, creating implicit default
   [junit4]   2> 64755 INFO  (coreLoadExecutor-141-thread-1-processing-n:127.0.0.1:46723_cbx) [n:127.0.0.1:46723_cbx c:tmp_collection s:shard1 r:core_node1 x:collection1] o.a.s.h.l.XMLLoader xsltCacheLifetimeSeconds=60
   [junit4]   2> 64757 INFO  (coreLoadExecutor-141-thread-1-processing-n:127.0.0.1:46723_cbx) [n:127.0.0.1:46723_cbx c:tmp_collection s:shard1 r:core_node1 x:collection1] o.a.s.h.l.XMLLoader xsltCacheLifetimeSeconds=60
   [junit4]   2> 64759 INFO  (coreLoadExecutor-141-thread-1-processing-n:127.0.0.1:46723_cbx) [n:127.0.0.1:46723_cbx c:tmp_collection s:shard1 r:core_node1 x:collection1] o.a.s.h.l.XMLLoader xsltCacheLifetimeSeconds=60
   [junit4]   2> 64760 INFO  (coreLoadExecutor-141-thread-1-processing-n:127.0.0.1:46723_cbx) [n:127.0.0.1:46723_cbx c:tmp_collection s:shard1 r:core_node1 x:collection1] o.a.s.h.l.XMLLoader xsltCacheLifetimeSeconds=60
   [junit4]   2> 64788 INFO  (coreLoadExecutor-141-thread-1-processing-n:127.0.0.1:46723_cbx) [n:127.0.0.1:46723_cbx c:tmp_collection s:shard1 r:core_node1 x:collection1] o.a.s.c.RequestHandlers Registered paths: /admin/mbeans,standard,/update/csv,/update/json/docs,/admin/luke,/admin/segments,/get,/admin/system,/replication,/admin/properties,/config,/schema,/admin/plugins,/admin/logging,/update/json,/admin/threads,/admin/ping,/cdcr,/update,/admin/file
   [junit4]   2> 64788 INFO  (coreLoadExecutor-141-thread-1-processing-n:127.0.0.1:46723_cbx) [n:127.0.0.1:46723_cbx c:tmp_collection s:shard1 r:core_node1 x:collection1] o.a.s.c.SolrCore Using default statsCache cache: org.apache.solr.search.stats.LocalStatsCache
   [junit4]   2> 64798 INFO  (coreLoadExecutor-141-thread-1-processing-n:127.0.0.1:46723_cbx) [n:127.0.0.1:46723_cbx c:tmp_collection s:shard1 r:core_node1 x:collection1] o.a.s.u.UpdateHandler Using UpdateLog implementation: org.apache.solr.update.CdcrUpdateLog
   [junit4]   2> 64798 INFO  (coreLoadExecutor-141-thread-1-processing-n:127.0.0.1:46723_cbx) [n:127.0.0.1:46723_cbx c:tmp_collection s:shard1 r:core_node1 x:collection1] o.a.s.u.UpdateLog Initializing UpdateLog: dataDir= defaultSyncLevel=FLUSH numRecordsToKeep=100 maxNumLogsToKeep=10 numVersionBuckets=65536
   [junit4]   2> 64799 INFO  (coreLoadExecutor-141-thread-1-processing-n:127.0.0.1:46723_cbx) [n:127.0.0.1:46723_cbx c:tmp_collection s:shard1 r:core_node1 x:collection1] o.a.s.c.SolrCore Hard AutoCommit: disabled
   [junit4]   2> 64799 INFO  (coreLoadExecutor-141-thread-1-processing-n:127.0.0.1:46723_cbx) [n:127.0.0.1:46723_cbx c:tmp_collection s:shard1 r:core_node1 x:collection1] o.a.s.c.SolrCore Soft AutoCommit: disabled
   [junit4]   2> 64800 INFO  (coreLoadExecutor-141-thread-1-processing-n:127.0.0.1:46723_cbx) [n:127.0.0.1:46723_cbx c:tmp_collection s:shard1 r:core_node1 x:collection1] o.a.s.u.RandomMergePolicy RandomMergePolicy wrapping class org.apache.lucene.index.TieredMergePolicy: [TieredMergePolicy: maxMergeAtOnce=40, maxMergeAtOnceExplicit=44, maxMergedSegmentMB=36.74609375, floorSegmentMB=1.0478515625, forceMergeDeletesPctAllowed=29.739769547709827, segmentsPerTier=24.0, maxCFSSegmentSizeMB=8.796093022207999E12, noCFSRatio=0.7711436329530285
   [junit4]   2> 64801 INFO  (coreLoadExecutor-141-thread-1-processing-n:127.0.0.1:46723_cbx) [n:127.0.0.1:46723_cbx c:tmp_collection s:shard1 r:core_node1 x:collection1] o.a.s.c.SolrCore SolrDeletionPolicy.onInit: commits: num=1
   [junit4]   2> 	commit{dir=/home/jenkins/workspace/Lucene-Solr-trunk-Linux/solr/build/solr-core/test/J0/temp/solr.cloud.CdcrReplicationHandlerTest_3FE60AB6FDCBDCC5-001/jetty-001/cores/collection1/data/index,segFN=segments_1,generation=1}
   [junit4]   2> 64801 INFO  (coreLoadExecutor-141-thread-1-processing-n:127.0.0.1:46723_cbx) [n:127.0.0.1:46723_cbx c:tmp_collection s:shard1 r:core_node1 x:collection1] o.a.s.c.SolrCore newest commit generation = 1
   [junit4]   2> 64801 INFO  (coreLoadExecutor-141-thread-1-processing-n:127.0.0.1:46723_cbx) [n:127.0.0.1:46723_cbx c:tmp_collection s:shard1 r:core_node1 x:collection1] o.a.s.s.SolrIndexSearcher Opening Searcher@735ebe[collection1] main
   [junit4]   2> 64801 INFO  (coreLoadExecutor-141-thread-1-processing-n:127.0.0.1:46723_cbx) [n:127.0.0.1:46723_cbx c:tmp_collection s:shard1 r:core_node1 x:collection1] o.a.s.c.c.ZkStateReader Load collection config from:/collections/tmp_collection
   [junit4]   2> 64802 INFO  (coreLoadExecutor-141-thread-1-processing-n:127.0.0.1:46723_cbx) [n:127.0.0.1:46723_cbx c:tmp_collection s:shard1 r:core_node1 x:collection1] o.a.s.c.c.ZkStateReader path=/collections/tmp_collection configName=conf1 specified config exists in ZooKeeper
   [junit4]   2> 64802 INFO  (coreLoadExecutor-141-thread-1-processing-n:127.0.0.1:46723_cbx) [n:127.0.0.1:46723_cbx c:tmp_collection s:shard1 r:core_node1 x:collection1] o.a.s.r.ManagedResourceStorage Setting up ZooKeeper-based storage for the RestManager with znodeBase: /configs/conf1
   [junit4]   2> 64802 INFO  (coreLoadExecutor-141-thread-1-processing-n:127.0.0.1:46723_cbx) [n:127.0.0.1:46723_cbx c:tmp_collection s:shard1 r:core_node1 x:collection1] o.a.s.r.ManagedResourceStorage Configured ZooKeeperStorageIO with znodeBase: /configs/conf1
   [junit4]   2> 64802 INFO  (coreLoadExecutor-141-thread-1-processing-n:127.0.0.1:46723_cbx) [n:127.0.0.1:46723_cbx c:tmp_collection s:shard1 r:core_node1 x:collection1] o.a.s.r.RestManager Initializing RestManager with initArgs: {}
   [junit4]   2> 64803 INFO  (coreLoadExecutor-141-thread-1-processing-n:127.0.0.1:46723_cbx) [n:127.0.0.1:46723_cbx c:tmp_collection s:shard1 r:core_node1 x:collection1] o.a.s.r.ManagedResourceStorage Reading _rest_managed.json using ZooKeeperStorageIO:path=/configs/conf1
   [junit4]   2> 64803 INFO  (coreLoadExecutor-141-thread-1-processing-n:127.0.0.1:46723_cbx) [n:127.0.0.1:46723_cbx c:tmp_collection s:shard1 r:core_node1 x:collection1] o.a.s.r.ManagedResourceStorage No data found for znode /configs/conf1/_rest_managed.json
   [junit4]   2> 64803 INFO  (coreLoadExecutor-141-thread-1-processing-n:127.0.0.1:46723_cbx) [n:127.0.0.1:46723_cbx c:tmp_collection s:shard1 r:core_node1 x:collection1] o.a.s.r.ManagedResourceStorage Loaded null at path _rest_managed.json using ZooKeeperStorageIO:path=/configs/conf1
   [junit4]   2> 64803 INFO  (coreLoadExecutor-141-thread-1-processing-n:127.0.0.1:46723_cbx) [n:127.0.0.1:46723_cbx c:tmp_collection s:shard1 r:core_node1 x:collection1] o.a.s.r.RestManager Initializing 0 registered ManagedResources
   [junit4]   2> 64803 INFO  (coreLoadExecutor-141-thread-1-processing-n:127.0.0.1:46723_cbx) [n:127.0.0.1:46723_cbx c:tmp_collection s:shard1 r:core_node1 x:collection1] o.a.s.h.ReplicationHandler Commits will be reserved for  10000
   [junit4]   2> 64807 INFO  (coreLoadExecutor-141-thread-1-processing-n:127.0.0.1:46723_cbx) [n:127.0.0.1:46723_cbx c:tmp_collection s:shard1 r:core_node1 x:collection1] o.a.s.c.c.SolrZkClient makePath: /collections/tmp_collection/cdcr/state
   [junit4]   2> 64829 INFO  (coreLoadExecutor-141-thread-1-processing-n:127.0.0.1:46723_cbx) [n:127.0.0.1:46723_cbx c:tmp_collection s:shard1 r:core_node1 x:collection1] o.a.s.h.CdcrBufferStateManager Created znode /collections/tmp_collection/cdcr/state/buffer
   [junit4]   2> 64834 INFO  (coreLoadExecutor-141-thread-1-processing-n:127.0.0.1:46723_cbx) [n:127.0.0.1:46723_cbx c:tmp_collection s:shard1 r:core_node1 x:collection1] o.a.s.h.CdcrProcessStateManager Created znode /collections/tmp_collection/cdcr/state/process
   [junit4]   2> 64845 INFO  (searcherExecutor-142-thread-1-processing-n:127.0.0.1:46723_cbx x:collection1 s:shard1 c:tmp_collection r:core_node1) [n:127.0.0.1:46723_cbx c:tmp_collection s:shard1 r:core_node1 x:collection1] o.a.s.c.SolrCore [collection1] Registered new searcher Searcher@735ebe[collection1] main{ExitableDirectoryReader(UninvertingDirectoryReader())}
   [junit4]   2> 64846 INFO  (coreLoadExecutor-141-thread-1-processing-n:127.0.0.1:46723_cbx) [n:127.0.0.1:46723_cbx c:tmp_collection s:shard1 r:core_node1 x:collection1] o.a.s.u.UpdateLog Looking up max value of version field to seed version buckets
   [junit4]   2> 64846 INFO  (coreLoadExecutor-141-thread-1-processing-n:127.0.0.1:46723_cbx) [n:127.0.0.1:46723_cbx c:tmp_collection s:shard1 r:core_node1 x:collection1] o.a.s.u.VersionInfo Refreshing highest value of _version_ for 65536 version buckets from index
   [junit4]   2> 64846 INFO  (coreLoadExecutor-141-thread-1-processing-n:127.0.0.1:46723_cbx) [n:127.0.0.1:46723_cbx c:tmp_collection s:shard1 r:core_node1 x:collection1] o.a.s.u.VersionInfo No terms found for _version_, cannot seed version bucket highest value from index
   [junit4]   2> 64846 INFO  (coreLoadExecutor-141-thread-1-processing-n:127.0.0.1:46723_cbx) [n:127.0.0.1:46723_cbx c:tmp_collection s:shard1 r:core_node1 x:collection1] o.a.s.u.UpdateLog Could not find max version in index or recent updates, using new clock 1513923906232123392
   [junit4]   2> 64847 INFO  (coreLoadExecutor-141-thread-1-processing-n:127.0.0.1:46723_cbx) [n:127.0.0.1:46723_cbx c:tmp_collection s:shard1 r:core_node1 x:collection1] o.a.s.u.UpdateLog Took 1.0ms to seed version buckets with highest version 1513923906232123392
   [junit4]   2> 64848 INFO  (coreLoadExecutor-141-thread-1-processing-n:127.0.0.1:46723_cbx) [n:127.0.0.1:46723_cbx c:tmp_collection s:shard1 r:core_node1 x:collection1] o.a.s.c.ZkController watch zkdir /configs/conf1
   [junit4]   2> 64848 INFO  (coreLoadExecutor-141-thread-1-processing-n:127.0.0.1:46723_cbx) [n:127.0.0.1:46723_cbx c:tmp_collection s:shard1 r:core_node1 x:collection1] o.a.s.c.CoreContainer registering core: collection1
   [junit4]   2> 64848 INFO  (coreZkRegister-135-thread-1-processing-n:127.0.0.1:46723_cbx x:collection1 s:shard1 c:tmp_collection r:core_node1) [n:127.0.0.1:46723_cbx c:tmp_collection s:shard1 r:core_node1 x:collection1] o.a.s.c.ZkController Register replica - core:collection1 address:https://127.0.0.1:46723/cbx collection:tmp_collection shard:shard1
   [junit4]   2> 64849 INFO  (coreZkRegister-135-thread-1-processing-n:127.0.0.1:46723_cbx x:collection1 s:shard1 c:tmp_collection r:core_node1) [n:127.0.0.1:46723_cbx c:tmp_collection s:shard1 r:core_node1 x:collection1] o.a.s.c.c.SolrZkClient makePath: /collections/tmp_collection/leader_elect/shard1/election
   [junit4]   2> 64854 INFO  (coreZkRegister-135-thread-1-processing-n:127.0.0.1:46723_cbx x:collection1 s:shard1 c:tmp_collection r:core_node1) [n:127.0.0.1:46723_cbx c:tmp_collection s:shard1 r:core_node1 x:collection1] o.a.s.c.LeaderElector Joined leadership election with path: /collections/tmp_collection/leader_elect/shard1/election/94620244002078725-core_node1-n_0000000000
   [junit4]   2> 64855 INFO  (coreZkRegister-135-thread-1-processing-n:127.0.0.1:46723_cbx x:collection1 s:shard1 c:tmp_collection r:core_node1) [n:127.0.0.1:46723_cbx c:tmp_collection s:shard1 r:core_node1 x:collection1] o.a.s.c.ShardLeaderElectionContext Running the leader process for shard shard1
   [junit4]   2> 64856 INFO  (coreZkRegister-135-thread-1-processing-n:127.0.0.1:46723_cbx x:collection1 s:shard1 c:tmp_collection r:core_node1) [n:127.0.0.1:46723_cbx c:tmp_collection s:shard1 r:core_node1 x:collection1] o.a.s.c.ShardLeaderElectionContext Enough replicas found to continue.
   [junit4]   2> 64856 INFO  (coreZkRegister-135-thread-1-processing-n:127.0.0.1:46723_cbx x:collection1 s:shard1 c:tmp_collection r:core_node1) [n:127.0.0.1:46723_cbx c:tmp_collection s:shard1 r:core_node1 x:collection1] o.a.s.c.ShardLeaderElectionContext I may be the new leader - try and sync
   [junit4]   2> 64857 INFO  (coreZkRegister-135-thread-1-processing-n:127.0.0.1:46723_cbx x:collection1 s:shard1 c:tmp_collection r:core_node1) [n:127.0.0.1:46723_cbx c:tmp_collection s:shard1 r:core_node1 x:collection1] o.a.s.c.SyncStrategy Sync replicas to https://127.0.0.1:46723/cbx/collection1/
   [junit4]   2> 64857 INFO  (coreZkRegister-135-thread-1-processing-n:127.0.0.1:46723_cbx x:collection1 s:shard1 c:tmp_collection r:core_node1) [n:127.0.0.1:46723_cbx c:tmp_collection s:shard1 r:core_node1 x:collection1] o.a.s.c.SyncStrategy Sync Success - now sync replicas to me
   [junit4]   2> 64857 INFO  (coreZkRegister-135-thread-1-processing-n:127.0.0.1:46723_cbx x:collection1 s:shard1 c:tmp_collection r:core_node1) [n:127.0.0.1:46723_cbx c:tmp_collection s:shard1 r:core_node1 x:collection1] o.a.s.c.SyncStrategy https://127.0.0.1:46723/cbx/collection1/ has no replicas
   [junit4]   2> 64857 INFO  (OverseerStateUpdate-94620244002078725-127.0.0.1:46723_cbx-n_0000000000) [n:127.0.0.1:46723_cbx    ] o.a.s.c.Overseer processMessage: queueSize: 1, message = {
   [junit4]   2>   "operation":"leader",
   [junit4]   2>   "shard":"shard1",
   [junit4]   2>   "collection":"tmp_collection"} current state version: 1
   [junit4]   2> 64857 INFO  (coreZkRegister-135-thread-1-processing-n:127.0.0.1:46723_cbx x:collection1 s:shard1 c:tmp_collection r:core_node1) [n:127.0.0.1:46723_cbx c:tmp_collection s:shard1 r:core_node1 x:collection1] o.a.s.c.ShardLeaderElectionContext I am the new leader: https://127.0.0.1:46723/cbx/collection1/ shard1
   [junit4]   2> 64857 INFO  (coreZkRegister-135-thread-1-processing-n:127.0.0.1:46723_cbx x:collection1 s:shard1 c:tmp_collection r:core_node1) [n:127.0.0.1:46723_cbx c:tmp_collection s:shard1 r:core_node1 x:collection1] o.a.s.c.c.SolrZkClient makePath: /collections/tmp_collection/leaders/shard1
   [junit4]   2> 64858 INFO  (zkCallback-45-thread-1-processing-n:127.0.0.1:46723_cbx) [n:127.0.0.1:46723_cbx    ] o.a.s.c.c.ZkStateReader A cluster state change: WatchedEvent state:SyncConnected type:NodeDataChanged path:/clusterstate.json, has occurred - updating... (live nodes size: 1)
   [junit4]   2> 64860 INFO  (coreZkRegister-135-thread-1-processing-n:127.0.0.1:46723_cbx x:collection1 s:shard1 c:tmp_collection r:core_node1) [n:127.0.0.1:46723_cbx c:tmp_collection s:shard1 r:core_node1 x:collection1] o.a.s.c.ShardLeaderElectionContextBase Creating leader registration node
   [junit4]   2> 64861 INFO  (zkCallback-45-thread-2-processing-n:127.0.0.1:46723_cbx) [n:127.0.0.1:46723_cbx    ] o.a.s.h.CdcrProcessStateManager Received new leader state @ tmp_collection:shard1
   [junit4]   2> 64864 INFO  (OverseerStateUpdate-94620244002078725-127.0.0.1:46723_cbx-n_0000000000) [n:127.0.0.1:46723_cbx    ] o.a.s.c.Overseer processMessage: queueSize: 1, message = {
   [junit4]   2>   "operation":"leader",
   [junit4]   2>   "shard":"shard1",
   [junit4]   2>   "collection":"tmp_collection",
   [junit4]   2>   "base_url":"https://127.0.0.1:46723/cbx",
   [junit4]   2>   "core":"collection1",
   [junit4]   2>   "state":"active"} current state version: 2
   [junit4]   2> 64968 INFO  (zkCallback-45-thread-2-processing-n:127.0.0.1:46723_cbx) [n:127.0.0.1:46723_cbx    ] o.a.s.c.c.ZkStateReader A cluster state change: WatchedEvent state:SyncConnected type:NodeDataChanged path:/clusterstate.json, has occurred - updating... (live nodes size: 1)
   [junit4]   2> 65015 INFO  (coreZkRegister-135-thread-1-processing-n:127.0.0.1:46723_cbx x:collection1 s:shard1 c:tmp_collection r:core_node1) [n:127.0.0.1:46723_cbx c:tmp_collection s:shard1 r:core_node1 x:collection1] o.a.s.c.ZkController We are https://127.0.0.1:46723/cbx/collection1/ and leader is https://127.0.0.1:46723/cbx/collection1/
   [junit4]   2> 65015 INFO  (coreZkRegister-135-thread-1-processing-n:127.0.0.1:46723_cbx x:collection1 s:shard1 c:tmp_collection r:core_node1) [n:127.0.0.1:46723_cbx c:tmp_collection s:shard1 r:core_node1 x:collection1] o.a.s.c.ZkController No LogReplay needed for core=collection1 baseURL=https://127.0.0.1:46723/cbx
   [junit4]   2> 65015 INFO  (coreZkRegister-135-thread-1-processing-n:127.0.0.1:46723_cbx x:collection1 s:shard1 c:tmp_collection r:core_node1) [n:127.0.0.1:46723_cbx c:tmp_collection s:shard1 r:core_node1 x:collection1] o.a.s.c.ZkController I am the leader, no recovery necessary
   [junit4]   2> 65015 INFO  (coreZkRegister-135-thread-1-processing-n:127.0.0.1:46723_cbx x:collection1 s:shard1 c:tmp_collection r:core_node1) [n:127.0.0.1:46723_cbx c:tmp_collection s:shard1 r:core_node1 x:collection1] o.a.s.c.ZkController publishing state=active
   [junit4]   2> 65015 INFO  (coreZkRegister-135-thread-1-processing-n:127.0.0.1:46723_cbx x:collection1 s:shard1 c:tmp_collection r:core_node1) [n:127.0.0.1:46723_cbx c:tmp_collection s:shard1 r:core_node1 x:collection1] o.a.s.c.ZkController numShards not found on descriptor - reading it from system property
   [junit4]   2> 65017 INFO  (OverseerStateUpdate-94620244002078725-127.0.0.1:46723_cbx-n_0000000000) [n:127.0.0.1:46723_cbx    ] o.a.s.c.Overseer processMessage: queueSize: 1, message = {
   [junit4]   2>   "core":"collection1",
   [junit4]   2>   "core_node_name":"core_node1",
   [junit4]   2>   "roles":null,
   [junit4]   2>   "base_url":"https://127.0.0.1:46723/cbx",
   [junit4]   2>   "node_name":"127.0.0.1:46723_cbx",
   [junit4]   2>   "numShards":"1",
   [junit4]   2>   "state":"active",
   [junit4]   2>   "shard":"shard1",
   [junit4]   2>   "collection":"tmp_collection",
   [junit4]   2>   "operation":"state"} current state version: 3
   [junit4]   2> 65017 INFO  (OverseerStateUpdate-94620244002078725-127.0.0.1:46723_cbx-n_0000000000) [n:127.0.0.1:46723_cbx    ] o.a.s.c.o.ReplicaMutator Update state numShards=1 message={
   [junit4]   2>   "core":"collection1",
   [junit4]   2>   "core_node_name":"core_node1",
   [junit4]   2>   "roles":null,
   [junit4]   2>   "base_url":"https://127.0.0.1:46723/cbx",
   [junit4]   2>   "node_name":"127.0.0.1:46723_cbx",
   [junit4]   2>   "numShards":"1",
   [junit4]   2>   "state":"active",
   [junit4]   2>   "shard":"shard1",
   [junit4]   2>   "collection":"tmp_collection",
   [junit4]   2>   "operation":"state"}
   [junit4]   2> 65119 INFO  (zkCallback-45-thread-2-processing-n:127.0.0.1:46723_cbx) [n:127.0.0.1:46723_cbx    ] o.a.s.c.c.ZkStateReader A cluster state change: WatchedEvent state:SyncConnected type:NodeDataChanged path:/clusterstate.json, has occurred - updating... (live nodes size: 1)
   [junit4]   2> 65405 INFO  (TEST-CdcrReplicationHandlerTest.doTest-seed#[3FE60AB6FDCBDCC5]) [    ] o.a.s.SolrTestCaseJ4 Writing core.properties file to /home/jenkins/workspace/Lucene-Solr-trunk-Linux/solr/build/solr-core/test/J0/temp/solr.cloud.CdcrReplicationHandlerTest_3FE60AB6FDCBDCC5-001/jetty-002/cores/collection1
   [junit4]   2> 65407 INFO  (TEST-CdcrReplicationHandlerTest.doTest-seed#[3FE60AB6FDCBDCC5]) [    ] o.e.j.s.Server jetty-9.2.13.v20150730
   [junit4]   2> 65408 INFO  (TEST-CdcrReplicationHandlerTest.doTest-seed#[3FE60AB6FDCBDCC5]) [    ] o.e.j.s.h.ContextHandler Started o.e.j.s.ServletContextHandler@16a7c79{/cbx,null,AVAILABLE}
   [junit4]   2> 65427 INFO  (TEST-CdcrReplicationHandlerTest.doTest-seed#[3FE60AB6FDCBDCC5]) [    ] o.e.j.s.ServerConnector Started ServerConnector@1415759{SSL-http/1.1}{127.0.0.1:56385}
   [junit4]   2> 65427 INFO  (TEST-CdcrReplicationHandlerTest.doTest-seed#[3FE60AB6FDCBDCC5]) [    ] o.e.j.s.Server Started @66868ms
   [junit4]   2> 65427 INFO  (TEST-CdcrReplicationHandlerTest.doTest-seed#[3FE60AB6FDCBDCC5]) [    ] o.a.s.c.s.e.JettySolrRunner Jetty properties: {shards=shard2, hostContext=/cbx, hostPort=56385, coreRootDirectory=/home/jenkins/workspace/Lucene-Solr-trunk-Linux/solr/build/solr-core/test/J0/temp/solr.cloud.CdcrReplicationHandlerTest_3FE60AB6FDCBDCC5-001/jetty-002/cores}
   [junit4]   2> 65428 INFO  (TEST-CdcrReplicationHandlerTest.doTest-seed#[3FE60AB6FDCBDCC5]) [    ] o.a.s.s.SolrDispatchFilter SolrDispatchFilter.init(): sun.misc.Launcher$AppClassLoader@181c5f3
   [junit4]   2> 65428 INFO  (TEST-CdcrReplicationHandlerTest.doTest-seed#[3FE60AB6FDCBDCC5]) [    ] o.a.s.c.SolrResourceLoader new SolrResourceLoader for directory: '/home/jenkins/workspace/Lucene-Solr-trunk-Linux/solr/build/solr-core/test/J0/temp/solr.cloud.CdcrReplicationHandlerTest_3FE60AB6FDCBDCC5-001/jetty-002/'
   [junit4]   2> 65439 INFO  (TEST-CdcrReplicationHandlerTest.doTest-seed#[3FE60AB6FDCBDCC5]) [    ] o.a.s.c.c.SolrZkClient Using default ZkCredentialsProvider
   [junit4]   2> 65442 INFO  (TEST-CdcrReplicationHandlerTest.doTest-seed#[3FE60AB6FDCBDCC5]) [    ] o.a.s.c.c.ConnectionManager Waiting for client to connect to ZooKeeper
   [junit4]   2> 65446 INFO  (zkCallback-46-thread-1) [    ] o.a.s.c.c.ConnectionManager Watcher org.apache.solr.common.cloud.ConnectionManager@b5896e name:ZooKeeperConnection Watcher:127.0.0.1:35956/solr got event WatchedEvent state:SyncConnected type:None path:null path:null type:None
   [junit4]   2> 65446 INFO  (TEST-CdcrReplicationHandlerTest.doTest-seed#[3FE60AB6FDCBDCC5]) [    ] o.a.s.c.c.ConnectionManager Client is connected to ZooKeeper
   [junit4]   2> 65447 INFO  (TEST-CdcrReplicationHandlerTest.doTest-seed#[3FE60AB6FDCBDCC5]) [    ] o.a.s.c.c.SolrZkClient Using default ZkACLProvider
   [junit4]   2> 65448 INFO  (TEST-CdcrReplicationHandlerTest.doTest-seed#[3FE60AB6FDCBDCC5]) [    ] o.a.s.s.SolrDispatchFilter Loading solr.xml from SolrHome (not found in ZooKeeper)
   [junit4]   2> 65448 INFO  (TEST-CdcrReplicationHandlerTest.doTest-seed#[3FE60AB6FDCBDCC5]) [    ] o.a.s.c.SolrXmlConfig Loading container configuration from /home/jenkins/workspace/Lucene-Solr-trunk-Linux/solr/build/solr-core/test/J0/temp/solr.cloud.CdcrReplicationHandlerTest_3FE60AB6FDCBDCC5-001/jetty-002/solr.xml
   [junit4]   2> 65455 INFO  (TEST-CdcrReplicationHandlerTest.doTest-seed#[3FE60AB6FDCBDCC5]) [    ] o.a.s.c.CoresLocator Config-defined core root directory: /home/jenkins/workspace/Lucene-Solr-trunk-Linux/solr/build/solr-core/test/J0/temp/solr.cloud.CdcrReplicationHandlerTest_3FE60AB6FDCBDCC5-001/jetty-002/cores
   [junit4]   2> 65455 INFO  (TEST-CdcrReplicationHandlerTest.doTest-seed#[3FE60AB6FDCBDCC5]) [    ] o.a.s.c.CoreContainer New CoreContainer 30019952
   [junit4]   2> 65455 INFO  (TEST-CdcrReplicationHandlerTest.doTest-seed#[3FE60AB6FDCBDCC5]) [    ] o.a.s.c.CoreContainer Loading cores into CoreContainer [instanceDir=/home/jenkins/workspace/Lucene-Solr-trunk-Linux/solr/build/solr-core/test/J0/temp/solr.cloud.CdcrReplicationHandlerTest_3FE60AB6FDCBDCC5-001/jetty-002/]
   [junit4]   2> 65455 INFO  (TEST-CdcrReplicationHandlerTest.doTest-seed#[3FE60AB6FDCBDCC5]) [    ] o.a.s.c.CoreContainer loading shared library: /home/jenkins/workspace/Lucene-Solr-trunk-Linux/solr/build/solr-core/test/J0/temp/solr.cloud.CdcrReplicationHandlerTest_3FE60AB6FDCBDCC5-001/jetty-002/lib
   [junit4]   2> 65455 WARN  (TEST-CdcrReplicationHandlerTest.doTest-seed#[3FE60AB6FDCBDCC5]) [    ] o.a.s.c.SolrResourceLoader Can't find (or read) directory to add to classloader: lib (resolved as: /home/jenkins/workspace/Lucene-Solr-trunk-Linux/solr/build/solr-core/test/J0/temp/solr.cloud.CdcrReplicationHandlerTest_3FE60AB6FDCBDCC5-001/jetty-002/lib).
   [junit4]   2> 65474 INFO  (TEST-CdcrReplicationHandlerTest.doTest-seed#[3FE60AB6FDCBDCC5]) [    ] o.a.s.h.c.HttpShardHandlerFactory created with socketTimeout : 90000,urlScheme : ,connTimeout : 15000,maxConnectionsPerHost : 20,maxConnections : 10000,corePoolSize : 0,maximumPoolSize : 2147483647,maxThreadIdleTime : 5,sizeOfQueue : -1,fairnessPolicy : false,useRetries : false,
   [junit4]   2> 65477 INFO  (TEST-CdcrReplicationHandlerTest.doTest-seed#[3FE60AB6FDCBDCC5]) [    ] o.a.s.u.UpdateShardHandler Creating UpdateShardHandler HTTP client with params: socketTimeout=340000&connTimeout=45000&retry=true
   [junit4]   2> 65480 INFO  (TEST-CdcrReplicationHandlerTest.doTest-seed#[3FE60AB6FDCBDCC5]) [    ] o.a.s.l.LogWatcher SLF4J impl is org.slf4j.impl.Log4jLoggerFactory
   [junit4]   2> 65480 INFO  (TEST-CdcrReplicationHandlerTest.doTest-seed#[3FE60AB6FDCBDCC5]) [    ] o.a.s.l.LogWatcher Registering Log Listener [Log4j (org.slf4j.impl.Log4jLoggerFactory)]
   [junit4]   2> 65480 INFO  (TEST-CdcrReplicationHandlerTest.doTest-seed#[3FE60AB6FDCBDCC5]) [    ] o.a.s.c.ZkContainer Zookeeper client=127.0.0.1:35956/solr
   [junit4]   2> 65480 INFO  (TEST-CdcrReplicationHandlerTest.doTest-seed#[3FE60AB6FDCBDCC5]) [    ] o.a.s.c.ZkController zkHost includes chroot
   [junit4]   2> 65480 INFO  (TEST-CdcrReplicationHandlerTest.doTest-seed#[3FE60AB6FDCBDCC5]) [    ] o.a.s.c.c.SolrZkClient Using default ZkCredentialsProvider
   [junit4]   2> 65481 INFO  (TEST-CdcrReplicationHandlerTest.doTest-seed#[3FE60AB6FDCBDCC5]) [    ] o.a.s.c.c.ConnectionManager Waiting for client to connect to ZooKeeper
   [junit4]   2> 65483 INFO  (zkCallback-48-thread-1) [    ] o.a.s.c.c.ConnectionManager Watcher org.apache.solr.common.cloud.ConnectionManager@1f7632c name:ZooKeeperConnection Watcher:127.0.0.1:35956 got event WatchedEvent state:SyncConnected type:None path:null path:null type:None
   [junit4]   2> 65483 INFO  (TEST-CdcrReplicationHandlerTest.doTest-seed#[3FE60AB6FDCBDCC5]) [    ] o.a.s.c.c.ConnectionManager Client is connected to ZooKeeper
   [junit4]   2> 65484 INFO  (TEST-CdcrReplicationHandlerTest.doTest-seed#[3FE60AB6FDCBDCC5]) [    ] o.a.s.c.c.SolrZkClient Using default ZkACLProvider
   [junit4]   2> 65486 INFO  (TEST-CdcrReplicationHandlerTest.doTest-seed#[3FE60AB6FDCBDCC5]) [n:127.0.0.1:56385_cbx    ] o.a.s.c.c.ConnectionManager Waiting for client to connect to ZooKeeper
   [junit4]   2> 65496 INFO  (zkCallback-49-thread-1-processing-n:127.0.0.1:56385_cbx) [n:127.0.0.1:56385_cbx    ] o.a.s.c.c.ConnectionManager Watcher org.apache.solr.common.cloud.ConnectionManager@caba9c name:ZooKeeperConnection Watcher:127.0.0.1:35956/solr got event WatchedEvent state:SyncConnected type:None path:null path:null type:None
   [junit4]   2> 65496 INFO  (TEST-CdcrReplicationHandlerTest.doTest-seed#[3FE60AB6FDCBDCC5]) [n:127.0.0.1:56385_cbx    ] o.a.s.c.c.ConnectionManager Client is connected to ZooKeeper
   [junit4]   2> 65502 INFO  (TEST-CdcrReplicationHandlerTest.doTest-seed#[3FE60AB6FDCBDCC5]) [n:127.0.0.1:56385_cbx    ] o.a.s.c.c.ZkStateReader Updating cluster state from ZooKeeper... 
   [junit4]   2> 66506 INFO  (TEST-CdcrReplicationHandlerTest.doTest-seed#[3FE60AB6FDCBDCC5]) [n:127.0.0.1:56385_cbx    ] o.a.s.c.ZkController Register node as live in ZooKeeper:/live_nodes/127.0.0.1:56385_cbx
   [junit4]   2> 66507 INFO  (TEST-CdcrReplicationHandlerTest.doTest-seed#[3FE60AB6FDCBDCC5]) [n:127.0.0.1:56385_cbx    ] o.a.s.c.c.SolrZkClient makePath: /live_nodes/127.0.0.1:56385_cbx
   [junit4]   2> 66507 INFO  (zkCallback-49-thread-1-processing-n:127.0.0.1:56385_cbx) [n:127.0.0.1:56385_cbx    ] o.a.s.c.c.ZkStateReader A live node change: WatchedEvent state:SyncConnected type:NodeChildrenChanged path:/live_nodes, has occurred - updating... (live nodes size: 1)
   [junit4]   2> 66507 INFO  (zkCallback-45-thread-2-processing-n:127.0.0.1:46723_cbx) [n:127.0.0.1:46723_cbx    ] o.a.s.c.c.ZkStateReader A live node change: WatchedEvent state:SyncConnected type:NodeChildrenChanged path:/live_nodes, has occurred - updating... (live nodes size: 1)
   [junit4]   2> 66511 INFO  (TEST-CdcrReplicationHandlerTest.doTest-seed#[3FE60AB6FDCBDCC5]) [n:127.0.0.1:56385_cbx    ] o.a.s.c.Overseer Overseer (id=null) closing
   [junit4]   2> 66512 INFO  (TEST-CdcrReplicationHandlerTest.doTest-seed#[3FE60AB6FDCBDCC5]) [n:127.0.0.1:56385_cbx    ] o.a.s.c.LeaderElector Joined leadership election with path: /overseer_elect/election/94620244002078728-127.0.0.1:56385_cbx-n_0000000001
   [junit4]   2> 66514 INFO  (TEST-CdcrReplicationHandlerTest.doTest-seed#[3FE60AB6FDCBDCC5]) [n:127.0.0.1:56385_cbx    ] o.a.s.c.LeaderElector Watching path /overseer_elect/election/94620244002078725-127.0.0.1:46723_cbx-n_0000000000 to know if I could be the leader
   [junit4]   2> 66541 INFO  (TEST-CdcrReplicationHandlerTest.doTest-seed#[3FE60AB6FDCBDCC5]) [n:127.0.0.1:56385_cbx    ] o.a.s.c.CoreContainer Security conf doesn't exist. Skipping setup for authorization module.
   [junit4]   2> 66541 INFO  (TEST-CdcrReplicationHandlerTest.doTest-seed#[3FE60AB6FDCBDCC5]) [n:127.0.0.1:56385_cbx    ] o.a.s.c.CoreContainer No authentication plugin used.
   [junit4]   2> 66541 INFO  (TEST-CdcrReplicationHandlerTest.doTest-seed#[3FE60AB6FDCBDCC5]) [n:127.0.0.1:56385_cbx    ] o.a.s.c.CoresLocator Looking for core definitions underneath /home/jenkins/workspace/Lucene-Solr-trunk-Linux/solr/build/solr-core/test/J0/temp/solr.cloud.CdcrReplicationHandlerTest_3FE60AB6FDCBDCC5-001/jetty-002/cores
   [junit4]   2> 66542 INFO  (TEST-CdcrReplicationHandlerTest.doTest-seed#[3FE60AB6FDCBDCC5]) [n:127.0.0.1:56385_cbx    ] o.a.s.c.SolrCore Created CoreDescriptor: {name=collection1, config=solrconfig.xml, transient=false, schema=schema.xml, loadOnStartup=true, configSetProperties=configsetprops.json, instanceDir=/home/jenkins/workspace/Lucene-Solr-trunk-Linux/solr/build/solr-core/test/J0/temp/solr.cloud.CdcrReplicationHandlerTest_3FE60AB6FDCBDCC5-001/jetty-002/cores/collection1, collection=tmp_collection, absoluteInstDir=/home/jenkins/workspace/Lucene-Solr-trunk-Linux/solr/build/solr-core/test/J0/temp/solr.cloud.CdcrReplicationHandlerTest_3FE60AB6FDCBDCC5-001/jetty-002/cores/collection1/, coreNodeName=, dataDir=data/, shard=}
   [junit4]   2> 66542 INFO  (TEST-CdcrReplicationHandlerTest.doTest-seed#[3FE60AB6FDCBDCC5]) [n:127.0.0.1:56385_cbx    ] o.a.s.c.CoresLocator Found core collection1 in /home/jenkins/workspace/Lucene-Solr-trunk-Linux/solr/build/solr-core/test/J0/temp/solr.cloud.CdcrReplicationHandlerTest_3FE60AB6FDCBDCC5-001/jetty-002/cores/collection1/
   [junit4]   2> 66542 INFO  (TEST-CdcrReplicationHandlerTest.doTest-seed#[3FE60AB6FDCBDCC5]) [n:127.0.0.1:56385_cbx    ] o.a.s.c.CoresLocator Found 1 core definitions
   [junit4]   2> 66543 INFO  (TEST-CdcrReplicationHandlerTest.doTest-seed#[3FE60AB6FDCBDCC5]) [n:127.0.0.1:56385_cbx    ] o.a.s.s.SolrDispatchFilter user.dir=/home/jenkins/workspace/Lucene-Solr-trunk-Linux/solr/build/solr-core/test/J0
   [junit4]   2> 66543 INFO  (TEST-CdcrReplicationHandlerTest.doTest-seed#[3FE60AB6FDCBDCC5]) [n:127.0.0.1:56385_cbx    ] o.a.s.s.SolrDispatchFilter SolrDispatchFilter.init() done
   [junit4]   2> 66544 INFO  (coreLoadExecutor-153-thread-1-processing-n:127.0.0.1:56385_cbx) [n:127.0.0.1:56385_cbx c:tmp_collection   x:collection1] o.a.s.c.ZkController publishing state=down
   [junit4]   2> 66544 INFO  (coreLoadExecutor-153-thread-1-processing-n:127.0.0.1:56385_cbx) [n:127.0.0.1:56385_cbx c:tmp_collection   x:collection1] o.a.s.c.ZkController numShards not found on descriptor - reading it from system property
   [junit4]   2> 66546 INFO  (coreLoadExecutor-153-thread-1-processing-n:127.0.0.1:56385_cbx) [n:127.0.0.1:56385_cbx c:tmp_collection   x:collection1] o.a.s.c.ZkController Registering watch for collection tmp_collection
   [junit4]   2> 66546 INFO  (coreLoadExecutor-153-thread-1-processing-n:127.0.0.1:56385_cbx) [n:127.0.0.1:56385_cbx c:tmp_collection   x:collection1] o.a.s.c.c.ZkStateReader addZkWatch tmp_collection
   [junit4]   2> 66547 INFO  (coreLoadExecutor-153-thread-1-processing-n:127.0.0.1:56385_cbx) [n:127.0.0.1:56385_cbx c:tmp_collection   x:collection1] o.a.s.c.c.ZkStateReader Deleting data for tmp_collection
   [junit4]   2> 66547 INFO  (OverseerStateUpdate-94620244002078725-127.0.0.1:46723_cbx-n_0000000000) [n:127.0.0.1:46723_cbx    ] o.a.s.c.Overseer processMessage: queueSize: 1, message = {
   [junit4]   2>   "core":"collection1",
   [junit4]   2>   "roles":null,
   [junit4]   2>   "base_url":"https://127.0.0.1:56385/cbx",
   [junit4]   2>   "node_name":"127.0.0.1:56385_cbx",
   [junit4]   2>   "numShards":"1",
   [junit4]   2>   "state":"down",
   [junit4]   2>   "shard":null,
   [junit4]   2>   "collection":"tmp_collection",
   [junit4]   2>   "operation":"state"} current state version: 4
   [junit4]   2> 66547 INFO  (OverseerStateUpdate-94620244002078725-127.0.0.1:46723_cbx-n_0000000000) [n:127.0.0.1:46723_cbx    ] o.a.s.c.o.ReplicaMutator Update state numShards=1 message={
   [junit4]   2>   "core":"collection1",
   [junit4]   2>   "roles":null,
   [junit4]   2>   "base_url":"https://127.0.0.1:56385/cbx",
   [junit4]   2>   "node_name":"127.0.0.1:56385_cbx",
   [junit4]   2>   "numShards":"1",
   [junit4]   2>   "state":"down",
   [junit4]   2>   "shard":null,
   [junit4]   2>   "collection":"tmp_collection",
   [junit4]   2>   "operation":"state"}
   [junit4]   2> 66547 INFO  (OverseerStateUpdate-94620244002078725-127.0.0.1:46723_cbx-n_0000000000) [n:127.0.0.1:46723_cbx    ] o.a.s.c.o.ReplicaMutator Collection already exists with numShards=1
   [junit4]   2> 66547 INFO  (OverseerStateUpdate-94620244002078725-127.0.0.1:46723_cbx-n_0000000000) [n:127.0.0.1:46723_cbx    ] o.a.s.c.o.ReplicaMutator Assigning new node to shard shard=shard1
   [junit4]   2> 66548 INFO  (coreLoadExecutor-153-thread-1-processing-n:127.0.0.1:56385_cbx) [n:127.0.0.1:56385_cbx c:tmp_collection   x:collection1] o.a.s.c.ZkController look for our core node name
   [junit4]   2> 66650 INFO  (zkCallback-49-thread-1-processing-n:127.0.0.1:56385_cbx) [n:127.0.0.1:56385_cbx    ] o.a.s.c.c.ZkStateReader A cluster state change: WatchedEvent state:SyncConnected type:NodeDataChanged path:/clusterstate.json, has occurred - updating... (live nodes size: 2)
   [junit4]   2> 66650 INFO  (zkCallback-45-thread-2-processing-n:127.0.0.1:46723_cbx) [n:127.0.0.1:46723_cbx    ] o.a.s.c.c.ZkStateReader A cluster state change: WatchedEvent state:SyncConnected type:NodeDataChanged path:/clusterstate.json, has occurred - updating... (live nodes size: 2)
   [junit4]   2> 67548 INFO  (coreLoadExecutor-153-thread-1-processing-n:127.0.0.1:56385_cbx) [n:127.0.0.1:56385_cbx c:tmp_collection   x:collection1] o.a.s.c.ZkController waiting to find shard id in clusterstate for collection1
   [junit4]   2> 67548 INFO  (coreLoadExecutor-153-thread-1-processing-n:127.0.0.1:56385_cbx) [n:127.0.0.1:56385_cbx c:tmp_collection   x:collection1] o.a.s.c.ZkController Check for collection zkNode:tmp_collection
   [junit4]   2> 67548 INFO  (coreLoadExecutor-153-thread-1-processing-n:127.0.0.1:56385_cbx) [n:127.0.0.1:56385_cbx c:tmp_collection   x:collection1] o.a.s.c.ZkController Collection zkNode exists
   [junit4]   2> 67548 INFO  (coreLoadExecutor-153-thread-1-processing-n:127.0.0.1:56385_cbx) [n:127.0.0.1:56385_cbx c:tmp_collection   x:collection1] o.a.s.c.c.ZkStateReader Load collection config from:/collections/tmp_collection
   [junit4]   2> 67549 INFO  (coreLoadExecutor-153-thread-1-processing-n:127.0.0.1:56385_cbx) [n:127.0.0.1:56385_cbx c:tmp_collection   x:collection1] o.a.s.c.c.ZkStateReader path=/collections/tmp_collection configName=conf1 specified config exists in ZooKeeper
   [junit4]   2> 67549 INFO  (coreLoadExecutor-153-thread-1-processing-n:127.0.0.1:56385_cbx) [n:127.0.0.1:56385_cbx c:tmp_collection   x:collection1] o.a.s.c.SolrResourceLoader new SolrResourceLoader for directory: '/home/jenkins/workspace/Lucene-Solr-trunk-Linux/solr/build/solr-core/test/J0/temp/solr.cloud.CdcrReplicationHandlerTest_3FE60AB6FDCBDCC5-001/jetty-002/cores/collection1/'
   [junit4]   2> 67564 INFO  (coreLoadExecutor-153-thread-1-processing-n:127.0.0.1:56385_cbx) [n:127.0.0.1:56385_cbx c:tmp_collection   x:collection1] o.a.s.c.Config loaded config solrconfig.xml with version 0 
   [junit4]   2> 67570 INFO  (coreLoadExecutor-153-thread-1-processing-n:127.0.0.1:56385_cbx) [n:127.0.0.1:56385_cbx c:tmp_collection   x:collection1] o.a.s.c.SolrConfig current version of requestparams : -1
   [junit4]   2> 67581 INFO  (coreLoadExecutor-153-thread-1-processing-n:127.0.0.1:56385_cbx) [n:127.0.0.1:56385_cbx c:tmp_collection   x:collection1] o.a.s.c.SolrConfig Using Lucene MatchVersion: 6.0.0
   [junit4]   2> 67598 INFO  (coreLoadExecutor-153-thread-1-processing-n:127.0.0.1:56385_cbx) [n:127.0.0.1:56385_cbx c:tmp_collection   x:collection1] o.a.s.c.Config Loaded SolrConfig: solrconfig.xml
   [junit4]   2> 67599 INFO  (coreLoadExecutor-153-thread-1-processing-n:127.0.0.1:56385_cbx) [n:127.0.0.1:56385_cbx c:tmp_collection   x:collection1] o.a.s.s.IndexSchema Reading Solr Schema from /configs/conf1/schema.xml
   [junit4]   2> 67604 INFO  (coreLoadExecutor-153-thread-1-processing-n:127.0.0.1:56385_cbx) [n:127.0.0.1:56385_cbx c:tmp_collection   x:collection1] o.a.s.s.IndexSchema [collection1] Schema name=test
   [junit4]   2> 67862 INFO  (coreLoadExecutor-153-thread-1-processing-n:127.0.0.1:56385_cbx) [n:127.0.0.1:56385_cbx c:tmp_collection   x:collection1] o.a.s.s.IndexSchema default search field in schema is text
   [junit4]   2> 67882 INFO  (coreLoadExecutor-153-thread-1-processing-n:127.0.0.1:56385_cbx) [n:127.0.0.1:56385_cbx c:tmp_collection   x:collection1] o.a.s.s.IndexSchema unique key field: id
   [junit4]   2> 67883 INFO  (coreLoadExecutor-153-thread-1-processing-n:127.0.0.1:56385_cbx) [n:127.0.0.1:56385_cbx c:tmp_collection   x:collection1] o.a.s.s.FileExchangeRateProvider Reloading exchange rates from file currency.xml
   [junit4]   2> 67885 INFO  (coreLoadExecutor-153-thread-1-processing-n:127.0.0.1:56385_cbx) [n:127.0.0.1:56385_cbx c:tmp_collection   x:collection1] o.a.s.s.FileExchangeRateProvider Reloading exchange rates from file currency.xml
   [junit4]   2> 67900 INFO  (coreLoadExecutor-153-thread-1-processing-n:127.0.0.1:56385_cbx) [n:127.0.0.1:56385_cbx c:tmp_collection   x:collection1] o.a.s.c.ConfigSetProperties Did not find ConfigSet properties, assuming default properties: Can't find resource 'configsetprops.json' in classpath or '/configs/conf1', cwd=/home/jenkins/workspace/Lucene-Solr-trunk-Linux/solr/build/solr-core/test/J0
   [junit4]   2> 67900 INFO  (coreLoadExecutor-153-thread-1-processing-n:127.0.0.1:56385_cbx) [n:127.0.0.1:56385_cbx c:tmp_collection   x:collection1] o.a.s.c.CoreContainer Creating SolrCore 'collection1' using configuration from collection tmp_collection
   [junit4]   2> 67900 INFO  (coreLoadExecutor-153-thread-1-processing-n:127.0.0.1:56385_cbx) [n:127.0.0.1:56385_cbx c:tmp_collection s:shard1 r:core_node2 x:collection1] o.a.s.c.SolrCore solr.StandardDirectoryFactory
   [junit4]   2> 67900 INFO  (coreLoadExecutor-153-thread-1-processing-n:127.0.0.1:56385_cbx) [n:127.0.0.1:56385_cbx c:tmp_collection s:shard1 r:core_node2 x:collection1] o.a.s.c.SolrCore [[collection1] ] Opening new SolrCore at [/home/jenkins/workspace/Lucene-Solr-trunk-Linux/solr/build/solr-core/test/J0/temp/solr.cloud.CdcrReplicationHandlerTest_3FE60AB6FDCBDCC5-001/jetty-002/cores/collection1/], dataDir=[null]
   [junit4]   2> 67900 INFO  (coreLoadExecutor-153-thread-1-processing-n:127.0.0.1:56385_cbx) [n:127.0.0.1:56385_cbx c:tmp_collection s:shard1 r:core_node2 x:collection1] o.a.s.c.JmxMonitoredMap JMX monitoring is enabled. Adding Solr mbeans to JMX Server: com.sun.jmx.mbeanserver.JmxMBeanServer@17cabef
   [junit4]   2> 67902 INFO  (coreLoadExecutor-153-thread-1-processing-n:127.0.0.1:56385_cbx) [n:127.0.0.1:56385_cbx c:tmp_collection s:shard1 r:core_node2 x:collection1] o.a.s.c.CachingDirectoryFactory return new directory for /home/jenkins/workspace/Lucene-Solr-trunk-Linux/solr/build/solr-core/test/J0/temp/solr.cloud.CdcrReplicationHandlerTest_3FE60AB6FDCBDCC5-001/jetty-002/cores/collection1/data
   [junit4]   2> 67902 INFO  (coreLoadExecutor-153-thread-1-processing-n:127.0.0.1:56385_cbx) [n:127.0.0.1:56385_cbx c:tmp_collection s:shard1 r:core_node2 x:collection1] o.a.s.c.SolrCore New index directory detected: old=null new=/home/jenkins/workspace/Lucene-Solr-trunk-Linux/solr/build/solr-core/test/J0/temp/solr.cloud.CdcrReplicationHandlerTest_3FE60AB6FDCBDCC5-001/jetty-002/cores/collection1/data/index/
   [junit4]   2> 67903 WARN  (coreLoadExecutor-153-thread-1-processing-n:127.0.0.1:56385_cbx) [n:127.0.0.1:56385_cbx c:tmp_collection s:shard1 r:core_node2 x:collection1] o.a.s.c.SolrCore [collection1] Solr index directory '/home/jenkins/workspace/Lucene-Solr-trunk-Linux/solr/build/solr-core/test/J0/temp/solr.cloud.CdcrReplicationHandlerTest_3FE60AB6FDCBDCC5-001/jetty-002/cores/collection1/data/index' doesn't exist. Creating new index...
   [junit4]   2> 67903 INFO  (coreLoadExecutor-153-thread-1-processing-n:127.0.0.1:56385_cbx) [n:127.0.0.1:56385_cbx c:tmp_collection s:shard1 r:core_node2 x:collection1] o.a.s.c.CachingDirectoryFactory return new directory for /home/jenkins/workspace/Lucene-Solr-trunk-Linux/solr/build/solr-core/test/J0/temp/solr.cloud.CdcrReplicationHandlerTest_3FE60AB6FDCBDCC5-001/jetty-002/cores/collection1/data/index
   [junit4]   2> 67903 INFO  (coreLoadExecutor-153-thread-1-processing-n:127.0.0.1:56385_cbx) [n:127.0.0.1:56385_cbx c:tmp_collection s:shard1 r:core_node2 x:collection1] o.a.s.u.RandomMergePolicy RandomMergePolicy wrapping class org.apache.lucene.index.TieredMergePolicy: [TieredMergePolicy: maxMergeAtOnce=49, maxMergeAtOnceExplicit=14, maxMergedSegmentMB=68.5380859375, floorSegmentMB=1.4423828125, forceMergeDeletesPctAllowed=24.781438663173272, segmentsPerTier=10.0, maxCFSSegmentSizeMB=8.796093022207999E12, noCFSRatio=0.723360172283442
   [junit4]   2> 67921 INFO  (coreLoadExecutor-153-thread-1-processing-n:127.0.0.1:56385_cbx) [n:127.0.0.1:56385_cbx c:tmp_collection s:shard1 r:core_node2 x:collection1] o.a.s.c.SolrCore SolrDeletionPolicy.onCommit: commits: num=1
   [junit4]   2> 	commit{dir=/home/jenkins/workspace/Lucene-Solr-trunk-Linux/solr/build/solr-core/test/J0/temp/solr.cloud.CdcrReplicationHandlerTest_3FE60AB6FDCBDCC5-001/jetty-002/cores/collection1/data/index,segFN=segments_1,generation=1}
   [junit4]   2> 67921 INFO  (coreLoadExecutor-153-thread-1-processing-n:127.0.0.1:56385_cbx) [n:127.0.0.1:56385_cbx c:tmp_collection s:shard1 r:core_node2 x:collection1] o.a.s.c.SolrCore newest commit generation = 1
   [junit4]   2> 67922 INFO  (OldIndexDirectoryCleanupThreadForCore-collection1) [n:127.0.0.1:56385_cbx c:tmp_collection s:shard1 r:core_node2 x:collection1] o.a.s.c.SolrCore Looking for old index directories to cleanup for core collection1 in /home/jenkins/workspace/Lucene-Solr-trunk-Linux/solr/build/solr-core/test/J0/temp/solr.cloud.CdcrReplicationHandlerTest_3FE60AB6FDCBDCC5-001/jetty-002/cores/collection1/data/
   [junit4]   2> 67930 INFO  (coreLoadExecutor-153-thread-1-processing-n:127.0.0.1:56385_cbx) [n:127.0.0.1:56385_cbx c:tmp_collection s:shard1 r:core_node2 x:collection1] o.a.s.u.p.UpdateRequestProcessorChain creating updateRequestProcessorChain "cdcr-processor-chain"
   [junit4]   2> 67930 INFO  (coreLoadExecutor-153-thread-1-processing-n:127.0.0.1:56385_cbx) [n:127.0.0.1:56385_cbx c:tmp_collection s:shard1 r:core_node2 x:collection1] o.a.s.c.SolrCore no updateRequestProcessorChain defined as default, creating implicit default
   [junit4]   2> 67932 INFO  (coreLoadExecutor-153-thread-1-processing-n:127.0.0.1:56385_cbx) [n:127.0.0.1:56385_cbx c:tmp_collection s:shard1 r:core_node2 x:collection1] o.a.s.h.l.XMLLoader xsltCacheLifetimeSeconds=60
   [junit4]   2> 67933 INFO  (coreLoadExecutor-153-thread-1-processing-n:127.0.0.1:56385_cbx) [n:127.0.0.1:56385_cbx c:tmp_collection s:shard1 r:core_node2 x:collection1] o.a.s.h.l.XMLLoader xsltCacheLifetimeSeconds=60
   [junit4]   2> 67935 INFO  (coreLoadExecutor-153-thread-1-processing-n:127.0.0.1:56385_cbx) [n:127.0.0.1:56385_cbx c:tmp_collection s:shard1 r:core_node2 x:collection1] o.a.s.h.l.XMLLoader xsltCacheLifetimeSeconds=60
   [junit4]   2> 67936 INFO  (coreLoadExecutor-153-thread-1-processing-n:127.0.0.1:56385_cbx) [n:127.0.0.1:56385_cbx c:tmp_collection s:shard1 r:core_node2 x:collection1] o.a.s.h.l.XMLLoader xsltCacheLifetimeSeconds=60
   [junit4]   2> 67942 INFO  (coreLoadExecutor-153-thread-1-processing-n:127.0.0.1:56385_cbx) [n:127.0.0.1:56385_cbx c:tmp_collection s:shard1 r:core_node2 x:collection1] o.a.s.c.RequestHandlers Registered paths: /admin/mbeans,standard,/update/csv,/update/json/docs,/admin/luke,/admin/segments,/get,/admin/system,/replication,/admin/properties,/config,/schema,/admin/plugins,/admin/logging,/update/json,/admin/threads,/admin/ping,/cdcr,/update,/admin/file
   [junit4]   2> 67943 INFO  (coreLoadExecutor-153-thread-1-processing-n:127.0.0.1:56385_cbx) [n:127.0.0.1:56385_cbx c:tmp_collection s:shard1 r:core_node2 x:collection1] o.a.s.c.SolrCore Using default statsCache cache: org.apache.solr.search.stats.LocalStatsCache
   [junit4]   2> 67943 INFO  (coreLoadExecutor-153-thread-1-processing-n:127.0.0.1:56385_cbx) [n:127.0.0.1:56385_cbx c:tmp_collection s:shard1 r:core_node2 x:collection1] o.a.s.u.UpdateHandler Using UpdateLog implementation: org.apache.solr.update.CdcrUpdateLog
   [junit4]   2> 67943 INFO  (coreLoadExecutor-153-thread-1-processing-n:127.0.0.1:56385_cbx) [n:127.0.0.1:56385_cbx c:tmp_collection s:shard1 r:core_node2 x:collection1] o.a.s.u.UpdateLog Initializing UpdateLog: dataDir= defaultSyncLevel=FLUSH numRecordsToKeep=100 maxNumLogsToKeep=10 numVersionBuckets=65536
   [junit4]   2> 67973 INFO  (coreLoadExecutor-153-thread-1-processing-n:127.0.0.1:56385_cbx) [n:127.0.0.1:56385_cbx c:tmp_collection s:shard1 r:core_node2 x:collection1] o.a.s.c.SolrCore Hard AutoCommit: disabled
   [junit4]   2> 67973 INFO  (coreLoadExecutor-153-thread-1-processing-n:127.0.0.1:56385_cbx) [n:127.0.0.1:56385_cbx c:tmp_collection s:shard1 r:core_node2 x:collection1] o.a.s.c.SolrCore Soft AutoCommit: disabled
   [junit4]   2> 67975 INFO  (coreLoadExecutor-153-thread-1-processing-n:127.0.0.1:56385_cbx) [n:127.0.0.1:56385_cbx c:tmp_collection s:shard1 r:core_node2 x:collection1] o.a.s.u.RandomMergePolicy RandomMergePolicy wrapping class org.apache.lucene.index.TieredMergePolicy: [TieredMergePolicy: maxMergeAtOnce=40, maxMergeAtOnceExplicit=44, maxMergedSegmentMB=36.74609375, floorSegmentMB=1.0478515625, forceMergeDeletesPctAllowed=29.739769547709827, segmentsPerTier=24.0, maxCFSSegmentSizeMB=8.796093022207999E12, noCFSRatio=0.7711436329530285
   [junit4]   2> 67976 INFO  (coreLoadExecutor-153-thread-1-processing-n:127.0.0.1:56385_cbx) [n:127.0.0.1:56385_cbx c:tmp_collection s:shard1 r:core_node2 x:collection1] o.a.s.c.SolrCore SolrDeletionPolicy.onInit: commits: num=1
   [junit4]   2> 	commit{dir=/home/jenkins/workspace/Lucene-Solr-trunk-Linux/solr/build/solr-core/test/J0/temp/solr.cloud.CdcrReplicationHandlerTest_3FE60AB6FDCBDCC5-001/jetty-002/cores/collection1/data/index,segFN=segments_1,generation=1}
   [junit4]   2> 67976 INFO  (coreLoadE

[...truncated too long message...]

ore_node1 x:b1x1_shard1_replica1] o.a.s.c.SolrCore [b1x1_shard1_replica1] Closing main searcher on request.
   [junit4]   2> 604825 INFO  (TEST-TestRandomRequestDistribution.testRequestTracking-seed#[3FE60AB6FDCBDCC5]) [n:127.0.0.1:56447_ c:b1x1 s:shard1 r:core_node1 x:b1x1_shard1_replica1] o.a.s.c.CachingDirectoryFactory Closing MockDirectoryFactory - 2 directories currently being tracked
   [junit4]   2> 604825 INFO  (TEST-TestRandomRequestDistribution.testRequestTracking-seed#[3FE60AB6FDCBDCC5]) [n:127.0.0.1:56447_ c:b1x1 s:shard1 r:core_node1 x:b1x1_shard1_replica1] o.a.s.c.CachingDirectoryFactory looking to close /home/jenkins/workspace/Lucene-Solr-trunk-Linux/solr/build/solr-core/test/J2/temp/solr.cloud.TestRandomRequestDistribution_3FE60AB6FDCBDCC5-001/shard-3-001/cores/b1x1_shard1_replica1/data [CachedDir<<refCount=0;path=/home/jenkins/workspace/Lucene-Solr-trunk-Linux/solr/build/solr-core/test/J2/temp/solr.cloud.TestRandomRequestDistribution_3FE60AB6FDCBDCC5-001/shard-3-001/cores/b1x1_shard1_replica1/data;done=false>>]
   [junit4]   2> 604825 INFO  (TEST-TestRandomRequestDistribution.testRequestTracking-seed#[3FE60AB6FDCBDCC5]) [n:127.0.0.1:56447_ c:b1x1 s:shard1 r:core_node1 x:b1x1_shard1_replica1] o.a.s.c.CachingDirectoryFactory Closing directory: /home/jenkins/workspace/Lucene-Solr-trunk-Linux/solr/build/solr-core/test/J2/temp/solr.cloud.TestRandomRequestDistribution_3FE60AB6FDCBDCC5-001/shard-3-001/cores/b1x1_shard1_replica1/data
   [junit4]   2> 604825 INFO  (TEST-TestRandomRequestDistribution.testRequestTracking-seed#[3FE60AB6FDCBDCC5]) [n:127.0.0.1:56447_ c:b1x1 s:shard1 r:core_node1 x:b1x1_shard1_replica1] o.a.s.c.CachingDirectoryFactory looking to close /home/jenkins/workspace/Lucene-Solr-trunk-Linux/solr/build/solr-core/test/J2/temp/solr.cloud.TestRandomRequestDistribution_3FE60AB6FDCBDCC5-001/shard-3-001/cores/b1x1_shard1_replica1/data/index [CachedDir<<refCount=0;path=/home/jenkins/workspace/Lucene-Solr-trunk-Linux/solr/build/solr-core/test/J2/temp/solr.cloud.TestRandomRequestDistribution_3FE60AB6FDCBDCC5-001/shard-3-001/cores/b1x1_shard1_replica1/data/index;done=false>>]
   [junit4]   2> 604825 INFO  (TEST-TestRandomRequestDistribution.testRequestTracking-seed#[3FE60AB6FDCBDCC5]) [n:127.0.0.1:56447_ c:b1x1 s:shard1 r:core_node1 x:b1x1_shard1_replica1] o.a.s.c.CachingDirectoryFactory Closing directory: /home/jenkins/workspace/Lucene-Solr-trunk-Linux/solr/build/solr-core/test/J2/temp/solr.cloud.TestRandomRequestDistribution_3FE60AB6FDCBDCC5-001/shard-3-001/cores/b1x1_shard1_replica1/data/index
   [junit4]   2> 604826 INFO  (TEST-TestRandomRequestDistribution.testRequestTracking-seed#[3FE60AB6FDCBDCC5]) [n:127.0.0.1:56447_ c:b1x1 s:shard1 r:core_node1 x:b1x1_shard1_replica1] o.a.s.c.Overseer Overseer (id=94620277375631374-127.0.0.1:56447_-n_0000000003) closing
   [junit4]   2> 604826 INFO  (OverseerStateUpdate-94620277375631374-127.0.0.1:56447_-n_0000000003) [n:127.0.0.1:56447_    ] o.a.s.c.Overseer Overseer Loop exiting : 127.0.0.1:56447_
   [junit4]   2> 604828 INFO  (zkCallback-374-thread-1-processing-n:127.0.0.1:56447_) [n:127.0.0.1:56447_    ] o.a.s.c.c.ZkStateReader A live node change: WatchedEvent state:SyncConnected type:NodeChildrenChanged path:/live_nodes, has occurred - updating... (live nodes size: 1)
   [junit4]   2> 604829 WARN  (zkCallback-374-thread-1-processing-n:127.0.0.1:56447_) [n:127.0.0.1:56447_    ] o.a.s.c.c.ZkStateReader ZooKeeper watch triggered, but Solr cannot talk to ZK
   [junit4]   2> 604830 INFO  (TEST-TestRandomRequestDistribution.testRequestTracking-seed#[3FE60AB6FDCBDCC5]) [    ] o.e.j.s.ServerConnector Stopped ServerConnector@19844a4{HTTP/1.1}{127.0.0.1:0}
   [junit4]   2> 604830 INFO  (TEST-TestRandomRequestDistribution.testRequestTracking-seed#[3FE60AB6FDCBDCC5]) [    ] o.e.j.s.h.ContextHandler Stopped o.e.j.s.ServletContextHandler@1a3b2ec{/,null,UNAVAILABLE}
   [junit4]   2> 604831 INFO  (TEST-TestRandomRequestDistribution.testRequestTracking-seed#[3FE60AB6FDCBDCC5]) [n:127.0.0.1:56447_ c:b1x1 s:shard1 r:core_node1 x:b1x1_shard1_replica1] o.a.s.c.ZkTestServer connecting to 127.0.0.1:58432 58432
   [junit4]   2> 604889 INFO  (Thread-1252) [    ] o.a.s.c.ZkTestServer connecting to 127.0.0.1:58432 58432
   [junit4]   2> 604890 WARN  (Thread-1252) [    ] o.a.s.c.ZkTestServer Watch limit violations: 
   [junit4]   2> Maximum concurrent create/delete watches above limit:
   [junit4]   2> 
   [junit4]   2> 	5	/solr/aliases.json
   [junit4]   2> 	4	/solr/security.json
   [junit4]   2> 	4	/solr/configs/conf1
   [junit4]   2> 
   [junit4]   2> Maximum concurrent data watches above limit:
   [junit4]   2> 
   [junit4]   2> 	5	/solr/clusterstate.json
   [junit4]   2> 	2	/solr/collections/a1x2/state.json
   [junit4]   2> 
   [junit4]   2> Maximum concurrent children watches above limit:
   [junit4]   2> 
   [junit4]   2> 	5	/solr/live_nodes
   [junit4]   2> 	5	/solr/collections
   [junit4]   2> 	4	/solr/overseer/queue
   [junit4]   2> 	4	/solr/overseer/collection-queue-work
   [junit4]   2> 
   [junit4]   2> NOTE: reproduce with: ant test  -Dtestcase=TestRandomRequestDistribution -Dtests.method=testRequestTracking -Dtests.seed=3FE60AB6FDCBDCC5 -Dtests.multiplier=3 -Dtests.slow=true -Dtests.locale=sw_TZ -Dtests.timezone=Europe/London -Dtests.asserts=true -Dtests.file.encoding=UTF-8
   [junit4] FAILURE 32.8s J2 | TestRandomRequestDistribution.testRequestTracking <<<
   [junit4]    > Throwable #1: java.lang.AssertionError: Shard a1x2_shard1_replica1 received all 10 requests
   [junit4]    > 	at __randomizedtesting.SeedInfo.seed([3FE60AB6FDCBDCC5:77DA537609C0CD53]:0)
   [junit4]    > 	at org.apache.solr.cloud.TestRandomRequestDistribution.testRequestTracking(TestRandomRequestDistribution.java:109)
   [junit4]    > 	at org.apache.solr.BaseDistributedSearchTestCase$ShardsRepeatRule$ShardsFixedStatement.callStatement(BaseDistributedSearchTestCase.java:963)
   [junit4]    > 	at org.apache.solr.BaseDistributedSearchTestCase$ShardsRepeatRule$ShardsStatement.evaluate(BaseDistributedSearchTestCase.java:938)
   [junit4]    > 	at java.lang.Thread.run(Thread.java:746)
   [junit4]   2> 604897 INFO  (SUITE-TestRandomRequestDistribution-seed#[3FE60AB6FDCBDCC5]-worker) [n:127.0.0.1:56447_ c:b1x1 s:shard1 r:core_node1 x:b1x1_shard1_replica1] o.a.s.SolrTestCaseJ4 ###deleteCore
   [junit4]   2> NOTE: leaving temporary files on disk at: /home/jenkins/workspace/Lucene-Solr-trunk-Linux/solr/build/solr-core/test/J2/temp/solr.cloud.TestRandomRequestDistribution_3FE60AB6FDCBDCC5-001
   [junit4]   2> Oct 02, 2015 1:01:26 PM com.carrotsearch.randomizedtesting.ThreadLeakControl checkThreadLeaks
   [junit4]   2> WARNING: Will linger awaiting termination of 2 leaked thread(s).
   [junit4]   2> NOTE: test params are: codec=Asserting(Lucene53): {}, docValues:{}, sim=ClassicSimilarity, locale=sw_TZ, timezone=Europe/London
   [junit4]   2> NOTE: Linux 3.19.0-28-generic i386/Oracle Corporation 1.9.0-ea (32-bit)/cpus=12,threads=1,free=103845992,total=276123648
   [junit4]   2> NOTE: All tests run in this JVM: [FieldMutatingUpdateProcessorTest, PluginInfoTest, UUIDFieldTest, DirectUpdateHandlerOptimizeTest, TestHighFrequencyDictionaryFactory, UnloadDistributedZkTest, TestOrdValues, TestSweetSpotSimilarityFactory, TestBulkSchemaAPI, TestCSVResponseWriter, AssignTest, HighlighterConfigTest, TestDefaultSimilarityFactory, TestDistributedStatsComponentCardinality, ClusterStateTest, DirectSolrConnectionTest, TestExpandComponent, TestDefaultSearchFieldResource, TestDocBasedVersionConstraints, TestSort, MultiThreadedOCPTest, TestCoreDiscovery, TestReversedWildcardFilterFactory, TestMissingGroups, TestScoreJoinQPNoScore, SuggesterWFSTTest, TestSystemIdResolver, SimpleFacetsTest, HdfsWriteToMultipleCollectionsTest, SecurityConfHandlerTest, DirectUpdateHandlerTest, QueryParsingTest, AnalyticsMergeStrategyTest, TestHashQParserPlugin, OverriddenZkACLAndCredentialsProvidersTest, TestFieldCollectionResource, AutoCommitTest, TestDynamicFieldCollectionResource, HdfsBasicDistributedZkTest, TestRTimerTree, TestSmileRequest, TestSolrConfigHandler, TestElisionMultitermQuery, HardAutoCommitTest, TestCollectionAPI, DocValuesMultiTest, TestCollapseQParserPlugin, TestMiniSolrCloudClusterBase, TestPHPSerializedResponseWriter, DataDrivenBlockJoinTest, FullSolrCloudDistribCmdsTest, TestTrieFacet, TestGroupingSearch, StatsComponentTest, ConcurrentDeleteAndCreateCollectionTest, SolrXmlInZkTest, TestManagedSynonymFilterFactory, SampleTest, TestSolrCloudWithKerberosAlt, TestAddFieldRealTimeGet, RequestHandlersTest, PrimitiveFieldTypeTest, TestLRUCache, SearchHandlerTest, TestRecovery, TestRandomRequestDistribution]
   [junit4] Completed [177/546] on J2 in 33.60s, 1 test, 1 failure <<< FAILURES!

[...truncated 1163 lines...]
BUILD FAILED
/home/jenkins/workspace/Lucene-Solr-trunk-Linux/build.xml:775: The following error occurred while executing this line:
/home/jenkins/workspace/Lucene-Solr-trunk-Linux/build.xml:719: The following error occurred while executing this line:
/home/jenkins/workspace/Lucene-Solr-trunk-Linux/build.xml:59: The following error occurred while executing this line:
/home/jenkins/workspace/Lucene-Solr-trunk-Linux/solr/build.xml:233: The following error occurred while executing this line:
/home/jenkins/workspace/Lucene-Solr-trunk-Linux/solr/common-build.xml:516: The following error occurred while executing this line:
/home/jenkins/workspace/Lucene-Solr-trunk-Linux/lucene/common-build.xml:1432: The following error occurred while executing this line:
/home/jenkins/workspace/Lucene-Solr-trunk-Linux/lucene/common-build.xml:987: There were test failures: 546 suites (8 ignored), 2145 tests, 1 error, 1 failure, 71 ignored (35 assumptions) [seed: 3FE60AB6FDCBDCC5]

Total time: 53 minutes 1 second
Build step 'Invoke Ant' marked build as failure
Archiving artifacts
[WARNINGS] Skipping publisher since build result is FAILURE
Recording test results
Email was triggered for: Failure - Any
Sending email for trigger: Failure - Any



Mime
View raw message