lucene-dev mailing list archives

Site index · List index
Message view « Date » · « Thread »
Top « Date » · « Thread »
From Apache Jenkins Server <jenk...@builds.apache.org>
Subject [JENKINS] Lucene-Solr-NightlyTests-trunk - Build # 826 - Still Failing
Date Mon, 19 Oct 2015 10:20:46 GMT
Build: https://builds.apache.org/job/Lucene-Solr-NightlyTests-trunk/826/

1 tests failed.
FAILED:  org.apache.lucene.codecs.lucene53.TestLucene53NormsFormat.testByteRange

Error Message:


Stack Trace:
java.lang.NullPointerException
	at __randomizedtesting.SeedInfo.seed([F4C9400FBBDCF0B7:3DB6793DDB4AB022]:0)
	at java.util.ComparableTimSort.binarySort(ComparableTimSort.java:258)
	at java.util.ComparableTimSort.sort(ComparableTimSort.java:203)
	at java.util.Arrays.sort(Arrays.java:1246)
	at org.apache.lucene.index.SegmentInfos$FindSegmentsFile.run(SegmentInfos.java:653)
	at org.apache.lucene.index.StandardDirectoryReader.open(StandardDirectoryReader.java:73)
	at org.apache.lucene.index.DirectoryReader.open(DirectoryReader.java:63)
	at org.apache.lucene.index.BaseNormsFormatTestCase.doTestNormsVersusDocValues(BaseNormsFormatTestCase.java:277)
	at org.apache.lucene.index.BaseNormsFormatTestCase.testByteRange(BaseNormsFormatTestCase.java:53)
	at sun.reflect.NativeMethodAccessorImpl.invoke0(Native Method)
	at sun.reflect.NativeMethodAccessorImpl.invoke(NativeMethodAccessorImpl.java:62)
	at sun.reflect.DelegatingMethodAccessorImpl.invoke(DelegatingMethodAccessorImpl.java:43)
	at java.lang.reflect.Method.invoke(Method.java:497)
	at com.carrotsearch.randomizedtesting.RandomizedRunner.invoke(RandomizedRunner.java:1665)
	at com.carrotsearch.randomizedtesting.RandomizedRunner$8.evaluate(RandomizedRunner.java:864)
	at com.carrotsearch.randomizedtesting.RandomizedRunner$9.evaluate(RandomizedRunner.java:900)
	at com.carrotsearch.randomizedtesting.RandomizedRunner$10.evaluate(RandomizedRunner.java:914)
	at org.apache.lucene.util.TestRuleSetupTeardownChained$1.evaluate(TestRuleSetupTeardownChained.java:50)
	at org.apache.lucene.util.AbstractBeforeAfterRule$1.evaluate(AbstractBeforeAfterRule.java:46)
	at org.apache.lucene.util.TestRuleThreadAndTestName$1.evaluate(TestRuleThreadAndTestName.java:49)
	at org.apache.lucene.util.TestRuleIgnoreAfterMaxFailures$1.evaluate(TestRuleIgnoreAfterMaxFailures.java:65)
	at org.apache.lucene.util.TestRuleMarkFailure$1.evaluate(TestRuleMarkFailure.java:48)
	at com.carrotsearch.randomizedtesting.rules.StatementAdapter.evaluate(StatementAdapter.java:36)
	at com.carrotsearch.randomizedtesting.ThreadLeakControl$StatementRunner.run(ThreadLeakControl.java:367)
	at com.carrotsearch.randomizedtesting.ThreadLeakControl.forkTimeoutingTask(ThreadLeakControl.java:809)
	at com.carrotsearch.randomizedtesting.ThreadLeakControl$3.evaluate(ThreadLeakControl.java:460)
	at com.carrotsearch.randomizedtesting.RandomizedRunner.runSingleTest(RandomizedRunner.java:873)
	at com.carrotsearch.randomizedtesting.RandomizedRunner$5.evaluate(RandomizedRunner.java:775)
	at com.carrotsearch.randomizedtesting.RandomizedRunner$6.evaluate(RandomizedRunner.java:809)
	at com.carrotsearch.randomizedtesting.RandomizedRunner$7.evaluate(RandomizedRunner.java:820)
	at org.apache.lucene.util.AbstractBeforeAfterRule$1.evaluate(AbstractBeforeAfterRule.java:46)
	at com.carrotsearch.randomizedtesting.rules.StatementAdapter.evaluate(StatementAdapter.java:36)
	at org.apache.lucene.util.TestRuleStoreClassName$1.evaluate(TestRuleStoreClassName.java:42)
	at com.carrotsearch.randomizedtesting.rules.NoShadowingOrOverridesOnMethodsRule$1.evaluate(NoShadowingOrOverridesOnMethodsRule.java:39)
	at com.carrotsearch.randomizedtesting.rules.NoShadowingOrOverridesOnMethodsRule$1.evaluate(NoShadowingOrOverridesOnMethodsRule.java:39)
	at com.carrotsearch.randomizedtesting.rules.StatementAdapter.evaluate(StatementAdapter.java:36)
	at com.carrotsearch.randomizedtesting.rules.StatementAdapter.evaluate(StatementAdapter.java:36)
	at com.carrotsearch.randomizedtesting.rules.StatementAdapter.evaluate(StatementAdapter.java:36)
	at org.apache.lucene.util.TestRuleAssertionsRequired$1.evaluate(TestRuleAssertionsRequired.java:54)
	at org.apache.lucene.util.TestRuleMarkFailure$1.evaluate(TestRuleMarkFailure.java:48)
	at org.apache.lucene.util.TestRuleIgnoreAfterMaxFailures$1.evaluate(TestRuleIgnoreAfterMaxFailures.java:65)
	at org.apache.lucene.util.TestRuleIgnoreTestSuites$1.evaluate(TestRuleIgnoreTestSuites.java:55)
	at com.carrotsearch.randomizedtesting.rules.StatementAdapter.evaluate(StatementAdapter.java:36)
	at com.carrotsearch.randomizedtesting.ThreadLeakControl$StatementRunner.run(ThreadLeakControl.java:367)
	at java.lang.Thread.run(Thread.java:745)




Build Log:
[...truncated 1313 lines...]
   [junit4] Suite: org.apache.lucene.codecs.lucene53.TestLucene53NormsFormat
   [junit4]   2> NOTE: download the large Jenkins line-docs file by running 'ant get-jenkins-line-docs'
in the lucene directory.
   [junit4]   2> NOTE: reproduce with: ant test  -Dtestcase=TestLucene53NormsFormat -Dtests.method=testByteRange
-Dtests.seed=F4C9400FBBDCF0B7 -Dtests.multiplier=2 -Dtests.nightly=true -Dtests.slow=true
-Dtests.linedocsfile=/x1/jenkins/lucene-data/enwiki.random.lines.txt -Dtests.locale=en_GB
-Dtests.timezone=America/Nassau -Dtests.asserts=true -Dtests.file.encoding=UTF-8
   [junit4] ERROR   2.06s J2 | TestLucene53NormsFormat.testByteRange <<<
   [junit4]    > Throwable #1: java.lang.NullPointerException
   [junit4]    > 	at __randomizedtesting.SeedInfo.seed([F4C9400FBBDCF0B7:3DB6793DDB4AB022]:0)
   [junit4]    > 	at java.util.ComparableTimSort.binarySort(ComparableTimSort.java:258)
   [junit4]    > 	at java.util.ComparableTimSort.sort(ComparableTimSort.java:203)
   [junit4]    > 	at java.util.Arrays.sort(Arrays.java:1246)
   [junit4]    > 	at org.apache.lucene.index.SegmentInfos$FindSegmentsFile.run(SegmentInfos.java:653)
   [junit4]    > 	at org.apache.lucene.index.StandardDirectoryReader.open(StandardDirectoryReader.java:73)
   [junit4]    > 	at org.apache.lucene.index.DirectoryReader.open(DirectoryReader.java:63)
   [junit4]    > 	at org.apache.lucene.index.BaseNormsFormatTestCase.doTestNormsVersusDocValues(BaseNormsFormatTestCase.java:277)
   [junit4]    > 	at org.apache.lucene.index.BaseNormsFormatTestCase.testByteRange(BaseNormsFormatTestCase.java:53)
   [junit4]    > 	at java.lang.Thread.run(Thread.java:745)
   [junit4] IGNOR/A 0.00s J2 | TestLucene53NormsFormat.testMergeStability
   [junit4]    > Assumption #1: The MockRandom PF randomizes content on the fly, so we
can't check it
   [junit4]   2> NOTE: leaving temporary files on disk at: /x1/jenkins/jenkins-slave/workspace/Lucene-Solr-NightlyTests-trunk/lucene/build/core/test/J2/temp/lucene.codecs.lucene53.TestLucene53NormsFormat_F4C9400FBBDCF0B7-001
   [junit4]   2> NOTE: test params are: codec=CheapBastard, sim=ClassicSimilarity, locale=en_GB,
timezone=America/Nassau
   [junit4]   2> NOTE: Linux 3.13.0-52-generic amd64/Oracle Corporation 1.8.0_45 (64-bit)/cpus=4,threads=1,free=396450272,total=511705088
   [junit4]   2> NOTE: All tests run in this JVM: [TestNumericRangeQuery32, TestExceedMaxTermLength,
TestComplexExplanationsOfNonMatches, TestLongPostings, TestMultiThreadTermVectors, TestNumericTokenStream,
TestReaderClosed, TestTermsEnum2, TestFieldReuse, TestDirectoryReader, TestIntBlockPool, TestIndexWriterOnDiskFull,
TestDateSort, TestNativeFSLockFactory, TestBooleanOr, TestMultiMMap, TestCustomSearcherSort,
TestFastDecompressionMode, TestDocCount, TestFixedBitDocIdSet, TestTryDelete, TestConcurrentMergeScheduler,
TestTotalHitCountCollector, TestIndexWriterOnJRECrash, TestStressIndexing2, TestSpanExplanationsOfNonMatches,
TestBytesRefHash, TestSparseFixedBitDocIdSet, TestElevationComparator, TestFrequencyTrackingRingBuffer,
Test2BTerms, TestSloppyPhraseQuery, TestSearchWithThreads, TestMixedCodecs, TestLucene50TermVectorsFormat,
TestBytesStore, TestControlledRealTimeReopenThread, TestLiveFieldValues, TestDocInverterPerFieldErrorInfo,
TestIndexInput, TestIndexSearcher, TestWildcard, TestCrashCausesCorruptIndex, TestIndexFileDeleter,
TestBytesRef, TestLucene50StoredFieldsFormatHighCompression, TestMultiTermsEnum, TestIndexWriterMerging,
TestForUtil, TestIndexWriterFromReader, TestSmallFloat, TestCompiledAutomaton, TestTopDocsMerge,
TestRollingUpdates, TestWildcardRandom, TestMergeSchedulerExternal, TestTopDocsCollector,
Test2BPagedBytes, Test2BPositions, TestMultiset, TestRegexpRandom2, TestIsCurrent, TestSpanOrQuery,
TestPayloadsOnVectors, TestSpanNotQuery, TestIndexWriterReader, TestFSTs, TestIndexWriterWithThreads,
TestShardSearching, TestFlushByRamOrCountsPolicy, TestNRTThreads, TestDuelingCodecs, TestBoolean2,
TestPersistentSnapshotDeletionPolicy, TestAtomicUpdate, TestStressAdvance, TestSearchAfter,
TestHighCompressionMode, TestTieredMergePolicy, TestArrayUtil, TestLevenshteinAutomata, TestBufferedIndexInput,
TestConsistentFieldNumbers, TestWeakIdentityMap, TestOmitNorms, TestComplexExplanations, TestNRTCachingDirectory,
TestParallelCompositeReader, TestIndexWriterNRTIsCurrent, TestTransactions, TestCrash, TestSegmentTermDocs,
TestPerFieldPostingsFormat2, TestSort, TestToken, TestSimpleSearchEquivalence, TestDocValuesIndexing,
TestSimilarityBase, TestHugeRamFile, TestBooleanMinShouldMatch, TestDeterminizeLexicon, TestSpans,
TestFlex, TestUTF32ToUTF8, TestFastCompressionMode, TestRAMDirectory, TestMultiPhraseQuery,
TestLazyProxSkipping, TestBagOfPostings, TestCodecs, TestCharTermAttributeImpl, TestOmitPositions,
TestStressNRT, TestNearSpansOrdered, TestDocumentsWriterDeleteQueue, TestDocumentWriter, TestScorerPerf,
TestFuzzyQuery, TestDoc, TestSimilarity2, TestFieldMaskingSpanQuery, TestExternalCodecs, TestNoDeletionPolicy,
TestTermVectorsReader, TestMultiValuedNumericRangeQuery, TestPrefixInBooleanQuery, TestPrefixCodedTerms,
TestAllFilesHaveCodecHeader, TestParallelReaderEmptyIndex, TestDocument, TestMaxTermFrequency,
TestTermScorer, TestTopFieldCollector, TestFileSwitchDirectory, TestSumDocFreq, TestIndexableField,
TestDocValuesScoring, TestSentinelIntSet, TestPrefixRandom, TestDirectory, TestCheckIndex,
TestSpanMultiTermQueryWrapper, TestSearchForDuplicates, TestSizeBoundedForceMerge, TestConstantScoreQuery,
TestMatchAllDocsQuery, TestParallelTermEnum, TestRecyclingIntBlockAllocator, TestIndexWriterConfig,
TestMultiTermQueryRewrites, TestSimilarity, TestCachingTokenFilter, TestDateTools, TestCharsRef,
TestPriorityQueue, Test2BPostings, TestLucene53NormsFormat]
   [junit4] Completed [330/398] on J2 in 176.32s, 17 tests, 1 error, 1 skipped <<<
FAILURES!

[...truncated 243 lines...]
BUILD FAILED
/x1/jenkins/jenkins-slave/workspace/Lucene-Solr-NightlyTests-trunk/build.xml:782: The following
error occurred while executing this line:
/x1/jenkins/jenkins-slave/workspace/Lucene-Solr-NightlyTests-trunk/build.xml:719: The following
error occurred while executing this line:
/x1/jenkins/jenkins-slave/workspace/Lucene-Solr-NightlyTests-trunk/build.xml:59: The following
error occurred while executing this line:
/x1/jenkins/jenkins-slave/workspace/Lucene-Solr-NightlyTests-trunk/lucene/build.xml:50: The
following error occurred while executing this line:
/x1/jenkins/jenkins-slave/workspace/Lucene-Solr-NightlyTests-trunk/lucene/common-build.xml:1432:
The following error occurred while executing this line:
/x1/jenkins/jenkins-slave/workspace/Lucene-Solr-NightlyTests-trunk/lucene/common-build.xml:987:
There were test failures: 398 suites (1 ignored), 3227 tests, 1 error, 30 ignored (26 assumptions)
[seed: F4C9400FBBDCF0B7]

Total time: 52 minutes 14 seconds
Build step 'Invoke Ant' marked build as failure
Archiving artifacts
No prior successful build to compare, so performing full copy of artifacts
Recording test results
Email was triggered for: Failure - Any
Sending email for trigger: Failure - Any



Mime
View raw message