lucene-dev mailing list archives

Site index · List index
Message view « Date » · « Thread »
Top « Date » · « Thread »
From Policeman Jenkins Server <jenk...@thetaphi.de>
Subject [JENKINS] Lucene-Solr-5.x-Linux (64bit/jdk1.8.0_60) - Build # 14282 - Failure!
Date Sun, 18 Oct 2015 09:44:18 GMT
Build: http://jenkins.thetaphi.de/job/Lucene-Solr-5.x-Linux/14282/
Java: 64bit/jdk1.8.0_60 -XX:+UseCompressedOops -XX:+UseParallelGC

3 tests failed.
FAILED:  junit.framework.TestSuite.org.apache.solr.handler.component.DistributedFacetPivotWhiteBoxTest

Error Message:
2 threads leaked from SUITE scope at org.apache.solr.handler.component.DistributedFacetPivotWhiteBoxTest:     1) Thread[id=11614, name=searcherExecutor-4739-thread-1, state=WAITING, group=TGRP-DistributedFacetPivotWhiteBoxTest]         at sun.misc.Unsafe.park(Native Method)         at java.util.concurrent.locks.LockSupport.park(LockSupport.java:175)         at java.util.concurrent.locks.AbstractQueuedSynchronizer$ConditionObject.await(AbstractQueuedSynchronizer.java:2039)         at java.util.concurrent.LinkedBlockingQueue.take(LinkedBlockingQueue.java:442)         at java.util.concurrent.ThreadPoolExecutor.getTask(ThreadPoolExecutor.java:1067)         at java.util.concurrent.ThreadPoolExecutor.runWorker(ThreadPoolExecutor.java:1127)         at java.util.concurrent.ThreadPoolExecutor$Worker.run(ThreadPoolExecutor.java:617)         at java.lang.Thread.run(Thread.java:745)    2) Thread[id=11606, name=qtp489986831-11606, state=RUNNABLE, group=TGRP-DistributedFacetPivotWhiteBoxTest]         at java.util.WeakHashMap.get(WeakHashMap.java:403)         at org.apache.solr.servlet.cache.HttpCacheHeaderUtil.calcEtag(HttpCacheHeaderUtil.java:102)         at org.apache.solr.servlet.cache.HttpCacheHeaderUtil.doCacheHeaderValidation(HttpCacheHeaderUtil.java:224)         at org.apache.solr.servlet.HttpSolrCall.call(HttpSolrCall.java:452)         at org.apache.solr.servlet.SolrDispatchFilter.doFilter(SolrDispatchFilter.java:220)         at org.apache.solr.servlet.SolrDispatchFilter.doFilter(SolrDispatchFilter.java:179)         at org.eclipse.jetty.servlet.ServletHandler$CachedChain.doFilter(ServletHandler.java:1652)         at org.apache.solr.client.solrj.embedded.JettySolrRunner$DebugFilter.doFilter(JettySolrRunner.java:109)         at org.eclipse.jetty.servlet.ServletHandler$CachedChain.doFilter(ServletHandler.java:1652)         at org.eclipse.jetty.servlets.UserAgentFilter.doFilter(UserAgentFilter.java:83)         at org.eclipse.jetty.servlets.GzipFilter.doFilter(GzipFilter.java:364)         at org.eclipse.jetty.servlet.ServletHandler$CachedChain.doFilter(ServletHandler.java:1652)         at org.eclipse.jetty.servlet.ServletHandler.doHandle(ServletHandler.java:585)         at org.eclipse.jetty.server.session.SessionHandler.doHandle(SessionHandler.java:221)         at org.eclipse.jetty.server.handler.ContextHandler.doHandle(ContextHandler.java:1127)         at org.eclipse.jetty.servlet.ServletHandler.doScope(ServletHandler.java:515)         at org.eclipse.jetty.server.session.SessionHandler.doScope(SessionHandler.java:185)         at org.eclipse.jetty.server.handler.ContextHandler.doScope(ContextHandler.java:1061)         at org.eclipse.jetty.server.handler.ScopedHandler.handle(ScopedHandler.java:141)         at org.eclipse.jetty.server.handler.HandlerWrapper.handle(HandlerWrapper.java:97)         at org.eclipse.jetty.server.Server.handle(Server.java:499)         at org.eclipse.jetty.server.HttpChannel.handle(HttpChannel.java:310)         at org.eclipse.jetty.server.HttpConnection.onFillable(HttpConnection.java:257)         at org.eclipse.jetty.io.AbstractConnection$2.run(AbstractConnection.java:540)         at org.eclipse.jetty.util.thread.QueuedThreadPool.runJob(QueuedThreadPool.java:635)         at org.eclipse.jetty.util.thread.QueuedThreadPool$3.run(QueuedThreadPool.java:555)         at java.lang.Thread.run(Thread.java:745)

Stack Trace:
com.carrotsearch.randomizedtesting.ThreadLeakError: 2 threads leaked from SUITE scope at org.apache.solr.handler.component.DistributedFacetPivotWhiteBoxTest: 
   1) Thread[id=11614, name=searcherExecutor-4739-thread-1, state=WAITING, group=TGRP-DistributedFacetPivotWhiteBoxTest]
        at sun.misc.Unsafe.park(Native Method)
        at java.util.concurrent.locks.LockSupport.park(LockSupport.java:175)
        at java.util.concurrent.locks.AbstractQueuedSynchronizer$ConditionObject.await(AbstractQueuedSynchronizer.java:2039)
        at java.util.concurrent.LinkedBlockingQueue.take(LinkedBlockingQueue.java:442)
        at java.util.concurrent.ThreadPoolExecutor.getTask(ThreadPoolExecutor.java:1067)
        at java.util.concurrent.ThreadPoolExecutor.runWorker(ThreadPoolExecutor.java:1127)
        at java.util.concurrent.ThreadPoolExecutor$Worker.run(ThreadPoolExecutor.java:617)
        at java.lang.Thread.run(Thread.java:745)
   2) Thread[id=11606, name=qtp489986831-11606, state=RUNNABLE, group=TGRP-DistributedFacetPivotWhiteBoxTest]
        at java.util.WeakHashMap.get(WeakHashMap.java:403)
        at org.apache.solr.servlet.cache.HttpCacheHeaderUtil.calcEtag(HttpCacheHeaderUtil.java:102)
        at org.apache.solr.servlet.cache.HttpCacheHeaderUtil.doCacheHeaderValidation(HttpCacheHeaderUtil.java:224)
        at org.apache.solr.servlet.HttpSolrCall.call(HttpSolrCall.java:452)
        at org.apache.solr.servlet.SolrDispatchFilter.doFilter(SolrDispatchFilter.java:220)
        at org.apache.solr.servlet.SolrDispatchFilter.doFilter(SolrDispatchFilter.java:179)
        at org.eclipse.jetty.servlet.ServletHandler$CachedChain.doFilter(ServletHandler.java:1652)
        at org.apache.solr.client.solrj.embedded.JettySolrRunner$DebugFilter.doFilter(JettySolrRunner.java:109)
        at org.eclipse.jetty.servlet.ServletHandler$CachedChain.doFilter(ServletHandler.java:1652)
        at org.eclipse.jetty.servlets.UserAgentFilter.doFilter(UserAgentFilter.java:83)
        at org.eclipse.jetty.servlets.GzipFilter.doFilter(GzipFilter.java:364)
        at org.eclipse.jetty.servlet.ServletHandler$CachedChain.doFilter(ServletHandler.java:1652)
        at org.eclipse.jetty.servlet.ServletHandler.doHandle(ServletHandler.java:585)
        at org.eclipse.jetty.server.session.SessionHandler.doHandle(SessionHandler.java:221)
        at org.eclipse.jetty.server.handler.ContextHandler.doHandle(ContextHandler.java:1127)
        at org.eclipse.jetty.servlet.ServletHandler.doScope(ServletHandler.java:515)
        at org.eclipse.jetty.server.session.SessionHandler.doScope(SessionHandler.java:185)
        at org.eclipse.jetty.server.handler.ContextHandler.doScope(ContextHandler.java:1061)
        at org.eclipse.jetty.server.handler.ScopedHandler.handle(ScopedHandler.java:141)
        at org.eclipse.jetty.server.handler.HandlerWrapper.handle(HandlerWrapper.java:97)
        at org.eclipse.jetty.server.Server.handle(Server.java:499)
        at org.eclipse.jetty.server.HttpChannel.handle(HttpChannel.java:310)
        at org.eclipse.jetty.server.HttpConnection.onFillable(HttpConnection.java:257)
        at org.eclipse.jetty.io.AbstractConnection$2.run(AbstractConnection.java:540)
        at org.eclipse.jetty.util.thread.QueuedThreadPool.runJob(QueuedThreadPool.java:635)
        at org.eclipse.jetty.util.thread.QueuedThreadPool$3.run(QueuedThreadPool.java:555)
        at java.lang.Thread.run(Thread.java:745)
	at __randomizedtesting.SeedInfo.seed([888062F01692F3DE]:0)


FAILED:  junit.framework.TestSuite.org.apache.solr.handler.component.DistributedFacetPivotWhiteBoxTest

Error Message:
There are still zombie threads that couldn't be terminated:    1) Thread[id=11614, name=searcherExecutor-4739-thread-1, state=WAITING, group=TGRP-DistributedFacetPivotWhiteBoxTest]         at sun.misc.Unsafe.park(Native Method)         at java.util.concurrent.locks.LockSupport.park(LockSupport.java:175)         at java.util.concurrent.locks.AbstractQueuedSynchronizer$ConditionObject.await(AbstractQueuedSynchronizer.java:2039)         at java.util.concurrent.LinkedBlockingQueue.take(LinkedBlockingQueue.java:442)         at java.util.concurrent.ThreadPoolExecutor.getTask(ThreadPoolExecutor.java:1067)         at java.util.concurrent.ThreadPoolExecutor.runWorker(ThreadPoolExecutor.java:1127)         at java.util.concurrent.ThreadPoolExecutor$Worker.run(ThreadPoolExecutor.java:617)         at java.lang.Thread.run(Thread.java:745)    2) Thread[id=11606, name=qtp489986831-11606, state=RUNNABLE, group=TGRP-DistributedFacetPivotWhiteBoxTest]         at java.util.WeakHashMap.get(WeakHashMap.java:403)         at org.apache.solr.servlet.cache.HttpCacheHeaderUtil.calcEtag(HttpCacheHeaderUtil.java:102)         at org.apache.solr.servlet.cache.HttpCacheHeaderUtil.doCacheHeaderValidation(HttpCacheHeaderUtil.java:224)         at org.apache.solr.servlet.HttpSolrCall.call(HttpSolrCall.java:452)         at org.apache.solr.servlet.SolrDispatchFilter.doFilter(SolrDispatchFilter.java:220)         at org.apache.solr.servlet.SolrDispatchFilter.doFilter(SolrDispatchFilter.java:179)         at org.eclipse.jetty.servlet.ServletHandler$CachedChain.doFilter(ServletHandler.java:1652)         at org.apache.solr.client.solrj.embedded.JettySolrRunner$DebugFilter.doFilter(JettySolrRunner.java:109)         at org.eclipse.jetty.servlet.ServletHandler$CachedChain.doFilter(ServletHandler.java:1652)         at org.eclipse.jetty.servlets.UserAgentFilter.doFilter(UserAgentFilter.java:83)         at org.eclipse.jetty.servlets.GzipFilter.doFilter(GzipFilter.java:364)         at org.eclipse.jetty.servlet.ServletHandler$CachedChain.doFilter(ServletHandler.java:1652)         at org.eclipse.jetty.servlet.ServletHandler.doHandle(ServletHandler.java:585)         at org.eclipse.jetty.server.session.SessionHandler.doHandle(SessionHandler.java:221)         at org.eclipse.jetty.server.handler.ContextHandler.doHandle(ContextHandler.java:1127)         at org.eclipse.jetty.servlet.ServletHandler.doScope(ServletHandler.java:515)         at org.eclipse.jetty.server.session.SessionHandler.doScope(SessionHandler.java:185)         at org.eclipse.jetty.server.handler.ContextHandler.doScope(ContextHandler.java:1061)         at org.eclipse.jetty.server.handler.ScopedHandler.handle(ScopedHandler.java:141)         at org.eclipse.jetty.server.handler.HandlerWrapper.handle(HandlerWrapper.java:97)         at org.eclipse.jetty.server.Server.handle(Server.java:499)         at org.eclipse.jetty.server.HttpChannel.handle(HttpChannel.java:310)         at org.eclipse.jetty.server.HttpConnection.onFillable(HttpConnection.java:257)         at org.eclipse.jetty.io.AbstractConnection$2.run(AbstractConnection.java:540)         at org.eclipse.jetty.util.thread.QueuedThreadPool.runJob(QueuedThreadPool.java:635)         at org.eclipse.jetty.util.thread.QueuedThreadPool$3.run(QueuedThreadPool.java:555)         at java.lang.Thread.run(Thread.java:745)

Stack Trace:
com.carrotsearch.randomizedtesting.ThreadLeakError: There are still zombie threads that couldn't be terminated:
   1) Thread[id=11614, name=searcherExecutor-4739-thread-1, state=WAITING, group=TGRP-DistributedFacetPivotWhiteBoxTest]
        at sun.misc.Unsafe.park(Native Method)
        at java.util.concurrent.locks.LockSupport.park(LockSupport.java:175)
        at java.util.concurrent.locks.AbstractQueuedSynchronizer$ConditionObject.await(AbstractQueuedSynchronizer.java:2039)
        at java.util.concurrent.LinkedBlockingQueue.take(LinkedBlockingQueue.java:442)
        at java.util.concurrent.ThreadPoolExecutor.getTask(ThreadPoolExecutor.java:1067)
        at java.util.concurrent.ThreadPoolExecutor.runWorker(ThreadPoolExecutor.java:1127)
        at java.util.concurrent.ThreadPoolExecutor$Worker.run(ThreadPoolExecutor.java:617)
        at java.lang.Thread.run(Thread.java:745)
   2) Thread[id=11606, name=qtp489986831-11606, state=RUNNABLE, group=TGRP-DistributedFacetPivotWhiteBoxTest]
        at java.util.WeakHashMap.get(WeakHashMap.java:403)
        at org.apache.solr.servlet.cache.HttpCacheHeaderUtil.calcEtag(HttpCacheHeaderUtil.java:102)
        at org.apache.solr.servlet.cache.HttpCacheHeaderUtil.doCacheHeaderValidation(HttpCacheHeaderUtil.java:224)
        at org.apache.solr.servlet.HttpSolrCall.call(HttpSolrCall.java:452)
        at org.apache.solr.servlet.SolrDispatchFilter.doFilter(SolrDispatchFilter.java:220)
        at org.apache.solr.servlet.SolrDispatchFilter.doFilter(SolrDispatchFilter.java:179)
        at org.eclipse.jetty.servlet.ServletHandler$CachedChain.doFilter(ServletHandler.java:1652)
        at org.apache.solr.client.solrj.embedded.JettySolrRunner$DebugFilter.doFilter(JettySolrRunner.java:109)
        at org.eclipse.jetty.servlet.ServletHandler$CachedChain.doFilter(ServletHandler.java:1652)
        at org.eclipse.jetty.servlets.UserAgentFilter.doFilter(UserAgentFilter.java:83)
        at org.eclipse.jetty.servlets.GzipFilter.doFilter(GzipFilter.java:364)
        at org.eclipse.jetty.servlet.ServletHandler$CachedChain.doFilter(ServletHandler.java:1652)
        at org.eclipse.jetty.servlet.ServletHandler.doHandle(ServletHandler.java:585)
        at org.eclipse.jetty.server.session.SessionHandler.doHandle(SessionHandler.java:221)
        at org.eclipse.jetty.server.handler.ContextHandler.doHandle(ContextHandler.java:1127)
        at org.eclipse.jetty.servlet.ServletHandler.doScope(ServletHandler.java:515)
        at org.eclipse.jetty.server.session.SessionHandler.doScope(SessionHandler.java:185)
        at org.eclipse.jetty.server.handler.ContextHandler.doScope(ContextHandler.java:1061)
        at org.eclipse.jetty.server.handler.ScopedHandler.handle(ScopedHandler.java:141)
        at org.eclipse.jetty.server.handler.HandlerWrapper.handle(HandlerWrapper.java:97)
        at org.eclipse.jetty.server.Server.handle(Server.java:499)
        at org.eclipse.jetty.server.HttpChannel.handle(HttpChannel.java:310)
        at org.eclipse.jetty.server.HttpConnection.onFillable(HttpConnection.java:257)
        at org.eclipse.jetty.io.AbstractConnection$2.run(AbstractConnection.java:540)
        at org.eclipse.jetty.util.thread.QueuedThreadPool.runJob(QueuedThreadPool.java:635)
        at org.eclipse.jetty.util.thread.QueuedThreadPool$3.run(QueuedThreadPool.java:555)
        at java.lang.Thread.run(Thread.java:745)
	at __randomizedtesting.SeedInfo.seed([888062F01692F3DE]:0)


FAILED:  org.apache.solr.handler.component.DistributedFacetPivotWhiteBoxTest.test

Error Message:
Timeout occured while waiting response from server at: https://127.0.0.1:33565//collection1

Stack Trace:
org.apache.solr.client.solrj.SolrServerException: Timeout occured while waiting response from server at: https://127.0.0.1:33565//collection1
	at __randomizedtesting.SeedInfo.seed([888062F01692F3DE:D45D2AB86E9E26]:0)
	at org.apache.solr.client.solrj.impl.HttpSolrClient.executeMethod(HttpSolrClient.java:587)
	at org.apache.solr.client.solrj.impl.HttpSolrClient.request(HttpSolrClient.java:241)
	at org.apache.solr.client.solrj.impl.HttpSolrClient.request(HttpSolrClient.java:230)
	at org.apache.solr.client.solrj.SolrRequest.process(SolrRequest.java:150)
	at org.apache.solr.client.solrj.SolrClient.query(SolrClient.java:943)
	at org.apache.solr.client.solrj.SolrClient.query(SolrClient.java:958)
	at org.apache.solr.handler.component.DistributedFacetPivotWhiteBoxTest.doTestRefinementRequest(DistributedFacetPivotWhiteBoxTest.java:122)
	at org.apache.solr.handler.component.DistributedFacetPivotWhiteBoxTest.test(DistributedFacetPivotWhiteBoxTest.java:64)
	at sun.reflect.NativeMethodAccessorImpl.invoke0(Native Method)
	at sun.reflect.NativeMethodAccessorImpl.invoke(NativeMethodAccessorImpl.java:62)
	at sun.reflect.DelegatingMethodAccessorImpl.invoke(DelegatingMethodAccessorImpl.java:43)
	at java.lang.reflect.Method.invoke(Method.java:497)
	at com.carrotsearch.randomizedtesting.RandomizedRunner.invoke(RandomizedRunner.java:1665)
	at com.carrotsearch.randomizedtesting.RandomizedRunner$8.evaluate(RandomizedRunner.java:864)
	at com.carrotsearch.randomizedtesting.RandomizedRunner$9.evaluate(RandomizedRunner.java:900)
	at com.carrotsearch.randomizedtesting.RandomizedRunner$10.evaluate(RandomizedRunner.java:914)
	at org.apache.solr.BaseDistributedSearchTestCase$ShardsRepeatRule$ShardsFixedStatement.callStatement(BaseDistributedSearchTestCase.java:963)
	at org.apache.solr.BaseDistributedSearchTestCase$ShardsRepeatRule$ShardsStatement.evaluate(BaseDistributedSearchTestCase.java:938)
	at com.carrotsearch.randomizedtesting.rules.SystemPropertiesRestoreRule$1.evaluate(SystemPropertiesRestoreRule.java:57)
	at org.apache.lucene.util.TestRuleSetupTeardownChained$1.evaluate(TestRuleSetupTeardownChained.java:50)
	at org.apache.lucene.util.AbstractBeforeAfterRule$1.evaluate(AbstractBeforeAfterRule.java:46)
	at org.apache.lucene.util.TestRuleThreadAndTestName$1.evaluate(TestRuleThreadAndTestName.java:49)
	at org.apache.lucene.util.TestRuleIgnoreAfterMaxFailures$1.evaluate(TestRuleIgnoreAfterMaxFailures.java:65)
	at org.apache.lucene.util.TestRuleMarkFailure$1.evaluate(TestRuleMarkFailure.java:48)
	at com.carrotsearch.randomizedtesting.rules.StatementAdapter.evaluate(StatementAdapter.java:36)
	at com.carrotsearch.randomizedtesting.ThreadLeakControl$StatementRunner.run(ThreadLeakControl.java:367)
	at com.carrotsearch.randomizedtesting.ThreadLeakControl.forkTimeoutingTask(ThreadLeakControl.java:809)
	at com.carrotsearch.randomizedtesting.ThreadLeakControl$3.evaluate(ThreadLeakControl.java:460)
	at com.carrotsearch.randomizedtesting.RandomizedRunner.runSingleTest(RandomizedRunner.java:873)
	at com.carrotsearch.randomizedtesting.RandomizedRunner$5.evaluate(RandomizedRunner.java:775)
	at com.carrotsearch.randomizedtesting.RandomizedRunner$6.evaluate(RandomizedRunner.java:809)
	at com.carrotsearch.randomizedtesting.RandomizedRunner$7.evaluate(RandomizedRunner.java:820)
	at com.carrotsearch.randomizedtesting.rules.StatementAdapter.evaluate(StatementAdapter.java:36)
	at com.carrotsearch.randomizedtesting.rules.SystemPropertiesRestoreRule$1.evaluate(SystemPropertiesRestoreRule.java:57)
	at org.apache.lucene.util.AbstractBeforeAfterRule$1.evaluate(AbstractBeforeAfterRule.java:46)
	at com.carrotsearch.randomizedtesting.rules.StatementAdapter.evaluate(StatementAdapter.java:36)
	at org.apache.lucene.util.TestRuleStoreClassName$1.evaluate(TestRuleStoreClassName.java:42)
	at com.carrotsearch.randomizedtesting.rules.NoShadowingOrOverridesOnMethodsRule$1.evaluate(NoShadowingOrOverridesOnMethodsRule.java:39)
	at com.carrotsearch.randomizedtesting.rules.NoShadowingOrOverridesOnMethodsRule$1.evaluate(NoShadowingOrOverridesOnMethodsRule.java:39)
	at com.carrotsearch.randomizedtesting.rules.StatementAdapter.evaluate(StatementAdapter.java:36)
	at com.carrotsearch.randomizedtesting.rules.StatementAdapter.evaluate(StatementAdapter.java:36)
	at com.carrotsearch.randomizedtesting.rules.StatementAdapter.evaluate(StatementAdapter.java:36)
	at org.apache.lucene.util.TestRuleAssertionsRequired$1.evaluate(TestRuleAssertionsRequired.java:54)
	at org.apache.lucene.util.TestRuleMarkFailure$1.evaluate(TestRuleMarkFailure.java:48)
	at org.apache.lucene.util.TestRuleIgnoreAfterMaxFailures$1.evaluate(TestRuleIgnoreAfterMaxFailures.java:65)
	at org.apache.lucene.util.TestRuleIgnoreTestSuites$1.evaluate(TestRuleIgnoreTestSuites.java:55)
	at com.carrotsearch.randomizedtesting.rules.StatementAdapter.evaluate(StatementAdapter.java:36)
	at com.carrotsearch.randomizedtesting.ThreadLeakControl$StatementRunner.run(ThreadLeakControl.java:367)
	at java.lang.Thread.run(Thread.java:745)
Caused by: java.net.SocketTimeoutException: Read timed out
	at java.net.SocketInputStream.socketRead0(Native Method)
	at java.net.SocketInputStream.socketRead(SocketInputStream.java:116)
	at java.net.SocketInputStream.read(SocketInputStream.java:170)
	at java.net.SocketInputStream.read(SocketInputStream.java:141)
	at sun.security.ssl.InputRecord.readFully(InputRecord.java:465)
	at sun.security.ssl.InputRecord.read(InputRecord.java:503)
	at sun.security.ssl.SSLSocketImpl.readRecord(SSLSocketImpl.java:973)
	at sun.security.ssl.SSLSocketImpl.readDataRecord(SSLSocketImpl.java:930)
	at sun.security.ssl.AppInputStream.read(AppInputStream.java:105)
	at org.apache.http.impl.io.AbstractSessionInputBuffer.fillBuffer(AbstractSessionInputBuffer.java:160)
	at org.apache.http.impl.io.SocketInputBuffer.fillBuffer(SocketInputBuffer.java:84)
	at org.apache.http.impl.io.AbstractSessionInputBuffer.readLine(AbstractSessionInputBuffer.java:273)
	at org.apache.http.impl.conn.DefaultHttpResponseParser.parseHead(DefaultHttpResponseParser.java:140)
	at org.apache.http.impl.conn.DefaultHttpResponseParser.parseHead(DefaultHttpResponseParser.java:57)
	at org.apache.http.impl.io.AbstractMessageParser.parse(AbstractMessageParser.java:261)
	at org.apache.http.impl.AbstractHttpClientConnection.receiveResponseHeader(AbstractHttpClientConnection.java:283)
	at org.apache.http.impl.conn.DefaultClientConnection.receiveResponseHeader(DefaultClientConnection.java:251)
	at org.apache.http.impl.conn.ManagedClientConnectionImpl.receiveResponseHeader(ManagedClientConnectionImpl.java:197)
	at org.apache.http.protocol.HttpRequestExecutor.doReceiveResponse(HttpRequestExecutor.java:272)
	at org.apache.http.protocol.HttpRequestExecutor.execute(HttpRequestExecutor.java:124)
	at org.apache.http.impl.client.DefaultRequestDirector.tryExecute(DefaultRequestDirector.java:685)
	at org.apache.http.impl.client.DefaultRequestDirector.execute(DefaultRequestDirector.java:487)
	at org.apache.http.impl.client.AbstractHttpClient.doExecute(AbstractHttpClient.java:882)
	at org.apache.http.impl.client.CloseableHttpClient.execute(CloseableHttpClient.java:82)
	at org.apache.http.impl.client.CloseableHttpClient.execute(CloseableHttpClient.java:107)
	at org.apache.http.impl.client.CloseableHttpClient.execute(CloseableHttpClient.java:55)
	at org.apache.solr.client.solrj.impl.HttpSolrClient.executeMethod(HttpSolrClient.java:480)
	... 48 more




Build Log:
[...truncated 11279 lines...]
   [junit4] Suite: org.apache.solr.handler.component.DistributedFacetPivotWhiteBoxTest
   [junit4]   2> Creating dataDir: /home/jenkins/workspace/Lucene-Solr-5.x-Linux/solr/build/solr-core/test/J1/temp/solr.handler.component.DistributedFacetPivotWhiteBoxTest_888062F01692F3DE-001/init-core-data-001
   [junit4]   2> 1421127 INFO  (SUITE-DistributedFacetPivotWhiteBoxTest-seed#[888062F01692F3DE]-worker) [    ] o.a.s.SolrTestCaseJ4 Randomized ssl (true) and clientAuth (false)
   [junit4]   2> 1421128 INFO  (SUITE-DistributedFacetPivotWhiteBoxTest-seed#[888062F01692F3DE]-worker) [    ] o.a.s.BaseDistributedSearchTestCase Setting hostContext system property: /
   [junit4]   2> 1421174 INFO  (TEST-DistributedFacetPivotWhiteBoxTest.test-seed#[888062F01692F3DE]) [    ] o.a.s.SolrTestCaseJ4 Writing core.properties file to /home/jenkins/workspace/Lucene-Solr-5.x-Linux/solr/build/solr-core/test/J1/temp/solr.handler.component.DistributedFacetPivotWhiteBoxTest_888062F01692F3DE-001/tempDir-001/control/cores/collection1
   [junit4]   2> 1421175 INFO  (TEST-DistributedFacetPivotWhiteBoxTest.test-seed#[888062F01692F3DE]) [    ] o.e.j.s.Server jetty-9.2.13.v20150730
   [junit4]   2> 1421176 INFO  (TEST-DistributedFacetPivotWhiteBoxTest.test-seed#[888062F01692F3DE]) [    ] o.e.j.s.h.ContextHandler Started o.e.j.s.ServletContextHandler@2f7dbd6{/,null,AVAILABLE}
   [junit4]   2> 1421179 INFO  (TEST-DistributedFacetPivotWhiteBoxTest.test-seed#[888062F01692F3DE]) [    ] o.e.j.s.ServerConnector Started ServerConnector@48f19af{SSL-http/1.1}{127.0.0.1:38296}
   [junit4]   2> 1421179 INFO  (TEST-DistributedFacetPivotWhiteBoxTest.test-seed#[888062F01692F3DE]) [    ] o.e.j.s.Server Started @1422926ms
   [junit4]   2> 1421179 INFO  (TEST-DistributedFacetPivotWhiteBoxTest.test-seed#[888062F01692F3DE]) [    ] o.a.s.c.s.e.JettySolrRunner Jetty properties: {hostContext=/, hostPort=38296, coreRootDirectory=/home/jenkins/workspace/Lucene-Solr-5.x-Linux/solr/build/solr-core/test/J1/temp/solr.handler.component.DistributedFacetPivotWhiteBoxTest_888062F01692F3DE-001/tempDir-001/control/cores}
   [junit4]   2> 1421179 INFO  (TEST-DistributedFacetPivotWhiteBoxTest.test-seed#[888062F01692F3DE]) [    ] o.a.s.s.SolrDispatchFilter SolrDispatchFilter.init(): sun.misc.Launcher$AppClassLoader@4e0e2f2a
   [junit4]   2> 1421180 INFO  (TEST-DistributedFacetPivotWhiteBoxTest.test-seed#[888062F01692F3DE]) [    ] o.a.s.c.SolrResourceLoader new SolrResourceLoader for directory: '/home/jenkins/workspace/Lucene-Solr-5.x-Linux/solr/build/solr-core/test/J1/temp/solr.handler.component.DistributedFacetPivotWhiteBoxTest_888062F01692F3DE-001/tempDir-001/control/'
   [junit4]   2> 1421180 INFO  (TEST-DistributedFacetPivotWhiteBoxTest.test-seed#[888062F01692F3DE]) [    ] o.a.s.c.SolrResourceLoader JNDI not configured for solr (NoInitialContextEx)
   [junit4]   2> 1421180 INFO  (TEST-DistributedFacetPivotWhiteBoxTest.test-seed#[888062F01692F3DE]) [    ] o.a.s.c.SolrResourceLoader solr home defaulted to 'solr/' (could not find system property or JNDI)
   [junit4]   2> 1421195 INFO  (TEST-DistributedFacetPivotWhiteBoxTest.test-seed#[888062F01692F3DE]) [    ] o.a.s.c.SolrXmlConfig Loading container configuration from /home/jenkins/workspace/Lucene-Solr-5.x-Linux/solr/build/solr-core/test/J1/temp/solr.handler.component.DistributedFacetPivotWhiteBoxTest_888062F01692F3DE-001/tempDir-001/control/solr.xml
   [junit4]   2> 1421202 INFO  (TEST-DistributedFacetPivotWhiteBoxTest.test-seed#[888062F01692F3DE]) [    ] o.a.s.c.CoresLocator Config-defined core root directory: /home/jenkins/workspace/Lucene-Solr-5.x-Linux/solr/build/solr-core/test/J1/temp/solr.handler.component.DistributedFacetPivotWhiteBoxTest_888062F01692F3DE-001/tempDir-001/control/cores
   [junit4]   2> 1421202 INFO  (TEST-DistributedFacetPivotWhiteBoxTest.test-seed#[888062F01692F3DE]) [    ] o.a.s.c.CoreContainer New CoreContainer 19128406
   [junit4]   2> 1421202 INFO  (TEST-DistributedFacetPivotWhiteBoxTest.test-seed#[888062F01692F3DE]) [    ] o.a.s.c.CoreContainer Loading cores into CoreContainer [instanceDir=/home/jenkins/workspace/Lucene-Solr-5.x-Linux/solr/build/solr-core/test/J1/temp/solr.handler.component.DistributedFacetPivotWhiteBoxTest_888062F01692F3DE-001/tempDir-001/control/]
   [junit4]   2> 1421202 INFO  (TEST-DistributedFacetPivotWhiteBoxTest.test-seed#[888062F01692F3DE]) [    ] o.a.s.c.CoreContainer loading shared library: /home/jenkins/workspace/Lucene-Solr-5.x-Linux/solr/build/solr-core/test/J1/temp/solr.handler.component.DistributedFacetPivotWhiteBoxTest_888062F01692F3DE-001/tempDir-001/control/lib
   [junit4]   2> 1421202 WARN  (TEST-DistributedFacetPivotWhiteBoxTest.test-seed#[888062F01692F3DE]) [    ] o.a.s.c.SolrResourceLoader Can't find (or read) directory to add to classloader: lib (resolved as: /home/jenkins/workspace/Lucene-Solr-5.x-Linux/solr/build/solr-core/test/J1/temp/solr.handler.component.DistributedFacetPivotWhiteBoxTest_888062F01692F3DE-001/tempDir-001/control/lib).
   [junit4]   2> 1421207 INFO  (TEST-DistributedFacetPivotWhiteBoxTest.test-seed#[888062F01692F3DE]) [    ] o.a.s.h.c.HttpShardHandlerFactory created with socketTimeout : 90000,urlScheme : https,connTimeout : 15000,maxConnectionsPerHost : 20,maxConnections : 10000,corePoolSize : 0,maximumPoolSize : 2147483647,maxThreadIdleTime : 5,sizeOfQueue : -1,fairnessPolicy : false,useRetries : false,
   [junit4]   2> 1421208 INFO  (TEST-DistributedFacetPivotWhiteBoxTest.test-seed#[888062F01692F3DE]) [    ] o.a.s.u.UpdateShardHandler Creating UpdateShardHandler HTTP client with params: socketTimeout=340000&connTimeout=45000&retry=true
   [junit4]   2> 1421209 INFO  (TEST-DistributedFacetPivotWhiteBoxTest.test-seed#[888062F01692F3DE]) [    ] o.a.s.l.LogWatcher SLF4J impl is org.slf4j.impl.Log4jLoggerFactory
   [junit4]   2> 1421209 INFO  (TEST-DistributedFacetPivotWhiteBoxTest.test-seed#[888062F01692F3DE]) [    ] o.a.s.l.LogWatcher Registering Log Listener [Log4j (org.slf4j.impl.Log4jLoggerFactory)]
   [junit4]   2> 1421209 INFO  (TEST-DistributedFacetPivotWhiteBoxTest.test-seed#[888062F01692F3DE]) [    ] o.a.s.c.CoreContainer Security conf doesn't exist. Skipping setup for authorization module.
   [junit4]   2> 1421209 INFO  (TEST-DistributedFacetPivotWhiteBoxTest.test-seed#[888062F01692F3DE]) [    ] o.a.s.c.CoreContainer No authentication plugin used.
   [junit4]   2> 1421209 INFO  (TEST-DistributedFacetPivotWhiteBoxTest.test-seed#[888062F01692F3DE]) [    ] o.a.s.c.CoresLocator Looking for core definitions underneath /home/jenkins/workspace/Lucene-Solr-5.x-Linux/solr/build/solr-core/test/J1/temp/solr.handler.component.DistributedFacetPivotWhiteBoxTest_888062F01692F3DE-001/tempDir-001/control/cores
   [junit4]   2> 1421213 INFO  (TEST-DistributedFacetPivotWhiteBoxTest.test-seed#[888062F01692F3DE]) [    ] o.a.s.c.SolrCore Created CoreDescriptor: {name=collection1, config=solrconfig.xml, transient=false, schema=schema.xml, loadOnStartup=true, configSetProperties=configsetprops.json, instanceDir=/home/jenkins/workspace/Lucene-Solr-5.x-Linux/solr/build/solr-core/test/J1/temp/solr.handler.component.DistributedFacetPivotWhiteBoxTest_888062F01692F3DE-001/tempDir-001/control/cores/collection1, absoluteInstDir=/home/jenkins/workspace/Lucene-Solr-5.x-Linux/solr/build/solr-core/test/J1/temp/solr.handler.component.DistributedFacetPivotWhiteBoxTest_888062F01692F3DE-001/tempDir-001/control/cores/collection1/, configSet=collection1, dataDir=data/}
   [junit4]   2> 1421213 INFO  (TEST-DistributedFacetPivotWhiteBoxTest.test-seed#[888062F01692F3DE]) [    ] o.a.s.c.CoresLocator Found core collection1 in /home/jenkins/workspace/Lucene-Solr-5.x-Linux/solr/build/solr-core/test/J1/temp/solr.handler.component.DistributedFacetPivotWhiteBoxTest_888062F01692F3DE-001/tempDir-001/control/cores/collection1/
   [junit4]   2> 1421213 INFO  (TEST-DistributedFacetPivotWhiteBoxTest.test-seed#[888062F01692F3DE]) [    ] o.a.s.c.CoresLocator Found 1 core definitions
   [junit4]   2> 1421213 INFO  (coreLoadExecutor-4727-thread-1) [    ] o.a.s.c.SolrResourceLoader new SolrResourceLoader for directory: '/home/jenkins/workspace/Lucene-Solr-5.x-Linux/solr/core/src/test-files/solr/collection1/'
   [junit4]   2> 1421213 INFO  (TEST-DistributedFacetPivotWhiteBoxTest.test-seed#[888062F01692F3DE]) [    ] o.a.s.s.SolrDispatchFilter user.dir=/home/jenkins/workspace/Lucene-Solr-5.x-Linux/solr/build/solr-core/test/J1
   [junit4]   2> 1421213 INFO  (TEST-DistributedFacetPivotWhiteBoxTest.test-seed#[888062F01692F3DE]) [    ] o.a.s.s.SolrDispatchFilter SolrDispatchFilter.init() done
   [junit4]   2> 1421213 INFO  (coreLoadExecutor-4727-thread-1) [    ] o.a.s.c.SolrResourceLoader JNDI not configured for solr (NoInitialContextEx)
   [junit4]   2> 1421213 INFO  (coreLoadExecutor-4727-thread-1) [    ] o.a.s.c.SolrResourceLoader solr home defaulted to 'solr/' (could not find system property or JNDI)
   [junit4]   2> 1421214 INFO  (coreLoadExecutor-4727-thread-1) [    ] o.a.s.c.SolrResourceLoader Adding 'file:/home/jenkins/workspace/Lucene-Solr-5.x-Linux/solr/core/src/test-files/solr/collection1/lib/classes/' to classloader
   [junit4]   2> 1421214 INFO  (coreLoadExecutor-4727-thread-1) [    ] o.a.s.c.SolrResourceLoader Adding 'file:/home/jenkins/workspace/Lucene-Solr-5.x-Linux/solr/core/src/test-files/solr/collection1/lib/README' to classloader
   [junit4]   2> 1421224 INFO  (coreLoadExecutor-4727-thread-1) [    ] o.a.s.c.SolrConfig current version of requestparams : -1
   [junit4]   2> 1421229 INFO  (coreLoadExecutor-4727-thread-1) [    ] o.a.s.c.SolrConfig Using Lucene MatchVersion: 5.4.0
   [junit4]   2> 1421250 INFO  (coreLoadExecutor-4727-thread-1) [    ] o.a.s.c.Config Loaded SolrConfig: solrconfig.xml
   [junit4]   2> 1421250 INFO  (coreLoadExecutor-4727-thread-1) [    ] o.a.s.s.IndexSchema Reading Solr Schema from /home/jenkins/workspace/Lucene-Solr-5.x-Linux/solr/core/src/test-files/solr/collection1/conf/schema.xml
   [junit4]   2> 1421253 INFO  (coreLoadExecutor-4727-thread-1) [    ] o.a.s.s.IndexSchema [collection1] Schema name=test
   [junit4]   2> 1421302 INFO  (coreLoadExecutor-4727-thread-1) [    ] o.a.s.s.OpenExchangeRatesOrgProvider Initialized with rates=open-exchange-rates.json, refreshInterval=1440.
   [junit4]   2> 1421306 INFO  (coreLoadExecutor-4727-thread-1) [    ] o.a.s.s.IndexSchema default search field in schema is text
   [junit4]   2> 1421306 INFO  (coreLoadExecutor-4727-thread-1) [    ] o.a.s.s.IndexSchema unique key field: id
   [junit4]   2> 1421308 INFO  (coreLoadExecutor-4727-thread-1) [    ] o.a.s.s.FileExchangeRateProvider Reloading exchange rates from file currency.xml
   [junit4]   2> 1421309 INFO  (coreLoadExecutor-4727-thread-1) [    ] o.a.s.s.FileExchangeRateProvider Reloading exchange rates from file currency.xml
   [junit4]   2> 1421310 INFO  (coreLoadExecutor-4727-thread-1) [    ] o.a.s.s.OpenExchangeRatesOrgProvider Reloading exchange rates from open-exchange-rates.json
   [junit4]   2> 1421310 WARN  (coreLoadExecutor-4727-thread-1) [    ] o.a.s.s.OpenExchangeRatesOrgProvider Unknown key IMPORTANT NOTE
   [junit4]   2> 1421310 WARN  (coreLoadExecutor-4727-thread-1) [    ] o.a.s.s.OpenExchangeRatesOrgProvider Expected key, got STRING
   [junit4]   2> 1421310 INFO  (coreLoadExecutor-4727-thread-1) [    ] o.a.s.s.OpenExchangeRatesOrgProvider Reloading exchange rates from open-exchange-rates.json
   [junit4]   2> 1421310 WARN  (coreLoadExecutor-4727-thread-1) [    ] o.a.s.s.OpenExchangeRatesOrgProvider Unknown key IMPORTANT NOTE
   [junit4]   2> 1421310 WARN  (coreLoadExecutor-4727-thread-1) [    ] o.a.s.s.OpenExchangeRatesOrgProvider Expected key, got STRING
   [junit4]   2> 1421311 INFO  (coreLoadExecutor-4727-thread-1) [    ] o.a.s.c.ConfigSetProperties Did not find ConfigSet properties, assuming default properties: Can't find resource 'configsetprops.json' in classpath or '/home/jenkins/workspace/Lucene-Solr-5.x-Linux/solr/core/src/test-files/solr/collection1/conf'
   [junit4]   2> 1421311 INFO  (coreLoadExecutor-4727-thread-1) [    ] o.a.s.c.CoreContainer Creating SolrCore 'collection1' using configuration from configset /home/jenkins/workspace/Lucene-Solr-5.x-Linux/solr/core/src/test-files/solr/collection1
   [junit4]   2> 1421311 INFO  (coreLoadExecutor-4727-thread-1) [    x:collection1] o.a.s.c.SolrCore org.apache.solr.core.MockDirectoryFactory
   [junit4]   2> 1421311 INFO  (coreLoadExecutor-4727-thread-1) [    x:collection1] o.a.s.c.SolrCore [[collection1] ] Opening new SolrCore at [/home/jenkins/workspace/Lucene-Solr-5.x-Linux/solr/core/src/test-files/solr/collection1/], dataDir=[null]
   [junit4]   2> 1421311 INFO  (coreLoadExecutor-4727-thread-1) [    x:collection1] o.a.s.c.JmxMonitoredMap JMX monitoring is enabled. Adding Solr mbeans to JMX Server: com.sun.jmx.mbeanserver.JmxMBeanServer@76063992
   [junit4]   2> 1421311 INFO  (coreLoadExecutor-4727-thread-1) [    x:collection1] o.a.s.c.CachingDirectoryFactory return new directory for /home/jenkins/workspace/Lucene-Solr-5.x-Linux/solr/build/solr-core/test/J1/temp/solr.handler.component.DistributedFacetPivotWhiteBoxTest_888062F01692F3DE-001/tempDir-001/control/cores/collection1/data
   [junit4]   2> 1421311 INFO  (coreLoadExecutor-4727-thread-1) [    x:collection1] o.a.s.c.SolrCore New index directory detected: old=null new=/home/jenkins/workspace/Lucene-Solr-5.x-Linux/solr/build/solr-core/test/J1/temp/solr.handler.component.DistributedFacetPivotWhiteBoxTest_888062F01692F3DE-001/tempDir-001/control/cores/collection1/data/index/
   [junit4]   2> 1421311 WARN  (coreLoadExecutor-4727-thread-1) [    x:collection1] o.a.s.c.SolrCore [collection1] Solr index directory '/home/jenkins/workspace/Lucene-Solr-5.x-Linux/solr/build/solr-core/test/J1/temp/solr.handler.component.DistributedFacetPivotWhiteBoxTest_888062F01692F3DE-001/tempDir-001/control/cores/collection1/data/index' doesn't exist. Creating new index...
   [junit4]   2> 1421312 INFO  (coreLoadExecutor-4727-thread-1) [    x:collection1] o.a.s.c.CachingDirectoryFactory return new directory for /home/jenkins/workspace/Lucene-Solr-5.x-Linux/solr/build/solr-core/test/J1/temp/solr.handler.component.DistributedFacetPivotWhiteBoxTest_888062F01692F3DE-001/tempDir-001/control/cores/collection1/data/index
   [junit4]   2> 1421312 INFO  (coreLoadExecutor-4727-thread-1) [    x:collection1] o.a.s.u.RandomMergePolicy RandomMergePolicy wrapping class org.apache.lucene.index.LogByteSizeMergePolicy: [LogByteSizeMergePolicy: minMergeSize=1677721, mergeFactor=17, maxMergeSize=2147483648, maxMergeSizeForForcedMerge=9223372036854775807, calibrateSizeByDeletes=false, maxMergeDocs=2147483647, maxCFSSegmentSizeMB=8.796093022207999E12, noCFSRatio=0.10394772538710342]
   [junit4]   2> 1421312 INFO  (coreLoadExecutor-4727-thread-1) [    x:collection1] o.a.s.c.SolrCore SolrDeletionPolicy.onCommit: commits: num=1
   [junit4]   2> 	commit{dir=MockDirectoryWrapper(RAMDirectory@6724ac05 lockFactory=org.apache.lucene.store.SingleInstanceLockFactory@18dee8ef),segFN=segments_1,generation=1}
   [junit4]   2> 1421312 INFO  (coreLoadExecutor-4727-thread-1) [    x:collection1] o.a.s.c.SolrCore newest commit generation = 1
   [junit4]   2> 1421312 INFO  (OldIndexDirectoryCleanupThreadForCore-collection1) [    x:collection1] o.a.s.c.SolrCore Looking for old index directories to cleanup for core collection1 in /home/jenkins/workspace/Lucene-Solr-5.x-Linux/solr/build/solr-core/test/J1/temp/solr.handler.component.DistributedFacetPivotWhiteBoxTest_888062F01692F3DE-001/tempDir-001/control/cores/collection1/data/
   [junit4]   2> 1421312 WARN  (OldIndexDirectoryCleanupThreadForCore-collection1) [    x:collection1] o.a.s.c.DirectoryFactory /home/jenkins/workspace/Lucene-Solr-5.x-Linux/solr/build/solr-core/test/J1/temp/solr.handler.component.DistributedFacetPivotWhiteBoxTest_888062F01692F3DE-001/tempDir-001/control/cores/collection1/data/ does not point to a valid data directory; skipping clean-up of old index directories.
   [junit4]   2> 1421315 INFO  (coreLoadExecutor-4727-thread-1) [    x:collection1] o.a.s.u.p.UpdateRequestProcessorChain creating updateRequestProcessorChain "dedupe"
   [junit4]   2> 1421315 INFO  (coreLoadExecutor-4727-thread-1) [    x:collection1] o.a.s.u.p.UpdateRequestProcessorChain inserting DistributedUpdateProcessorFactory into updateRequestProcessorChain "dedupe"
   [junit4]   2> 1421315 INFO  (coreLoadExecutor-4727-thread-1) [    x:collection1] o.a.s.u.p.UpdateRequestProcessorChain creating updateRequestProcessorChain "dedupe-allfields"
   [junit4]   2> 1421315 INFO  (coreLoadExecutor-4727-thread-1) [    x:collection1] o.a.s.u.p.UpdateRequestProcessorChain inserting DistributedUpdateProcessorFactory into updateRequestProcessorChain "dedupe-allfields"
   [junit4]   2> 1421315 INFO  (coreLoadExecutor-4727-thread-1) [    x:collection1] o.a.s.u.p.UpdateRequestProcessorChain creating updateRequestProcessorChain "stored_sig"
   [junit4]   2> 1421315 INFO  (coreLoadExecutor-4727-thread-1) [    x:collection1] o.a.s.u.p.UpdateRequestProcessorChain inserting DistributedUpdateProcessorFactory into updateRequestProcessorChain "stored_sig"
   [junit4]   2> 1421315 INFO  (coreLoadExecutor-4727-thread-1) [    x:collection1] o.a.s.u.p.UpdateRequestProcessorChain creating updateRequestProcessorChain "uniq-fields"
   [junit4]   2> 1421315 INFO  (coreLoadExecutor-4727-thread-1) [    x:collection1] o.a.s.u.p.UpdateRequestProcessorChain inserting DistributedUpdateProcessorFactory into updateRequestProcessorChain "uniq-fields"
   [junit4]   2> 1421315 INFO  (coreLoadExecutor-4727-thread-1) [    x:collection1] o.a.s.u.p.UpdateRequestProcessorChain creating updateRequestProcessorChain "distrib-dup-test-chain-explicit"
   [junit4]   2> 1421315 INFO  (coreLoadExecutor-4727-thread-1) [    x:collection1] o.a.s.u.p.UpdateRequestProcessorChain creating updateRequestProcessorChain "distrib-dup-test-chain-implicit"
   [junit4]   2> 1421315 INFO  (coreLoadExecutor-4727-thread-1) [    x:collection1] o.a.s.u.p.UpdateRequestProcessorChain inserting DistributedUpdateProcessorFactory into updateRequestProcessorChain "distrib-dup-test-chain-implicit"
   [junit4]   2> 1421315 INFO  (coreLoadExecutor-4727-thread-1) [    x:collection1] o.a.s.c.SolrCore no updateRequestProcessorChain defined as default, creating implicit default
   [junit4]   2> 1421316 INFO  (coreLoadExecutor-4727-thread-1) [    x:collection1] o.a.s.h.l.XMLLoader xsltCacheLifetimeSeconds=60
   [junit4]   2> 1421317 INFO  (coreLoadExecutor-4727-thread-1) [    x:collection1] o.a.s.h.l.XMLLoader xsltCacheLifetimeSeconds=60
   [junit4]   2> 1421317 INFO  (coreLoadExecutor-4727-thread-1) [    x:collection1] o.a.s.h.l.XMLLoader xsltCacheLifetimeSeconds=60
   [junit4]   2> 1421318 INFO  (coreLoadExecutor-4727-thread-1) [    x:collection1] o.a.s.h.l.XMLLoader xsltCacheLifetimeSeconds=60
   [junit4]   2> 1421320 INFO  (coreLoadExecutor-4727-thread-1) [    x:collection1] o.a.s.c.PluginBag requestHandler : 'lazy' created with startup=lazy 
   [junit4]   2> 1422014 INFO  (coreLoadExecutor-4727-thread-1) [    x:collection1] o.a.s.c.RequestHandlers Registered paths: /admin/mbeans,standard,spellCheckCompRH,lazy,/update/json/docs,/admin/luke,spellCheckWithWordbreak_Direct,tvrh,/get,/admin/properties,/update/json,mltrh,/admin/threads,/search-facet-def,/update/csv,/search-facet-invariants,/admin/segments,spellCheckCompRH1,/mlt,/admin/system,/replication,dismax,defaults,/config,/schema,/admin/plugins,/admin/logging,spellCheckWithWordbreak,mock,/admin/ping,/update,/admin/file,/terms,spellCheckCompRH_Direct,/debug/dump
   [junit4]   2> 1422015 WARN  (coreLoadExecutor-4727-thread-1) [    x:collection1] o.a.s.c.SolrCore solrconfig.xml uses deprecated <admin/gettableFiles>, Please update your config to use the ShowFileRequestHandler.
   [junit4]   2> 1422015 INFO  (coreLoadExecutor-4727-thread-1) [    x:collection1] o.a.s.c.SolrCore Using default statsCache cache: org.apache.solr.search.stats.LocalStatsCache
   [junit4]   2> 1422016 INFO  (coreLoadExecutor-4727-thread-1) [    x:collection1] o.a.s.u.UpdateHandler Using UpdateLog implementation: org.apache.solr.update.UpdateLog
   [junit4]   2> 1422016 INFO  (coreLoadExecutor-4727-thread-1) [    x:collection1] o.a.s.u.UpdateLog Initializing UpdateLog: dataDir= defaultSyncLevel=FLUSH numRecordsToKeep=100 maxNumLogsToKeep=10 numVersionBuckets=65536
   [junit4]   2> 1422016 INFO  (coreLoadExecutor-4727-thread-1) [    x:collection1] o.a.s.c.SolrCore Hard AutoCommit: disabled
   [junit4]   2> 1422016 INFO  (coreLoadExecutor-4727-thread-1) [    x:collection1] o.a.s.c.SolrCore Soft AutoCommit: disabled
   [junit4]   2> 1422017 INFO  (coreLoadExecutor-4727-thread-1) [    x:collection1] o.a.s.u.RandomMergePolicy RandomMergePolicy wrapping class org.apache.lucene.index.TieredMergePolicy: [TieredMergePolicy: maxMergeAtOnce=48, maxMergeAtOnceExplicit=13, maxMergedSegmentMB=54.7705078125, floorSegmentMB=1.4794921875, forceMergeDeletesPctAllowed=9.858192004623433, segmentsPerTier=49.0, maxCFSSegmentSizeMB=8.796093022207999E12, noCFSRatio=1.0
   [junit4]   2> 1422017 INFO  (coreLoadExecutor-4727-thread-1) [    x:collection1] o.a.s.c.SolrCore SolrDeletionPolicy.onInit: commits: num=1
   [junit4]   2> 	commit{dir=MockDirectoryWrapper(RAMDirectory@6724ac05 lockFactory=org.apache.lucene.store.SingleInstanceLockFactory@18dee8ef),segFN=segments_1,generation=1}
   [junit4]   2> 1422017 INFO  (coreLoadExecutor-4727-thread-1) [    x:collection1] o.a.s.c.SolrCore newest commit generation = 1
   [junit4]   2> 1422017 INFO  (coreLoadExecutor-4727-thread-1) [    x:collection1] o.a.s.s.SolrIndexSearcher Opening Searcher@787b0328[collection1] main
   [junit4]   2> 1422017 INFO  (coreLoadExecutor-4727-thread-1) [    x:collection1] o.a.s.r.RestManager Initializing RestManager with initArgs: {storageIO=org.apache.solr.rest.ManagedResourceStorage$InMemoryStorageIO}
   [junit4]   2> 1422017 INFO  (coreLoadExecutor-4727-thread-1) [    x:collection1] o.a.s.r.ManagedResourceStorage Reading _rest_managed.json using InMemoryStorage
   [junit4]   2> 1422018 INFO  (coreLoadExecutor-4727-thread-1) [    x:collection1] o.a.s.r.RestManager Initializing 0 registered ManagedResources
   [junit4]   2> 1422018 INFO  (coreLoadExecutor-4727-thread-1) [    x:collection1] o.a.s.h.c.SpellCheckComponent Initializing spell checkers
   [junit4]   2> 1422054 INFO  (coreLoadExecutor-4727-thread-1) [    x:collection1] o.a.s.s.DirectSolrSpellChecker init: {name=direct,classname=DirectSolrSpellChecker,field=lowerfilt,minQueryLength=3}
   [junit4]   2> 1422202 INFO  (coreLoadExecutor-4727-thread-1) [    x:collection1] o.a.s.h.ReplicationHandler Commits will be reserved for  10000
   [junit4]   2> 1422202 INFO  (searcherExecutor-4728-thread-1-processing-x:collection1) [    x:collection1] o.a.s.h.c.SpellCheckComponent Loading spell index for spellchecker: default
   [junit4]   2> 1422203 INFO  (searcherExecutor-4728-thread-1-processing-x:collection1) [    x:collection1] o.a.s.h.c.SpellCheckComponent Loading spell index for spellchecker: direct
   [junit4]   2> 1422203 INFO  (searcherExecutor-4728-thread-1-processing-x:collection1) [    x:collection1] o.a.s.h.c.SpellCheckComponent Loading spell index for spellchecker: wordbreak
   [junit4]   2> 1422203 INFO  (searcherExecutor-4728-thread-1-processing-x:collection1) [    x:collection1] o.a.s.h.c.SpellCheckComponent Loading spell index for spellchecker: multipleFields
   [junit4]   2> 1422203 INFO  (coreLoadExecutor-4727-thread-1) [    x:collection1] o.a.s.u.UpdateLog Looking up max value of version field to seed version buckets
   [junit4]   2> 1422203 INFO  (searcherExecutor-4728-thread-1-processing-x:collection1) [    x:collection1] o.a.s.h.c.SpellCheckComponent Loading spell index for spellchecker: jarowinkler
   [junit4]   2> 1422203 INFO  (coreLoadExecutor-4727-thread-1) [    x:collection1] o.a.s.u.VersionInfo Refreshing highest value of _version_ for 65536 version buckets from index
   [junit4]   2> 1422203 INFO  (coreLoadExecutor-4727-thread-1) [    x:collection1] o.a.s.u.VersionInfo No terms found for _version_, cannot seed version bucket highest value from index
   [junit4]   2> 1422203 INFO  (coreLoadExecutor-4727-thread-1) [    x:collection1] o.a.s.u.UpdateLog Could not find max version in index or recent updates, using new clock 1515361446844694528
   [junit4]   2> 1422203 INFO  (searcherExecutor-4728-thread-1-processing-x:collection1) [    x:collection1] o.a.s.h.c.SpellCheckComponent Loading spell index for spellchecker: external
   [junit4]   2> 1422203 INFO  (searcherExecutor-4728-thread-1-processing-x:collection1) [    x:collection1] o.a.s.h.c.SpellCheckComponent Loading spell index for spellchecker: freq
   [junit4]   2> 1422204 INFO  (searcherExecutor-4728-thread-1-processing-x:collection1) [    x:collection1] o.a.s.h.c.SpellCheckComponent Loading spell index for spellchecker: fqcn
   [junit4]   2> 1422204 INFO  (searcherExecutor-4728-thread-1-processing-x:collection1) [    x:collection1] o.a.s.h.c.SpellCheckComponent Loading spell index for spellchecker: perDict
   [junit4]   2> 1422204 INFO  (searcherExecutor-4728-thread-1-processing-x:collection1) [    x:collection1] o.a.s.c.SolrCore [collection1] Registered new searcher Searcher@787b0328[collection1] main{ExitableDirectoryReader(UninvertingDirectoryReader())}
   [junit4]   2> 1422205 INFO  (coreLoadExecutor-4727-thread-1) [    x:collection1] o.a.s.u.UpdateLog Took 1.0ms to seed version buckets with highest version 1515361446844694528
   [junit4]   2> 1422205 INFO  (coreLoadExecutor-4727-thread-1) [    x:collection1] o.a.s.c.CoreContainer registering core: collection1
   [junit4]   2> 1422574 INFO  (TEST-DistributedFacetPivotWhiteBoxTest.test-seed#[888062F01692F3DE]) [    ] o.a.s.SolrTestCaseJ4 Writing core.properties file to /home/jenkins/workspace/Lucene-Solr-5.x-Linux/solr/build/solr-core/test/J1/temp/solr.handler.component.DistributedFacetPivotWhiteBoxTest_888062F01692F3DE-001/tempDir-001/shard0/cores/collection1
   [junit4]   2> 1422575 INFO  (TEST-DistributedFacetPivotWhiteBoxTest.test-seed#[888062F01692F3DE]) [    ] o.e.j.s.Server jetty-9.2.13.v20150730
   [junit4]   2> 1422576 INFO  (TEST-DistributedFacetPivotWhiteBoxTest.test-seed#[888062F01692F3DE]) [    ] o.e.j.s.h.ContextHandler Started o.e.j.s.ServletContextHandler@b1bf659{/,null,AVAILABLE}
   [junit4]   2> 1422578 INFO  (TEST-DistributedFacetPivotWhiteBoxTest.test-seed#[888062F01692F3DE]) [    ] o.e.j.s.ServerConnector Started ServerConnector@44611d8b{SSL-http/1.1}{127.0.0.1:33565}
   [junit4]   2> 1422578 INFO  (TEST-DistributedFacetPivotWhiteBoxTest.test-seed#[888062F01692F3DE]) [    ] o.e.j.s.Server Started @1424324ms
   [junit4]   2> 1422578 INFO  (TEST-DistributedFacetPivotWhiteBoxTest.test-seed#[888062F01692F3DE]) [    ] o.a.s.c.s.e.JettySolrRunner Jetty properties: {hostContext=/, hostPort=33565, coreRootDirectory=/home/jenkins/workspace/Lucene-Solr-5.x-Linux/solr/build/solr-core/test/J1/temp/solr.handler.component.DistributedFacetPivotWhiteBoxTest_888062F01692F3DE-001/tempDir-001/shard0/cores}
   [junit4]   2> 1422578 INFO  (TEST-DistributedFacetPivotWhiteBoxTest.test-seed#[888062F01692F3DE]) [    ] o.a.s.s.SolrDispatchFilter SolrDispatchFilter.init(): sun.misc.Launcher$AppClassLoader@4e0e2f2a
   [junit4]   2> 1422578 INFO  (TEST-DistributedFacetPivotWhiteBoxTest.test-seed#[888062F01692F3DE]) [    ] o.a.s.c.SolrResourceLoader new SolrResourceLoader for directory: '/home/jenkins/workspace/Lucene-Solr-5.x-Linux/solr/build/solr-core/test/J1/temp/solr.handler.component.DistributedFacetPivotWhiteBoxTest_888062F01692F3DE-001/tempDir-001/shard0/'
   [junit4]   2> 1422578 INFO  (TEST-DistributedFacetPivotWhiteBoxTest.test-seed#[888062F01692F3DE]) [    ] o.a.s.c.SolrResourceLoader JNDI not configured for solr (NoInitialContextEx)
   [junit4]   2> 1422578 INFO  (TEST-DistributedFacetPivotWhiteBoxTest.test-seed#[888062F01692F3DE]) [    ] o.a.s.c.SolrResourceLoader solr home defaulted to 'solr/' (could not find system property or JNDI)
   [junit4]   2> 1422587 INFO  (TEST-DistributedFacetPivotWhiteBoxTest.test-seed#[888062F01692F3DE]) [    ] o.a.s.c.SolrXmlConfig Loading container configuration from /home/jenkins/workspace/Lucene-Solr-5.x-Linux/solr/build/solr-core/test/J1/temp/solr.handler.component.DistributedFacetPivotWhiteBoxTest_888062F01692F3DE-001/tempDir-001/shard0/solr.xml
   [junit4]   2> 1422590 INFO  (TEST-DistributedFacetPivotWhiteBoxTest.test-seed#[888062F01692F3DE]) [    ] o.a.s.c.CoresLocator Config-defined core root directory: /home/jenkins/workspace/Lucene-Solr-5.x-Linux/solr/build/solr-core/test/J1/temp/solr.handler.component.DistributedFacetPivotWhiteBoxTest_888062F01692F3DE-001/tempDir-001/shard0/cores
   [junit4]   2> 1422590 INFO  (TEST-DistributedFacetPivotWhiteBoxTest.test-seed#[888062F01692F3DE]) [    ] o.a.s.c.CoreContainer New CoreContainer 416647997
   [junit4]   2> 1422590 INFO  (TEST-DistributedFacetPivotWhiteBoxTest.test-seed#[888062F01692F3DE]) [    ] o.a.s.c.CoreContainer Loading cores into CoreContainer [instanceDir=/home/jenkins/workspace/Lucene-Solr-5.x-Linux/solr/build/solr-core/test/J1/temp/solr.handler.component.DistributedFacetPivotWhiteBoxTest_888062F01692F3DE-001/tempDir-001/shard0/]
   [junit4]   2> 1422590 INFO  (TEST-DistributedFacetPivotWhiteBoxTest.test-seed#[888062F01692F3DE]) [    ] o.a.s.c.CoreContainer loading shared library: /home/jenkins/workspace/Lucene-Solr-5.x-Linux/solr/build/solr-core/test/J1/temp/solr.handler.component.DistributedFacetPivotWhiteBoxTest_888062F01692F3DE-001/tempDir-001/shard0/lib
   [junit4]   2> 1422590 WARN  (TEST-DistributedFacetPivotWhiteBoxTest.test-seed#[888062F01692F3DE]) [    ] o.a.s.c.SolrResourceLoader Can't find (or read) directory to add to classloader: lib (resolved as: /home/jenkins/workspace/Lucene-Solr-5.x-Linux/solr/build/solr-core/test/J1/temp/solr.handler.component.DistributedFacetPivotWhiteBoxTest_888062F01692F3DE-001/tempDir-001/shard0/lib).
   [junit4]   2> 1422594 INFO  (TEST-DistributedFacetPivotWhiteBoxTest.test-seed#[888062F01692F3DE]) [    ] o.a.s.h.c.HttpShardHandlerFactory created with socketTimeout : 90000,urlScheme : https,connTimeout : 15000,maxConnectionsPerHost : 20,maxConnections : 10000,corePoolSize : 0,maximumPoolSize : 2147483647,maxThreadIdleTime : 5,sizeOfQueue : -1,fairnessPolicy : false,useRetries : false,
   [junit4]   2> 1422595 INFO  (TEST-DistributedFacetPivotWhiteBoxTest.test-seed#[888062F01692F3DE]) [    ] o.a.s.u.UpdateShardHandler Creating UpdateShardHandler HTTP client with params: socketTimeout=340000&connTimeout=45000&retry=true
   [junit4]   2> 1422596 INFO  (TEST-DistributedFacetPivotWhiteBoxTest.test-seed#[888062F01692F3DE]) [    ] o.a.s.l.LogWatcher SLF4J impl is org.slf4j.impl.Log4jLoggerFactory
   [junit4]   2> 1422596 INFO  (TEST-DistributedFacetPivotWhiteBoxTest.test-seed#[888062F01692F3DE]) [    ] o.a.s.l.LogWatcher Registering Log Listener [Log4j (org.slf4j.impl.Log4jLoggerFactory)]
   [junit4]   2> 1422596 INFO  (TEST-DistributedFacetPivotWhiteBoxTest.test-seed#[888062F01692F3DE]) [    ] o.a.s.c.CoreContainer Security conf doesn't exist. Skipping setup for authorization module.
   [junit4]   2> 1422596 INFO  (TEST-DistributedFacetPivotWhiteBoxTest.test-seed#[888062F01692F3DE]) [    ] o.a.s.c.CoreContainer No authentication plugin used.
   [junit4]   2> 1422597 INFO  (TEST-DistributedFacetPivotWhiteBoxTest.test-seed#[888062F01692F3DE]) [    ] o.a.s.c.CoresLocator Looking for core definitions underneath /home/jenkins/workspace/Lucene-Solr-5.x-Linux/solr/build/solr-core/test/J1/temp/solr.handler.component.DistributedFacetPivotWhiteBoxTest_888062F01692F3DE-001/tempDir-001/shard0/cores
   [junit4]   2> 1422597 INFO  (TEST-DistributedFacetPivotWhiteBoxTest.test-seed#[888062F01692F3DE]) [    ] o.a.s.c.SolrCore Created CoreDescriptor: {name=collection1, config=solrconfig.xml, transient=false, schema=schema.xml, loadOnStartup=true, configSetProperties=configsetprops.json, instanceDir=/home/jenkins/workspace/Lucene-Solr-5.x-Linux/solr/build/solr-core/test/J1/temp/solr.handler.component.DistributedFacetPivotWhiteBoxTest_888062F01692F3DE-001/tempDir-001/shard0/cores/collection1, absoluteInstDir=/home/jenkins/workspace/Lucene-Solr-5.x-Linux/solr/build/solr-core/test/J1/temp/solr.handler.component.DistributedFacetPivotWhiteBoxTest_888062F01692F3DE-001/tempDir-001/shard0/cores/collection1/, configSet=collection1, dataDir=data/}
   [junit4]   2> 1422597 INFO  (TEST-DistributedFacetPivotWhiteBoxTest.test-seed#[888062F01692F3DE]) [    ] o.a.s.c.CoresLocator Found core collection1 in /home/jenkins/workspace/Lucene-Solr-5.x-Linux/solr/build/solr-core/test/J1/temp/solr.handler.component.DistributedFacetPivotWhiteBoxTest_888062F01692F3DE-001/tempDir-001/shard0/cores/collection1/
   [junit4]   2> 1422597 INFO  (TEST-DistributedFacetPivotWhiteBoxTest.test-seed#[888062F01692F3DE]) [    ] o.a.s.c.CoresLocator Found 1 core definitions
   [junit4]   2> 1422598 INFO  (TEST-DistributedFacetPivotWhiteBoxTest.test-seed#[888062F01692F3DE]) [    ] o.a.s.s.SolrDispatchFilter user.dir=/home/jenkins/workspace/Lucene-Solr-5.x-Linux/solr/build/solr-core/test/J1
   [junit4]   2> 1422598 INFO  (coreLoadExecutor-4738-thread-1) [    ] o.a.s.c.SolrResourceLoader new SolrResourceLoader for directory: '/home/jenkins/workspace/Lucene-Solr-5.x-Linux/solr/core/src/test-files/solr/collection1/'
   [junit4]   2> 1422598 INFO  (TEST-DistributedFacetPivotWhiteBoxTest.test-seed#[888062F01692F3DE]) [    ] o.a.s.s.SolrDispatchFilter SolrDispatchFilter.init() done
   [junit4]   2> 1422598 INFO  (coreLoadExecutor-4738-thread-1) [    ] o.a.s.c.SolrResourceLoader JNDI not configured for solr (NoInitialContextEx)
   [junit4]   2> 1422598 INFO  (coreLoadExecutor-4738-thread-1) [    ] o.a.s.c.SolrResourceLoader solr home defaulted to 'solr/' (could not find system property or JNDI)
   [junit4]   2> 1422598 INFO  (coreLoadExecutor-4738-thread-1) [    ] o.a.s.c.SolrResourceLoader Adding 'file:/home/jenkins/workspace/Lucene-Solr-5.x-Linux/solr/core/src/test-files/solr/collection1/lib/classes/' to classloader
   [junit4]   2> 1422598 INFO  (coreLoadExecutor-4738-thread-1) [    ] o.a.s.c.SolrResourceLoader Adding 'file:/home/jenkins/workspace/Lucene-Solr-5.x-Linux/solr/core/src/test-files/solr/collection1/lib/README' to classloader
   [junit4]   2> 1422610 INFO  (coreLoadExecutor-4738-thread-1) [    ] o.a.s.c.SolrConfig current version of requestparams : -1
   [junit4]   2> 1422615 INFO  (coreLoadExecutor-4738-thread-1) [    ] o.a.s.c.SolrConfig Using Lucene MatchVersion: 5.4.0
   [junit4]   2> 1422628 INFO  (coreLoadExecutor-4738-thread-1) [    ] o.a.s.c.Config Loaded SolrConfig: solrconfig.xml
   [junit4]   2> 1422628 INFO  (coreLoadExecutor-4738-thread-1) [    ] o.a.s.s.IndexSchema Reading Solr Schema from /home/jenkins/workspace/Lucene-Solr-5.x-Linux/solr/core/src/test-files/solr/collection1/conf/schema.xml
   [junit4]   2> 1422631 INFO  (coreLoadExecutor-4738-thread-1) [    ] o.a.s.s.IndexSchema [collection1] Schema name=test
   [junit4]   2> 1422724 INFO  (coreLoadExecutor-4738-thread-1) [    ] o.a.s.s.OpenExchangeRatesOrgProvider Initialized with rates=open-exchange-rates.json, refreshInterval=1440.
   [junit4]   2> 1422727 INFO  (coreLoadExecutor-4738-thread-1) [    ] o.a.s.s.IndexSchema default search field in schema is text
   [junit4]   2> 1422728 INFO  (coreLoadExecutor-4738-thread-1) [    ] o.a.s.s.IndexSchema unique key field: id
   [junit4]   2> 1422731 INFO  (coreLoadExecutor-4738-thread-1) [    ] o.a.s.s.FileExchangeRateProvider Reloading exchange rates from file currency.xml
   [junit4]   2> 1422731 INFO  (coreLoadExecutor-4738-thread-1) [    ] o.a.s.s.FileExchangeRateProvider Reloading exchange rates from file currency.xml
   [junit4]   2> 1422732 INFO  (coreLoadExecutor-4738-thread-1) [    ] o.a.s.s.OpenExchangeRatesOrgProvider Reloading exchange rates from open-exchange-rates.json
   [junit4]   2> 1422732 WARN  (coreLoadExecutor-4738-thread-1) [    ] o.a.s.s.OpenExchangeRatesOrgProvider Unknown key IMPORTANT NOTE
   [junit4]   2> 1422733 WARN  (coreLoadExecutor-4738-thread-1) [    ] o.a.s.s.OpenExchangeRatesOrgProvider Expected key, got STRING
   [junit4]   2> 1422733 INFO  (coreLoadExecutor-4738-thread-1) [    ] o.a.s.s.OpenExchangeRatesOrgProvider Reloading exchange rates from open-exchange-rates.json
   [junit4]   2> 1422733 WARN  (coreLoadExecutor-4738-thread-1) [    ] o.a.s.s.OpenExchangeRatesOrgProvider Unknown key IMPORTANT NOTE
   [junit4]   2> 1422733 WARN  (coreLoadExecutor-4738-thread-1) [    ] o.a.s.s.OpenExchangeRatesOrgProvider Expected key, got STRING
   [junit4]   2> 1422734 INFO  (coreLoadExecutor-4738-thread-1) [    ] o.a.s.c.ConfigSetProperties Did not find ConfigSet properties, assuming default properties: Can't find resource 'configsetprops.json' in classpath or '/home/jenkins/workspace/Lucene-Solr-5.x-Linux/solr/core/src/test-files/solr/collection1/conf'
   [junit4]   2> 1422734 INFO  (coreLoadExecutor-4738-thread-1) [    ] o.a.s.c.CoreContainer Creating SolrCore 'collection1' using configuration from configset /home/jenkins/workspace/Lucene-Solr-5.x-Linux/solr/core/src/test-files/solr/collection1
   [junit4]   2> 1422734 INFO  (coreLoadExecutor-4738-thread-1) [    x:collection1] o.a.s.c.SolrCore org.apache.solr.core.MockDirectoryFactory
   [junit4]   2> 1422734 INFO  (coreLoadExecutor-4738-thread-1) [    x:collection1] o.a.s.c.SolrCore [[collection1] ] Opening new SolrCore at [/home/jenkins/workspace/Lucene-Solr-5.x-Linux/solr/core/src/test-files/solr/collection1/], dataDir=[null]
   [junit4]   2> 1422734 INFO  (coreLoadExecutor-4738-thread-1) [    x:collection1] o.a.s.c.JmxMonitoredMap JMX monitoring is enabled. Adding Solr mbeans to JMX Server: com.sun.jmx.mbeanserver.JmxMBeanServer@76063992
   [junit4]   2> 1422735 INFO  (coreLoadExecutor-4738-thread-1) [    x:collection1] o.a.s.c.CachingDirectoryFactory return new directory for /home/jenkins/workspace/Lucene-Solr-5.x-Linux/solr/build/solr-core/test/J1/temp/solr.handler.component.DistributedFacetPivotWhiteBoxTest_888062F01692F3DE-001/tempDir-001/shard0/cores/collection1/data
   [junit4]   2> 1422735 INFO  (coreLoadExecutor-4738-thread-1) [    x:collection1] o.a.s.c.SolrCore New index directory detected: old=null new=/home/jenkins/workspace/Lucene-Solr-5.x-Linux/solr/build/solr-core/test/J1/temp/solr.handler.component.DistributedFacetPivotWhiteBoxTest_888062F01692F3DE-001/tempDir-001/shard0/cores/collection1/data/index/
   [junit4]   2> 1422735 WARN  (coreLoadExecutor-4738-thread-1) [    x:collection1] o.a.s.c.SolrCore [collection1] Solr index directory '/home/jenkins/workspace/Lucene-Solr-5.x-Linux/solr/build/solr-core/test/J1/temp/solr.handler.component.DistributedFacetPivotWhiteBoxTest_888062F01692F3DE-001/tempDir-001/shard0/cores/collection1/data/index' doesn't exist. Creating new index...
   [junit4]   2> 1422735 INFO  (coreLoadExecutor-4738-thread-1) [    x:collection1] o.a.s.c.CachingDirectoryFactory return new directory for /home/jenkins/workspace/Lucene-Solr-5.x-Linux/solr/build/solr-core/test/J1/temp/solr.handler.component.DistributedFacetPivotWhiteBoxTest_888062F01692F3DE-001/tempDir-001/shard0/cores/collection1/data/index
   [junit4]   2> 1422735 INFO  (coreLoadExecutor-4738-thread-1) [    x:collection1] o.a.s.u.RandomMergePolicy RandomMergePolicy wrapping class org.apache.lucene.index.LogByteSizeMergePolicy: [LogByteSizeMergePolicy: minMergeSize=1677721, mergeFactor=17, maxMergeSize=2147483648, maxMergeSizeForForcedMerge=9223372036854775807, calibrateSizeByDeletes=false, maxMergeDocs=2147483647, maxCFSSegmentSizeMB=8.796093022207999E12, noCFSRatio=0.10394772538710342]
   [junit4]   2> 1422735 INFO  (coreLoadExecutor-4738-thread-1) [    x:collection1] o.a.s.c.SolrCore SolrDeletionPolicy.onCommit: commits: num=1
   [junit4]   2> 	commit{dir=MockDirectoryWrapper(RAMDirectory@7425773c lockFactory=org.apache.lucene.store.SingleInstanceLockFactory@4a869f5e),segFN=segments_1,generation=1}
   [junit4]   2> 1422735 INFO  (coreLoadExecutor-4738-thread-1) [    x:collection1] o.a.s.c.SolrCore newest commit generation = 1
   [junit4]   2> 1422736 INFO  (OldIndexDirectoryCleanupThreadForCore-collection1) [    x:collection1] o.a.s.c.SolrCore Looking for old index directories to cleanup for core collection1 in /home/jenkins/workspace/Lucene-Solr-5.x-Linux/solr/build/solr-core/test/J1/temp/solr.handler.component.DistributedFacetPivotWhiteBoxTest_888062F01692F3DE-001/tempDir-001/shard0/cores/collection1/data/
   [junit4]   2> 1422736 WARN  (OldIndexDirectoryCleanupThreadForCore-collection1) [    x:collection1] o.a.s.c.DirectoryFactory /home/jenkins/workspace/Lucene-Solr-5.x-Linux/solr/build/solr-core/test/J1/temp/solr.handler.component.DistributedFacetPivotWhiteBoxTest_888062F01692F3DE-001/tempDir-001/shard0/cores/collection1/data/ does not point to a valid data directory; skipping clean-up of old index directories.
   [junit4]   2> 1422738 INFO  (coreLoadExecutor-4738-thread-1) [    x:collection1] o.a.s.u.p.UpdateRequestProcessorChain creating updateRequestProcessorChain "dedupe"
   [junit4]   2> 1422738 INFO  (coreLoadExecutor-4738-thread-1) [    x:collection1] o.a.s.u.p.UpdateRequestProcessorChain inserting DistributedUpdateProcessorFactory into updateRequestProcessorChain "dedupe"
   [junit4]   2> 1422738 INFO  (coreLoadExecutor-4738-thread-1) [    x:collection1] o.a.s.u.p.UpdateRequestProcessorChain creating updateRequestProcessorChain "dedupe-allfields"
   [junit4]   2> 1422738 INFO  (coreLoadExecutor-4738-thread-1) [    x:collection1] o.a.s.u.p.UpdateRequestProcessorChain inserting DistributedUpdateProcessorFactory into updateRequestProcessorChain "dedupe-allfields"
   [junit4]   2> 1422738 INFO  (coreLoadExecutor-4738-thread-1) [    x:collection1] o.a.s.u.p.UpdateRequestProcessorChain creating updateRequestProcessorChain "stored_sig"
   [junit4]   2> 1422738 INFO  (coreLoadExecutor-4738-thread-1) [    x:collection1] o.a.s.u.p.UpdateRequestProcessorChain inserting DistributedUpdateProcessorFactory into updateRequestProcessorChain "stored_sig"
   [junit4]   2> 1422738 INFO  (coreLoadExecutor-4738-thread-1) [    x:collection1] o.a.s.u.p.UpdateRequestProcessorChain creating updateRequestProcessorChain "uniq-fields"
   [junit4]   2> 1422738 INFO  (coreLoadExecutor-4738-thread-1) [    x:collection1] o.a.s.u.p.UpdateRequestProcessorChain inserting DistributedUpdateProcessorFactory into updateRequestProcessorChain "uniq-fields"
   [junit4]   2> 1422738 INFO  (coreLoadExecutor-4738-thread-1) [    x:collection1] o.a.s.u.p.UpdateRequestProcessorChain creating updateRequestProcessorChain "distrib-dup-test-chain-explicit"
   [junit4]   2> 1422738 INFO  (coreLoadExecutor-4738-thread-1) [    x:collection1] o.a.s.u.p.UpdateRequestProcessorChain creating updateRequestProcessorChain "distrib-dup-test-chain-implicit"
   [junit4]   2> 1422738 INFO  (coreLoadExecutor-4738-thread-1) [    x:collection1] o.a.s.u.p.UpdateRequestProcessorChain inserting DistributedUpdateProcessorFactory into updateRequestProcessorChain "distrib-dup-test-chain-implicit"
   [junit4]   2> 1422738 INFO  (coreLoadExecutor-4738-thread-1) [    x:collection1] o.a.s.c.SolrCore no updateRequestProcessorChain defined as default, creating implicit default
   [junit4]   2> 1422740 INFO  (coreLoadExecutor-4738-thread-1) [    x:collection1] o.a.s.h.l.XMLLoader xsltCacheLifetimeSeconds=60
   [junit4]   2> 1422740 INFO  (coreLoadExecutor-4738-thread-1) [    x:collection1] o.a.s.h.l.XMLLoader xsltCacheLifetimeSeconds=60
   [junit4]   2> 1422741 INFO  (coreLoadExecutor-4738-thread-1) [    x:collection1] o.a.s.h.l.XMLLoader xsltCacheLifetimeSeconds=60
   [junit4]   2> 1422741 INFO  (coreLoadExecutor-4738-thread-1) [    x:collection1] o.a.s.h.l.XMLLoader xsltCacheLifetimeSeconds=60
   [junit4]   2> 1422743 INFO  (coreLoadExecutor-4738-thread-1) [    x:collection1] o.a.s.c.PluginBag requestHandler : 'lazy' created with startup=lazy 
   [junit4]   2> 1422744 INFO  (coreLoadExecutor-4738-thread-1) [    x:collection1] o.a.s.c.RequestHandlers Registered paths: /admin/mbeans,standard,spellCheckCompRH,lazy,/update/json/docs,/admin/luke,spellCheckWithWordbreak_Direct,tvrh,/get,/admin/properties,/update/json,mltrh,/admin/threads,/search-facet-def,/update/csv,/search-facet-invariants,/admin/segments,spellCheckCompRH1,/mlt,/admin/system,/replication,dismax,defaults,/config,/schema,/admin/plugins,/admin/logging,spellCheckWithWordbreak,mock,/admin/ping,/update,/admin/file,/terms,spellCheckCompRH_Direct,/debug/dump
   [junit4]   2> 1422745 WARN  (coreLoadExecutor-4738-thread-1) [    x:collection1] o.a.s.c.SolrCore solrconfig.xml uses deprecated <admin/gettableFiles>, Please update your config to use the ShowFileRequestHandler.
   [junit4]   2> 1422745 INFO  (coreLoadExecutor-4738-thread-1) [    x:collection1] o.a.s.c.SolrCore Using default statsCache cache: org.apache.solr.search.stats.LocalStatsCache
   [junit4]   2> 1422746 INFO  (coreLoadExecutor-4738-thread-1) [    x:collection1] o.a.s.u.UpdateHandler Using UpdateLog implementation: org.apache.solr.update.UpdateLog
   [junit4]   2> 1422746 INFO  (coreLoadExecutor-4738-thread-1) [    x:collection1] o.a.s.u.UpdateLog Initializing UpdateLog: dataDir= defaultSyncLevel=FLUSH numRecordsToKeep=100 maxNumLogsToKeep=10 numVersionBuckets=65536
   [junit4]   2> 1422746 INFO  (coreLoadExecutor-4738-thread-1) [    x:collection1] o.a.s.c.SolrCore Hard AutoCommit: disabled
   [junit4]   2> 1422746 INFO  (coreLoadExecutor-4738-thread-1) [    x:collection1] o.a.s.c.SolrCore Soft AutoCommit: disabled
   [junit4]   2> 1422747 INFO  (coreLoadExecutor-4738-thread-1) [    x:collection1] o.a.s.u.RandomMergePolicy RandomMergePolicy wrapping class org.apache.lucene.index.TieredMergePolicy: [TieredMergePolicy: maxMergeAtOnce=48, maxMergeAtOnceExplicit=13, maxMergedSegmentMB=54.7705078125, floorSegmentMB=1.4794921875, forceMergeDeletesPctAllowed=9.858192004623433, segmentsPerTier=49.0, maxCFSSegmentSizeMB=8.796093022207999E12, noCFSRatio=1.0
   [junit4]   2> 1422747 INFO  (coreLoadExecutor-4738-thread-1) [    x:collection1] o.a.s.c.SolrCore SolrDeletionPolicy.onInit: commits: num=1
   [junit4]   2> 	commit{dir=MockDirectoryWrapper(RAMDirectory@7425773c lockFactory=org.apache.lucene.store.SingleInstanceLockFactory@4a869f5e),segFN=segments_1,generation=1}
   [junit4]   2> 1422747 INFO  (coreLoadExecutor-4738-thread-1) [    x:collection1] o.a.s.c.SolrCore newest commit generation = 1
   [junit4]   2> 1422747 INFO  (coreLoadExecutor-4738-thread-1) [    x:collection1] o.a.s.s.SolrIndexSearcher Opening Searcher@9c572[collection1] main
   [junit4]   2> 1422747 INFO  (coreLoadExecutor-4738-thread-1) [    x:collection1] o.a.s.r.RestManager Initializing RestManager with initArgs: {storageIO=org.apache.solr.rest.ManagedResourceStorage$InMemoryStorageIO}
   [junit4]   2> 1422747 INFO  (coreLoadExecutor-4738-thread-1) [    x:collection1] o.a.s.r.ManagedResourceStorage Reading _rest_managed.json using InMemoryStorage
   [junit4]   2> 1422747 INFO  (coreLoadExecutor-4738-thread-1) [    x:collection1] o.a.s.r.RestManager Initializing 0 registered ManagedResources
   [junit4]   2> 1422747 INFO  (coreLoadExecutor-4738-thread-1) [    x:collection1] o.a.s.h.c.SpellCheckComponent Initializing spell checkers
   [junit4]   2> 1422779 INFO  (coreLoadExecutor-4738-thread-1) [    x:collection1] o.a.s.s.DirectSolrSpellChecker init: {name=direct,classname=DirectSolrSpellChecker,field=lowerfilt,minQueryLength=3}
   [junit4]   2> 1422930 INFO  (coreLoadExecutor-4738-thread-1) [    x:collection1] o.a.s.h.ReplicationHandler Commits will be reserved for  10000
   [junit4]   2> 1422931 INFO  (searcherExecutor-4739-thread-1-processing-x:collection1) [    x:collection1] o.a.s.h.c.SpellCheckComponent Loading spell index for spellchecker: default
   [junit4]   2> 1422931 INFO  (searcherExecutor-4739-thread-1-processing-x:collection1) [    x:collection1] o.a.s.h.c.SpellCheckComponent Loading spell index for spellchecker: direct
   [junit4]   2> 1422931 INFO  (searcherExecutor-4739-thread-1-processing-x:collection1) [    x:collection1] o.a.s.h.c.SpellCheckComponent Loading spell index for spellchecker: wordbreak
   [junit4]   2> 1422931 INFO  (searcherExecutor-4739-thread-1-processing-x:collection1) [    x:collection1] o.a.s.h.c.SpellCheckComponent Loading spell index for spellchecker: multipleFields
   [junit4]   2> 1422931 INFO  (searcherExecutor-4739-thread-1-processing-x:collection1) [    x:collection1] o.a.s.h.c.SpellCheckComponent Loading spell index for spellchecker: jarowinkler
   [junit4]   2> 1422931 INFO  (searcherExecutor-4739-thread-1-processing-x:collection1) [    x:collection1] o.a.s.h.c.SpellCheckComponent Loading spell index for spellchecker: external
   [junit4]   2> 1422931 INFO  (coreLoadExecutor-4738-thread-1) [    x:collection1] o.a.s.u.UpdateLog Looking up max value of version field to seed version buckets
   [junit4]   2> 1422931 INFO  (coreLoadExecutor-4738-thread-1) [    x:collection1] o.a.s.u.VersionInfo Refreshing highest value of _version_ for 65536 version buckets from index
   [junit4]   2> 1422931 INFO  (coreLoadExecutor-4738-thread-1) [    x:collection1] o.a.s.u.VersionInfo No terms found for _version_, cannot seed version bucket highest value from index
   [junit4]   2> 1422931 INFO  (searcherExecutor-4739-thread-1-processing-x:collection1) [    x:collection1] o.a.s.h.c.SpellCheckComponent Loading spell index for spellchecker: freq
   [junit4]   2> 1422931 INFO  (coreLoadExecutor-4738-thread-1) [    x:collection1] o.a.s.u.UpdateLog Could not find max version in index or recent updates, using new clock 1515361447608057856
   [junit4]   2> 1422931 INFO  (searcherExecutor-4739-thread-1-processing-x:collection1) [    x:collection1] o.a.s.h.c.SpellCheckComponent Loading spell index for spellchecker: fqcn
   [junit4]   2> 1422932 INFO  (searcherExecutor-4739-thread-1-processing-x:collection1) [    x:collection1] o.a.s.h.c.SpellCheckComponent Loading spell index for spellchecker: perDict
   [junit4]   2> 1422932 INFO  (searcherExecutor-4739-thread-1-processing-x:collection1) [    x:collection1] o.a.s.c.SolrCore [collection1] Registered new searcher Searcher@9c572[collection1] main{ExitableDirectoryReader(UninvertingDirectoryReader())}
   [junit4]   2> 1422933 INFO  (coreLoadExecutor-4738-thread-1) [    x:collection1] o.a.s.u.UpdateLog Took 1.0ms to seed version buckets with highest version 1515361447608057856
   [junit4]   2> 1422933 INFO  (coreLoadExecutor-4738-thread-1) [    x:collection1] o.a.s.c.CoreContainer registering core: collection1
   [junit4]   2> 1423251 INFO  (TEST-DistributedFacetPivotWhiteBoxTest.test-seed#[888062F01692F3DE]) [    ] o.a.s.SolrTestCaseJ4 Writing core.properties file to /home/jenkins/workspace/Lucene-Solr-5.x-Linux/solr/build/solr-core/test/J1/temp/solr.handler.component.DistributedFacetPivotWhiteBoxTest_888062F01692F3DE-001/tempDir-001/shard1/cores/collection1
   [junit4]   2> 1423252 INFO  (TEST-DistributedFacetPivotWhiteBoxTest.test-seed#[888062F01692F3DE]) [    ] o.e.j.s.Server jetty-9.2.13.v20150730
   [junit4]   2> 1423253 INFO  (TEST-DistributedFacetPivotWhiteBoxTest.test-seed#[888062F01692F3DE]) [    ] o.e.j.s.h.ContextHandler Started o.e.j.s.ServletContextHandler@7438fa55{/,null,AVAILABLE}
   [junit4]   2> 1423257 INFO  (TEST-DistributedFacetPivotWhiteBoxTest.test-seed#[888062F01692F3DE]) [    ] o.e.j.s.ServerConnector Started ServerConnector@165fa484{SSL-http/1.1}{127.0.0.1:57381}
   [junit4]   2> 1423257 INFO  (TEST-DistributedFacetPivotWhiteBoxTest.test-seed#[888062F01692F3DE]) [    ] o.e.j.s.Server Started @1425003ms
   [junit4]   2> 1423257 INFO  (TEST-DistributedFacetPivotWhiteBoxTest.test-seed#[888062F01692F3DE]) [    ] o.a.s.c.s.e.JettySolrRunner Jetty properties: {hostContext=/, hostPort=57381, coreRootDirectory=/home/jenkins/workspace/Lucene-Solr-5.x-Linux/solr/build/solr-core/test/J1/temp/solr.handler.component.DistributedFacetPivotWhiteBoxTest_888062F01692F3DE-001/tempDir-001/shard1/cores}
   [junit4]   2> 1423257 INFO  (TEST-DistributedFacetPivotWhiteBoxTest.test-seed#[888062F01692F3DE]) [    ] o.a.s.s.SolrDispatchFilter SolrDispatchFilter.init(): sun.misc.Launcher$AppClassLoader@4e0e2f2a
   [junit4]   2> 1423257 INFO  (TEST-DistributedFacetPivotWhiteBoxTest.test-seed#[888062F01692F3DE]) [    ] o.a.s.c.SolrResourceLoader new SolrResourceLoader for directory: '/home/jenkins/workspace/Lucene-Solr-5.x-Linux/solr/build/solr-core/test/J1/temp/solr.handler.component.DistributedFacetPivotWhiteBoxTest_888062F01692F3DE-001/tempDir-001/shard1/'
   [junit4]   2> 1423257 INFO  (TEST-DistributedFacetPivotWhiteBoxTest.test-seed#[888062F01692F3DE]) [    ] o.a.s.c.SolrResourceLoader JNDI not configured for solr (NoInitialContextEx)
   [junit4]   2> 1423257 INFO  (TEST-DistributedFacetPivotWhiteBoxTest.test-seed#[888062F01692F3DE]) [    ] o.a.s.c.SolrResourceLoader solr home defaulted to 'solr/' (could not find system property or JNDI)
   [junit4]   2> 1423271 INFO  (TEST-DistributedFacetPivotWhiteBoxTest.test-seed#[888062F01692F3DE]) [    ] o.a.s.c.SolrXmlConfig Loading container configuration from /home/jenkins/workspace/Lucene-Solr-5.x-Linux/solr/build/solr-core/test/J1/temp/solr.handler.component.DistributedFacetPivotWhiteBoxTest_888062F01692F3DE-001/tempDir-001/shard1/solr.xml
   [junit4]   2> 1423275 INFO  (TEST-DistributedFacetPivotWhiteBoxTest.test-seed#[888062F01692F3DE]) [    ] o.a.s.c.CoresLocator Config-defined core root directory: /home/jenkins/workspace/Lucene-Solr-5.x-Linux/solr/build/solr-core/test/J1/temp/solr.handler.component.DistributedFacetPivotWhiteBoxTest_888062F01692F3DE-001/tempDir-001/shard1/cores
   [junit4]   2> 1423275 INFO  (TEST-DistributedFacetPivotWhiteBoxTest.test-seed#[888062F01692F3DE]) [    ] o.a.s.c.CoreContainer New CoreContainer 1600928362
   [junit4]   2> 1423275 INFO  (TEST-DistributedFacetPivotWhiteBoxTest.test-seed#[888062F01692F3DE]) [    ] o.a.s.c.CoreContainer Loading cores into CoreContainer [instanceDir=/home/jenkins/workspace/Lucene-Solr-5.x-Linux/solr/build/solr-core/test/J1/temp/solr.handler.component.DistributedFacetPivotWhiteBoxTest_888062F01692F3DE-001/tempDir-001/shard1/]
   [junit4]   2> 1423275 INFO  (TEST-DistributedFacetPivotWhiteBoxTest.test-seed#[888062F01692F3DE]) [    ] o.a.s.c.CoreContainer loading shared library: /home/jenkins/workspace/Lucene-Solr-5.x-Linux/solr/build/solr-core/test/J1/temp/solr.handler.component.DistributedFacetPivotWhiteBoxTest_888062F01692F3DE-001/tempDir-001/shard1/lib
   [junit4]   2> 1423276 WARN  (TEST-DistributedFacetPivotWhiteBoxTest.test-seed#[888062F01692F3DE]) [    ] o.a.s.c.SolrResourceLoader Can't find (or read) directory to add to classloader: lib (resolved as: /home/jenkins/workspace/Lucene-Solr-5.x-Linux/solr/build/solr-core/test/J1/temp/solr.handler.component.DistributedFacetPivotWhiteBoxTest_888062F01692F3DE-001/tempDir-001/shard1/lib).
   [junit4]   2> 1423281 INFO  (TEST-DistributedFacetPivotWhiteBoxTest.test-seed#[888062F01692F3DE]) [    ] o.a.s.h.c.HttpShardHandlerFactory created with socketTimeout : 90000,urlScheme : https,connTimeout : 15000,maxConnectionsPerHost : 20,maxConnections : 10000,corePoolSize : 0,maximumPoolSize : 2147483647,maxThreadIdleTime : 5,sizeOfQueue : -1,fairnessPolicy : false,useRetries : false,
   [junit4]   2> 1423283 INFO  (TEST-DistributedFacetPivotWhiteBoxTest.test-seed#[888062F01692F3DE]) [    ] o.a.s.u.UpdateShardHandler Creating UpdateShardHandler HTTP client with params: socketTimeout=340000&connTimeout=45000&retry=true
   [junit4]   2> 1423284 INFO  (TEST-DistributedFacetPivotWhiteBoxTest.test-seed#[888062F01692F3DE]) [    ] o.a.s.l.LogWatcher SLF4J impl is org.slf4j.impl.Log4jLoggerFactory
   [junit4]   2> 1423284 INFO  (TEST-DistributedFacetPivotWhiteBoxTest.test-seed#[888062F01692F3DE]) [    ] o.a.s.l.LogWatcher Registering Log Listener [Log4j (org.slf4j.impl.Log4jLoggerFactory)]
   [junit4]   2> 1423284 INFO  (TEST-DistributedFacetPivotWhiteBoxTest.test-seed#[888062F01692F3DE]) [    ] o.a.s.c.CoreContainer Security conf doesn't exist. Skipping setup for authorization module.
   [junit4]   2> 1423284 INFO  (TEST-DistributedFacetPivotWhiteBoxTest.test-seed#[888062F01692F3DE]) [    ] o.a.s.c.CoreContainer No authentication plugin used.
   [junit4]   2> 1423285 INFO  (TEST-DistributedFacetPivotWhiteBoxTest.test-seed#[888062F01692F3DE]) [    ] o.a.s.c.CoresLocator Looking for core definitions underneath /home/jenkins/workspace/Lucene-Solr-5.x-Linux/solr/build/solr-core/test/J1/temp/solr.handler.component.DistributedFacetPivotWhiteBoxTest_888062F01692F3DE-001/tempDir-001/shard1/cores
   [junit4]   2> 1423285 INFO  (TEST-DistributedFacetPivotWhiteBoxTest.test-seed#[888062F01692F3DE]) [    ] o.a.s.c.SolrCore Created CoreDescriptor: {name=collection1, config=solrconfig.xml, transient=false, schema=schema.xml, loadOnStartup=true, configSetProperties=configsetprops.json, instanceDir=/home/jenkins/workspace/Lucene-Solr-5.x-Linux/solr/build/solr-core/test/J1/temp/solr.handler.component.DistributedFacetPivotWhiteBoxTest_888062F01692F3DE-001/tempDir-001/shard1/cores/collection1, absoluteInstDir=/home/jenkins/workspace/Lucene-Solr-5.x-Linux/solr/build/solr-core/test/J1/temp/solr.handler.component.DistributedFacetPivotWhiteBoxTest_888062F01692F3DE-001/tempDir-001/shard1/cores/collection1/, configSet=collection1, dataDir=data/}
   [junit4]   2> 1423286 INFO  (TEST-DistributedFacetPivotWhiteBoxTest.test-seed#[888062F01692F3DE]) [    ] o.a.s.c.CoresLocator Found core collection1 in /home/jenkins/workspace/Lucene-Solr-5.x-Linux/solr/build/solr-core/test/J1/temp/solr.handler.component.DistributedFacetPivotWhiteBoxTest_888062F01692F3DE-001/tempDir-001/shard1/cores/collection1/
   [junit4]   2> 1423286 INFO  (TEST-DistributedFacetPivotWhiteBoxTest.test-seed#[888062F01692F3DE]) [    ] o.a.s.c.CoresLocator Found 1 core definitions
   [junit4]   2> 1423286 INFO  (coreLoadExecutor-4749-thread-1) [    ] o.a.s.c.SolrResourceLoader new SolrResourceLoader for directory: '/home/jenkins/workspace/Lucene-Solr-5.x-Linux/solr/core/src/test-files/solr/collection1/'
   [junit4]   2> 1423286 INFO  (coreLoadExecutor-4749-thread-1) [    ] o.a.s.c.SolrResourceLoader JNDI not configured for solr (NoInitialContextEx)
   [junit4]   2> 1423286 INFO  (coreLoadExecutor-4749-thread-1) [    ] o.a.s.c.SolrResourceLoader solr home defaulted to 'solr/' (could not find system property or JNDI)
   [junit4]   2> 1423286 INFO  (TEST-DistributedFacetPivotWhiteBoxTest.test-seed#[888062F01692F3DE]) [    ] o.a.s.s.SolrDispatchFilter user.dir=/home/jenkins/workspace/Lucene-Solr-5.x-Linux/solr/build/solr-core/test/J1
   [junit4]   2> 1423286 INFO  (TEST-DistributedFacetPivotWhiteBoxTest.test-seed#[888062F01692F3DE]) [    ] o.a.s.s.SolrDispatchFilter SolrDispatchFilter.init() done
   [junit4]   2> 1423287 INFO  (coreLoadExecutor-4749-thread-1) [    ] o.a.s.c.SolrResourceLoader Adding 'file:/home/jenkins/workspace/Lucene-Solr-5.x-Linux/solr/core/src/test-files/solr/collection1/lib/classes/' to classloader
   [junit4]   2> 1423287 INFO  (coreLoadExecutor-4749-thread-1) [    ] o.a.s.c.SolrResourceLoader Adding 'file:/home/jenkins/workspace/Lucene-Solr-5.x-Linux/solr/core/src/test-files/solr/collection1/lib/README' to classloader
   [junit4]   2> 1423304 INFO  (coreLoadExecutor-4749-thread-1) [    ] o.a.s.c.SolrConfig current version of requestparams : -1
   [junit4]   2> 1423314 INFO  (coreLoadExecutor-4749-thread-1) [    ] o.a.s.c.SolrConfig Using Lucene MatchVersion: 5.4.0
   [junit4]   2> 1423336 INFO  (coreLoadExecutor-4749-thread-1) [    ] o.a.s.c.Config Loaded SolrConfig: solrconfig.xml
   [junit4]   2> 1423336 INFO  (coreLoadExecutor-4749-thread-1) [    ] o.a.s.s.IndexSchema Reading Solr Schema from /home/jenkins/workspace/Lucene-Solr-5.x-Linux/solr/core/src/test-files/solr/collection1/conf/schema.xml
   [junit4]   2> 1423341 INFO  (coreLoadExecutor-4749-thread-1) [    ] o.a.s.s.IndexSchema [collection1] Schema name=test
   [junit4]   2> 1423455 INFO  (coreLoadExecutor-4749-thread-1) [    ] o.a.s.s.OpenExchangeRatesOrgProvider Initialized with rates=open-exchange-rates.json, refreshInterval=1440.
   [junit4]   2> 1423460 INFO  (coreLoadExecutor-4749-thread-1) [    ] o.a.s.s.IndexSchema default search field in schema is text
   [junit4]   2> 1423461 INFO  (coreLoadExecutor-4749-thread-1) [    ] o.a.s.s.IndexSchema unique key field: id
   [junit4]   2> 1423465 INFO  (coreLoadExecutor-4749-thread-1) [    ] o.a.s.s.FileExchangeRateProvider Reloading exchange rates from file currency.xml
   [junit4]   2> 1423467 INFO  (coreLoadExecutor-4749-thread-1) [    ] o.a.s.s.FileExchangeRateProvider Reloading exchange rates from file currency.xml
   [junit4]   2> 1423469 INFO  (coreLoadExecutor-4749-thread-1) [    ] o.a.s.s.OpenExchangeRatesOrgProvider Reloading exchange rates from open-exchange-rates.json
   [junit4]   2> 1423469 WARN  (coreLoadExecutor-4749-thread-1) [    ] o.a.s.s.OpenExchangeRatesOrgProvider Unknown key IMPORTANT NOTE
   [junit4]   2> 1423470 WARN  (coreLoadExecutor-4749-thread-1) [    ] o.a.s.s.OpenExchangeRatesOrgProvider Expected key, got STRING
   [junit4]   2> 1423470 INFO  (coreLoadExecutor-4749-thread-1) [    ] o.a.s.s.OpenExchangeRatesOrgProvider Reloading exchange rates from open-exchange-rates.json
   [junit4]   2> 1423470 WARN  (coreLoadExecutor-4749-thread-1) [    ] o.a.s.s.OpenExchangeRatesOrgProvider Unknown key IMPORTANT NOTE
   [junit4]   2> 1423470 WARN  (coreLoadExecutor-4749-thread-1) [    ] o.a.s.s.OpenExchangeRatesOrgProvider Expected key, got STRING
   [junit4]   2> 1423471 INFO  (coreLoadExecutor-4749-thread-1) [    ] o.a.s.c.ConfigSetProperties Did not find ConfigSet properties, assuming default properties: Can't find resource 'configsetprops.json' in classpath or '/home/jenkins/workspace/Lucene-Solr-5.x-Linux/solr/core/src/test-files/solr/collection1/conf'
   [junit4]   2> 1423471 INFO  (coreLoadExecutor-4749-thread-1) [    ] o.a.s.c.CoreContainer Creating SolrCore 'collection1' using configuration from configset /home/jenkins/workspace/Lucene-Solr-5.x-Linux/solr/core/src/test-files/solr/collection1
   [junit4]   2> 1423471 INFO  (coreLoadExecutor-4749-thread-1) [    x:collection1] o.a.s.c.SolrCore org.apache.solr.core.MockDirectoryFactory
   [junit4]   2> 1423471 INFO  (coreLoadExecutor-4749-thread-1) [    x:collection1] o.a.s.c.SolrCore [[collection1] ] Opening new SolrCore at [/home/jenkins/workspace/Lucene-Solr-5.x-Linux/solr/core/src/test-files/solr/collection1/], dataDir=[null]
   [junit4]   2> 1423471 INFO  (coreLoadExecutor-4749-thread-1) [    x:collection1] o.a.s.c.JmxMonitoredMap JMX monitoring is enabled. Adding Solr mbeans to JMX Server: com.sun.jmx.mbeanserver.JmxMBeanServer@76063992
   [junit4]   2> 1423472 INFO  (coreLoadExecutor-4749-thread-1) [    x:collection1] o.a.s.c.CachingDirectoryFactory return new directory for /home/jenkins/workspace/Lucene-Solr-5.x-Linux/solr/build/solr-core/test/J1/temp/solr.handler.component.DistributedFacetPivotWhiteBoxTest_888062F01692F3DE-001/tempDir-001/shard1/cores/collection1/data
   [junit4]   2> 1423472 INFO  (coreLoadExecutor-4749-thread-1) [    x:collection1] o.a.s.c.SolrCore New index directory detected: old=null new=/home/jenkins/workspace/Lucene-Solr-5.x-Linux/solr/build/solr-core/test/J1/temp/solr.handler.component.DistributedFacetPivotWhiteBoxTest_888062F01692F3DE-001/tempDir-001/shard1/cores/collection1/data/index/
   [junit4]   2> 1423472 WARN  (coreLoadExecutor-4749-thread-1) [    x:collection1] o.a.s.c.SolrCore [collection1] Solr index directory '/home/jenkins/workspace/Lucene-Solr-5.x-Linux/solr/build/solr-core/test/J1/temp/solr.handler.component.DistributedFacetPivotWhiteBoxTest_888062F01692F3DE-001/tempDir-001/shard1/cores/collection1/data/index' doesn't exist. Creating new index...
   [junit4]   2> 1423472 INFO  (coreLoadExecutor-4749-thread-1) [    x:collection1] o.a.s.c.CachingDirectoryFactory return new directory for /home/jenkins/workspace/Lucene-Solr-5.x-Linux/solr/build/solr-core/test/J1/temp/solr.handler.component.DistributedFacetPivotWhiteBoxTest_888062F01692F3DE-001/tempDir-001/shard1/cores/collection1/data/index
   [junit4]   2> 1423472 INFO  (coreLoadExecutor-4749-thread-1) [    x:collection1] o.a.s.u.RandomMergePolicy RandomMergePolicy wrapping class org.apache.lucene.index.LogByteSizeMergePolicy: [LogByteSizeMergePolicy: minMergeSize=1677721, mergeFactor=17, maxMergeSize=2147483648, maxMergeSizeForForcedMerge=9223372036854775807, calibrateSizeByDeletes=false, maxMergeDocs=2147483647, maxCFSSegmentSizeMB=8.796093022207999E12, noCFSRatio=0.10394772538710342]
   [junit4]   2> 1423473 INFO  (coreLoadExecutor-4749-thread-1) [    x:collection1] o.a.s.c.SolrCore SolrDeletionPolicy.onCommit: commits: num=1
   [junit4]   2> 	commit{dir=MockDirectoryWrapper(RAMDirectory@5c87e48d lockFactory=org.apache.lucene.store.SingleInstanceLockFactory@3354fa83),segFN=segments_1,generation=1}
   [junit4]   2> 1423473 INFO  (coreLoadExecutor-4749-thread-1) [    x:collection1] o.a.s.c.SolrCore newest commit generation = 1
   [junit4]   2> 1423484 INFO  (OldIndexDirectoryCleanupThreadForCore-collection1) [    x:collection1] o.a.s.c.SolrCore Looking for old index directories to cleanup for core collection1 in /home/jenkins/workspace/Lucene-Solr-5.x-Linux/solr/build/solr-core/test/J1/temp/solr.handler.component.DistributedFacetPivotWhiteBoxTest_888062F01692F3DE-001/tempDir-001/shard1/cores/collection1/data/
   [junit4]   2> 1423484 WARN  (OldIndexDirectoryCleanupThreadForCore-collection1) [    x:collection1] o.a.s.c.DirectoryFactory /home/jenkins/workspace/Lucene-Solr-5.x-Linux/solr/build/solr-core/test/J1/temp/solr.handler.component.DistributedFacetPivotWhiteBoxTest_888062F01692F3DE-001/tempDir-001/shard1/cores/collection1/data/ does not point to a valid data directory; skipping clean-up of old index directories.
   [junit4]   2> 1423485 INFO  (coreLoadExecutor-4749-thread-1) [    x:collection1] o.a.s.u.p.UpdateRequestProcessorChain creating updateRequestProcessorChain "dedupe"
   [junit4]   2> 1423485 INFO  (coreLoadExecutor-4749-thread-1) [    x:collection1] o.a.s.u.p.UpdateRequestProcessorChain inserting DistributedUpdateProcessorFactory into updateRequestProcessorChain "dedupe"
   [junit4]   2> 1423485 INFO  (coreLoadExecutor-4749-thread-1) [    x:collection1] o.a.s.u.p.UpdateRequestProcessorChain creating updateRequestProcessorChain "dedupe-allfields"
   [junit4]   2> 1423485 INFO  (coreLoadExecutor-4749-thread-1) [    x:collection1] o.a.s.u.p.UpdateRequestProcessorChain inserting DistributedUpdateProcessorFactory into updateRequestProcessorChain "dedupe-allfields"
   [junit4]   2> 1423485 INFO  (coreLoadExecutor-4749-thread-1) [    x:collection1] o.a.s.u.p.UpdateRequestProcessorChain creating updateRequestProcessorChain "stored_sig"
   [junit4]   2> 1423485 INFO  (coreLoadExecutor-4749-thread-1) [    x:collection1] o.a.s.u.p.UpdateRequestProcessorChain inserting DistributedUpdateProcessorFactory into updateRequestProcessorChain "stored_sig"
   [junit4]   2> 1423485 INFO  (coreLoadExecutor-4749-thread-1) [    x:collection1] o.a.s.u.p.UpdateRequestProcessorChain creating updateRequestProcessorChain "uniq-fields"
   [junit4]   2> 1423485 INFO  (coreLoadExecutor-4749-thread-1) [    x:collection1] o.a.s.u.p.UpdateRequestProcessorChain inserting DistributedUpdateProcessorFactory into updateRequestProcessorChain "uniq-fields"
   [junit4]   2> 1423485 INFO  (coreLoadExecutor-4749-thread-1) [    x:collection1] o.a.s.u.p.UpdateRequestProcessorChain creating updateRequestProcessorChain "distrib-dup-test-chain-explicit"
   [junit4]   2> 1423485 INFO  (coreLoadExecutor-4749-thread-1) [    x:collection1] o.a.s.u.p.UpdateRequestProcessorChain creating updateRequestProcessorChain "distrib-dup-test-chain-implicit"
   [junit4]   2> 1423485 INFO  (coreLoadExecutor-4749-thread-1) [    x:collection1] o.a.s.u.p.UpdateRequestProcessorChain inserting DistributedUpdateProcessorFactory into updateRequestProcessorChain "distrib-dup-test-chain-implicit"
   [junit4]   2> 1423486 INFO  (coreLoadExecutor-4749-thread-1) [    x:collection1] o.a.s.c.SolrCore no updateRequestProcessorChain defined as default, creating implicit default
   [junit4]   2> 1423487 INFO  (coreLoadExecutor-4749-thread-1) [    x:collection1] o.a.s.h.l.XMLLoader xsltCacheLifetimeSeconds=6

[...truncated too long message...]

tusTest, DistributedFacetPivotWhiteBoxTest]
   [junit4]   2> NOTE: reproduce with: ant test  -Dtestcase=DistributedFacetPivotWhiteBoxTest -Dtests.seed=888062F01692F3DE -Dtests.multiplier=3 -Dtests.slow=true -Dtests.locale=fr -Dtests.timezone=America/Indiana/Marengo -Dtests.asserts=true -Dtests.file.encoding=UTF-8
   [junit4] ERROR   0.00s J1 | DistributedFacetPivotWhiteBoxTest (suite) <<<
   [junit4]    > Throwable #1: com.carrotsearch.randomizedtesting.ThreadLeakError: 2 threads leaked from SUITE scope at org.apache.solr.handler.component.DistributedFacetPivotWhiteBoxTest: 
   [junit4]    >    1) Thread[id=11614, name=searcherExecutor-4739-thread-1, state=WAITING, group=TGRP-DistributedFacetPivotWhiteBoxTest]
   [junit4]    >         at sun.misc.Unsafe.park(Native Method)
   [junit4]    >         at java.util.concurrent.locks.LockSupport.park(LockSupport.java:175)
   [junit4]    >         at java.util.concurrent.locks.AbstractQueuedSynchronizer$ConditionObject.await(AbstractQueuedSynchronizer.java:2039)
   [junit4]    >         at java.util.concurrent.LinkedBlockingQueue.take(LinkedBlockingQueue.java:442)
   [junit4]    >         at java.util.concurrent.ThreadPoolExecutor.getTask(ThreadPoolExecutor.java:1067)
   [junit4]    >         at java.util.concurrent.ThreadPoolExecutor.runWorker(ThreadPoolExecutor.java:1127)
   [junit4]    >         at java.util.concurrent.ThreadPoolExecutor$Worker.run(ThreadPoolExecutor.java:617)
   [junit4]    >         at java.lang.Thread.run(Thread.java:745)
   [junit4]    >    2) Thread[id=11606, name=qtp489986831-11606, state=RUNNABLE, group=TGRP-DistributedFacetPivotWhiteBoxTest]
   [junit4]    >         at java.util.WeakHashMap.get(WeakHashMap.java:403)
   [junit4]    >         at org.apache.solr.servlet.cache.HttpCacheHeaderUtil.calcEtag(HttpCacheHeaderUtil.java:102)
   [junit4]    >         at org.apache.solr.servlet.cache.HttpCacheHeaderUtil.doCacheHeaderValidation(HttpCacheHeaderUtil.java:224)
   [junit4]    >         at org.apache.solr.servlet.HttpSolrCall.call(HttpSolrCall.java:452)
   [junit4]    >         at org.apache.solr.servlet.SolrDispatchFilter.doFilter(SolrDispatchFilter.java:220)
   [junit4]    >         at org.apache.solr.servlet.SolrDispatchFilter.doFilter(SolrDispatchFilter.java:179)
   [junit4]    >         at org.eclipse.jetty.servlet.ServletHandler$CachedChain.doFilter(ServletHandler.java:1652)
   [junit4]    >         at org.apache.solr.client.solrj.embedded.JettySolrRunner$DebugFilter.doFilter(JettySolrRunner.java:109)
   [junit4]    >         at org.eclipse.jetty.servlet.ServletHandler$CachedChain.doFilter(ServletHandler.java:1652)
   [junit4]    >         at org.eclipse.jetty.servlets.UserAgentFilter.doFilter(UserAgentFilter.java:83)
   [junit4]    >         at org.eclipse.jetty.servlets.GzipFilter.doFilter(GzipFilter.java:364)
   [junit4]    >         at org.eclipse.jetty.servlet.ServletHandler$CachedChain.doFilter(ServletHandler.java:1652)
   [junit4]    >         at org.eclipse.jetty.servlet.ServletHandler.doHandle(ServletHandler.java:585)
   [junit4]    >         at org.eclipse.jetty.server.session.SessionHandler.doHandle(SessionHandler.java:221)
   [junit4]    >         at org.eclipse.jetty.server.handler.ContextHandler.doHandle(ContextHandler.java:1127)
   [junit4]    >         at org.eclipse.jetty.servlet.ServletHandler.doScope(ServletHandler.java:515)
   [junit4]    >         at org.eclipse.jetty.server.session.SessionHandler.doScope(SessionHandler.java:185)
   [junit4]    >         at org.eclipse.jetty.server.handler.ContextHandler.doScope(ContextHandler.java:1061)
   [junit4]    >         at org.eclipse.jetty.server.handler.ScopedHandler.handle(ScopedHandler.java:141)
   [junit4]    >         at org.eclipse.jetty.server.handler.HandlerWrapper.handle(HandlerWrapper.java:97)
   [junit4]    >         at org.eclipse.jetty.server.Server.handle(Server.java:499)
   [junit4]    >         at org.eclipse.jetty.server.HttpChannel.handle(HttpChannel.java:310)
   [junit4]    >         at org.eclipse.jetty.server.HttpConnection.onFillable(HttpConnection.java:257)
   [junit4]    >         at org.eclipse.jetty.io.AbstractConnection$2.run(AbstractConnection.java:540)
   [junit4]    >         at org.eclipse.jetty.util.thread.QueuedThreadPool.runJob(QueuedThreadPool.java:635)
   [junit4]    >         at org.eclipse.jetty.util.thread.QueuedThreadPool$3.run(QueuedThreadPool.java:555)
   [junit4]    >         at java.lang.Thread.run(Thread.java:745)
   [junit4]    > 	at __randomizedtesting.SeedInfo.seed([888062F01692F3DE]:0)Throwable #2: com.carrotsearch.randomizedtesting.ThreadLeakError: There are still zombie threads that couldn't be terminated:
   [junit4]    >    1) Thread[id=11614, name=searcherExecutor-4739-thread-1, state=WAITING, group=TGRP-DistributedFacetPivotWhiteBoxTest]
   [junit4]    >         at sun.misc.Unsafe.park(Native Method)
   [junit4]    >         at java.util.concurrent.locks.LockSupport.park(LockSupport.java:175)
   [junit4]    >         at java.util.concurrent.locks.AbstractQueuedSynchronizer$ConditionObject.await(AbstractQueuedSynchronizer.java:2039)
   [junit4]    >         at java.util.concurrent.LinkedBlockingQueue.take(LinkedBlockingQueue.java:442)
   [junit4]    >         at java.util.concurrent.ThreadPoolExecutor.getTask(ThreadPoolExecutor.java:1067)
   [junit4]    >         at java.util.concurrent.ThreadPoolExecutor.runWorker(ThreadPoolExecutor.java:1127)
   [junit4]    >         at java.util.concurrent.ThreadPoolExecutor$Worker.run(ThreadPoolExecutor.java:617)
   [junit4]    >         at java.lang.Thread.run(Thread.java:745)
   [junit4]    >    2) Thread[id=11606, name=qtp489986831-11606, state=RUNNABLE, group=TGRP-DistributedFacetPivotWhiteBoxTest]
   [junit4]    >         at java.util.WeakHashMap.get(WeakHashMap.java:403)
   [junit4]    >         at org.apache.solr.servlet.cache.HttpCacheHeaderUtil.calcEtag(HttpCacheHeaderUtil.java:102)
   [junit4]    >         at org.apache.solr.servlet.cache.HttpCacheHeaderUtil.doCacheHeaderValidation(HttpCacheHeaderUtil.java:224)
   [junit4]    >         at org.apache.solr.servlet.HttpSolrCall.call(HttpSolrCall.java:452)
   [junit4]    >         at org.apache.solr.servlet.SolrDispatchFilter.doFilter(SolrDispatchFilter.java:220)
   [junit4]    >         at org.apache.solr.servlet.SolrDispatchFilter.doFilter(SolrDispatchFilter.java:179)
   [junit4]    >         at org.eclipse.jetty.servlet.ServletHandler$CachedChain.doFilter(ServletHandler.java:1652)
   [junit4]    >         at org.apache.solr.client.solrj.embedded.JettySolrRunner$DebugFilter.doFilter(JettySolrRunner.java:109)
   [junit4]    >         at org.eclipse.jetty.servlet.ServletHandler$CachedChain.doFilter(ServletHandler.java:1652)
   [junit4]    >         at org.eclipse.jetty.servlets.UserAgentFilter.doFilter(UserAgentFilter.java:83)
   [junit4]    >         at org.eclipse.jetty.servlets.GzipFilter.doFilter(GzipFilter.java:364)
   [junit4]    >         at org.eclipse.jetty.servlet.ServletHandler$CachedChain.doFilter(ServletHandler.java:1652)
   [junit4]    >         at org.eclipse.jetty.servlet.ServletHandler.doHandle(ServletHandler.java:585)
   [junit4]    >         at org.eclipse.jetty.server.session.SessionHandler.doHandle(SessionHandler.java:221)
   [junit4]    >         at org.eclipse.jetty.server.handler.ContextHandler.doHandle(ContextHandler.java:1127)
   [junit4]    >         at org.eclipse.jetty.servlet.ServletHandler.doScope(ServletHandler.java:515)
   [junit4]    >         at org.eclipse.jetty.server.session.SessionHandler.doScope(SessionHandler.java:185)
   [junit4]    >         at org.eclipse.jetty.server.handler.ContextHandler.doScope(ContextHandler.java:1061)
   [junit4]    >         at org.eclipse.jetty.server.handler.ScopedHandler.handle(ScopedHandler.java:141)
   [junit4]    >         at org.eclipse.jetty.server.handler.HandlerWrapper.handle(HandlerWrapper.java:97)
   [junit4]    >         at org.eclipse.jetty.server.Server.handle(Server.java:499)
   [junit4]    >         at org.eclipse.jetty.server.HttpChannel.handle(HttpChannel.java:310)
   [junit4]    >         at org.eclipse.jetty.server.HttpConnection.onFillable(HttpConnection.java:257)
   [junit4]    >         at org.eclipse.jetty.io.AbstractConnection$2.run(AbstractConnection.java:540)
   [junit4]    >         at org.eclipse.jetty.util.thread.QueuedThreadPool.runJob(QueuedThreadPool.java:635)
   [junit4]    >         at org.eclipse.jetty.util.thread.QueuedThreadPool$3.run(QueuedThreadPool.java:555)
   [junit4]    >         at java.lang.Thread.run(Thread.java:745)
   [junit4]    > 	at __randomizedtesting.SeedInfo.seed([888062F01692F3DE]:0)
   [junit4] Completed [521/542] on J1 in 147.55s, 1 test, 3 errors <<< FAILURES!

[...truncated 83 lines...]
BUILD FAILED
/home/jenkins/workspace/Lucene-Solr-5.x-Linux/build.xml:785: The following error occurred while executing this line:
/home/jenkins/workspace/Lucene-Solr-5.x-Linux/build.xml:729: The following error occurred while executing this line:
/home/jenkins/workspace/Lucene-Solr-5.x-Linux/build.xml:59: The following error occurred while executing this line:
/home/jenkins/workspace/Lucene-Solr-5.x-Linux/solr/build.xml:233: The following error occurred while executing this line:
/home/jenkins/workspace/Lucene-Solr-5.x-Linux/solr/common-build.xml:526: The following error occurred while executing this line:
/home/jenkins/workspace/Lucene-Solr-5.x-Linux/lucene/common-build.xml:1452: The following error occurred while executing this line:
/home/jenkins/workspace/Lucene-Solr-5.x-Linux/lucene/common-build.xml:1006: There were test failures: 542 suites (7 ignored), 2143 tests, 2 suite-level errors, 1 error, 123 ignored (37 assumptions) [seed: 888062F01692F3DE]

Total time: 47 minutes 10 seconds
Build step 'Invoke Ant' marked build as failure
Archiving artifacts
[WARNINGS] Skipping publisher since build result is FAILURE
Recording test results
Email was triggered for: Failure - Any
Sending email for trigger: Failure - Any



Mime
View raw message