lucene-dev mailing list archives

Site index · List index
Message view « Date » · « Thread »
Top « Date » · « Thread »
From Apache Jenkins Server <jenk...@builds.apache.org>
Subject [JENKINS] Lucene-Solr-NightlyTests-5.x - Build # 981 - Still Failing
Date Fri, 09 Oct 2015 23:49:35 GMT
Build: https://builds.apache.org/job/Lucene-Solr-NightlyTests-5.x/981/

3 tests failed.
FAILED:  org.apache.solr.cloud.SolrCloudExampleTest.testLoadDocsIntoGettingStartedCollection

Error Message:
Delete action failed!

Stack Trace:
java.lang.AssertionError: Delete action failed!
	at __randomizedtesting.SeedInfo.seed([FD8F3F9C919320A6:EEEC0DF3A0FC9900]:0)
	at org.junit.Assert.fail(Assert.java:93)
	at org.junit.Assert.assertTrue(Assert.java:43)
	at org.apache.solr.cloud.SolrCloudExampleTest.doTestDeleteAction(SolrCloudExampleTest.java:169)
	at org.apache.solr.cloud.SolrCloudExampleTest.testLoadDocsIntoGettingStartedCollection(SolrCloudExampleTest.java:145)
	at sun.reflect.NativeMethodAccessorImpl.invoke0(Native Method)
	at sun.reflect.NativeMethodAccessorImpl.invoke(NativeMethodAccessorImpl.java:57)
	at sun.reflect.DelegatingMethodAccessorImpl.invoke(DelegatingMethodAccessorImpl.java:43)
	at java.lang.reflect.Method.invoke(Method.java:606)
	at com.carrotsearch.randomizedtesting.RandomizedRunner.invoke(RandomizedRunner.java:1665)
	at com.carrotsearch.randomizedtesting.RandomizedRunner$8.evaluate(RandomizedRunner.java:864)
	at com.carrotsearch.randomizedtesting.RandomizedRunner$9.evaluate(RandomizedRunner.java:900)
	at com.carrotsearch.randomizedtesting.RandomizedRunner$10.evaluate(RandomizedRunner.java:914)
	at org.apache.solr.BaseDistributedSearchTestCase$ShardsRepeatRule$ShardsFixedStatement.callStatement(BaseDistributedSearchTestCase.java:963)
	at org.apache.solr.BaseDistributedSearchTestCase$ShardsRepeatRule$ShardsStatement.evaluate(BaseDistributedSearchTestCase.java:938)
	at com.carrotsearch.randomizedtesting.rules.SystemPropertiesRestoreRule$1.evaluate(SystemPropertiesRestoreRule.java:57)
	at org.apache.lucene.util.TestRuleSetupTeardownChained$1.evaluate(TestRuleSetupTeardownChained.java:50)
	at org.apache.lucene.util.AbstractBeforeAfterRule$1.evaluate(AbstractBeforeAfterRule.java:46)
	at org.apache.lucene.util.TestRuleThreadAndTestName$1.evaluate(TestRuleThreadAndTestName.java:49)
	at org.apache.lucene.util.TestRuleIgnoreAfterMaxFailures$1.evaluate(TestRuleIgnoreAfterMaxFailures.java:65)
	at org.apache.lucene.util.TestRuleMarkFailure$1.evaluate(TestRuleMarkFailure.java:48)
	at com.carrotsearch.randomizedtesting.rules.StatementAdapter.evaluate(StatementAdapter.java:36)
	at com.carrotsearch.randomizedtesting.ThreadLeakControl$StatementRunner.run(ThreadLeakControl.java:367)
	at com.carrotsearch.randomizedtesting.ThreadLeakControl.forkTimeoutingTask(ThreadLeakControl.java:809)
	at com.carrotsearch.randomizedtesting.ThreadLeakControl$3.evaluate(ThreadLeakControl.java:460)
	at com.carrotsearch.randomizedtesting.RandomizedRunner.runSingleTest(RandomizedRunner.java:873)
	at com.carrotsearch.randomizedtesting.RandomizedRunner$5.evaluate(RandomizedRunner.java:775)
	at com.carrotsearch.randomizedtesting.RandomizedRunner$6.evaluate(RandomizedRunner.java:809)
	at com.carrotsearch.randomizedtesting.RandomizedRunner$7.evaluate(RandomizedRunner.java:820)
	at com.carrotsearch.randomizedtesting.rules.StatementAdapter.evaluate(StatementAdapter.java:36)
	at com.carrotsearch.randomizedtesting.rules.SystemPropertiesRestoreRule$1.evaluate(SystemPropertiesRestoreRule.java:57)
	at org.apache.lucene.util.AbstractBeforeAfterRule$1.evaluate(AbstractBeforeAfterRule.java:46)
	at com.carrotsearch.randomizedtesting.rules.StatementAdapter.evaluate(StatementAdapter.java:36)
	at org.apache.lucene.util.TestRuleStoreClassName$1.evaluate(TestRuleStoreClassName.java:42)
	at com.carrotsearch.randomizedtesting.rules.NoShadowingOrOverridesOnMethodsRule$1.evaluate(NoShadowingOrOverridesOnMethodsRule.java:39)
	at com.carrotsearch.randomizedtesting.rules.NoShadowingOrOverridesOnMethodsRule$1.evaluate(NoShadowingOrOverridesOnMethodsRule.java:39)
	at com.carrotsearch.randomizedtesting.rules.StatementAdapter.evaluate(StatementAdapter.java:36)
	at com.carrotsearch.randomizedtesting.rules.StatementAdapter.evaluate(StatementAdapter.java:36)
	at com.carrotsearch.randomizedtesting.rules.StatementAdapter.evaluate(StatementAdapter.java:36)
	at org.apache.lucene.util.TestRuleAssertionsRequired$1.evaluate(TestRuleAssertionsRequired.java:54)
	at org.apache.lucene.util.TestRuleMarkFailure$1.evaluate(TestRuleMarkFailure.java:48)
	at org.apache.lucene.util.TestRuleIgnoreAfterMaxFailures$1.evaluate(TestRuleIgnoreAfterMaxFailures.java:65)
	at org.apache.lucene.util.TestRuleIgnoreTestSuites$1.evaluate(TestRuleIgnoreTestSuites.java:55)
	at com.carrotsearch.randomizedtesting.rules.StatementAdapter.evaluate(StatementAdapter.java:36)
	at com.carrotsearch.randomizedtesting.ThreadLeakControl$StatementRunner.run(ThreadLeakControl.java:367)
	at java.lang.Thread.run(Thread.java:745)


FAILED:  org.apache.solr.cloud.CollectionsAPIDistributedZkTest.test

Error Message:
Captured an uncaught exception in thread: Thread[id=2770, name=collection1, state=RUNNABLE, group=TGRP-CollectionsAPIDistributedZkTest]

Stack Trace:
com.carrotsearch.randomizedtesting.UncaughtExceptionError: Captured an uncaught exception in thread: Thread[id=2770, name=collection1, state=RUNNABLE, group=TGRP-CollectionsAPIDistributedZkTest]
Caused by: org.apache.solr.client.solrj.impl.HttpSolrClient$RemoteSolrException: Error from server at http://127.0.0.1:39407: Could not find collection : awholynewstresscollection_collection1_1
	at __randomizedtesting.SeedInfo.seed([FD8F3F9C919320A6]:0)
	at org.apache.solr.client.solrj.impl.HttpSolrClient.executeMethod(HttpSolrClient.java:575)
	at org.apache.solr.client.solrj.impl.HttpSolrClient.request(HttpSolrClient.java:241)
	at org.apache.solr.client.solrj.impl.HttpSolrClient.request(HttpSolrClient.java:230)
	at org.apache.solr.client.solrj.impl.LBHttpSolrClient.doRequest(LBHttpSolrClient.java:372)
	at org.apache.solr.client.solrj.impl.LBHttpSolrClient.request(LBHttpSolrClient.java:325)
	at org.apache.solr.client.solrj.impl.CloudSolrClient.sendRequest(CloudSolrClient.java:1099)
	at org.apache.solr.client.solrj.impl.CloudSolrClient.requestWithRetryOnStaleState(CloudSolrClient.java:870)
	at org.apache.solr.client.solrj.impl.CloudSolrClient.request(CloudSolrClient.java:806)
	at org.apache.solr.client.solrj.SolrClient.request(SolrClient.java:1220)
	at org.apache.solr.cloud.CollectionsAPIDistributedZkTest$1CollectionThread.run(CollectionsAPIDistributedZkTest.java:895)


FAILED:  org.apache.solr.cloud.LeaderInitiatedRecoveryOnShardRestartTest.testRestartWithAllInLIR

Error Message:
Captured an uncaught exception in thread: Thread[id=67647, name=coreZkRegister-4391-thread-1, state=RUNNABLE, group=TGRP-LeaderInitiatedRecoveryOnShardRestartTest]

Stack Trace:
com.carrotsearch.randomizedtesting.UncaughtExceptionError: Captured an uncaught exception in thread: Thread[id=67647, name=coreZkRegister-4391-thread-1, state=RUNNABLE, group=TGRP-LeaderInitiatedRecoveryOnShardRestartTest]
Caused by: java.lang.AssertionError
	at __randomizedtesting.SeedInfo.seed([FD8F3F9C919320A6]:0)
	at org.apache.solr.cloud.ZkController.updateLeaderInitiatedRecoveryState(ZkController.java:2133)
	at org.apache.solr.cloud.ShardLeaderElectionContext.runLeaderProcess(ElectionContext.java:434)
	at org.apache.solr.cloud.LeaderElector.runIamLeaderProcess(LeaderElector.java:197)
	at org.apache.solr.cloud.LeaderElector.checkIfIamLeader(LeaderElector.java:157)
	at org.apache.solr.cloud.LeaderElector.joinElection(LeaderElector.java:346)
	at org.apache.solr.cloud.ZkController.joinElection(ZkController.java:1113)
	at org.apache.solr.cloud.ZkController.register(ZkController.java:926)
	at org.apache.solr.cloud.ZkController.register(ZkController.java:881)
	at org.apache.solr.core.ZkContainer$2.run(ZkContainer.java:183)
	at org.apache.solr.common.util.ExecutorUtil$MDCAwareThreadPoolExecutor$1.run(ExecutorUtil.java:231)
	at java.util.concurrent.ThreadPoolExecutor.runWorker(ThreadPoolExecutor.java:1145)
	at java.util.concurrent.ThreadPoolExecutor$Worker.run(ThreadPoolExecutor.java:615)
	at java.lang.Thread.run(Thread.java:745)




Build Log:
[...truncated 10476 lines...]
   [junit4] Suite: org.apache.solr.cloud.CollectionsAPIDistributedZkTest
   [junit4]   2> Creating dataDir: /x1/jenkins/jenkins-slave/workspace/Lucene-Solr-NightlyTests-5.x/solr/build/solr-core/test/J1/temp/solr.cloud.CollectionsAPIDistributedZkTest_FD8F3F9C919320A6-001/init-core-data-001
   [junit4]   2> 877612 INFO  (SUITE-CollectionsAPIDistributedZkTest-seed#[FD8F3F9C919320A6]-worker) [    ] o.a.s.SolrTestCaseJ4 Randomized ssl (false) and clientAuth (false)
   [junit4]   2> 877612 INFO  (SUITE-CollectionsAPIDistributedZkTest-seed#[FD8F3F9C919320A6]-worker) [    ] o.a.s.BaseDistributedSearchTestCase Setting hostContext system property: /
   [junit4]   2> 877616 INFO  (TEST-CollectionsAPIDistributedZkTest.test-seed#[FD8F3F9C919320A6]) [    ] o.a.s.c.ZkTestServer STARTING ZK TEST SERVER
   [junit4]   2> 877617 INFO  (Thread-1199) [    ] o.a.s.c.ZkTestServer client port:0.0.0.0/0.0.0.0:0
   [junit4]   2> 877617 INFO  (Thread-1199) [    ] o.a.s.c.ZkTestServer Starting server
   [junit4]   2> 877717 INFO  (TEST-CollectionsAPIDistributedZkTest.test-seed#[FD8F3F9C919320A6]) [    ] o.a.s.c.ZkTestServer start zk server on port:55231
   [junit4]   2> 877717 INFO  (TEST-CollectionsAPIDistributedZkTest.test-seed#[FD8F3F9C919320A6]) [    ] o.a.s.c.c.SolrZkClient Using default ZkCredentialsProvider
   [junit4]   2> 877723 INFO  (TEST-CollectionsAPIDistributedZkTest.test-seed#[FD8F3F9C919320A6]) [    ] o.a.s.c.c.ConnectionManager Waiting for client to connect to ZooKeeper
   [junit4]   2> 877745 INFO  (zkCallback-183-thread-1) [    ] o.a.s.c.c.ConnectionManager Watcher org.apache.solr.common.cloud.ConnectionManager@62281cbd name:ZooKeeperConnection Watcher:127.0.0.1:55231 got event WatchedEvent state:SyncConnected type:None path:null path:null type:None
   [junit4]   2> 877745 INFO  (TEST-CollectionsAPIDistributedZkTest.test-seed#[FD8F3F9C919320A6]) [    ] o.a.s.c.c.ConnectionManager Client is connected to ZooKeeper
   [junit4]   2> 877745 INFO  (TEST-CollectionsAPIDistributedZkTest.test-seed#[FD8F3F9C919320A6]) [    ] o.a.s.c.c.SolrZkClient Using default ZkACLProvider
   [junit4]   2> 877745 INFO  (TEST-CollectionsAPIDistributedZkTest.test-seed#[FD8F3F9C919320A6]) [    ] o.a.s.c.c.SolrZkClient makePath: /solr
   [junit4]   2> 877750 INFO  (TEST-CollectionsAPIDistributedZkTest.test-seed#[FD8F3F9C919320A6]) [    ] o.a.s.c.c.SolrZkClient Using default ZkCredentialsProvider
   [junit4]   2> 877762 INFO  (TEST-CollectionsAPIDistributedZkTest.test-seed#[FD8F3F9C919320A6]) [    ] o.a.s.c.c.ConnectionManager Waiting for client to connect to ZooKeeper
   [junit4]   2> 877766 INFO  (zkCallback-184-thread-1) [    ] o.a.s.c.c.ConnectionManager Watcher org.apache.solr.common.cloud.ConnectionManager@7ec3566a name:ZooKeeperConnection Watcher:127.0.0.1:55231/solr got event WatchedEvent state:SyncConnected type:None path:null path:null type:None
   [junit4]   2> 877766 INFO  (TEST-CollectionsAPIDistributedZkTest.test-seed#[FD8F3F9C919320A6]) [    ] o.a.s.c.c.ConnectionManager Client is connected to ZooKeeper
   [junit4]   2> 877766 INFO  (TEST-CollectionsAPIDistributedZkTest.test-seed#[FD8F3F9C919320A6]) [    ] o.a.s.c.c.SolrZkClient Using default ZkACLProvider
   [junit4]   2> 877766 INFO  (TEST-CollectionsAPIDistributedZkTest.test-seed#[FD8F3F9C919320A6]) [    ] o.a.s.c.c.SolrZkClient makePath: /collections/collection1
   [junit4]   2> 877768 INFO  (TEST-CollectionsAPIDistributedZkTest.test-seed#[FD8F3F9C919320A6]) [    ] o.a.s.c.c.SolrZkClient makePath: /collections/collection1/shards
   [junit4]   2> 877770 INFO  (TEST-CollectionsAPIDistributedZkTest.test-seed#[FD8F3F9C919320A6]) [    ] o.a.s.c.c.SolrZkClient makePath: /collections/control_collection
   [junit4]   2> 877771 INFO  (TEST-CollectionsAPIDistributedZkTest.test-seed#[FD8F3F9C919320A6]) [    ] o.a.s.c.c.SolrZkClient makePath: /collections/control_collection/shards
   [junit4]   2> 877773 INFO  (TEST-CollectionsAPIDistributedZkTest.test-seed#[FD8F3F9C919320A6]) [    ] o.a.s.c.AbstractZkTestCase put /x1/jenkins/jenkins-slave/workspace/Lucene-Solr-NightlyTests-5.x/solr/core/src/test-files/solr/collection1/conf/solrconfig-tlog.xml to /configs/conf1/solrconfig.xml
   [junit4]   2> 877773 INFO  (TEST-CollectionsAPIDistributedZkTest.test-seed#[FD8F3F9C919320A6]) [    ] o.a.s.c.c.SolrZkClient makePath: /configs/conf1/solrconfig.xml
   [junit4]   2> 877776 INFO  (TEST-CollectionsAPIDistributedZkTest.test-seed#[FD8F3F9C919320A6]) [    ] o.a.s.c.AbstractZkTestCase put /x1/jenkins/jenkins-slave/workspace/Lucene-Solr-NightlyTests-5.x/solr/core/src/test-files/solr/collection1/conf/schema.xml to /configs/conf1/schema.xml
   [junit4]   2> 877776 INFO  (TEST-CollectionsAPIDistributedZkTest.test-seed#[FD8F3F9C919320A6]) [    ] o.a.s.c.c.SolrZkClient makePath: /configs/conf1/schema.xml
   [junit4]   2> 877778 INFO  (TEST-CollectionsAPIDistributedZkTest.test-seed#[FD8F3F9C919320A6]) [    ] o.a.s.c.AbstractZkTestCase put /x1/jenkins/jenkins-slave/workspace/Lucene-Solr-NightlyTests-5.x/solr/core/src/test-files/solr/collection1/conf/solrconfig.snippet.randomindexconfig.xml to /configs/conf1/solrconfig.snippet.randomindexconfig.xml
   [junit4]   2> 877778 INFO  (TEST-CollectionsAPIDistributedZkTest.test-seed#[FD8F3F9C919320A6]) [    ] o.a.s.c.c.SolrZkClient makePath: /configs/conf1/solrconfig.snippet.randomindexconfig.xml
   [junit4]   2> 877780 INFO  (TEST-CollectionsAPIDistributedZkTest.test-seed#[FD8F3F9C919320A6]) [    ] o.a.s.c.AbstractZkTestCase put /x1/jenkins/jenkins-slave/workspace/Lucene-Solr-NightlyTests-5.x/solr/core/src/test-files/solr/collection1/conf/stopwords.txt to /configs/conf1/stopwords.txt
   [junit4]   2> 877780 INFO  (TEST-CollectionsAPIDistributedZkTest.test-seed#[FD8F3F9C919320A6]) [    ] o.a.s.c.c.SolrZkClient makePath: /configs/conf1/stopwords.txt
   [junit4]   2> 877782 INFO  (TEST-CollectionsAPIDistributedZkTest.test-seed#[FD8F3F9C919320A6]) [    ] o.a.s.c.AbstractZkTestCase put /x1/jenkins/jenkins-slave/workspace/Lucene-Solr-NightlyTests-5.x/solr/core/src/test-files/solr/collection1/conf/protwords.txt to /configs/conf1/protwords.txt
   [junit4]   2> 877782 INFO  (TEST-CollectionsAPIDistributedZkTest.test-seed#[FD8F3F9C919320A6]) [    ] o.a.s.c.c.SolrZkClient makePath: /configs/conf1/protwords.txt
   [junit4]   2> 877784 INFO  (TEST-CollectionsAPIDistributedZkTest.test-seed#[FD8F3F9C919320A6]) [    ] o.a.s.c.AbstractZkTestCase put /x1/jenkins/jenkins-slave/workspace/Lucene-Solr-NightlyTests-5.x/solr/core/src/test-files/solr/collection1/conf/currency.xml to /configs/conf1/currency.xml
   [junit4]   2> 877784 INFO  (TEST-CollectionsAPIDistributedZkTest.test-seed#[FD8F3F9C919320A6]) [    ] o.a.s.c.c.SolrZkClient makePath: /configs/conf1/currency.xml
   [junit4]   2> 877786 INFO  (TEST-CollectionsAPIDistributedZkTest.test-seed#[FD8F3F9C919320A6]) [    ] o.a.s.c.AbstractZkTestCase put /x1/jenkins/jenkins-slave/workspace/Lucene-Solr-NightlyTests-5.x/solr/core/src/test-files/solr/collection1/conf/enumsConfig.xml to /configs/conf1/enumsConfig.xml
   [junit4]   2> 877786 INFO  (TEST-CollectionsAPIDistributedZkTest.test-seed#[FD8F3F9C919320A6]) [    ] o.a.s.c.c.SolrZkClient makePath: /configs/conf1/enumsConfig.xml
   [junit4]   2> 877788 INFO  (TEST-CollectionsAPIDistributedZkTest.test-seed#[FD8F3F9C919320A6]) [    ] o.a.s.c.AbstractZkTestCase put /x1/jenkins/jenkins-slave/workspace/Lucene-Solr-NightlyTests-5.x/solr/core/src/test-files/solr/collection1/conf/open-exchange-rates.json to /configs/conf1/open-exchange-rates.json
   [junit4]   2> 877788 INFO  (TEST-CollectionsAPIDistributedZkTest.test-seed#[FD8F3F9C919320A6]) [    ] o.a.s.c.c.SolrZkClient makePath: /configs/conf1/open-exchange-rates.json
   [junit4]   2> 877790 INFO  (TEST-CollectionsAPIDistributedZkTest.test-seed#[FD8F3F9C919320A6]) [    ] o.a.s.c.AbstractZkTestCase put /x1/jenkins/jenkins-slave/workspace/Lucene-Solr-NightlyTests-5.x/solr/core/src/test-files/solr/collection1/conf/mapping-ISOLatin1Accent.txt to /configs/conf1/mapping-ISOLatin1Accent.txt
   [junit4]   2> 877790 INFO  (TEST-CollectionsAPIDistributedZkTest.test-seed#[FD8F3F9C919320A6]) [    ] o.a.s.c.c.SolrZkClient makePath: /configs/conf1/mapping-ISOLatin1Accent.txt
   [junit4]   2> 877792 INFO  (TEST-CollectionsAPIDistributedZkTest.test-seed#[FD8F3F9C919320A6]) [    ] o.a.s.c.AbstractZkTestCase put /x1/jenkins/jenkins-slave/workspace/Lucene-Solr-NightlyTests-5.x/solr/core/src/test-files/solr/collection1/conf/old_synonyms.txt to /configs/conf1/old_synonyms.txt
   [junit4]   2> 877792 INFO  (TEST-CollectionsAPIDistributedZkTest.test-seed#[FD8F3F9C919320A6]) [    ] o.a.s.c.c.SolrZkClient makePath: /configs/conf1/old_synonyms.txt
   [junit4]   2> 877794 INFO  (TEST-CollectionsAPIDistributedZkTest.test-seed#[FD8F3F9C919320A6]) [    ] o.a.s.c.AbstractZkTestCase put /x1/jenkins/jenkins-slave/workspace/Lucene-Solr-NightlyTests-5.x/solr/core/src/test-files/solr/collection1/conf/synonyms.txt to /configs/conf1/synonyms.txt
   [junit4]   2> 877794 INFO  (TEST-CollectionsAPIDistributedZkTest.test-seed#[FD8F3F9C919320A6]) [    ] o.a.s.c.c.SolrZkClient makePath: /configs/conf1/synonyms.txt
   [junit4]   2> 878139 INFO  (TEST-CollectionsAPIDistributedZkTest.test-seed#[FD8F3F9C919320A6]) [    ] o.a.s.SolrTestCaseJ4 Writing core.properties file to /x1/jenkins/jenkins-slave/workspace/Lucene-Solr-NightlyTests-5.x/solr/build/solr-core/test/J1/temp/solr.cloud.CollectionsAPIDistributedZkTest_FD8F3F9C919320A6-001/control-001/cores/collection1
   [junit4]   2> 878158 INFO  (TEST-CollectionsAPIDistributedZkTest.test-seed#[FD8F3F9C919320A6]) [    ] o.e.j.s.Server jetty-9.2.13.v20150730
   [junit4]   2> 878191 INFO  (TEST-CollectionsAPIDistributedZkTest.test-seed#[FD8F3F9C919320A6]) [    ] o.e.j.s.h.ContextHandler Started o.e.j.s.ServletContextHandler@70f72e42{/,null,AVAILABLE}
   [junit4]   2> 878202 INFO  (TEST-CollectionsAPIDistributedZkTest.test-seed#[FD8F3F9C919320A6]) [    ] o.e.j.s.ServerConnector Started ServerConnector@73fe28fe{HTTP/1.1}{127.0.0.1:51007}
   [junit4]   2> 878202 INFO  (TEST-CollectionsAPIDistributedZkTest.test-seed#[FD8F3F9C919320A6]) [    ] o.e.j.s.Server Started @881245ms
   [junit4]   2> 878202 INFO  (TEST-CollectionsAPIDistributedZkTest.test-seed#[FD8F3F9C919320A6]) [    ] o.a.s.c.s.e.JettySolrRunner Jetty properties: {solr.data.dir=/x1/jenkins/jenkins-slave/workspace/Lucene-Solr-NightlyTests-5.x/solr/build/solr-core/test/J1/temp/solr.cloud.CollectionsAPIDistributedZkTest_FD8F3F9C919320A6-001/tempDir-001/control/data, coreRootDirectory=/x1/jenkins/jenkins-slave/workspace/Lucene-Solr-NightlyTests-5.x/solr/build/solr-core/test/J1/temp/solr.cloud.CollectionsAPIDistributedZkTest_FD8F3F9C919320A6-001/control-001/cores, hostPort=51007, hostContext=/}
   [junit4]   2> 878202 INFO  (TEST-CollectionsAPIDistributedZkTest.test-seed#[FD8F3F9C919320A6]) [    ] o.a.s.s.SolrDispatchFilter SolrDispatchFilter.init(): sun.misc.Launcher$AppClassLoader@4e0add57
   [junit4]   2> 878203 INFO  (TEST-CollectionsAPIDistributedZkTest.test-seed#[FD8F3F9C919320A6]) [    ] o.a.s.c.SolrResourceLoader new SolrResourceLoader for directory: '/x1/jenkins/jenkins-slave/workspace/Lucene-Solr-NightlyTests-5.x/solr/build/solr-core/test/J1/temp/solr.cloud.CollectionsAPIDistributedZkTest_FD8F3F9C919320A6-001/control-001/'
   [junit4]   2> 878203 INFO  (TEST-CollectionsAPIDistributedZkTest.test-seed#[FD8F3F9C919320A6]) [    ] o.a.s.c.SolrResourceLoader JNDI not configured for solr (NoInitialContextEx)
   [junit4]   2> 878203 INFO  (TEST-CollectionsAPIDistributedZkTest.test-seed#[FD8F3F9C919320A6]) [    ] o.a.s.c.SolrResourceLoader solr home defaulted to 'solr/' (could not find system property or JNDI)
   [junit4]   2> 878224 INFO  (TEST-CollectionsAPIDistributedZkTest.test-seed#[FD8F3F9C919320A6]) [    ] o.a.s.c.c.SolrZkClient Using default ZkCredentialsProvider
   [junit4]   2> 878230 INFO  (TEST-CollectionsAPIDistributedZkTest.test-seed#[FD8F3F9C919320A6]) [    ] o.a.s.c.c.ConnectionManager Waiting for client to connect to ZooKeeper
   [junit4]   2> 878237 INFO  (zkCallback-185-thread-1) [    ] o.a.s.c.c.ConnectionManager Watcher org.apache.solr.common.cloud.ConnectionManager@2b3c745c name:ZooKeeperConnection Watcher:127.0.0.1:55231/solr got event WatchedEvent state:SyncConnected type:None path:null path:null type:None
   [junit4]   2> 878238 INFO  (TEST-CollectionsAPIDistributedZkTest.test-seed#[FD8F3F9C919320A6]) [    ] o.a.s.c.c.ConnectionManager Client is connected to ZooKeeper
   [junit4]   2> 878238 INFO  (TEST-CollectionsAPIDistributedZkTest.test-seed#[FD8F3F9C919320A6]) [    ] o.a.s.c.c.SolrZkClient Using default ZkACLProvider
   [junit4]   2> 878241 INFO  (TEST-CollectionsAPIDistributedZkTest.test-seed#[FD8F3F9C919320A6]) [    ] o.a.s.s.SolrDispatchFilter Loading solr.xml from SolrHome (not found in ZooKeeper)
   [junit4]   2> 878241 INFO  (TEST-CollectionsAPIDistributedZkTest.test-seed#[FD8F3F9C919320A6]) [    ] o.a.s.c.SolrXmlConfig Loading container configuration from /x1/jenkins/jenkins-slave/workspace/Lucene-Solr-NightlyTests-5.x/solr/build/solr-core/test/J1/temp/solr.cloud.CollectionsAPIDistributedZkTest_FD8F3F9C919320A6-001/control-001/solr.xml
   [junit4]   2> 878266 INFO  (TEST-CollectionsAPIDistributedZkTest.test-seed#[FD8F3F9C919320A6]) [    ] o.a.s.c.CoresLocator Config-defined core root directory: /x1/jenkins/jenkins-slave/workspace/Lucene-Solr-NightlyTests-5.x/solr/build/solr-core/test/J1/temp/solr.cloud.CollectionsAPIDistributedZkTest_FD8F3F9C919320A6-001/control-001/cores
   [junit4]   2> 878267 INFO  (TEST-CollectionsAPIDistributedZkTest.test-seed#[FD8F3F9C919320A6]) [    ] o.a.s.c.CoreContainer New CoreContainer 1721211612
   [junit4]   2> 878267 INFO  (TEST-CollectionsAPIDistributedZkTest.test-seed#[FD8F3F9C919320A6]) [    ] o.a.s.c.CoreContainer Loading cores into CoreContainer [instanceDir=/x1/jenkins/jenkins-slave/workspace/Lucene-Solr-NightlyTests-5.x/solr/build/solr-core/test/J1/temp/solr.cloud.CollectionsAPIDistributedZkTest_FD8F3F9C919320A6-001/control-001/]
   [junit4]   2> 878267 INFO  (TEST-CollectionsAPIDistributedZkTest.test-seed#[FD8F3F9C919320A6]) [    ] o.a.s.c.CoreContainer loading shared library: /x1/jenkins/jenkins-slave/workspace/Lucene-Solr-NightlyTests-5.x/solr/build/solr-core/test/J1/temp/solr.cloud.CollectionsAPIDistributedZkTest_FD8F3F9C919320A6-001/control-001/lib
   [junit4]   2> 878267 WARN  (TEST-CollectionsAPIDistributedZkTest.test-seed#[FD8F3F9C919320A6]) [    ] o.a.s.c.SolrResourceLoader Can't find (or read) directory to add to classloader: lib (resolved as: /x1/jenkins/jenkins-slave/workspace/Lucene-Solr-NightlyTests-5.x/solr/build/solr-core/test/J1/temp/solr.cloud.CollectionsAPIDistributedZkTest_FD8F3F9C919320A6-001/control-001/lib).
   [junit4]   2> 878282 INFO  (TEST-CollectionsAPIDistributedZkTest.test-seed#[FD8F3F9C919320A6]) [    ] o.a.s.h.c.HttpShardHandlerFactory created with socketTimeout : 90000,urlScheme : ,connTimeout : 15000,maxConnectionsPerHost : 20,maxConnections : 10000,corePoolSize : 0,maximumPoolSize : 2147483647,maxThreadIdleTime : 5,sizeOfQueue : -1,fairnessPolicy : false,useRetries : false,
   [junit4]   2> 878284 INFO  (TEST-CollectionsAPIDistributedZkTest.test-seed#[FD8F3F9C919320A6]) [    ] o.a.s.u.UpdateShardHandler Creating UpdateShardHandler HTTP client with params: socketTimeout=340000&connTimeout=45000&retry=true
   [junit4]   2> 878284 INFO  (TEST-CollectionsAPIDistributedZkTest.test-seed#[FD8F3F9C919320A6]) [    ] o.a.s.l.LogWatcher SLF4J impl is org.slf4j.impl.Log4jLoggerFactory
   [junit4]   2> 878284 INFO  (TEST-CollectionsAPIDistributedZkTest.test-seed#[FD8F3F9C919320A6]) [    ] o.a.s.l.LogWatcher Registering Log Listener [Log4j (org.slf4j.impl.Log4jLoggerFactory)]
   [junit4]   2> 878284 INFO  (TEST-CollectionsAPIDistributedZkTest.test-seed#[FD8F3F9C919320A6]) [    ] o.a.s.c.ZkContainer Zookeeper client=127.0.0.1:55231/solr
   [junit4]   2> 878284 INFO  (TEST-CollectionsAPIDistributedZkTest.test-seed#[FD8F3F9C919320A6]) [    ] o.a.s.c.ZkController zkHost includes chroot
   [junit4]   2> 878284 INFO  (TEST-CollectionsAPIDistributedZkTest.test-seed#[FD8F3F9C919320A6]) [    ] o.a.s.c.c.SolrZkClient Using default ZkCredentialsProvider
   [junit4]   2> 878292 INFO  (TEST-CollectionsAPIDistributedZkTest.test-seed#[FD8F3F9C919320A6]) [    ] o.a.s.c.c.ConnectionManager Waiting for client to connect to ZooKeeper
   [junit4]   2> 878294 INFO  (zkCallback-187-thread-1) [    ] o.a.s.c.c.ConnectionManager Watcher org.apache.solr.common.cloud.ConnectionManager@155c7d1e name:ZooKeeperConnection Watcher:127.0.0.1:55231 got event WatchedEvent state:SyncConnected type:None path:null path:null type:None
   [junit4]   2> 878294 INFO  (TEST-CollectionsAPIDistributedZkTest.test-seed#[FD8F3F9C919320A6]) [    ] o.a.s.c.c.ConnectionManager Client is connected to ZooKeeper
   [junit4]   2> 878294 INFO  (TEST-CollectionsAPIDistributedZkTest.test-seed#[FD8F3F9C919320A6]) [    ] o.a.s.c.c.SolrZkClient Using default ZkACLProvider
   [junit4]   2> 878310 INFO  (TEST-CollectionsAPIDistributedZkTest.test-seed#[FD8F3F9C919320A6]) [n:127.0.0.1:51007_    ] o.a.s.c.c.ConnectionManager Waiting for client to connect to ZooKeeper
   [junit4]   2> 878315 INFO  (zkCallback-188-thread-1-processing-n:127.0.0.1:51007_) [n:127.0.0.1:51007_    ] o.a.s.c.c.ConnectionManager Watcher org.apache.solr.common.cloud.ConnectionManager@509eaeb0 name:ZooKeeperConnection Watcher:127.0.0.1:55231/solr got event WatchedEvent state:SyncConnected type:None path:null path:null type:None
   [junit4]   2> 878315 INFO  (TEST-CollectionsAPIDistributedZkTest.test-seed#[FD8F3F9C919320A6]) [n:127.0.0.1:51007_    ] o.a.s.c.c.ConnectionManager Client is connected to ZooKeeper
   [junit4]   2> 878316 INFO  (TEST-CollectionsAPIDistributedZkTest.test-seed#[FD8F3F9C919320A6]) [n:127.0.0.1:51007_    ] o.a.s.c.c.SolrZkClient makePath: /overseer/queue
   [junit4]   2> 878318 INFO  (TEST-CollectionsAPIDistributedZkTest.test-seed#[FD8F3F9C919320A6]) [n:127.0.0.1:51007_    ] o.a.s.c.c.SolrZkClient makePath: /overseer/collection-queue-work
   [junit4]   2> 878321 INFO  (TEST-CollectionsAPIDistributedZkTest.test-seed#[FD8F3F9C919320A6]) [n:127.0.0.1:51007_    ] o.a.s.c.c.SolrZkClient makePath: /overseer/collection-map-running
   [junit4]   2> 878323 INFO  (TEST-CollectionsAPIDistributedZkTest.test-seed#[FD8F3F9C919320A6]) [n:127.0.0.1:51007_    ] o.a.s.c.c.SolrZkClient makePath: /overseer/collection-map-completed
   [junit4]   2> 878325 INFO  (TEST-CollectionsAPIDistributedZkTest.test-seed#[FD8F3F9C919320A6]) [n:127.0.0.1:51007_    ] o.a.s.c.c.SolrZkClient makePath: /overseer/collection-map-failure
   [junit4]   2> 878327 INFO  (TEST-CollectionsAPIDistributedZkTest.test-seed#[FD8F3F9C919320A6]) [n:127.0.0.1:51007_    ] o.a.s.c.c.SolrZkClient makePath: /live_nodes
   [junit4]   2> 878328 INFO  (TEST-CollectionsAPIDistributedZkTest.test-seed#[FD8F3F9C919320A6]) [n:127.0.0.1:51007_    ] o.a.s.c.c.SolrZkClient makePath: /aliases.json
   [junit4]   2> 878329 INFO  (TEST-CollectionsAPIDistributedZkTest.test-seed#[FD8F3F9C919320A6]) [n:127.0.0.1:51007_    ] o.a.s.c.c.SolrZkClient makePath: /clusterstate.json
   [junit4]   2> 878330 INFO  (TEST-CollectionsAPIDistributedZkTest.test-seed#[FD8F3F9C919320A6]) [n:127.0.0.1:51007_    ] o.a.s.c.c.SolrZkClient makePath: /security.json
   [junit4]   2> 878331 INFO  (TEST-CollectionsAPIDistributedZkTest.test-seed#[FD8F3F9C919320A6]) [n:127.0.0.1:51007_    ] o.a.s.c.ZkController Register node as live in ZooKeeper:/live_nodes/127.0.0.1:51007_
   [junit4]   2> 878332 INFO  (TEST-CollectionsAPIDistributedZkTest.test-seed#[FD8F3F9C919320A6]) [n:127.0.0.1:51007_    ] o.a.s.c.c.SolrZkClient makePath: /live_nodes/127.0.0.1:51007_
   [junit4]   2> 878333 INFO  (TEST-CollectionsAPIDistributedZkTest.test-seed#[FD8F3F9C919320A6]) [n:127.0.0.1:51007_    ] o.a.s.c.c.SolrZkClient makePath: /overseer_elect
   [junit4]   2> 878334 INFO  (TEST-CollectionsAPIDistributedZkTest.test-seed#[FD8F3F9C919320A6]) [n:127.0.0.1:51007_    ] o.a.s.c.c.SolrZkClient makePath: /overseer_elect/election
   [junit4]   2> 878335 INFO  (TEST-CollectionsAPIDistributedZkTest.test-seed#[FD8F3F9C919320A6]) [n:127.0.0.1:51007_    ] o.a.s.c.Overseer Overseer (id=null) closing
   [junit4]   2> 878336 INFO  (TEST-CollectionsAPIDistributedZkTest.test-seed#[FD8F3F9C919320A6]) [n:127.0.0.1:51007_    ] o.a.s.c.LeaderElector Joined leadership election with path: /overseer_elect/election/94662258141429764-127.0.0.1:51007_-n_0000000000
   [junit4]   2> 878336 INFO  (TEST-CollectionsAPIDistributedZkTest.test-seed#[FD8F3F9C919320A6]) [n:127.0.0.1:51007_    ] o.a.s.c.OverseerElectionContext I am going to be the leader 127.0.0.1:51007_
   [junit4]   2> 878336 INFO  (TEST-CollectionsAPIDistributedZkTest.test-seed#[FD8F3F9C919320A6]) [n:127.0.0.1:51007_    ] o.a.s.c.c.SolrZkClient makePath: /overseer_elect/leader
   [junit4]   2> 878337 INFO  (TEST-CollectionsAPIDistributedZkTest.test-seed#[FD8F3F9C919320A6]) [n:127.0.0.1:51007_    ] o.a.s.c.Overseer Overseer (id=94662258141429764-127.0.0.1:51007_-n_0000000000) starting
   [junit4]   2> 878339 INFO  (TEST-CollectionsAPIDistributedZkTest.test-seed#[FD8F3F9C919320A6]) [n:127.0.0.1:51007_    ] o.a.s.c.c.SolrZkClient makePath: /overseer/queue-work
   [junit4]   2> 878345 INFO  (TEST-CollectionsAPIDistributedZkTest.test-seed#[FD8F3F9C919320A6]) [n:127.0.0.1:51007_    ] o.a.s.c.OverseerAutoReplicaFailoverThread Starting OverseerAutoReplicaFailoverThread autoReplicaFailoverWorkLoopDelay=10000 autoReplicaFailoverWaitAfterExpiration=10000 autoReplicaFailoverBadNodeExpiration=60000
   [junit4]   2> 878346 INFO  (OverseerStateUpdate-94662258141429764-127.0.0.1:51007_-n_0000000000) [n:127.0.0.1:51007_    ] o.a.s.c.Overseer Starting to work on the main queue
   [junit4]   2> 878347 INFO  (OverseerStateUpdate-94662258141429764-127.0.0.1:51007_-n_0000000000) [n:127.0.0.1:51007_    ] o.a.s.c.c.ZkStateReader Updating cluster state from ZooKeeper... 
   [junit4]   2> 878353 INFO  (OverseerCollectionConfigSetProcessor-94662258141429764-127.0.0.1:51007_-n_0000000000) [n:127.0.0.1:51007_    ] o.a.s.c.OverseerTaskProcessor Process current queue of overseer operations
   [junit4]   2> 878361 INFO  (TEST-CollectionsAPIDistributedZkTest.test-seed#[FD8F3F9C919320A6]) [n:127.0.0.1:51007_    ] o.a.s.c.c.ZkStateReader Updating cluster state from ZooKeeper... 
   [junit4]   2> 878377 INFO  (TEST-CollectionsAPIDistributedZkTest.test-seed#[FD8F3F9C919320A6]) [n:127.0.0.1:51007_    ] o.a.s.c.CoreContainer Security conf doesn't exist. Skipping setup for authorization module.
   [junit4]   2> 878377 INFO  (TEST-CollectionsAPIDistributedZkTest.test-seed#[FD8F3F9C919320A6]) [n:127.0.0.1:51007_    ] o.a.s.c.CoreContainer No authentication plugin used.
   [junit4]   2> 878378 INFO  (TEST-CollectionsAPIDistributedZkTest.test-seed#[FD8F3F9C919320A6]) [n:127.0.0.1:51007_    ] o.a.s.c.CoresLocator Looking for core definitions underneath /x1/jenkins/jenkins-slave/workspace/Lucene-Solr-NightlyTests-5.x/solr/build/solr-core/test/J1/temp/solr.cloud.CollectionsAPIDistributedZkTest_FD8F3F9C919320A6-001/control-001/cores
   [junit4]   2> 878379 INFO  (TEST-CollectionsAPIDistributedZkTest.test-seed#[FD8F3F9C919320A6]) [n:127.0.0.1:51007_    ] o.a.s.c.SolrCore Created CoreDescriptor: {transient=false, configSetProperties=configsetprops.json, collection=control_collection, instanceDir=/x1/jenkins/jenkins-slave/workspace/Lucene-Solr-NightlyTests-5.x/solr/build/solr-core/test/J1/temp/solr.cloud.CollectionsAPIDistributedZkTest_FD8F3F9C919320A6-001/control-001/cores/collection1, shard=, dataDir=data/, config=solrconfig.xml, schema=schema.xml, name=collection1, loadOnStartup=true, absoluteInstDir=/x1/jenkins/jenkins-slave/workspace/Lucene-Solr-NightlyTests-5.x/solr/build/solr-core/test/J1/temp/solr.cloud.CollectionsAPIDistributedZkTest_FD8F3F9C919320A6-001/control-001/cores/collection1/, coreNodeName=}
   [junit4]   2> 878379 INFO  (TEST-CollectionsAPIDistributedZkTest.test-seed#[FD8F3F9C919320A6]) [n:127.0.0.1:51007_    ] o.a.s.c.CoresLocator Found core collection1 in /x1/jenkins/jenkins-slave/workspace/Lucene-Solr-NightlyTests-5.x/solr/build/solr-core/test/J1/temp/solr.cloud.CollectionsAPIDistributedZkTest_FD8F3F9C919320A6-001/control-001/cores/collection1/
   [junit4]   2> 878379 INFO  (TEST-CollectionsAPIDistributedZkTest.test-seed#[FD8F3F9C919320A6]) [n:127.0.0.1:51007_    ] o.a.s.c.CoresLocator Found 1 core definitions
   [junit4]   2> 878382 INFO  (coreLoadExecutor-1031-thread-1-processing-n:127.0.0.1:51007_) [n:127.0.0.1:51007_ c:control_collection   x:collection1] o.a.s.c.ZkController publishing state=down
   [junit4]   2> 878382 INFO  (coreLoadExecutor-1031-thread-1-processing-n:127.0.0.1:51007_) [n:127.0.0.1:51007_ c:control_collection   x:collection1] o.a.s.c.ZkController numShards not found on descriptor - reading it from system property
   [junit4]   2> 878386 INFO  (TEST-CollectionsAPIDistributedZkTest.test-seed#[FD8F3F9C919320A6]) [n:127.0.0.1:51007_    ] o.a.s.s.SolrDispatchFilter user.dir=/x1/jenkins/jenkins-slave/workspace/Lucene-Solr-NightlyTests-5.x/solr/build/solr-core/test/J1
   [junit4]   2> 878386 INFO  (TEST-CollectionsAPIDistributedZkTest.test-seed#[FD8F3F9C919320A6]) [n:127.0.0.1:51007_    ] o.a.s.s.SolrDispatchFilter SolrDispatchFilter.init() done
   [junit4]   2> 878386 INFO  (OverseerStateUpdate-94662258141429764-127.0.0.1:51007_-n_0000000000) [n:127.0.0.1:51007_    ] o.a.s.c.Overseer processMessage: queueSize: 1, message = {
   [junit4]   2>   "numShards":"1",
   [junit4]   2>   "base_url":"http://127.0.0.1:51007",
   [junit4]   2>   "core":"collection1",
   [junit4]   2>   "node_name":"127.0.0.1:51007_",
   [junit4]   2>   "state":"down",
   [junit4]   2>   "shard":null,
   [junit4]   2>   "roles":null,
   [junit4]   2>   "operation":"state",
   [junit4]   2>   "collection":"control_collection"} current state version: 0
   [junit4]   2> 878387 INFO  (OverseerStateUpdate-94662258141429764-127.0.0.1:51007_-n_0000000000) [n:127.0.0.1:51007_    ] o.a.s.c.o.ReplicaMutator Update state numShards=1 message={
   [junit4]   2>   "numShards":"1",
   [junit4]   2>   "base_url":"http://127.0.0.1:51007",
   [junit4]   2>   "core":"collection1",
   [junit4]   2>   "node_name":"127.0.0.1:51007_",
   [junit4]   2>   "state":"down",
   [junit4]   2>   "shard":null,
   [junit4]   2>   "roles":null,
   [junit4]   2>   "operation":"state",
   [junit4]   2>   "collection":"control_collection"}
   [junit4]   2> 878387 INFO  (coreLoadExecutor-1031-thread-1-processing-n:127.0.0.1:51007_) [n:127.0.0.1:51007_ c:control_collection   x:collection1] o.a.s.c.ZkController look for our core node name
   [junit4]   2> 878387 INFO  (OverseerStateUpdate-94662258141429764-127.0.0.1:51007_-n_0000000000) [n:127.0.0.1:51007_    ] o.a.s.c.o.ClusterStateMutator building a new cName: control_collection
   [junit4]   2> 878388 INFO  (OverseerStateUpdate-94662258141429764-127.0.0.1:51007_-n_0000000000) [n:127.0.0.1:51007_    ] o.a.s.c.o.ReplicaMutator Assigning new node to shard shard=shard1
   [junit4]   2> 878391 INFO  (zkCallback-188-thread-1-processing-n:127.0.0.1:51007_) [n:127.0.0.1:51007_    ] o.a.s.c.c.ZkStateReader A cluster state change: WatchedEvent state:SyncConnected type:NodeDataChanged path:/clusterstate.json, has occurred - updating... (live nodes size: 1)
   [junit4]   2> 878392 INFO  (zkCallback-188-thread-2-processing-n:127.0.0.1:51007_) [n:127.0.0.1:51007_    ] o.a.s.c.c.ZkStateReader A cluster state change: WatchedEvent state:SyncConnected type:NodeDataChanged path:/clusterstate.json, has occurred - updating... (live nodes size: 1)
   [junit4]   2> 879387 INFO  (coreLoadExecutor-1031-thread-1-processing-n:127.0.0.1:51007_) [n:127.0.0.1:51007_ c:control_collection   x:collection1] o.a.s.c.ZkController waiting to find shard id in clusterstate for collection1
   [junit4]   2> 879388 INFO  (coreLoadExecutor-1031-thread-1-processing-n:127.0.0.1:51007_) [n:127.0.0.1:51007_ c:control_collection   x:collection1] o.a.s.c.ZkController Check for collection zkNode:control_collection
   [junit4]   2> 879388 INFO  (coreLoadExecutor-1031-thread-1-processing-n:127.0.0.1:51007_) [n:127.0.0.1:51007_ c:control_collection   x:collection1] o.a.s.c.ZkController Collection zkNode exists
   [junit4]   2> 879388 INFO  (coreLoadExecutor-1031-thread-1-processing-n:127.0.0.1:51007_) [n:127.0.0.1:51007_ c:control_collection   x:collection1] o.a.s.c.c.ZkStateReader Load collection config from:/collections/control_collection
   [junit4]   2> 879389 INFO  (coreLoadExecutor-1031-thread-1-processing-n:127.0.0.1:51007_) [n:127.0.0.1:51007_ c:control_collection   x:collection1] o.a.s.c.c.ZkStateReader path=/collections/control_collection configName=conf1 specified config exists in ZooKeeper
   [junit4]   2> 879389 INFO  (coreLoadExecutor-1031-thread-1-processing-n:127.0.0.1:51007_) [n:127.0.0.1:51007_ c:control_collection   x:collection1] o.a.s.c.SolrResourceLoader new SolrResourceLoader for directory: '/x1/jenkins/jenkins-slave/workspace/Lucene-Solr-NightlyTests-5.x/solr/build/solr-core/test/J1/temp/solr.cloud.CollectionsAPIDistributedZkTest_FD8F3F9C919320A6-001/control-001/cores/collection1/'
   [junit4]   2> 879389 INFO  (coreLoadExecutor-1031-thread-1-processing-n:127.0.0.1:51007_) [n:127.0.0.1:51007_ c:control_collection   x:collection1] o.a.s.c.SolrResourceLoader JNDI not configured for solr (NoInitialContextEx)
   [junit4]   2> 879389 INFO  (coreLoadExecutor-1031-thread-1-processing-n:127.0.0.1:51007_) [n:127.0.0.1:51007_ c:control_collection   x:collection1] o.a.s.c.SolrResourceLoader solr home defaulted to 'solr/' (could not find system property or JNDI)
   [junit4]   2> 879405 INFO  (coreLoadExecutor-1031-thread-1-processing-n:127.0.0.1:51007_) [n:127.0.0.1:51007_ c:control_collection   x:collection1] o.a.s.c.Config loaded config solrconfig.xml with version 0 
   [junit4]   2> 879421 INFO  (coreLoadExecutor-1031-thread-1-processing-n:127.0.0.1:51007_) [n:127.0.0.1:51007_ c:control_collection   x:collection1] o.a.s.c.SolrConfig current version of requestparams : -1
   [junit4]   2> 879436 INFO  (coreLoadExecutor-1031-thread-1-processing-n:127.0.0.1:51007_) [n:127.0.0.1:51007_ c:control_collection   x:collection1] o.a.s.c.SolrConfig Using Lucene MatchVersion: 5.4.0
   [junit4]   2> 879467 INFO  (coreLoadExecutor-1031-thread-1-processing-n:127.0.0.1:51007_) [n:127.0.0.1:51007_ c:control_collection   x:collection1] o.a.s.c.Config Loaded SolrConfig: solrconfig.xml
   [junit4]   2> 879468 INFO  (coreLoadExecutor-1031-thread-1-processing-n:127.0.0.1:51007_) [n:127.0.0.1:51007_ c:control_collection   x:collection1] o.a.s.s.IndexSchema Reading Solr Schema from /configs/conf1/schema.xml
   [junit4]   2> 879475 INFO  (coreLoadExecutor-1031-thread-1-processing-n:127.0.0.1:51007_) [n:127.0.0.1:51007_ c:control_collection   x:collection1] o.a.s.s.IndexSchema [collection1] Schema name=test
   [junit4]   2> 880000 INFO  (coreLoadExecutor-1031-thread-1-processing-n:127.0.0.1:51007_) [n:127.0.0.1:51007_ c:control_collection   x:collection1] o.a.s.s.OpenExchangeRatesOrgProvider Initialized with rates=open-exchange-rates.json, refreshInterval=1440.
   [junit4]   2> 880011 INFO  (coreLoadExecutor-1031-thread-1-processing-n:127.0.0.1:51007_) [n:127.0.0.1:51007_ c:control_collection   x:collection1] o.a.s.s.IndexSchema default search field in schema is text
   [junit4]   2> 880013 INFO  (coreLoadExecutor-1031-thread-1-processing-n:127.0.0.1:51007_) [n:127.0.0.1:51007_ c:control_collection   x:collection1] o.a.s.s.IndexSchema unique key field: id
   [junit4]   2> 880027 INFO  (coreLoadExecutor-1031-thread-1-processing-n:127.0.0.1:51007_) [n:127.0.0.1:51007_ c:control_collection   x:collection1] o.a.s.s.FileExchangeRateProvider Reloading exchange rates from file currency.xml
   [junit4]   2> 880031 INFO  (coreLoadExecutor-1031-thread-1-processing-n:127.0.0.1:51007_) [n:127.0.0.1:51007_ c:control_collection   x:collection1] o.a.s.s.FileExchangeRateProvider Reloading exchange rates from file currency.xml
   [junit4]   2> 880035 INFO  (coreLoadExecutor-1031-thread-1-processing-n:127.0.0.1:51007_) [n:127.0.0.1:51007_ c:control_collection   x:collection1] o.a.s.s.OpenExchangeRatesOrgProvider Reloading exchange rates from open-exchange-rates.json
   [junit4]   2> 880036 WARN  (coreLoadExecutor-1031-thread-1-processing-n:127.0.0.1:51007_) [n:127.0.0.1:51007_ c:control_collection   x:collection1] o.a.s.s.OpenExchangeRatesOrgProvider Unknown key IMPORTANT NOTE
   [junit4]   2> 880037 WARN  (coreLoadExecutor-1031-thread-1-processing-n:127.0.0.1:51007_) [n:127.0.0.1:51007_ c:control_collection   x:collection1] o.a.s.s.OpenExchangeRatesOrgProvider Expected key, got STRING
   [junit4]   2> 880037 INFO  (coreLoadExecutor-1031-thread-1-processing-n:127.0.0.1:51007_) [n:127.0.0.1:51007_ c:control_collection   x:collection1] o.a.s.s.OpenExchangeRatesOrgProvider Reloading exchange rates from open-exchange-rates.json
   [junit4]   2> 880037 WARN  (coreLoadExecutor-1031-thread-1-processing-n:127.0.0.1:51007_) [n:127.0.0.1:51007_ c:control_collection   x:collection1] o.a.s.s.OpenExchangeRatesOrgProvider Unknown key IMPORTANT NOTE
   [junit4]   2> 880037 WARN  (coreLoadExecutor-1031-thread-1-processing-n:127.0.0.1:51007_) [n:127.0.0.1:51007_ c:control_collection   x:collection1] o.a.s.s.OpenExchangeRatesOrgProvider Expected key, got STRING
   [junit4]   2> 880038 INFO  (coreLoadExecutor-1031-thread-1-processing-n:127.0.0.1:51007_) [n:127.0.0.1:51007_ c:control_collection   x:collection1] o.a.s.c.ConfigSetProperties Did not find ConfigSet properties, assuming default properties: Can't find resource 'configsetprops.json' in classpath or '/configs/conf1', cwd=/x1/jenkins/jenkins-slave/workspace/Lucene-Solr-NightlyTests-5.x/solr/build/solr-core/test/J1
   [junit4]   2> 880039 INFO  (coreLoadExecutor-1031-thread-1-processing-n:127.0.0.1:51007_) [n:127.0.0.1:51007_ c:control_collection   x:collection1] o.a.s.c.CoreContainer Creating SolrCore 'collection1' using configuration from collection control_collection
   [junit4]   2> 880039 INFO  (coreLoadExecutor-1031-thread-1-processing-n:127.0.0.1:51007_) [n:127.0.0.1:51007_ c:control_collection s:shard1 r:core_node1 x:collection1] o.a.s.c.SolrCore org.apache.solr.core.MockDirectoryFactory
   [junit4]   2> 880039 INFO  (coreLoadExecutor-1031-thread-1-processing-n:127.0.0.1:51007_) [n:127.0.0.1:51007_ c:control_collection s:shard1 r:core_node1 x:collection1] o.a.s.c.SolrCore [[collection1] ] Opening new SolrCore at [/x1/jenkins/jenkins-slave/workspace/Lucene-Solr-NightlyTests-5.x/solr/build/solr-core/test/J1/temp/solr.cloud.CollectionsAPIDistributedZkTest_FD8F3F9C919320A6-001/control-001/cores/collection1/], dataDir=[null]
   [junit4]   2> 880039 INFO  (coreLoadExecutor-1031-thread-1-processing-n:127.0.0.1:51007_) [n:127.0.0.1:51007_ c:control_collection s:shard1 r:core_node1 x:collection1] o.a.s.c.JmxMonitoredMap JMX monitoring is enabled. Adding Solr mbeans to JMX Server: com.sun.jmx.mbeanserver.JmxMBeanServer@1c7f97ce
   [junit4]   2> 880040 INFO  (coreLoadExecutor-1031-thread-1-processing-n:127.0.0.1:51007_) [n:127.0.0.1:51007_ c:control_collection s:shard1 r:core_node1 x:collection1] o.a.s.c.CachingDirectoryFactory return new directory for /x1/jenkins/jenkins-slave/workspace/Lucene-Solr-NightlyTests-5.x/solr/build/solr-core/test/J1/temp/solr.cloud.CollectionsAPIDistributedZkTest_FD8F3F9C919320A6-001/control-001/cores/collection1/data
   [junit4]   2> 880040 INFO  (coreLoadExecutor-1031-thread-1-processing-n:127.0.0.1:51007_) [n:127.0.0.1:51007_ c:control_collection s:shard1 r:core_node1 x:collection1] o.a.s.c.SolrCore New index directory detected: old=null new=/x1/jenkins/jenkins-slave/workspace/Lucene-Solr-NightlyTests-5.x/solr/build/solr-core/test/J1/temp/solr.cloud.CollectionsAPIDistributedZkTest_FD8F3F9C919320A6-001/control-001/cores/collection1/data/index/
   [junit4]   2> 880040 WARN  (coreLoadExecutor-1031-thread-1-processing-n:127.0.0.1:51007_) [n:127.0.0.1:51007_ c:control_collection s:shard1 r:core_node1 x:collection1] o.a.s.c.SolrCore [collection1] Solr index directory '/x1/jenkins/jenkins-slave/workspace/Lucene-Solr-NightlyTests-5.x/solr/build/solr-core/test/J1/temp/solr.cloud.CollectionsAPIDistributedZkTest_FD8F3F9C919320A6-001/control-001/cores/collection1/data/index' doesn't exist. Creating new index...
   [junit4]   2> 880041 INFO  (coreLoadExecutor-1031-thread-1-processing-n:127.0.0.1:51007_) [n:127.0.0.1:51007_ c:control_collection s:shard1 r:core_node1 x:collection1] o.a.s.c.CachingDirectoryFactory return new directory for /x1/jenkins/jenkins-slave/workspace/Lucene-Solr-NightlyTests-5.x/solr/build/solr-core/test/J1/temp/solr.cloud.CollectionsAPIDistributedZkTest_FD8F3F9C919320A6-001/control-001/cores/collection1/data/index
   [junit4]   2> 880042 INFO  (coreLoadExecutor-1031-thread-1-processing-n:127.0.0.1:51007_) [n:127.0.0.1:51007_ c:control_collection s:shard1 r:core_node1 x:collection1] o.a.s.u.RandomMergePolicy RandomMergePolicy wrapping class org.apache.lucene.index.AlcoholicMergePolicy: [AlcoholicMergePolicy: minMergeSize=0, mergeFactor=10, maxMergeSize=1523303849, maxMergeSizeForForcedMerge=9223372036854775807, calibrateSizeByDeletes=true, maxMergeDocs=2147483647, maxCFSSegmentSizeMB=8.796093022207999E12, noCFSRatio=0.1]
   [junit4]   2> 880045 INFO  (coreLoadExecutor-1031-thread-1-processing-n:127.0.0.1:51007_) [n:127.0.0.1:51007_ c:control_collection s:shard1 r:core_node1 x:collection1] o.a.s.c.SolrCore SolrDeletionPolicy.onCommit: commits: num=1
   [junit4]   2> 	commit{dir=MockDirectoryWrapper(RAMDirectory@2a404804 lockFactory=org.apache.lucene.store.SingleInstanceLockFactory@62381447),segFN=segments_1,generation=1}
   [junit4]   2> 880045 INFO  (coreLoadExecutor-1031-thread-1-processing-n:127.0.0.1:51007_) [n:127.0.0.1:51007_ c:control_collection s:shard1 r:core_node1 x:collection1] o.a.s.c.SolrCore newest commit generation = 1
   [junit4]   2> 880045 INFO  (OldIndexDirectoryCleanupThreadForCore-collection1) [n:127.0.0.1:51007_ c:control_collection s:shard1 r:core_node1 x:collection1] o.a.s.c.SolrCore Looking for old index directories to cleanup for core collection1 in /x1/jenkins/jenkins-slave/workspace/Lucene-Solr-NightlyTests-5.x/solr/build/solr-core/test/J1/temp/solr.cloud.CollectionsAPIDistributedZkTest_FD8F3F9C919320A6-001/control-001/cores/collection1/data/
   [junit4]   2> 880045 WARN  (OldIndexDirectoryCleanupThreadForCore-collection1) [n:127.0.0.1:51007_ c:control_collection s:shard1 r:core_node1 x:collection1] o.a.s.c.DirectoryFactory /x1/jenkins/jenkins-slave/workspace/Lucene-Solr-NightlyTests-5.x/solr/build/solr-core/test/J1/temp/solr.cloud.CollectionsAPIDistributedZkTest_FD8F3F9C919320A6-001/control-001/cores/collection1/data/ does not point to a valid data directory; skipping clean-up of old index directories.
   [junit4]   2> 880053 INFO  (coreLoadExecutor-1031-thread-1-processing-n:127.0.0.1:51007_) [n:127.0.0.1:51007_ c:control_collection s:shard1 r:core_node1 x:collection1] o.a.s.u.p.UpdateRequestProcessorChain creating updateRequestProcessorChain "nodistrib"
   [junit4]   2> 880053 INFO  (coreLoadExecutor-1031-thread-1-processing-n:127.0.0.1:51007_) [n:127.0.0.1:51007_ c:control_collection s:shard1 r:core_node1 x:collection1] o.a.s.u.p.UpdateRequestProcessorChain creating updateRequestProcessorChain "dedupe"
   [junit4]   2> 880053 INFO  (coreLoadExecutor-1031-thread-1-processing-n:127.0.0.1:51007_) [n:127.0.0.1:51007_ c:control_collection s:shard1 r:core_node1 x:collection1] o.a.s.u.p.UpdateRequestProcessorChain inserting DistributedUpdateProcessorFactory into updateRequestProcessorChain "dedupe"
   [junit4]   2> 880053 INFO  (coreLoadExecutor-1031-thread-1-processing-n:127.0.0.1:51007_) [n:127.0.0.1:51007_ c:control_collection s:shard1 r:core_node1 x:collection1] o.a.s.u.p.UpdateRequestProcessorChain creating updateRequestProcessorChain "stored_sig"
   [junit4]   2> 880053 INFO  (coreLoadExecutor-1031-thread-1-processing-n:127.0.0.1:51007_) [n:127.0.0.1:51007_ c:control_collection s:shard1 r:core_node1 x:collection1] o.a.s.u.p.UpdateRequestProcessorChain inserting DistributedUpdateProcessorFactory into updateRequestProcessorChain "stored_sig"
   [junit4]   2> 880053 INFO  (coreLoadExecutor-1031-thread-1-processing-n:127.0.0.1:51007_) [n:127.0.0.1:51007_ c:control_collection s:shard1 r:core_node1 x:collection1] o.a.s.u.p.UpdateRequestProcessorChain creating updateRequestProcessorChain "distrib-dup-test-chain-explicit"
   [junit4]   2> 880054 INFO  (coreLoadExecutor-1031-thread-1-processing-n:127.0.0.1:51007_) [n:127.0.0.1:51007_ c:control_collection s:shard1 r:core_node1 x:collection1] o.a.s.u.p.UpdateRequestProcessorChain creating updateRequestProcessorChain "distrib-dup-test-chain-implicit"
   [junit4]   2> 880054 INFO  (coreLoadExecutor-1031-thread-1-processing-n:127.0.0.1:51007_) [n:127.0.0.1:51007_ c:control_collection s:shard1 r:core_node1 x:collection1] o.a.s.u.p.UpdateRequestProcessorChain inserting DistributedUpdateProcessorFactory into updateRequestProcessorChain "distrib-dup-test-chain-implicit"
   [junit4]   2> 880054 INFO  (coreLoadExecutor-1031-thread-1-processing-n:127.0.0.1:51007_) [n:127.0.0.1:51007_ c:control_collection s:shard1 r:core_node1 x:collection1] o.a.s.c.SolrCore no updateRequestProcessorChain defined as default, creating implicit default
   [junit4]   2> 880058 INFO  (coreLoadExecutor-1031-thread-1-processing-n:127.0.0.1:51007_) [n:127.0.0.1:51007_ c:control_collection s:shard1 r:core_node1 x:collection1] o.a.s.h.l.XMLLoader xsltCacheLifetimeSeconds=60
   [junit4]   2> 880060 INFO  (coreLoadExecutor-1031-thread-1-processing-n:127.0.0.1:51007_) [n:127.0.0.1:51007_ c:control_collection s:shard1 r:core_node1 x:collection1] o.a.s.h.l.XMLLoader xsltCacheLifetimeSeconds=60
   [junit4]   2> 880061 INFO  (coreLoadExecutor-1031-thread-1-processing-n:127.0.0.1:51007_) [n:127.0.0.1:51007_ c:control_collection s:shard1 r:core_node1 x:collection1] o.a.s.h.l.XMLLoader xsltCacheLifetimeSeconds=60
   [junit4]   2> 880062 INFO  (coreLoadExecutor-1031-thread-1-processing-n:127.0.0.1:51007_) [n:127.0.0.1:51007_ c:control_collection s:shard1 r:core_node1 x:collection1] o.a.s.h.l.XMLLoader xsltCacheLifetimeSeconds=60
   [junit4]   2> 880066 INFO  (coreLoadExecutor-1031-thread-1-processing-n:127.0.0.1:51007_) [n:127.0.0.1:51007_ c:control_collection s:shard1 r:core_node1 x:collection1] o.a.s.c.RequestHandlers Registered paths: /get,/admin/threads,/replication,/update/csv,/schema,/update/json/docs,/admin/segments,/admin/plugins,/admin/logging,/admin/system,/update,/admin/properties,/admin/mbeans,/admin/file,/config,/admin/ping,standard,/admin/luke,/update/json
   [junit4]   2> 880068 INFO  (coreLoadExecutor-1031-thread-1-processing-n:127.0.0.1:51007_) [n:127.0.0.1:51007_ c:control_collection s:shard1 r:core_node1 x:collection1] o.a.s.c.SolrCore Using default statsCache cache: org.apache.solr.search.stats.LocalStatsCache
   [junit4]   2> 880068 INFO  (coreLoadExecutor-1031-thread-1-processing-n:127.0.0.1:51007_) [n:127.0.0.1:51007_ c:control_collection s:shard1 r:core_node1 x:collection1] o.a.s.u.UpdateHandler Using UpdateLog implementation: org.apache.solr.update.UpdateLog
   [junit4]   2> 880068 INFO  (coreLoadExecutor-1031-thread-1-processing-n:127.0.0.1:51007_) [n:127.0.0.1:51007_ c:control_collection s:shard1 r:core_node1 x:collection1] o.a.s.u.UpdateLog Initializing UpdateLog: dataDir= defaultSyncLevel=FLUSH numRecordsToKeep=100 maxNumLogsToKeep=10 numVersionBuckets=65536
   [junit4]   2> 880069 INFO  (coreLoadExecutor-1031-thread-1-processing-n:127.0.0.1:51007_) [n:127.0.0.1:51007_ c:control_collection s:shard1 r:core_node1 x:collection1] o.a.s.c.SolrCore Hard AutoCommit: disabled
   [junit4]   2> 880069 INFO  (coreLoadExecutor-1031-thread-1-processing-n:127.0.0.1:51007_) [n:127.0.0.1:51007_ c:control_collection s:shard1 r:core_node1 x:collection1] o.a.s.c.SolrCore Soft AutoCommit: disabled
   [junit4]   2> 880070 INFO  (coreLoadExecutor-1031-thread-1-processing-n:127.0.0.1:51007_) [n:127.0.0.1:51007_ c:control_collection s:shard1 r:core_node1 x:collection1] o.a.s.u.RandomMergePolicy RandomMergePolicy wrapping class org.apache.lucene.index.TieredMergePolicy: [TieredMergePolicy: maxMergeAtOnce=9, maxMergeAtOnceExplicit=4, maxMergedSegmentMB=26.0927734375, floorSegmentMB=1.6708984375, forceMergeDeletesPctAllowed=27.3347841271099, segmentsPerTier=22.0, maxCFSSegmentSizeMB=8.796093022207999E12, noCFSRatio=0.30546056196163796
   [junit4]   2> 880070 INFO  (coreLoadExecutor-1031-thread-1-processing-n:127.0.0.1:51007_) [n:127.0.0.1:51007_ c:control_collection s:shard1 r:core_node1 x:collection1] o.a.s.c.SolrCore SolrDeletionPolicy.onInit: commits: num=1
   [junit4]   2> 	commit{dir=MockDirectoryWrapper(RAMDirectory@2a404804 lockFactory=org.apache.lucene.store.SingleInstanceLockFactory@62381447),segFN=segments_1,generation=1}
   [junit4]   2> 880070 INFO  (coreLoadExecutor-1031-thread-1-processing-n:127.0.0.1:51007_) [n:127.0.0.1:51007_ c:control_collection s:shard1 r:core_node1 x:collection1] o.a.s.c.SolrCore newest commit generation = 1
   [junit4]   2> 880070 INFO  (coreLoadExecutor-1031-thread-1-processing-n:127.0.0.1:51007_) [n:127.0.0.1:51007_ c:control_collection s:shard1 r:core_node1 x:collection1] o.a.s.s.SolrIndexSearcher Opening Searcher@35ed8a30[collection1] main
   [junit4]   2> 880070 INFO  (coreLoadExecutor-1031-thread-1-processing-n:127.0.0.1:51007_) [n:127.0.0.1:51007_ c:control_collection s:shard1 r:core_node1 x:collection1] o.a.s.c.c.ZkStateReader Load collection config from:/collections/control_collection
   [junit4]   2> 880071 INFO  (coreLoadExecutor-1031-thread-1-processing-n:127.0.0.1:51007_) [n:127.0.0.1:51007_ c:control_collection s:shard1 r:core_node1 x:collection1] o.a.s.c.c.ZkStateReader path=/collections/control_collection configName=conf1 specified config exists in ZooKeeper
   [junit4]   2> 880071 INFO  (coreLoadExecutor-1031-thread-1-processing-n:127.0.0.1:51007_) [n:127.0.0.1:51007_ c:control_collection s:shard1 r:core_node1 x:collection1] o.a.s.r.ManagedResourceStorage Setting up ZooKeeper-based storage for the RestManager with znodeBase: /configs/conf1
   [junit4]   2> 880072 INFO  (coreLoadExecutor-1031-thread-1-processing-n:127.0.0.1:51007_) [n:127.0.0.1:51007_ c:control_collection s:shard1 r:core_node1 x:collection1] o.a.s.r.ManagedResourceStorage Configured ZooKeeperStorageIO with znodeBase: /configs/conf1
   [junit4]   2> 880072 INFO  (coreLoadExecutor-1031-thread-1-processing-n:127.0.0.1:51007_) [n:127.0.0.1:51007_ c:control_collection s:shard1 r:core_node1 x:collection1] o.a.s.r.RestManager Initializing RestManager with initArgs: {}
   [junit4]   2> 880072 INFO  (coreLoadExecutor-1031-thread-1-processing-n:127.0.0.1:51007_) [n:127.0.0.1:51007_ c:control_collection s:shard1 r:core_node1 x:collection1] o.a.s.r.ManagedResourceStorage Reading _rest_managed.json using ZooKeeperStorageIO:path=/configs/conf1
   [junit4]   2> 880072 INFO  (coreLoadExecutor-1031-thread-1-processing-n:127.0.0.1:51007_) [n:127.0.0.1:51007_ c:control_collection s:shard1 r:core_node1 x:collection1] o.a.s.r.ManagedResourceStorage No data found for znode /configs/conf1/_rest_managed.json
   [junit4]   2> 880072 INFO  (coreLoadExecutor-1031-thread-1-processing-n:127.0.0.1:51007_) [n:127.0.0.1:51007_ c:control_collection s:shard1 r:core_node1 x:collection1] o.a.s.r.ManagedResourceStorage Loaded null at path _rest_managed.json using ZooKeeperStorageIO:path=/configs/conf1
   [junit4]   2> 880073 INFO  (coreLoadExecutor-1031-thread-1-processing-n:127.0.0.1:51007_) [n:127.0.0.1:51007_ c:control_collection s:shard1 r:core_node1 x:collection1] o.a.s.r.RestManager Initializing 0 registered ManagedResources
   [junit4]   2> 880073 INFO  (coreLoadExecutor-1031-thread-1-processing-n:127.0.0.1:51007_) [n:127.0.0.1:51007_ c:control_collection s:shard1 r:core_node1 x:collection1] o.a.s.h.ReplicationHandler Commits will be reserved for  10000
   [junit4]   2> 880073 INFO  (searcherExecutor-1032-thread-1-processing-x:collection1 n:127.0.0.1:51007_ s:shard1 c:control_collection r:core_node1) [n:127.0.0.1:51007_ c:control_collection s:shard1 r:core_node1 x:collection1] o.a.s.c.SolrCore [collection1] Registered new searcher Searcher@35ed8a30[collection1] main{ExitableDirectoryReader(UninvertingDirectoryReader())}
   [junit4]   2> 880073 INFO  (coreLoadExecutor-1031-thread-1-processing-n:127.0.0.1:51007_) [n:127.0.0.1:51007_ c:control_collection s:shard1 r:core_node1 x:collection1] o.a.s.u.UpdateLog Looking up max value of version field to seed version buckets
   [junit4]   2> 880074 INFO  (coreLoadExecutor-1031-thread-1-processing-n:127.0.0.1:51007_) [n:127.0.0.1:51007_ c:control_collection s:shard1 r:core_node1 x:collection1] o.a.s.u.VersionInfo Refreshing highest value of _version_ for 65536 version buckets from index
   [junit4]   2> 880074 INFO  (coreLoadExecutor-1031-thread-1-processing-n:127.0.0.1:51007_) [n:127.0.0.1:51007_ c:control_collection s:shard1 r:core_node1 x:collection1] o.a.s.u.VersionInfo No terms found for _version_, cannot seed version bucket highest value from index
   [junit4]   2> 880074 INFO  (coreLoadExecutor-1031-thread-1-processing-n:127.0.0.1:51007_) [n:127.0.0.1:51007_ c:control_collection s:shard1 r:core_node1 x:collection1] o.a.s.u.UpdateLog Could not find max version in index or recent updates, using new clock 1514596132838178816
   [junit4]   2> 880076 INFO  (coreLoadExecutor-1031-thread-1-processing-n:127.0.0.1:51007_) [n:127.0.0.1:51007_ c:control_collection s:shard1 r:core_node1 x:collection1] o.a.s.u.UpdateLog Took 2.0ms to seed version buckets with highest version 1514596132838178816
   [junit4]   2> 880076 INFO  (coreLoadExecutor-1031-thread-1-processing-n:127.0.0.1:51007_) [n:127.0.0.1:51007_ c:control_collection s:shard1 r:core_node1 x:collection1] o.a.s.c.ZkController watch zkdir /configs/conf1
   [junit4]   2> 880077 INFO  (coreLoadExecutor-1031-thread-1-processing-n:127.0.0.1:51007_) [n:127.0.0.1:51007_ c:control_collection s:shard1 r:core_node1 x:collection1] o.a.s.c.CoreContainer registering core: collection1
   [junit4]   2> 880077 INFO  (coreZkRegister-1025-thread-1-processing-x:collection1 n:127.0.0.1:51007_ s:shard1 c:control_collection r:core_node1) [n:127.0.0.1:51007_ c:control_collection s:shard1 r:core_node1 x:collection1] o.a.s.c.ZkController Register replica - core:collection1 address:http://127.0.0.1:51007 collection:control_collection shard:shard1
   [junit4]   2> 880078 INFO  (coreZkRegister-1025-thread-1-processing-x:collection1 n:127.0.0.1:51007_ s:shard1 c:control_collection r:core_node1) [n:127.0.0.1:51007_ c:control_collection s:shard1 r:core_node1 x:collection1] o.a.s.c.c.SolrZkClient makePath: /collections/control_collection/leader_elect/shard1/election
   [junit4]   2> 880087 INFO  (coreZkRegister-1025-thread-1-processing-x:collection1 n:127.0.0.1:51007_ s:shard1 c:control_collection r:core_node1) [n:127.0.0.1:51007_ c:control_collection s:shard1 r:core_node1 x:collection1] o.a.s.c.LeaderElector Joined leadership election with path: /collections/control_collection/leader_elect/shard1/election/94662258141429764-core_node1-n_0000000000
   [junit4]   2> 880088 INFO  (coreZkRegister-1025-thread-1-processing-x:collection1 n:127.0.0.1:51007_ s:shard1 c:control_collection r:core_node1) [n:127.0.0.1:51007_ c:control_collection s:shard1 r:core_node1 x:collection1] o.a.s.c.ShardLeaderElectionContext Running the leader process for shard shard1
   [junit4]   2> 880091 INFO  (coreZkRegister-1025-thread-1-processing-x:collection1 n:127.0.0.1:51007_ s:shard1 c:control_collection r:core_node1) [n:127.0.0.1:51007_ c:control_collection s:shard1 r:core_node1 x:collection1] o.a.s.c.ShardLeaderElectionContext Enough replicas found to continue.
   [junit4]   2> 880091 INFO  (OverseerStateUpdate-94662258141429764-127.0.0.1:51007_-n_0000000000) [n:127.0.0.1:51007_    ] o.a.s.c.Overseer processMessage: queueSize: 1, message = {
   [junit4]   2>   "operation":"leader",
   [junit4]   2>   "shard":"shard1",
   [junit4]   2>   "collection":"control_collection"} current state version: 1
   [junit4]   2> 880091 INFO  (coreZkRegister-1025-thread-1-processing-x:collection1 n:127.0.0.1:51007_ s:shard1 c:control_collection r:core_node1) [n:127.0.0.1:51007_ c:control_collection s:shard1 r:core_node1 x:collection1] o.a.s.c.ShardLeaderElectionContext I may be the new leader - try and sync
   [junit4]   2> 880091 INFO  (coreZkRegister-1025-thread-1-processing-x:collection1 n:127.0.0.1:51007_ s:shard1 c:control_collection r:core_node1) [n:127.0.0.1:51007_ c:control_collection s:shard1 r:core_node1 x:collection1] o.a.s.c.SyncStrategy Sync replicas to http://127.0.0.1:51007/collection1/
   [junit4]   2> 880091 INFO  (coreZkRegister-1025-thread-1-processing-x:collection1 n:127.0.0.1:51007_ s:shard1 c:control_collection r:core_node1) [n:127.0.0.1:51007_ c:control_collection s:shard1 r:core_node1 x:collection1] o.a.s.c.SyncStrategy Sync Success - now sync replicas to me
   [junit4]   2> 880091 INFO  (coreZkRegister-1025-thread-1-processing-x:collection1 n:127.0.0.1:51007_ s:shard1 c:control_collection r:core_node1) [n:127.0.0.1:51007_ c:control_collection s:shard1 r:core_node1 x:collection1] o.a.s.c.SyncStrategy http://127.0.0.1:51007/collection1/ has no replicas
   [junit4]   2> 880091 INFO  (coreZkRegister-1025-thread-1-processing-x:collection1 n:127.0.0.1:51007_ s:shard1 c:control_collection r:core_node1) [n:127.0.0.1:51007_ c:control_collection s:shard1 r:core_node1 x:collection1] o.a.s.c.ShardLeaderElectionContext I am the new leader: http://127.0.0.1:51007/collection1/ shard1
   [junit4]   2> 880092 INFO  (zkCallback-188-thread-1-processing-n:127.0.0.1:51007_) [n:127.0.0.1:51007_    ] o.a.s.c.c.ZkStateReader A cluster state change: WatchedEvent state:SyncConnected type:NodeDataChanged path:/clusterstate.json, has occurred - updating... (live nodes size: 1)
   [junit4]   2> 880092 INFO  (zkCallback-188-thread-2-processing-n:127.0.0.1:51007_) [n:127.0.0.1:51007_    ] o.a.s.c.c.ZkStateReader A cluster state change: WatchedEvent state:SyncConnected type:NodeDataChanged path:/clusterstate.json, has occurred - updating... (live nodes size: 1)
   [junit4]   2> 880094 INFO  (coreZkRegister-1025-thread-1-processing-x:collection1 n:127.0.0.1:51007_ s:shard1 c:control_collection r:core_node1) [n:127.0.0.1:51007_ c:control_collection s:shard1 r:core_node1 x:collection1] o.a.s.c.c.SolrZkClient makePath: /collections/control_collection/leaders/shard1
   [junit4]   2> 880097 INFO  (coreZkRegister-1025-thread-1-processing-x:collection1 n:127.0.0.1:51007_ s:shard1 c:control_collection r:core_node1) [n:127.0.0.1:51007_ c:control_collection s:shard1 r:core_node1 x:collection1] o.a.s.c.ShardLeaderElectionContextBase Creating leader registration node
   [junit4]   2> 880100 INFO  (OverseerStateUpdate-94662258141429764-127.0.0.1:51007_-n_0000000000) [n:127.0.0.1:51007_    ] o.a.s.c.Overseer processMessage: queueSize: 1, message = {
   [junit4]   2>   "operation":"leader",
   [junit4]   2>   "shard":"shard1",
   [junit4]   2>   "collection":"control_collection",
   [junit4]   2>   "base_url":"http://127.0.0.1:51007",
   [junit4]   2>   "core":"collection1",
   [junit4]   2>   "state":"active"} current state version: 2
   [junit4]   2> 880207 INFO  (zkCallback-188-thread-2-processing-n:127.0.0.1:51007_) [n:127.0.0.1:51007_    ] o.a.s.c.c.ZkStateReader A cluster state change: WatchedEvent state:SyncConnected type:NodeDataChanged path:/clusterstate.json, has occurred - updating... (live nodes size: 1)
   [junit4]   2> 880207 INFO  (zkCallback-188-thread-1-processing-n:127.0.0.1:51007_) [n:127.0.0.1:51007_    ] o.a.s.c.c.ZkStateReader A cluster state change: WatchedEvent state:SyncConnected type:NodeDataChanged path:/clusterstate.json, has occurred - updating... (live nodes size: 1)
   [junit4]   2> 880252 INFO  (coreZkRegister-1025-thread-1-processing-x:collection1 n:127.0.0.1:51007_ s:shard1 c:control_collection r:core_node1) [n:127.0.0.1:51007_ c:control_collection s:shard1 r:core_node1 x:collection1] o.a.s.c.ZkController We are http://127.0.0.1:51007/collection1/ and leader is http://127.0.0.1:51007/collection1/
   [junit4]   2> 880252 INFO  (coreZkRegister-1025-thread-1-processing-x:collection1 n:127.0.0.1:51007_ s:shard1 c:control_collection r:core_node1) [n:127.0.0.1:51007_ c:control_collection s:shard1 r:core_node1 x:collection1] o.a.s.c.ZkController No LogReplay needed for core=collection1 baseURL=http://127.0.0.1:51007
   [junit4]   2> 880252 INFO  (coreZkRegister-1025-thread-1-processing-x:collection1 n:127.0.0.1:51007_ s:shard1 c:control_collection r:core_node1) [n:127.0.0.1:51007_ c:control_collection s:shard1 r:core_node1 x:collection1] o.a.s.c.ZkController I am the leader, no recovery necessary
   [junit4]   2> 880252 INFO  (coreZkRegister-1025-thread-1-processing-x:collection1 n:127.0.0.1:51007_ s:shard1 c:control_collection r:core_node1) [n:127.0.0.1:51007_ c:control_collection s:shard1 r:core_node1 x:collection1] o.a.s.c.ZkController publishing state=active
   [junit4]   2> 880252 INFO  (coreZkRegister-1025-thread-1-processing-x:collection1 n:127.0.0.1:51007_ s:shard1 c:control_collection r:core_node1) [n:127.0.0.1:51007_ c:control_collection s:shard1 r:core_node1 x:collection1] o.a.s.c.ZkController numShards not found on descriptor - reading it from system property
   [junit4]   2> 880255 INFO  (OverseerStateUpdate-94662258141429764-127.0.0.1:51007_-n_0000000000) [n:127.0.0.1:51007_    ] o.a.s.c.Overseer processMessage: queueSize: 1, message = {
   [junit4]   2>   "numShards":"1",
   [junit4]   2>   "base_url":"http://127.0.0.1:51007",
   [junit4]   2>   "core":"collection1",
   [junit4]   2>   "node_name":"127.0.0.1:51007_",
   [junit4]   2>   "state":"active",
   [junit4]   2>   "core_node_name":"core_node1",
   [junit4]   2>   "shard":"shard1",
   [junit4]   2>   "roles":null,
   [junit4]   2>   "operation":"state",
   [junit4]   2>   "collection":"control_collection"} current state version: 3
   [junit4]   2> 880256 INFO  (OverseerStateUpdate-94662258141429764-127.0.0.1:51007_-n_0000000000) [n:127.0.0.1:51007_    ] o.a.s.c.o.ReplicaMutator Update state numShards=1 message={
   [junit4]   2>   "numShards":"1",
   [junit4]   2>   "base_url":"http://127.0.0.1:51007",
   [junit4]   2>   "core":"collection1",
   [junit4]   2>   "node_name":"127.0.0.1:51007_",
   [junit4]   2>   "state":"active",
   [junit4]   2>   "core_node_name":"core_node1",
   [junit4]   2>   "shard":"shard1",
   [junit4]   2>   "roles":null,
   [junit4]   2>   "operation":"state",
   [junit4]   2>   "collection":"control_collection"}
   [junit4]   2> 880358 INFO  (zkCallback-188-thread-2-processing-n:127.0.0.1:51007_) [n:127.0.0.1:51007_    ] o.a.s.c.c.ZkStateReader A cluster state change: WatchedEvent state:SyncConnected type:NodeDataChanged path:/clusterstate.json, has occurred - updating... (live nodes size: 1)
   [junit4]   2> 880358 INFO  (zkCallback-188-thread-1-processing-n:127.0.0.1:51007_) [n:127.0.0.1:51007_    ] o.a.s.c.c.ZkStateReader A cluster state change: WatchedEvent state:SyncConnected type:NodeDataChanged path:/clusterstate.json, has occurred - updating... (live nodes size: 1)
   [junit4]   2> 880389 INFO  (TEST-CollectionsAPIDistributedZkTest.test-seed#[FD8F3F9C919320A6]) [    ] o.a.s.c.c.SolrZkClient Using default ZkCredentialsProvider
   [junit4]   2> 880390 INFO  (TEST-CollectionsAPIDistributedZkTest.test-seed#[FD8F3F9C919320A6]) [    ] o.a.s.c.c.ConnectionManager Waiting for client to connect to ZooKeeper
   [junit4]   2> 880393 INFO  (zkCallback-190-thread-1) [    ] o.a.s.c.c.ConnectionManager Watcher org.apache.solr.common.cloud.ConnectionManager@4a7e564b name:ZooKeeperConnection Watcher:127.0.0.1:55231/solr got event WatchedEvent state:SyncConnected type:None path:null path:null type:None
   [junit4]   2> 880393 INFO  (TEST-CollectionsAPIDistributedZkTest.test-seed#[FD8F3F9C919320A6]) [    ] o.a.s.c.c.ConnectionManager Client is connected to ZooKeeper
   [junit4]   2> 880393 INFO  (TEST-CollectionsAPIDistributedZkTest.test-seed#[FD8F3F9C919320A6]) [    ] o.a.s.c.c.SolrZkClient Using default ZkACLProvider
   [junit4]   2> 880393 INFO  (TEST-CollectionsAPIDistributedZkTest.test-seed#[FD8F3F9C919320A6]) [    ] o.a.s.c.c.ZkStateReader Updating cluster state from ZooKeeper... 
   [junit4]   2> 880397 INFO  (TEST-CollectionsAPIDistributedZkTest.test-seed#[FD8F3F9C919320A6]) [    ] o.a.s.c.ChaosMonkey monkey: init - expire sessions:false cause connection loss:false
   [junit4]   2> 880397 INFO  (TEST-CollectionsAPIDistributedZkTest.test-seed#[FD8F3F9C919320A6]) [    ] o.a.s.c.AbstractFullDistribZkTestBase Creating collection1 with stateFormat=2
   [junit4]   2> 880397 INFO  (TEST-CollectionsAPIDistributedZkTest.test-seed#[FD8F3F9C919320A6]) [    ] o.a.s.c.c.SolrZkClient Using default ZkCredentialsProvider
   [junit4]   2> 880398 INFO  (TEST-CollectionsAPIDistributedZkTest.test-seed#[FD8F3F9C919320A6]) [    ] o.a.s.c.c.ConnectionManager Waiting for client to connect to ZooKeeper
   [junit4]   2> 880399 INFO  (zkCallback-191-thread-1) [    ] o.a.s.c.c.ConnectionManager Watcher org.apache.solr.common.cloud.ConnectionManager@1f877f41 name:ZooKeeperConnection Watcher:127.0.0.1:55231/solr got event WatchedEvent state:SyncConnected type:None path:null path:null type:None
   [junit4]   2> 880399 INFO  (TEST-CollectionsAPIDistributedZkTest.test-seed#[FD8F3F9C919320A6]) [    ] o.a.s.c.c.ConnectionManager Client is connected to ZooKeeper
   [junit4]   2> 880399 INFO  (TEST-CollectionsAPIDistributedZkTest.test-seed#[FD8F3F9C919320A6]) [    ] o.a.s.c.c.SolrZkClient Using default ZkACLProvider
   [junit4]   2> 880404 INFO  (OverseerStateUpdate-94662258141429764-127.0.0.1:51007_-n_0000000000) [n:127.0.0.1:51007_    ] o.a.s.c.Overseer processMessage: queueSize: 1, message = {
   [junit4]   2>   "operation":"create",
   [junit4]   2>   "name":"collection1",
   [junit4]   2>   "numShards":"2",
   [junit4]   2>   "stateFormat":"2"} current state version: 4
   [junit4]   2> 880404 INFO  (OverseerStateUpdate-94662258141429764-127.0.0.1:51007_-n_0000000000) [n:127.0.0.1:51007_    ] o.a.s.c.o.ClusterStateMutator building a new cName: collection1
   [junit4]   2> 880511 INFO  (OverseerStateUpdate-94662258141429764-127.0.0.1:51007_-n_0000000000) [n:127.0.0.1:51007_    ] o.a.s.c.o.ZkStateWriter going to create_collection /collections/collection1/state.json
   [junit4]   2> 880725 INFO  (TEST-CollectionsAPIDistributedZkTest.test-seed#[FD8F3F9C919320A6]) [    ] o.a.s.SolrTestCaseJ4 Writing core.properties file to /x1/jenkins/jenkins-slave/workspace/Lucene-Solr-NightlyTests-5.x/solr/build/solr-core/test/J1/temp/solr.cloud.CollectionsAPIDistributedZkTest_FD8F3F9C919320A6-001/shard-1-001/cores/collection1
   [junit4]   2> 880726 INFO  (TEST-CollectionsAPIDistributedZkTest.test-seed#[FD8F3F9C919320A6]) [    ] o.a.s.c.AbstractFullDistribZkTestBase create jetty 1 in directory /x1/jenkins/jenkins-slave/workspace/Lucene-Solr-NightlyTests-5.x/solr/build/solr-core/test/J1/temp/solr.cloud.CollectionsAPIDistributedZkTest_FD8F3F9C919320A6-001/shard-1-001
   [junit4]   2> 880727 INFO  (TEST-CollectionsAPIDistributedZkTest.test-seed#[FD8F3F9C919320A6]) [    ] o.e.j.s.Server jetty-9.2.13.v20150730
   [junit4]   2> 880730 INFO  (TEST-CollectionsAPIDistributedZkTest.test-seed#[FD8F3F9C919320A6]) [    ] o.e.j.s.h.ContextHandler Started o.e.j.s.ServletContextHandler@20940707{/,null,AVAILABLE}
   [junit4]   2> 880730 INFO  (TEST-CollectionsAPIDistributedZkTest.test-seed#[FD8F3F9C919320A6]) [    ] o.e.j.s.ServerConnector Started ServerConnector@9153af4{HTTP/1.1}{127.0.0.1:44911}
   [junit4]   2> 880730 INFO  (TEST-CollectionsAPIDistributedZkTest.test-seed#[FD8F3F9C919320A6]) [    ] o.e.j.s.Server Started @883773ms
   [junit4]   2> 880730 INFO  (TEST-CollectionsAPIDistributedZkTest.test-seed#[FD8F3F9C919320A6]) [    ] o.a.s.c.s.e.JettySolrRunner Jetty properties: {coreRootDirectory=/x1/jenkins/jenkins-slave/workspace/Lucene-Solr-NightlyTests-5.x/solr/build/solr-core/test/J1/temp/solr.cloud.CollectionsAPIDistributedZkTest_FD8F3F9C919320A6-001/shard-1-001/cores, hostContext=/, hostPort=44911, solr.data.dir=/x1/jenkins/jenkins-slave/workspace/Lucene-Solr-NightlyTests-5.x/solr/build/solr-core/test/J1/temp/solr.cloud.CollectionsAPIDistributedZkTest_FD8F3F9C919320A6-001/tempDir-001/jetty1, solrconfig=solrconfig.xml}
   [junit4]   2> 880731 INFO  (TEST-CollectionsAPIDistributedZkTest.test-seed#[FD8F3F9C919320A6]) [    ] o.a.s.s.SolrDispatchFilter SolrDispatchFilter.init(): sun.misc.Launcher$AppClassLoader@4e0add57
   [junit4]   2> 880731 INFO  (TEST-CollectionsAPIDistributedZkTest.test-seed#[FD8F3F9C919320A6]) [    ] o.a.s.c.SolrResourceLoader new SolrResourceLoader for directory: '/x1/jenkins/jenkins-slave/workspace/Lucene-Solr-NightlyTests-5.x/solr/build/solr-core/test/J1/temp/solr.cloud.CollectionsAPIDistributedZkTest_FD8F3F9C919320A6-001/shard-1-001/'
   [junit4]   2> 880731 INFO  (TEST-CollectionsAPIDistributedZkTest.test-seed#[FD8F3F9C919320A6]) [    ] o.a.s.c.SolrResourceLoader JNDI not configured for solr (NoInitialContextEx)
   [junit4]   2> 880731 INFO  (TEST-CollectionsAPIDistributedZkTest.test-seed#[FD8F3F9C919320A6]) [    ] o.a.s.c.SolrResourceLoader solr home defaulted to 'solr/' (could not find system property or JNDI)
   [junit4]   2> 880754 INFO  (TEST-CollectionsAPIDistributedZkTest.test-seed#[FD8F3F9C919320A6]) [    ] o.a.s.c.c.SolrZkClient Using default ZkCredentialsProvider
   [junit4]   2> 880756 INFO  (TEST-CollectionsAPIDistributedZkTest.test-seed#[FD8F3F9C919320A6]) [    ] o.a.s.c.c.ConnectionManager Waiting for client to connect to ZooKeeper
   [junit4]   2> 880765 INFO  (zkCallback-192-thread-1) [    ] o.a.s.c.c.ConnectionManager Watcher org.apache.solr.common.cloud.ConnectionManager@55e3ec2 name:ZooKeeperConnection Watcher:127.0.0.1:55231/solr got event WatchedEvent state:SyncConnected type:None path:null path:null type:None
   [junit4]   2> 880765 INFO  (TEST-CollectionsAPIDistributedZkTest.test-seed#[FD8F3F9C919320A6]) [    ] o.a.s.c.c.ConnectionManager Client is connected to ZooKeeper
   [junit4]   2> 880765 INFO  (TEST-CollectionsAPIDistributedZkTest.test-seed#[FD8F3F9C919320A6]) [    ] o.a.s.c.c.SolrZkClient Using default ZkACLProvider
   [junit4]   2> 880768 INFO  (TEST-CollectionsAPIDistributedZkTest.test-seed#[FD8F3F9C919320A6]) [    ] o.a.s.s.SolrDispatchFilter Loading solr.xml from SolrHome (not found in ZooKeeper)
   [junit4]   2> 880768 INFO  (TEST-CollectionsAPIDistributedZkTest.test-seed#[FD8F3F9C919320A6]) [    ] o.a.s.c.SolrXmlConfig Loading container configuration from /x1/jenkins/jenkins-slave/workspace/Lucene-Solr-NightlyTests-5.x/solr/build/solr-core/test/J1/temp/solr.cloud.CollectionsAPIDistributedZkTest_FD8F3F9C919320A6-001/shard-1-001/solr.xml
   [junit4]   2> 880783 INFO  (TEST-CollectionsAPIDistributedZkTest.test-seed#[FD8F3F9C919320A6]) [    ] o.a.s.c.CoresLocator Config-defined core root directory: /x1/jenkins/jenkins-slave/workspace/Lucene-Solr-NightlyTests-5.x/solr/build/solr-core/test/J1/temp/solr.cloud.CollectionsAPIDistributedZkTest_FD8F3F9C919320A6-001/shard-1-001/cores
   [junit4]   2> 880784 INFO  (TEST-CollectionsAPIDistributedZkTest.test-seed#[FD8F3F9C919320A6]) [    ] o.a.s.c.CoreContainer New CoreContainer 887351633
   [junit4]   2> 880784 INFO  (TEST-CollectionsAPIDistributedZkTest.test-seed#[FD8F3F9C919320A6]) [    ] o.a.s.c.CoreContainer Loading cores into CoreContainer [instanceDir=/x1/jenkins/jenkins-slave/workspace/Lucene-Solr-NightlyTests-5.x/solr/build/solr-core/test/J1/temp/solr.cloud.CollectionsAPIDistributedZkTest_FD8F3F9C919320A6-001/shard-1-001/]
   [junit4]   2> 880784 INFO  (TEST-CollectionsAPIDistributedZkTest.test-seed#[FD8F3F9C919320A6]) [    ] o.a.s.c.CoreContainer loading shared library: /x1/jenkins/jenkins-slave/workspace/Lucene-Solr-NightlyTests-5.x/solr/build/solr-core/test/J1/temp/solr.cloud.CollectionsAPIDistributedZkTest_FD8F3F9C919320A6-001/shard-1-001/lib
   [junit4]   2> 880784 WARN  (TEST-CollectionsAPIDistributedZkTest.test-seed#[FD8F3F9C919320A6]) [    ] o.a.s.c.SolrResourceLoader Can't find (or read) directory to add to classloader: lib (resolved as: /x1/jenkins/jenkins-slave/workspace/Lucene-Solr-NightlyTests-5.x/solr/build/solr-core/test/J1/temp/solr.cloud.CollectionsAPIDistributedZkTest_FD8F3F9C919320A6-001/shard-1-001/lib).
   [junit4]   2> 880792 INFO  (TEST-CollectionsAPIDistributedZkTest.test-seed#[FD8F3F9C919320A6]) [    ] o.a.s.h.c.HttpShardHandlerFactory created with socketTimeout : 90000,urlScheme : ,connTimeout : 15000,maxConnectionsPerHost : 20,maxConnections : 10000,corePoolSize : 0,maximumPoolSize : 2147483647,maxThreadIdleTime : 5,sizeOfQueue : -1,fairnessPolicy : false,useRetries : false,
   [junit4]   2> 880794 INFO  (TEST-CollectionsAPIDistributedZkTest.test-seed#[FD8F3F9C919320A6]) [    ] o.a.s.u.UpdateShardHandler Creating UpdateShardHandler HTTP client with params: socketTimeout=340000&connTimeout=45000&retry=true
   [junit4]   2> 880794 INFO  (TEST-CollectionsAPIDistributedZkTest.test-seed#[FD8F3F9C919320A6]) [    ] o.a.s.l.LogWatcher SLF4J impl is org.slf4j.impl.Log4jLoggerFactory
   [junit4]   2> 880794 INFO  (TEST-CollectionsAPIDistributedZkTest.test-seed#[FD8F3F9C919320A6]) [    ] o.a.s.l.LogWatcher Registering Log Listener [Log4j (org.slf4j.impl.Log4jLoggerFactory)]
   [junit4]   2> 880794 INFO  (TEST-CollectionsAPIDistributedZkTest.test-seed#[FD8F3F9C919320A6]) [    ] o.a.s.c.ZkContainer Zookeeper client=127.0.0.1:55231/solr
   [junit4]   2> 880794 INFO  (TEST-CollectionsAPIDistributedZkTest.test-seed#[FD8F3F9C919320A6]) [    ] o.a.s.c.ZkController zkHost includes chroot
   [junit4]   2> 880795 INFO  (TEST-CollectionsAPIDistributedZkTest.test-seed#[FD8F3F9C919320A6]) [    ] o.a.s.c.c.SolrZkClient Using default ZkCredentialsProvider
   [junit4]   2> 880795 INFO  (TEST-CollectionsAPIDistributedZkTest.test-seed#[FD8F3F9C919320A6]) [    ] o.a.s.c.c.ConnectionManager Waiting for client to connect to ZooKeeper
   [junit4]   2> 880797 INFO  (zkCallback-194-thread-1) [    ] o.a.s.c.c.ConnectionManager Watcher org.apache.solr.common.cloud.ConnectionManager@89799d2 name:ZooKeeperConnection Watcher:127.0.0.1:55231 got event WatchedEvent state:SyncConnected type:None path:null path:null type:None
   [junit4]   2> 880797 INFO  (TEST-CollectionsAPIDistributedZkTest.test-seed#[FD8F3F9C919320A6]) [    ] o.a.s.c.c.ConnectionManager Client is connected to ZooKeeper
   [junit4]   2> 880798 INFO  (TEST-CollectionsAPIDistributedZkTest.test-seed#[FD8F3F9C919320A6]) [    ] o.a.s.c.c.SolrZkClient Using default ZkACLProvider
   [junit4]   2> 880802 INFO  (TEST-CollectionsAPIDistributedZkTest.test-seed#[FD8F3F9C919320A6]) [n:127.0.0.1:44911_    ] o.a.s.c.c.ConnectionManager Waiting for client to connect to ZooKeeper
   [junit4]   2> 880804 INFO  (zkCallback-195-thread-1-processing-n:127.0.0.1:44911_) [n:127.0.0.1:44911_    ] o.a.s.c.c.ConnectionManager Watcher org.apache.solr.common.cloud.ConnectionManager@29360df7 name:ZooKeeperConnection Watcher:127.0.0.1:55231/solr got event WatchedEvent state:SyncConnected type:None path:null path:null type:None
   [junit4]   2> 880804 INFO  (TEST-CollectionsAPIDistributedZkTest.test-seed#[FD8F3F9C919320A6]) [n:127.0.0.1:44911_    ] o.a.s.c.c.ConnectionManager Client is connected to ZooKeeper
   [junit4]   2> 880812 INFO  (TEST-CollectionsAPIDistributedZkTest.test-seed#[FD8F3F9C919320A6]) [n:127.0.0.1:44911_    ] o.a.s.c.c.ZkStateReader Updating cluster state from ZooKeeper... 
   [junit4]   2> 881819 INFO  (TEST-CollectionsAPIDistributedZkTest.test-seed#[FD8F3F9C919320A6]) [n:127.0.0.1:44911_    ] o.a.s.c.ZkController Register node as live in ZooKeeper:/live_nodes/127.0.0.1:44911_
   [junit4]   2> 881820 INFO  (TEST-CollectionsAPIDistributedZkTest.test-seed#[FD8F3F9C919320A6]) [n:127.0.0.1:44911_    ] o.a.s.c.c.SolrZkClient makePath: /live_nodes/127.0.0.1:44911_
   [junit4]   2> 881822 INFO  (zkCallback-190-thread-1) [    ] o.a.s.c.c.ZkStateReader A live node change: WatchedEvent state:SyncConnected type:NodeChildrenChanged path:/live_nodes, has occurred - updating... (live nodes size: 1)
   [junit4]   2> 881822 INFO  (zkCallback-188-thread-1-processing-n:127.0.0.1:51007_) [n:127.0.0.1:51007_    ] o.a.s.c.c.ZkStateReader A live node change: WatchedEvent state:SyncConnected type:NodeChildrenChanged path:/live_nodes, has occurred - updating... (live nodes size: 1)
   [junit4]   2> 881822 INFO  (zkCallback-195-thread-1-processing-n:127.0.0.1:44911_) [n:127.0.0.1:44911_    ] o.a.s.c.c.ZkStateReader A live node change: WatchedEvent state:SyncConnected type:NodeChildrenChanged path:/live_nodes, has occurred - updating... (live nodes size: 1)
   [junit4]   2> 881822 INFO  (zkCallback-188-thread-2-processing-n:127.0.0.1:51007_) [n:127.0.0.1:51007_    ] o.a.s.c.c.ZkStateReader A live node change: WatchedEvent state:SyncConnected type:NodeChildrenChanged path:/live_nodes, has occurred - updating... (live nodes size: 1)
   [junit4]   2> 881825 INFO  (TEST-CollectionsAPIDistributedZkTest.test-seed#[FD8F3F9C919320A6]) [n:127.0.0.1:44911_    ] o.a.s.c.Overseer Overseer (id=null) closing
   [junit4]   2> 881826 INFO  (TEST-CollectionsAPIDistributedZkTest.test-seed#[FD8F3F9C919320A6]) [n:127.0.0.1:44911_    ] o.a.s.c.LeaderElector Joined leadership election with path: /overseer_elect/election/94662258141429769-127.0.0.1:44911_-n_0000000001
   [junit4]   2> 881827 INFO  (TEST-CollectionsAPIDistributedZkTest.test-seed#[FD8F3F9C919320A6]) [n:127.0.0.1:44911_    ] o.a.s.c.LeaderElector Watching path /overseer_elect/election/94662258141429764-127.0.0.1:51007_-n_0000000000 to know if I could be the leader
   [junit4]   2> 881851 INFO  (TEST-CollectionsAPIDistributedZkTest.test-seed#[FD8F3F9C919320A6]) [n:127.0.0.1:44911_    ] o.a.s.c.CoreContainer Security conf doesn't exist. Skipping setup for authorization module.
   [junit4]   2> 881851 INFO  (TEST-CollectionsAPIDistributedZkTest.test-seed#[FD8F3F9C919320A6]) [n:127.0.0.1:44911_    ] o.a.s.c.CoreContainer No authentication plugin used.
   [junit4]   2> 881852 INFO  (TEST-CollectionsAPIDistributedZkTest.test-seed#[FD8F3F9C919320A6]) [n:127.0.0.1:44911_    ] o.a.s.c.CoresLocator Looking for core definitions underneath /x1/jenkins/jenkins-slave/workspace/Lucene-Solr-NightlyTests-5.x/solr/build/solr-core/test/J1/temp/solr.cloud.CollectionsAPIDistributedZkTest_FD8F3F9C919320A6-001/shard-1-001/cores
   [junit4]   2> 881853 INFO  (TEST-CollectionsAPIDistributedZkTest.test-seed#[FD8F3F9C919320A6]) [n:127.0.0.1:44911_    ] o.a.s.c.SolrCore Created CoreDescriptor: {shard=, collection=collection1, config=solrconfig.xml, dataDir=data/, loadOnStartup=true, name=collection1, absoluteInstDir=/x1/jenkins/jenkins-slave/workspace/Lucene-Solr-NightlyTests-5.x/solr/build/solr-core/test/J1/temp/solr.cloud.CollectionsAPIDistributedZkTest_FD8F3F9C919320A6-001/shard-1-001/cores/collection1/, configSetProperties=configsetprops.json, instanceDir=/x1/jenkins/jenkins-slave/workspace/Lucene-Solr-NightlyTests-5.x/solr/build/solr-core/test/J1/temp/solr.cloud.CollectionsAPIDistributedZkTest_FD8F3F9C919320A6-001/shard-1-001/cores/collection1, coreNodeName=, transient=false, schema=schema.xml}
   [junit4]   2> 881853 INFO  (TEST-CollectionsAPIDistributedZkTest.test-seed#[FD8F3F9C919320A6]) [n:127.0.0.1:44911_    ] o.a.s.c.CoresLocator Found core collection1 in /x1/jenkins/jenkins-slave/workspace/Lucene-Solr-NightlyTests-5.x/solr/build/solr-core/test/J1/temp/solr.cloud.CollectionsAPIDistributedZkTest_FD8F3F9C919320A6-001/shard-1-001/cores/collection1/
   [junit4]   2> 881853 INFO  (TEST-CollectionsAPIDistributedZkTest.test-seed#[FD8F3F9C919320A6]) [n:127.0.0.1:44911_    ] o.a.s.c.CoresLocator Found 1 core definitions
   [junit4]   2> 881857 INFO  (TEST-CollectionsAPIDistributedZkTest.test-seed#[FD8F3F9C919320A6]) [n:127.0.0.1:44911_    ] o.a.s.s.SolrDispatchFilter user.dir=/x1/jenkins/jenkins-slave/workspace/Lucene-Solr-NightlyTests-5.x/solr/build/solr-core/test/J1
   [junit4]   2> 881857 INFO  (TEST-CollectionsAPIDistributedZkTest.test-seed#[FD8F3F9C919320A6]) [n:127.0.0.1:44911_    ] o.a.s.s.SolrDispatchFilter SolrDispatchFilter.init() done
   [junit4]   2> 881857 INFO  (coreLoadExecutor-1042-thread-1-processing-n:127.0.0.1:44911_) [n:127.0.0.1:44911_ c:collection1   x:collection1] o.a.s.c.ZkController publishing state=down
   [junit4]   2> 881857 INFO  (coreLoadExecutor-1042-thread-1-processing-n:127.0.0.1:44911_) [n:127.0.0.1:44911_ c:collection1   x:collection1] o.a.s.c.ZkController numShards not found on descriptor - reading it from system property
   [junit4]   2> 881859 INFO  (coreLoadExecutor-1042-thread-1-processing-n:127.0.0.1:44911_) [n:127.0.0.1:44911_ c:collection1   x:collection1] o.a.s.c.ZkController Registering watch for collection collection1
   [junit4]   2> 881859 INFO  (coreLoadExecutor-1042-thread-1-processing-n:127.0.0.1:44911_) [n:127.0.0.1:44911_ c:collection1   x:collection1] o.a.s.c.c.ZkStateReader addZkWatch collection1
   [junit4]   2> 881859 INFO  (OverseerStateUpdate-94662258141429764-127.0.0.1:51007_-n_0000000000) [n:127.0.0.1:51007_    ] o.a.s.c.Overseer processMessage: queueSize: 1, message = {
   [junit4]   2>   "numShards":"2",
   [junit4]   2>   "base_url":"http://127.0.0.1:44911",
   [junit4]   2>   "core":"collection1",
   [junit4]   2>   "node_name":"127.0.0.1:44911_",
   [junit4]   2>   "state":"down",
   [junit4]   2>   "shard":null,
   [junit4]   2>   "roles":null,
   [junit4]   2>   "operation":"state",
   [junit4]   2>   "collection":"collection1"} current state version: 4
   [junit4]   2> 881859 INFO  (coreLoadExecutor-1042-thread-1-processing-n:127.0.0.1:44911_) [n:127.0.0.1:44911_ c:collection1   x:collection1] o.a.s.c.c.ZkStateReader Add data for collection1 ver 0 
   [junit4]   2> 881859 INFO  (OverseerStateUpdate-94662258141429764-127.0.0.1:51007_-n_0000000000) [n:127.0.0.1:51007_    ] o.a.s.c.o.ReplicaMutator Update state numShards=2 message={
   [junit4]   2>   "numShards":"2",
   [junit4]   2>   "base_url":"http://127.0.0.1:44911",
   [junit4]   2>   "core":"collection1",
   [junit4]   2>   "node_name":"127.0.0.1:44911_",
   [junit4]   2>   "state":"down",
   [junit4]   2>   "shard":null,
   [junit4]   2>   "roles":null,
   [junit4]   2>   "operation":"state",
   [junit4]   2>   "collection":"collection1"}
   [junit4]   2> 881859 INFO  (coreLoadExecutor-1042-thread-1-processing-n:127.0.0.1:44911_) [n:127.0.0.1:44911_ c:collection1   x:collection1] o.a.s.c.ZkController look for our core node name
   [junit4]   2> 881860 INFO  (OverseerStateUpdate-94662258141429764-127.0.0.1:51007_-n_0000000000) [n:127.0.0.1:51007_    ] o.a.s.c.o.ReplicaMutator Collection already exists with numShards=2
   [junit4]   2> 881860 INFO  (OverseerStateUpdate-94662258141429764-127.0.0.1:51007_-n_0000000000) [n:127.0.0.1:51007_    ] o.a.s.c.o.ReplicaMutator Assigning new node to shard shard=shard1
   [junit4]   2> 881962 INFO  (OverseerStateUpdate-94662258141429764-127.0.0.1:51007_-n_0000000000) [n:127.0.0.1:51007_    ] o.a.s.c.o.ZkStateWriter going to update_collection /collections/collection1/state.json version: 0
   [junit4]   2> 881963 INFO  (zkCallback-195-thread-1-processing-n:127.0.0.1:44911_) [n:127.0.0.1:44911_    ] o.a.s.c.c.ZkStateReader A cluster state change: WatchedEvent state:SyncConnected type:NodeDataChanged path:/collections/collection1/state.json for collection collection1 has occurred - updating... (live nodes size: 2)
   [junit4]   2> 881964 INFO  (zkCallback-195-thread-1-processing-n:127.0.0.1:44911_) [n:127.0.0.1:44911_    ] o.a.s.c.c.ZkStateReader Updating data for collection1 from 0 to 1 
   [junit4]   2> 882860 INFO  (coreLoadExecutor-1042-thread-1-processing-n:127.0.0.1:44911_) [n:127.0.0.1:44911_ c:collection1   x:collection1] o.a.s.c.ZkController waiting to find shard id in clusterstate for collection1
   [junit4]   2> 882860 INFO  (coreLoadExecutor-1042-thread-1-processing-n:127.0.0.1:44911_) [n:127.0.0.1:44911_ c:collection1   x:collection1] o.a.s.c.ZkController Check for collection zkNode:collection1
   [junit4]   2> 882860 INFO  (coreLoadExecutor-1042-thread-1-processing-n:127.0.0.1:44911_) [n:127.0.0.1:44911_ c:collection1   x:collection1] o.a.s.c.ZkController Collection zkNode exists
   [junit4]   2> 882860 INFO  (coreLoadExecutor-1042-thread-1-processing-n:127.0.0.1:44911_) [n:127.0.0.1:44911_ c:collection1   x:collection1] o.a.s.c.c.ZkStateReader Load collection config from:/collections/collection1
   [junit4]   2> 882861 INFO  (coreLoadExecutor-1042-thread-1-processing-n:127.0.0.1:44911_) [n:127.0.0.1:44911_ c:collection1   x:collection1] o.a.s.c.c.ZkStateReader path=/collections/collection1 configName=conf1 specified config exists in ZooKeeper
   [junit4]   2> 882861 INFO  (coreLoadExecutor-1042-thread-1-processing-n:127.0.0.1:44911_) [n:127.0.0.1:44911_ c:collection1   x:collection1] o.a.s.c.SolrResourceLoader new SolrResourceLoader for directory: '/x1/jenkins/jenkins-slave/workspace/Lucene-Solr-NightlyTests-5.x/solr/build/solr-core/test/J1/temp/solr.cloud.CollectionsAPIDistributedZkTest_FD8F3F9C919320A6-001/shard-1-001/cores/collection1/'
   [junit4]   2> 882861 INFO  (coreLoadExecutor-1042-thread-1-processing-n:127.0.0.1:44911_) [n:127.0.0.1:44911_ c:collection1   x:collection1] o.a.s.c.SolrResourceLoader JNDI not configured for solr (NoInitialContextEx)
   [junit4]   2> 882862 INFO  (coreLoadExecutor-1042-thread-1-processing-n:127.0.0.1:44911_) [n:127.0.0.1:44911_ c:collection1   x:collection1] o.a.s.c.SolrResourceLoader solr home defaulted to 'solr/' (could not find system property or JNDI)
   [junit4]   2> 882879 INFO  (coreLoadExecutor-1042-thread-1-processing-n:127.0.0.1:44911_) [n:127.0.0.1:44911_ c:collection1   x:collection1] o.a.s.c.Config loaded config solrconfig.xml with version 0 
   [junit4]   2> 882885 INFO  (coreLoadExecutor-1042-thread-1-processing-n:127.0.0.1:44911_) [n:127.0.0.1:44911_ c:collection1   x:collection1] o.a.s.c.SolrConfig current version of requestparams : -1
   [junit4]   2

[...truncated too long message...]

766952 INFO  (TEST-LeaderInitiatedRecoveryOnShardRestartTest.testRestartWithAllInLIR-seed#[FD8F3F9C919320A6]) [    ] o.e.j.s.ServerConnector Stopped ServerConnector@95593ac{HTTP/1.1}{127.0.0.1:37208}
   [junit4]   2> 2766952 INFO  (TEST-LeaderInitiatedRecoveryOnShardRestartTest.testRestartWithAllInLIR-seed#[FD8F3F9C919320A6]) [    ] o.e.j.s.h.ContextHandler Stopped o.e.j.s.ServletContextHandler@46267ee7{/,null,UNAVAILABLE}
   [junit4]   2> 2766954 INFO  (TEST-LeaderInitiatedRecoveryOnShardRestartTest.testRestartWithAllInLIR-seed#[FD8F3F9C919320A6]) [n:127.0.0.1:37208_ c:collection1 s:shard1 r:core_node2 x:collection1] o.a.s.c.ZkTestServer connecting to 127.0.0.1:36935 36935
   [junit4]   2> 2767078 INFO  (Thread-58578) [    ] o.a.s.c.ZkTestServer connecting to 127.0.0.1:36935 36935
   [junit4]   2> 2767079 WARN  (Thread-58578) [    ] o.a.s.c.ZkTestServer Watch limit violations: 
   [junit4]   2> Maximum concurrent create/delete watches above limit:
   [junit4]   2> 
   [junit4]   2> 	7	/solr/aliases.json
   [junit4]   2> 	6	/solr/security.json
   [junit4]   2> 	5	/solr/configs/conf1
   [junit4]   2> 
   [junit4]   2> Maximum concurrent data watches above limit:
   [junit4]   2> 
   [junit4]   2> 	35	/solr/clusterstate.json
   [junit4]   2> 	3	/solr/overseer_elect/election/94662358046998532-127.0.0.1:42116_-n_0000000000
   [junit4]   2> 
   [junit4]   2> Maximum concurrent children watches above limit:
   [junit4]   2> 
   [junit4]   2> 	11	/solr/live_nodes
   [junit4]   2> 	8	/solr/collections
   [junit4]   2> 	3	/solr/overseer/collection-queue-work
   [junit4]   2> 	3	/solr/overseer/queue
   [junit4]   2> 
   [junit4]   2> NOTE: download the large Jenkins line-docs file by running 'ant get-jenkins-line-docs' in the lucene directory.
   [junit4]   2> NOTE: reproduce with: ant test  -Dtestcase=LeaderInitiatedRecoveryOnShardRestartTest -Dtests.method=testRestartWithAllInLIR -Dtests.seed=FD8F3F9C919320A6 -Dtests.multiplier=2 -Dtests.nightly=true -Dtests.slow=true -Dtests.linedocsfile=/x1/jenkins/lucene-data/enwiki.random.lines.txt -Dtests.locale=ar_LB -Dtests.timezone=Africa/Bissau -Dtests.asserts=true -Dtests.file.encoding=US-ASCII
   [junit4] ERROR    365s J2 | LeaderInitiatedRecoveryOnShardRestartTest.testRestartWithAllInLIR <<<
   [junit4]    > Throwable #1: java.lang.AssertionError: There are still nodes recoverying - waited for 330 seconds
   [junit4]    > 	at org.apache.solr.cloud.AbstractDistribZkTestBase.waitForRecoveriesToFinish(AbstractDistribZkTestBase.java:172)
   [junit4]    > 	at org.apache.solr.cloud.AbstractDistribZkTestBase.waitForRecoveriesToFinish(AbstractDistribZkTestBase.java:133)
   [junit4]    > 	at org.apache.solr.cloud.AbstractDistribZkTestBase.waitForRecoveriesToFinish(AbstractDistribZkTestBase.java:128)
   [junit4]    > 	at org.apache.solr.cloud.AbstractFullDistribZkTestBase.waitForRecoveriesToFinish(AbstractFullDistribZkTestBase.java:830)
   [junit4]    > 	at org.apache.solr.cloud.LeaderInitiatedRecoveryOnShardRestartTest.testRestartWithAllInLIR(LeaderInitiatedRecoveryOnShardRestartTest.java:81)
   [junit4]    > 	at org.apache.solr.BaseDistributedSearchTestCase$ShardsRepeatRule$ShardsFixedStatement.callStatement(BaseDistributedSearchTestCase.java:963)
   [junit4]    > 	at org.apache.solr.BaseDistributedSearchTestCase$ShardsRepeatRule$ShardsStatement.evaluate(BaseDistributedSearchTestCase.java:938)
   [junit4]    > 	at java.lang.Thread.run(Thread.java:745)Throwable #2: com.carrotsearch.randomizedtesting.UncaughtExceptionError: Captured an uncaught exception in thread: Thread[id=67647, name=coreZkRegister-4391-thread-1, state=RUNNABLE, group=TGRP-LeaderInitiatedRecoveryOnShardRestartTest]
   [junit4]    > Caused by: java.lang.AssertionError
   [junit4]    > 	at __randomizedtesting.SeedInfo.seed([FD8F3F9C919320A6]:0)
   [junit4]    > 	at org.apache.solr.cloud.ZkController.updateLeaderInitiatedRecoveryState(ZkController.java:2133)
   [junit4]    > 	at org.apache.solr.cloud.ShardLeaderElectionContext.runLeaderProcess(ElectionContext.java:434)
   [junit4]    > 	at org.apache.solr.cloud.LeaderElector.runIamLeaderProcess(LeaderElector.java:197)
   [junit4]    > 	at org.apache.solr.cloud.LeaderElector.checkIfIamLeader(LeaderElector.java:157)
   [junit4]    > 	at org.apache.solr.cloud.LeaderElector.joinElection(LeaderElector.java:346)
   [junit4]    > 	at org.apache.solr.cloud.ZkController.joinElection(ZkController.java:1113)
   [junit4]    > 	at org.apache.solr.cloud.ZkController.register(ZkController.java:926)
   [junit4]    > 	at org.apache.solr.cloud.ZkController.register(ZkController.java:881)
   [junit4]    > 	at org.apache.solr.core.ZkContainer$2.run(ZkContainer.java:183)
   [junit4]    > 	at org.apache.solr.common.util.ExecutorUtil$MDCAwareThreadPoolExecutor$1.run(ExecutorUtil.java:231)
   [junit4]    > 	at java.util.concurrent.ThreadPoolExecutor.runWorker(ThreadPoolExecutor.java:1145)
   [junit4]    > 	at java.util.concurrent.ThreadPoolExecutor$Worker.run(ThreadPoolExecutor.java:615)
   [junit4]    > 	at java.lang.Thread.run(Thread.java:745)
   [junit4]   2> 2767094 INFO  (SUITE-LeaderInitiatedRecoveryOnShardRestartTest-seed#[FD8F3F9C919320A6]-worker) [n:127.0.0.1:37208_ c:collection1 s:shard1 r:core_node2 x:collection1] o.a.s.SolrTestCaseJ4 ###deleteCore
   [junit4]   2> NOTE: leaving temporary files on disk at: /x1/jenkins/jenkins-slave/workspace/Lucene-Solr-NightlyTests-5.x/solr/build/solr-core/test/J2/temp/solr.cloud.LeaderInitiatedRecoveryOnShardRestartTest_FD8F3F9C919320A6-001
   [junit4]   2> Oct 09, 2015 7:28:38 PM com.carrotsearch.randomizedtesting.ThreadLeakControl checkThreadLeaks
   [junit4]   2> WARNING: Will linger awaiting termination of 1 leaked thread(s).
   [junit4]   2> NOTE: test params are: codec=Asserting(Lucene53): {}, docValues:{}, sim=DefaultSimilarity, locale=ar_LB, timezone=Africa/Bissau
   [junit4]   2> NOTE: Linux 3.13.0-52-generic amd64/Oracle Corporation 1.7.0_72 (64-bit)/cpus=4,threads=1,free=341330552,total=478674944
   [junit4]   2> NOTE: All tests run in this JVM: [UpdateParamsTest, TestAnalyzeInfixSuggestions, HdfsLockFactoryTest, DirectUpdateHandlerOptimizeTest, TestCollationField, SuggesterWFSTTest, CloudMLTQParserTest, TestJsonFacets, QueryResultKeyTest, OverseerTest, FieldAnalysisRequestHandlerTest, TestReplicationHandlerBackup, ZkNodePropsTest, ChangedSchemaMergeTest, SparseHLLTest, DateRangeFieldTest, RecoveryZkTest, SolrCoreCheckLockOnStartupTest, TestExactSharedStatsCache, TestSort, BadComponentTest, DirectUpdateHandlerTest, TestSolrQueryParserResource, TestSolrQueryParser, ActionThrottleTest, TestFuzzyAnalyzedSuggestions, DistribDocExpirationUpdateProcessorTest, RulesTest, TestShardHandlerFactory, TestNonDefinedSimilarityFactory, ShowFileRequestHandlerTest, AsyncCallRequestStatusResponseTest, TestMinMaxOnMultiValuedField, TestJettySolrRunner, TestFastLRUCache, TestCharFilters, TestDistributedStatsComponentCardinality, TestShortCircuitedRequests, ShardSplitTest, DebugComponentTest, DistributedSuggestComponentTest, TestCopyFieldCollectionResource, TestFastWriter, TestStressReorder, SpatialRPTFieldTypeTest, TermVectorComponentDistributedTest, TestSolrConfigHandlerCloud, TestSimpleTrackingShardHandler, DocExpirationUpdateProcessorFactoryTest, SolrTestCaseJ4Test, TestNoOpRegenerator, TestIndexSearcher, DocValuesMultiTest, TestExtendedDismaxParser, SystemInfoHandlerTest, BitVectorTest, TestStressRecovery, TestLeaderInitiatedRecoveryThread, TestMiniSolrCloudClusterBase, AutoCommitTest, PrimitiveFieldTypeTest, TestJsonRequest, SecurityConfHandlerTest, TestReRankQParserPlugin, TestRemoveLastDynamicCopyField, TestSearchPerf, RAMDirectoryFactoryTest, TestHashQParserPlugin, TestManagedSchemaFieldResource, FullSolrCloudDistribCmdsTest, CursorMarkTest, TestLRUCache, AddBlockUpdateTest, FieldMutatingUpdateProcessorTest, MergeStrategyTest, BadIndexSchemaTest, FacetPivotSmallTest, TestXIncludeConfig, TestCSVResponseWriter, LeaderFailoverAfterPartitionTest, ZkStateWriterTest, TestElisionMultitermQuery, DirectSolrConnectionTest, LeaderElectionTest, TestReversedWildcardFilterFactory, TestFieldTypeResource, ChaosMonkeySafeLeaderTest, BasicDistributedZk2Test, UnloadDistributedZkTest, ZkSolrClientTest, TestZkChroot, ShardRoutingCustomTest, TestDistributedSearch, TestSystemIdResolver, PrimUtilsTest, TestSuggestSpellingConverter, DOMUtilTest, ClusterStateTest, TestUtils, TestDocumentBuilder, UUIDFieldTest, DistributedMLTComponentTest, CursorPagingTest, DistributedIntervalFacetingTest, DeleteReplicaTest, DeleteShardTest, DistributedQueueTest, LeaderInitiatedRecoveryOnShardRestartTest]
   [junit4] Completed [416/540] on J2 in 365.79s, 1 test, 1 error <<< FAILURES!

[...truncated 408 lines...]
BUILD FAILED
/x1/jenkins/jenkins-slave/workspace/Lucene-Solr-NightlyTests-5.x/build.xml:792: The following error occurred while executing this line:
/x1/jenkins/jenkins-slave/workspace/Lucene-Solr-NightlyTests-5.x/build.xml:729: The following error occurred while executing this line:
/x1/jenkins/jenkins-slave/workspace/Lucene-Solr-NightlyTests-5.x/build.xml:59: The following error occurred while executing this line:
/x1/jenkins/jenkins-slave/workspace/Lucene-Solr-NightlyTests-5.x/solr/build.xml:233: The following error occurred while executing this line:
/x1/jenkins/jenkins-slave/workspace/Lucene-Solr-NightlyTests-5.x/solr/common-build.xml:526: The following error occurred while executing this line:
/x1/jenkins/jenkins-slave/workspace/Lucene-Solr-NightlyTests-5.x/lucene/common-build.xml:1452: The following error occurred while executing this line:
/x1/jenkins/jenkins-slave/workspace/Lucene-Solr-NightlyTests-5.x/lucene/common-build.xml:1006: There were test failures: 540 suites (7 ignored), 2131 tests, 2 errors, 1 failure, 29 ignored (17 assumptions) [seed: FD8F3F9C919320A6]

Total time: 188 minutes 55 seconds
Build step 'Invoke Ant' marked build as failure
Archiving artifacts
Recording test results
Email was triggered for: Failure - Any
Sending email for trigger: Failure - Any



Mime
View raw message