lucene-dev mailing list archives

Site index · List index
Message view « Date » · « Thread »
Top « Date » · « Thread »
From Apache Jenkins Server <jenk...@builds.apache.org>
Subject [JENKINS] Lucene-Solr-NightlyTests-5.x - Build # 983 - Still Failing
Date Mon, 12 Oct 2015 14:35:09 GMT
Build: https://builds.apache.org/job/Lucene-Solr-NightlyTests-5.x/983/

13 tests failed.
FAILED:  junit.framework.TestSuite.org.apache.solr.TestSolrCoreProperties

Error Message:
ObjectTracker found 6 object(s) that were not released!!! [SolrZkClient]

Stack Trace:
java.lang.AssertionError: ObjectTracker found 6 object(s) that were not released!!! [SolrZkClient]
	at __randomizedtesting.SeedInfo.seed([628DB96865AB7A13]:0)
	at org.junit.Assert.fail(Assert.java:93)
	at org.junit.Assert.assertTrue(Assert.java:43)
	at org.junit.Assert.assertNull(Assert.java:551)
	at org.apache.solr.SolrTestCaseJ4.afterClass(SolrTestCaseJ4.java:236)
	at sun.reflect.NativeMethodAccessorImpl.invoke0(Native Method)
	at sun.reflect.NativeMethodAccessorImpl.invoke(NativeMethodAccessorImpl.java:57)
	at sun.reflect.DelegatingMethodAccessorImpl.invoke(DelegatingMethodAccessorImpl.java:43)
	at java.lang.reflect.Method.invoke(Method.java:606)
	at com.carrotsearch.randomizedtesting.RandomizedRunner.invoke(RandomizedRunner.java:1665)
	at com.carrotsearch.randomizedtesting.RandomizedRunner$7.evaluate(RandomizedRunner.java:827)
	at com.carrotsearch.randomizedtesting.rules.StatementAdapter.evaluate(StatementAdapter.java:36)
	at com.carrotsearch.randomizedtesting.rules.SystemPropertiesRestoreRule$1.evaluate(SystemPropertiesRestoreRule.java:57)
	at org.apache.lucene.util.AbstractBeforeAfterRule$1.evaluate(AbstractBeforeAfterRule.java:46)
	at com.carrotsearch.randomizedtesting.rules.StatementAdapter.evaluate(StatementAdapter.java:36)
	at org.apache.lucene.util.TestRuleStoreClassName$1.evaluate(TestRuleStoreClassName.java:42)
	at com.carrotsearch.randomizedtesting.rules.NoShadowingOrOverridesOnMethodsRule$1.evaluate(NoShadowingOrOverridesOnMethodsRule.java:39)
	at com.carrotsearch.randomizedtesting.rules.NoShadowingOrOverridesOnMethodsRule$1.evaluate(NoShadowingOrOverridesOnMethodsRule.java:39)
	at com.carrotsearch.randomizedtesting.rules.StatementAdapter.evaluate(StatementAdapter.java:36)
	at com.carrotsearch.randomizedtesting.rules.StatementAdapter.evaluate(StatementAdapter.java:36)
	at com.carrotsearch.randomizedtesting.rules.StatementAdapter.evaluate(StatementAdapter.java:36)
	at org.apache.lucene.util.TestRuleAssertionsRequired$1.evaluate(TestRuleAssertionsRequired.java:54)
	at org.apache.lucene.util.TestRuleMarkFailure$1.evaluate(TestRuleMarkFailure.java:48)
	at org.apache.lucene.util.TestRuleIgnoreAfterMaxFailures$1.evaluate(TestRuleIgnoreAfterMaxFailures.java:65)
	at org.apache.lucene.util.TestRuleIgnoreTestSuites$1.evaluate(TestRuleIgnoreTestSuites.java:55)
	at com.carrotsearch.randomizedtesting.rules.StatementAdapter.evaluate(StatementAdapter.java:36)
	at com.carrotsearch.randomizedtesting.ThreadLeakControl$StatementRunner.run(ThreadLeakControl.java:367)
	at java.lang.Thread.run(Thread.java:745)


FAILED:  org.apache.solr.cloud.DeleteLastCustomShardedReplicaTest.test

Error Message:
KeeperErrorCode = Session expired for /solr

Stack Trace:
org.apache.zookeeper.KeeperException$SessionExpiredException: KeeperErrorCode = Session expired for /solr
	at __randomizedtesting.SeedInfo.seed([628DB96865AB7A13:EAD986B2CB5717EB]:0)
	at org.apache.zookeeper.KeeperException.create(KeeperException.java:127)
	at org.apache.zookeeper.KeeperException.create(KeeperException.java:51)
	at org.apache.zookeeper.ZooKeeper.exists(ZooKeeper.java:1045)
	at org.apache.solr.common.cloud.SolrZkClient$4.execute(SolrZkClient.java:294)
	at org.apache.solr.common.cloud.SolrZkClient$4.execute(SolrZkClient.java:291)
	at org.apache.solr.common.cloud.ZkCmdExecutor.retryOperation(ZkCmdExecutor.java:61)
	at org.apache.solr.common.cloud.SolrZkClient.exists(SolrZkClient.java:291)
	at org.apache.solr.common.cloud.SolrZkClient.makePath(SolrZkClient.java:486)
	at org.apache.solr.common.cloud.SolrZkClient.makePath(SolrZkClient.java:403)
	at org.apache.solr.cloud.AbstractZkTestCase.buildZooKeeper(AbstractZkTestCase.java:90)
	at org.apache.solr.cloud.AbstractZkTestCase.buildZooKeeper(AbstractZkTestCase.java:83)
	at org.apache.solr.cloud.AbstractDistribZkTestBase.distribSetUp(AbstractDistribZkTestBase.java:72)
	at org.apache.solr.cloud.AbstractFullDistribZkTestBase.distribSetUp(AbstractFullDistribZkTestBase.java:197)
	at org.apache.solr.BaseDistributedSearchTestCase$ShardsRepeatRule$ShardsStatement.evaluate(BaseDistributedSearchTestCase.java:933)
	at com.carrotsearch.randomizedtesting.rules.SystemPropertiesRestoreRule$1.evaluate(SystemPropertiesRestoreRule.java:57)
	at org.apache.lucene.util.TestRuleSetupTeardownChained$1.evaluate(TestRuleSetupTeardownChained.java:50)
	at org.apache.lucene.util.AbstractBeforeAfterRule$1.evaluate(AbstractBeforeAfterRule.java:46)
	at org.apache.lucene.util.TestRuleThreadAndTestName$1.evaluate(TestRuleThreadAndTestName.java:49)
	at org.apache.lucene.util.TestRuleIgnoreAfterMaxFailures$1.evaluate(TestRuleIgnoreAfterMaxFailures.java:65)
	at org.apache.lucene.util.TestRuleMarkFailure$1.evaluate(TestRuleMarkFailure.java:48)
	at com.carrotsearch.randomizedtesting.rules.StatementAdapter.evaluate(StatementAdapter.java:36)
	at com.carrotsearch.randomizedtesting.ThreadLeakControl$StatementRunner.run(ThreadLeakControl.java:367)
	at com.carrotsearch.randomizedtesting.ThreadLeakControl.forkTimeoutingTask(ThreadLeakControl.java:809)
	at com.carrotsearch.randomizedtesting.ThreadLeakControl$3.evaluate(ThreadLeakControl.java:460)
	at com.carrotsearch.randomizedtesting.RandomizedRunner.runSingleTest(RandomizedRunner.java:873)
	at com.carrotsearch.randomizedtesting.RandomizedRunner$5.evaluate(RandomizedRunner.java:775)
	at com.carrotsearch.randomizedtesting.RandomizedRunner$6.evaluate(RandomizedRunner.java:809)
	at com.carrotsearch.randomizedtesting.RandomizedRunner$7.evaluate(RandomizedRunner.java:820)
	at com.carrotsearch.randomizedtesting.rules.StatementAdapter.evaluate(StatementAdapter.java:36)
	at com.carrotsearch.randomizedtesting.rules.SystemPropertiesRestoreRule$1.evaluate(SystemPropertiesRestoreRule.java:57)
	at org.apache.lucene.util.AbstractBeforeAfterRule$1.evaluate(AbstractBeforeAfterRule.java:46)
	at com.carrotsearch.randomizedtesting.rules.StatementAdapter.evaluate(StatementAdapter.java:36)
	at org.apache.lucene.util.TestRuleStoreClassName$1.evaluate(TestRuleStoreClassName.java:42)
	at com.carrotsearch.randomizedtesting.rules.NoShadowingOrOverridesOnMethodsRule$1.evaluate(NoShadowingOrOverridesOnMethodsRule.java:39)
	at com.carrotsearch.randomizedtesting.rules.NoShadowingOrOverridesOnMethodsRule$1.evaluate(NoShadowingOrOverridesOnMethodsRule.java:39)
	at com.carrotsearch.randomizedtesting.rules.StatementAdapter.evaluate(StatementAdapter.java:36)
	at com.carrotsearch.randomizedtesting.rules.StatementAdapter.evaluate(StatementAdapter.java:36)
	at com.carrotsearch.randomizedtesting.rules.StatementAdapter.evaluate(StatementAdapter.java:36)
	at org.apache.lucene.util.TestRuleAssertionsRequired$1.evaluate(TestRuleAssertionsRequired.java:54)
	at org.apache.lucene.util.TestRuleMarkFailure$1.evaluate(TestRuleMarkFailure.java:48)
	at org.apache.lucene.util.TestRuleIgnoreAfterMaxFailures$1.evaluate(TestRuleIgnoreAfterMaxFailures.java:65)
	at org.apache.lucene.util.TestRuleIgnoreTestSuites$1.evaluate(TestRuleIgnoreTestSuites.java:55)
	at com.carrotsearch.randomizedtesting.rules.StatementAdapter.evaluate(StatementAdapter.java:36)
	at com.carrotsearch.randomizedtesting.ThreadLeakControl$StatementRunner.run(ThreadLeakControl.java:367)
	at java.lang.Thread.run(Thread.java:745)


FAILED:  junit.framework.TestSuite.org.apache.solr.cloud.DeleteLastCustomShardedReplicaTest

Error Message:
6 threads leaked from SUITE scope at org.apache.solr.cloud.DeleteLastCustomShardedReplicaTest:     1) Thread[id=9036, name=ProcessThread(sid:0 cport:-1):, state=WAITING, group=TGRP-DeleteLastCustomShardedReplicaTest]         at sun.misc.Unsafe.park(Native Method)         at java.util.concurrent.locks.LockSupport.park(LockSupport.java:186)         at java.util.concurrent.locks.AbstractQueuedSynchronizer$ConditionObject.await(AbstractQueuedSynchronizer.java:2043)         at java.util.concurrent.LinkedBlockingQueue.take(LinkedBlockingQueue.java:442)         at org.apache.zookeeper.server.PrepRequestProcessor.run(PrepRequestProcessor.java:120)    2) Thread[id=9030, name=Thread-6103, state=WAITING, group=TGRP-DeleteLastCustomShardedReplicaTest]         at java.lang.Object.wait(Native Method)         at java.lang.Thread.join(Thread.java:1281)         at java.lang.Thread.join(Thread.java:1355)         at org.apache.zookeeper.server.NIOServerCnxnFactory.join(NIOServerCnxnFactory.java:302)         at org.apache.solr.cloud.ZkTestServer$ZKServerMain.runFromConfig(ZkTestServer.java:310)         at org.apache.solr.cloud.ZkTestServer$2.run(ZkTestServer.java:491)    3) Thread[id=9031, name=NIOServerCxn.Factory:0.0.0.0/0.0.0.0:0, state=RUNNABLE, group=TGRP-DeleteLastCustomShardedReplicaTest]         at sun.nio.ch.EPollArrayWrapper.epollWait(Native Method)         at sun.nio.ch.EPollArrayWrapper.poll(EPollArrayWrapper.java:269)         at sun.nio.ch.EPollSelectorImpl.doSelect(EPollSelectorImpl.java:79)         at sun.nio.ch.SelectorImpl.lockAndDoSelect(SelectorImpl.java:87)         at sun.nio.ch.SelectorImpl.select(SelectorImpl.java:98)         at org.apache.zookeeper.server.NIOServerCnxnFactory.run(NIOServerCnxnFactory.java:178)         at java.lang.Thread.run(Thread.java:745)    4) Thread[id=9032, name=SessionTracker, state=TIMED_WAITING, group=TGRP-DeleteLastCustomShardedReplicaTest]         at java.lang.Object.wait(Native Method)         at org.apache.zookeeper.server.SessionTrackerImpl.run(SessionTrackerImpl.java:146)

Stack Trace:
com.carrotsearch.randomizedtesting.ThreadLeakError: 6 threads leaked from SUITE scope at org.apache.solr.cloud.DeleteLastCustomShardedReplicaTest: 
   1) Thread[id=9036, name=ProcessThread(sid:0 cport:-1):, state=WAITING, group=TGRP-DeleteLastCustomShardedReplicaTest]
        at sun.misc.Unsafe.park(Native Method)
        at java.util.concurrent.locks.LockSupport.park(LockSupport.java:186)
        at java.util.concurrent.locks.AbstractQueuedSynchronizer$ConditionObject.await(AbstractQueuedSynchronizer.java:2043)
        at java.util.concurrent.LinkedBlockingQueue.take(LinkedBlockingQueue.java:442)
        at org.apache.zookeeper.server.PrepRequestProcessor.run(PrepRequestProcessor.java:120)
   2) Thread[id=9030, name=Thread-6103, state=WAITING, group=TGRP-DeleteLastCustomShardedReplicaTest]
        at java.lang.Object.wait(Native Method)
        at java.lang.Thread.join(Thread.java:1281)
        at java.lang.Thread.join(Thread.java:1355)
        at org.apache.zookeeper.server.NIOServerCnxnFactory.join(NIOServerCnxnFactory.java:302)
        at org.apache.solr.cloud.ZkTestServer$ZKServerMain.runFromConfig(ZkTestServer.java:310)
        at org.apache.solr.cloud.ZkTestServer$2.run(ZkTestServer.java:491)
   3) Thread[id=9031, name=NIOServerCxn.Factory:0.0.0.0/0.0.0.0:0, state=RUNNABLE, group=TGRP-DeleteLastCustomShardedReplicaTest]
        at sun.nio.ch.EPollArrayWrapper.epollWait(Native Method)
        at sun.nio.ch.EPollArrayWrapper.poll(EPollArrayWrapper.java:269)
        at sun.nio.ch.EPollSelectorImpl.doSelect(EPollSelectorImpl.java:79)
        at sun.nio.ch.SelectorImpl.lockAndDoSelect(SelectorImpl.java:87)
        at sun.nio.ch.SelectorImpl.select(SelectorImpl.java:98)
        at org.apache.zookeeper.server.NIOServerCnxnFactory.run(NIOServerCnxnFactory.java:178)
        at java.lang.Thread.run(Thread.java:745)
   4) Thread[id=9032, name=SessionTracker, state=TIMED_WAITING, group=TGRP-DeleteLastCustomShardedReplicaTest]
        at java.lang.Object.wait(Native Method)
        at org.apache.zookeeper.server.SessionTrackerImpl.run(SessionTrackerImpl.java:146)
	at __randomizedtesting.SeedInfo.seed([628DB96865AB7A13]:0)


FAILED:  org.apache.solr.cloud.SolrCloudExampleTest.testLoadDocsIntoGettingStartedCollection

Error Message:
Delete action failed!

Stack Trace:
java.lang.AssertionError: Delete action failed!
	at __randomizedtesting.SeedInfo.seed([628DB96865AB7A13:71EE8B0754C4C3B5]:0)
	at org.junit.Assert.fail(Assert.java:93)
	at org.junit.Assert.assertTrue(Assert.java:43)
	at org.apache.solr.cloud.SolrCloudExampleTest.doTestDeleteAction(SolrCloudExampleTest.java:169)
	at org.apache.solr.cloud.SolrCloudExampleTest.testLoadDocsIntoGettingStartedCollection(SolrCloudExampleTest.java:145)
	at sun.reflect.NativeMethodAccessorImpl.invoke0(Native Method)
	at sun.reflect.NativeMethodAccessorImpl.invoke(NativeMethodAccessorImpl.java:57)
	at sun.reflect.DelegatingMethodAccessorImpl.invoke(DelegatingMethodAccessorImpl.java:43)
	at java.lang.reflect.Method.invoke(Method.java:606)
	at com.carrotsearch.randomizedtesting.RandomizedRunner.invoke(RandomizedRunner.java:1665)
	at com.carrotsearch.randomizedtesting.RandomizedRunner$8.evaluate(RandomizedRunner.java:864)
	at com.carrotsearch.randomizedtesting.RandomizedRunner$9.evaluate(RandomizedRunner.java:900)
	at com.carrotsearch.randomizedtesting.RandomizedRunner$10.evaluate(RandomizedRunner.java:914)
	at org.apache.solr.BaseDistributedSearchTestCase$ShardsRepeatRule$ShardsFixedStatement.callStatement(BaseDistributedSearchTestCase.java:963)
	at org.apache.solr.BaseDistributedSearchTestCase$ShardsRepeatRule$ShardsStatement.evaluate(BaseDistributedSearchTestCase.java:938)
	at com.carrotsearch.randomizedtesting.rules.SystemPropertiesRestoreRule$1.evaluate(SystemPropertiesRestoreRule.java:57)
	at org.apache.lucene.util.TestRuleSetupTeardownChained$1.evaluate(TestRuleSetupTeardownChained.java:50)
	at org.apache.lucene.util.AbstractBeforeAfterRule$1.evaluate(AbstractBeforeAfterRule.java:46)
	at org.apache.lucene.util.TestRuleThreadAndTestName$1.evaluate(TestRuleThreadAndTestName.java:49)
	at org.apache.lucene.util.TestRuleIgnoreAfterMaxFailures$1.evaluate(TestRuleIgnoreAfterMaxFailures.java:65)
	at org.apache.lucene.util.TestRuleMarkFailure$1.evaluate(TestRuleMarkFailure.java:48)
	at com.carrotsearch.randomizedtesting.rules.StatementAdapter.evaluate(StatementAdapter.java:36)
	at com.carrotsearch.randomizedtesting.ThreadLeakControl$StatementRunner.run(ThreadLeakControl.java:367)
	at com.carrotsearch.randomizedtesting.ThreadLeakControl.forkTimeoutingTask(ThreadLeakControl.java:809)
	at com.carrotsearch.randomizedtesting.ThreadLeakControl$3.evaluate(ThreadLeakControl.java:460)
	at com.carrotsearch.randomizedtesting.RandomizedRunner.runSingleTest(RandomizedRunner.java:873)
	at com.carrotsearch.randomizedtesting.RandomizedRunner$5.evaluate(RandomizedRunner.java:775)
	at com.carrotsearch.randomizedtesting.RandomizedRunner$6.evaluate(RandomizedRunner.java:809)
	at com.carrotsearch.randomizedtesting.RandomizedRunner$7.evaluate(RandomizedRunner.java:820)
	at com.carrotsearch.randomizedtesting.rules.StatementAdapter.evaluate(StatementAdapter.java:36)
	at com.carrotsearch.randomizedtesting.rules.SystemPropertiesRestoreRule$1.evaluate(SystemPropertiesRestoreRule.java:57)
	at org.apache.lucene.util.AbstractBeforeAfterRule$1.evaluate(AbstractBeforeAfterRule.java:46)
	at com.carrotsearch.randomizedtesting.rules.StatementAdapter.evaluate(StatementAdapter.java:36)
	at org.apache.lucene.util.TestRuleStoreClassName$1.evaluate(TestRuleStoreClassName.java:42)
	at com.carrotsearch.randomizedtesting.rules.NoShadowingOrOverridesOnMethodsRule$1.evaluate(NoShadowingOrOverridesOnMethodsRule.java:39)
	at com.carrotsearch.randomizedtesting.rules.NoShadowingOrOverridesOnMethodsRule$1.evaluate(NoShadowingOrOverridesOnMethodsRule.java:39)
	at com.carrotsearch.randomizedtesting.rules.StatementAdapter.evaluate(StatementAdapter.java:36)
	at com.carrotsearch.randomizedtesting.rules.StatementAdapter.evaluate(StatementAdapter.java:36)
	at com.carrotsearch.randomizedtesting.rules.StatementAdapter.evaluate(StatementAdapter.java:36)
	at org.apache.lucene.util.TestRuleAssertionsRequired$1.evaluate(TestRuleAssertionsRequired.java:54)
	at org.apache.lucene.util.TestRuleMarkFailure$1.evaluate(TestRuleMarkFailure.java:48)
	at org.apache.lucene.util.TestRuleIgnoreAfterMaxFailures$1.evaluate(TestRuleIgnoreAfterMaxFailures.java:65)
	at org.apache.lucene.util.TestRuleIgnoreTestSuites$1.evaluate(TestRuleIgnoreTestSuites.java:55)
	at com.carrotsearch.randomizedtesting.rules.StatementAdapter.evaluate(StatementAdapter.java:36)
	at com.carrotsearch.randomizedtesting.ThreadLeakControl$StatementRunner.run(ThreadLeakControl.java:367)
	at java.lang.Thread.run(Thread.java:745)


FAILED:  junit.framework.TestSuite.org.apache.solr.core.TestCodecSupport

Error Message:


Stack Trace:
java.lang.AssertionError
	at __randomizedtesting.SeedInfo.seed([628DB96865AB7A13]:0)
	at org.apache.lucene.util.TestRuleRestoreSystemProperties.before(TestRuleRestoreSystemProperties.java:53)
	at com.carrotsearch.randomizedtesting.rules.TestRuleAdapter$1.before(TestRuleAdapter.java:26)
	at com.carrotsearch.randomizedtesting.rules.StatementAdapter.evaluate(StatementAdapter.java:35)
	at org.apache.lucene.util.TestRuleStoreClassName$1.evaluate(TestRuleStoreClassName.java:42)
	at com.carrotsearch.randomizedtesting.rules.NoShadowingOrOverridesOnMethodsRule$1.evaluate(NoShadowingOrOverridesOnMethodsRule.java:39)
	at com.carrotsearch.randomizedtesting.rules.NoShadowingOrOverridesOnMethodsRule$1.evaluate(NoShadowingOrOverridesOnMethodsRule.java:39)
	at com.carrotsearch.randomizedtesting.rules.StatementAdapter.evaluate(StatementAdapter.java:36)
	at com.carrotsearch.randomizedtesting.rules.StatementAdapter.evaluate(StatementAdapter.java:36)
	at com.carrotsearch.randomizedtesting.rules.StatementAdapter.evaluate(StatementAdapter.java:36)
	at org.apache.lucene.util.TestRuleAssertionsRequired$1.evaluate(TestRuleAssertionsRequired.java:54)
	at org.apache.lucene.util.TestRuleMarkFailure$1.evaluate(TestRuleMarkFailure.java:48)
	at org.apache.lucene.util.TestRuleIgnoreAfterMaxFailures$1.evaluate(TestRuleIgnoreAfterMaxFailures.java:65)
	at org.apache.lucene.util.TestRuleIgnoreTestSuites$1.evaluate(TestRuleIgnoreTestSuites.java:55)
	at com.carrotsearch.randomizedtesting.rules.StatementAdapter.evaluate(StatementAdapter.java:36)
	at com.carrotsearch.randomizedtesting.ThreadLeakControl$StatementRunner.run(ThreadLeakControl.java:367)
	at java.lang.Thread.run(Thread.java:745)


FAILED:  junit.framework.TestSuite.org.apache.solr.handler.CSVRequestHandlerTest

Error Message:
ERROR: SolrIndexSearcher opens=1 closes=27

Stack Trace:
java.lang.AssertionError: ERROR: SolrIndexSearcher opens=1 closes=27
	at __randomizedtesting.SeedInfo.seed([628DB96865AB7A13]:0)
	at org.junit.Assert.fail(Assert.java:93)
	at org.apache.solr.SolrTestCaseJ4.endTrackingSearchers(SolrTestCaseJ4.java:467)
	at org.apache.solr.SolrTestCaseJ4.afterClass(SolrTestCaseJ4.java:233)
	at sun.reflect.NativeMethodAccessorImpl.invoke0(Native Method)
	at sun.reflect.NativeMethodAccessorImpl.invoke(NativeMethodAccessorImpl.java:57)
	at sun.reflect.DelegatingMethodAccessorImpl.invoke(DelegatingMethodAccessorImpl.java:43)
	at java.lang.reflect.Method.invoke(Method.java:606)
	at com.carrotsearch.randomizedtesting.RandomizedRunner.invoke(RandomizedRunner.java:1665)
	at com.carrotsearch.randomizedtesting.RandomizedRunner$7.evaluate(RandomizedRunner.java:827)
	at com.carrotsearch.randomizedtesting.rules.StatementAdapter.evaluate(StatementAdapter.java:36)
	at com.carrotsearch.randomizedtesting.rules.SystemPropertiesRestoreRule$1.evaluate(SystemPropertiesRestoreRule.java:57)
	at org.apache.lucene.util.AbstractBeforeAfterRule$1.evaluate(AbstractBeforeAfterRule.java:46)
	at com.carrotsearch.randomizedtesting.rules.StatementAdapter.evaluate(StatementAdapter.java:36)
	at org.apache.lucene.util.TestRuleStoreClassName$1.evaluate(TestRuleStoreClassName.java:42)
	at com.carrotsearch.randomizedtesting.rules.NoShadowingOrOverridesOnMethodsRule$1.evaluate(NoShadowingOrOverridesOnMethodsRule.java:39)
	at com.carrotsearch.randomizedtesting.rules.NoShadowingOrOverridesOnMethodsRule$1.evaluate(NoShadowingOrOverridesOnMethodsRule.java:39)
	at com.carrotsearch.randomizedtesting.rules.StatementAdapter.evaluate(StatementAdapter.java:36)
	at com.carrotsearch.randomizedtesting.rules.StatementAdapter.evaluate(StatementAdapter.java:36)
	at com.carrotsearch.randomizedtesting.rules.StatementAdapter.evaluate(StatementAdapter.java:36)
	at org.apache.lucene.util.TestRuleAssertionsRequired$1.evaluate(TestRuleAssertionsRequired.java:54)
	at org.apache.lucene.util.TestRuleMarkFailure$1.evaluate(TestRuleMarkFailure.java:48)
	at org.apache.lucene.util.TestRuleIgnoreAfterMaxFailures$1.evaluate(TestRuleIgnoreAfterMaxFailures.java:65)
	at org.apache.lucene.util.TestRuleIgnoreTestSuites$1.evaluate(TestRuleIgnoreTestSuites.java:55)
	at com.carrotsearch.randomizedtesting.rules.StatementAdapter.evaluate(StatementAdapter.java:36)
	at com.carrotsearch.randomizedtesting.ThreadLeakControl$StatementRunner.run(ThreadLeakControl.java:367)
	at java.lang.Thread.run(Thread.java:745)


FAILED:  junit.framework.TestSuite.org.apache.solr.handler.MoreLikeThisHandlerTest

Error Message:
ERROR: SolrIndexSearcher opens=2 closes=20

Stack Trace:
java.lang.AssertionError: ERROR: SolrIndexSearcher opens=2 closes=20
	at __randomizedtesting.SeedInfo.seed([628DB96865AB7A13]:0)
	at org.junit.Assert.fail(Assert.java:93)
	at org.apache.solr.SolrTestCaseJ4.endTrackingSearchers(SolrTestCaseJ4.java:467)
	at org.apache.solr.SolrTestCaseJ4.afterClass(SolrTestCaseJ4.java:233)
	at sun.reflect.NativeMethodAccessorImpl.invoke0(Native Method)
	at sun.reflect.NativeMethodAccessorImpl.invoke(NativeMethodAccessorImpl.java:57)
	at sun.reflect.DelegatingMethodAccessorImpl.invoke(DelegatingMethodAccessorImpl.java:43)
	at java.lang.reflect.Method.invoke(Method.java:606)
	at com.carrotsearch.randomizedtesting.RandomizedRunner.invoke(RandomizedRunner.java:1665)
	at com.carrotsearch.randomizedtesting.RandomizedRunner$7.evaluate(RandomizedRunner.java:827)
	at com.carrotsearch.randomizedtesting.rules.StatementAdapter.evaluate(StatementAdapter.java:36)
	at com.carrotsearch.randomizedtesting.rules.SystemPropertiesRestoreRule$1.evaluate(SystemPropertiesRestoreRule.java:57)
	at org.apache.lucene.util.AbstractBeforeAfterRule$1.evaluate(AbstractBeforeAfterRule.java:46)
	at com.carrotsearch.randomizedtesting.rules.StatementAdapter.evaluate(StatementAdapter.java:36)
	at org.apache.lucene.util.TestRuleStoreClassName$1.evaluate(TestRuleStoreClassName.java:42)
	at com.carrotsearch.randomizedtesting.rules.NoShadowingOrOverridesOnMethodsRule$1.evaluate(NoShadowingOrOverridesOnMethodsRule.java:39)
	at com.carrotsearch.randomizedtesting.rules.NoShadowingOrOverridesOnMethodsRule$1.evaluate(NoShadowingOrOverridesOnMethodsRule.java:39)
	at com.carrotsearch.randomizedtesting.rules.StatementAdapter.evaluate(StatementAdapter.java:36)
	at com.carrotsearch.randomizedtesting.rules.StatementAdapter.evaluate(StatementAdapter.java:36)
	at com.carrotsearch.randomizedtesting.rules.StatementAdapter.evaluate(StatementAdapter.java:36)
	at org.apache.lucene.util.TestRuleAssertionsRequired$1.evaluate(TestRuleAssertionsRequired.java:54)
	at org.apache.lucene.util.TestRuleMarkFailure$1.evaluate(TestRuleMarkFailure.java:48)
	at org.apache.lucene.util.TestRuleIgnoreAfterMaxFailures$1.evaluate(TestRuleIgnoreAfterMaxFailures.java:65)
	at org.apache.lucene.util.TestRuleIgnoreTestSuites$1.evaluate(TestRuleIgnoreTestSuites.java:55)
	at com.carrotsearch.randomizedtesting.rules.StatementAdapter.evaluate(StatementAdapter.java:36)
	at com.carrotsearch.randomizedtesting.ThreadLeakControl$StatementRunner.run(ThreadLeakControl.java:367)
	at java.lang.Thread.run(Thread.java:745)


FAILED:  junit.framework.TestSuite.org.apache.solr.rest.schema.TestManagedSchemaFieldTypeResource

Error Message:
ERROR: SolrIndexSearcher opens=1 closes=28

Stack Trace:
java.lang.AssertionError: ERROR: SolrIndexSearcher opens=1 closes=28
	at __randomizedtesting.SeedInfo.seed([628DB96865AB7A13]:0)
	at org.junit.Assert.fail(Assert.java:93)
	at org.apache.solr.SolrTestCaseJ4.endTrackingSearchers(SolrTestCaseJ4.java:467)
	at org.apache.solr.SolrTestCaseJ4.afterClass(SolrTestCaseJ4.java:233)
	at sun.reflect.NativeMethodAccessorImpl.invoke0(Native Method)
	at sun.reflect.NativeMethodAccessorImpl.invoke(NativeMethodAccessorImpl.java:57)
	at sun.reflect.DelegatingMethodAccessorImpl.invoke(DelegatingMethodAccessorImpl.java:43)
	at java.lang.reflect.Method.invoke(Method.java:606)
	at com.carrotsearch.randomizedtesting.RandomizedRunner.invoke(RandomizedRunner.java:1665)
	at com.carrotsearch.randomizedtesting.RandomizedRunner$7.evaluate(RandomizedRunner.java:827)
	at com.carrotsearch.randomizedtesting.rules.StatementAdapter.evaluate(StatementAdapter.java:36)
	at com.carrotsearch.randomizedtesting.rules.SystemPropertiesRestoreRule$1.evaluate(SystemPropertiesRestoreRule.java:57)
	at org.apache.lucene.util.AbstractBeforeAfterRule$1.evaluate(AbstractBeforeAfterRule.java:46)
	at com.carrotsearch.randomizedtesting.rules.StatementAdapter.evaluate(StatementAdapter.java:36)
	at org.apache.lucene.util.TestRuleStoreClassName$1.evaluate(TestRuleStoreClassName.java:42)
	at com.carrotsearch.randomizedtesting.rules.NoShadowingOrOverridesOnMethodsRule$1.evaluate(NoShadowingOrOverridesOnMethodsRule.java:39)
	at com.carrotsearch.randomizedtesting.rules.NoShadowingOrOverridesOnMethodsRule$1.evaluate(NoShadowingOrOverridesOnMethodsRule.java:39)
	at com.carrotsearch.randomizedtesting.rules.StatementAdapter.evaluate(StatementAdapter.java:36)
	at com.carrotsearch.randomizedtesting.rules.StatementAdapter.evaluate(StatementAdapter.java:36)
	at com.carrotsearch.randomizedtesting.rules.StatementAdapter.evaluate(StatementAdapter.java:36)
	at org.apache.lucene.util.TestRuleAssertionsRequired$1.evaluate(TestRuleAssertionsRequired.java:54)
	at org.apache.lucene.util.TestRuleMarkFailure$1.evaluate(TestRuleMarkFailure.java:48)
	at org.apache.lucene.util.TestRuleIgnoreAfterMaxFailures$1.evaluate(TestRuleIgnoreAfterMaxFailures.java:65)
	at org.apache.lucene.util.TestRuleIgnoreTestSuites$1.evaluate(TestRuleIgnoreTestSuites.java:55)
	at com.carrotsearch.randomizedtesting.rules.StatementAdapter.evaluate(StatementAdapter.java:36)
	at com.carrotsearch.randomizedtesting.ThreadLeakControl$StatementRunner.run(ThreadLeakControl.java:367)
	at java.lang.Thread.run(Thread.java:745)


FAILED:  org.apache.solr.schema.TestCloudManagedSchemaConcurrent.test

Error Message:
QUERY FAILED: xpath=/response/lst[@name='responseHeader']/int[@name='status'][.='0']  request=/schema/fieldtypes/newfieldtypePut12?wt=xml&updateTimeoutSecs=15  response=<?xml version="1.0" encoding="UTF-8"?> <response>  <lst name="responseHeader">   <int name="status">500</int>   <int name="QTime">15570</int> </lst> <lst name="error">   <str name="msg">6 out of 8 replicas failed to update their schema to version 83 within 15 seconds! Failed cores: [http://127.0.0.1:58910/collection1/, http://127.0.0.1:46483/collection1/, http://127.0.0.1:44303/collection1/, http://127.0.0.1:34415/collection1/, http://127.0.0.1:43603/collection1/, http://127.0.0.1:36992/collection1/]</str>   <str name="trace">org.apache.solr.common.SolrException: 6 out of 8 replicas failed to update their schema to version 83 within 15 seconds! Failed cores: [http://127.0.0.1:58910/collection1/, http://127.0.0.1:46483/collection1/, http://127.0.0.1:44303/collection1/, http://127.0.0.1:34415/collection1/, http://127.0.0.1:43603/collection1/, http://127.0.0.1:36992/collection1/]  at org.apache.solr.schema.ManagedIndexSchema.waitForSchemaZkVersionAgreement(ManagedIndexSchema.java:260)  at org.apache.solr.rest.schema.BaseFieldTypeResource.addNewFieldTypes(BaseFieldTypeResource.java:91)  at org.apache.solr.rest.schema.FieldTypeResource.addOrUpdateFieldType(FieldTypeResource.java:167)  at org.apache.solr.rest.schema.FieldTypeResource.put(FieldTypeResource.java:154)  at org.restlet.resource.ServerResource.doHandle(ServerResource.java:447)  at org.restlet.resource.ServerResource.doConditionalHandle(ServerResource.java:359)  at org.restlet.resource.ServerResource.handle(ServerResource.java:1044)  at org.restlet.resource.Finder.handle(Finder.java:236)  at org.restlet.routing.Filter.doHandle(Filter.java:150)  at org.restlet.routing.Filter.handle(Filter.java:197)  at org.restlet.routing.Router.doHandle(Router.java:422)  at org.restlet.routing.Router.handle(Router.java:639)  at org.restlet.routing.Filter.doHandle(Filter.java:150)  at org.restlet.routing.Filter.handle(Filter.java:197)  at org.restlet.routing.Filter.doHandle(Filter.java:150)  at org.restlet.routing.Filter.handle(Filter.java:197)  at org.restlet.routing.Filter.doHandle(Filter.java:150)  at org.restlet.engine.application.StatusFilter.doHandle(StatusFilter.java:140)  at org.restlet.routing.Filter.handle(Filter.java:197)  at org.restlet.routing.Filter.doHandle(Filter.java:150)  at org.restlet.routing.Filter.handle(Filter.java:197)  at org.restlet.engine.CompositeHelper.handle(CompositeHelper.java:202)  at org.restlet.engine.application.ApplicationHelper.handle(ApplicationHelper.java:75)  at org.restlet.Application.handle(Application.java:385)  at org.restlet.routing.Filter.doHandle(Filter.java:150)  at org.restlet.routing.Filter.handle(Filter.java:197)  at org.restlet.routing.Router.doHandle(Router.java:422)  at org.restlet.routing.Router.handle(Router.java:639)  at org.restlet.routing.Filter.doHandle(Filter.java:150)  at org.restlet.routing.Filter.handle(Filter.java:197)  at org.restlet.routing.Router.doHandle(Router.java:422)  at org.restlet.routing.Router.handle(Router.java:639)  at org.restlet.routing.Filter.doHandle(Filter.java:150)  at org.restlet.routing.Filter.handle(Filter.java:197)  at org.restlet.engine.CompositeHelper.handle(CompositeHelper.java:202)  at org.restlet.Component.handle(Component.java:408)  at org.restlet.Server.handle(Server.java:507)  at org.restlet.engine.connector.ServerHelper.handle(ServerHelper.java:63)  at org.restlet.engine.adapter.HttpServerHelper.handle(HttpServerHelper.java:143)  at org.restlet.ext.servlet.ServerServlet.service(ServerServlet.java:1117)  at javax.servlet.http.HttpServlet.service(HttpServlet.java:790)  at org.eclipse.jetty.servlet.ServletHolder.handle(ServletHolder.java:808)  at org.eclipse.jetty.servlet.ServletHandler.doHandle(ServletHandler.java:587)  at org.eclipse.jetty.server.session.SessionHandler.doHandle(SessionHandler.java:221)  at org.eclipse.jetty.server.handler.ContextHandler.doHandle(ContextHandler.java:1127)  at org.eclipse.jetty.servlet.ServletHandler.doScope(ServletHandler.java:515)  at org.eclipse.jetty.server.session.SessionHandler.doScope(SessionHandler.java:185)  at org.eclipse.jetty.server.handler.ContextHandler.doScope(ContextHandler.java:1061)  at org.eclipse.jetty.server.handler.ScopedHandler.handle(ScopedHandler.java:141)  at org.eclipse.jetty.server.Dispatcher.forward(Dispatcher.java:191)  at org.eclipse.jetty.server.Dispatcher.forward(Dispatcher.java:72)  at org.apache.solr.servlet.SolrDispatchFilter.doFilter(SolrDispatchFilter.java:229)  at org.apache.solr.servlet.SolrDispatchFilter.doFilter(SolrDispatchFilter.java:179)  at org.eclipse.jetty.servlet.ServletHandler$CachedChain.doFilter(ServletHandler.java:1652)  at org.apache.solr.client.solrj.embedded.JettySolrRunner$DebugFilter.doFilter(JettySolrRunner.java:109)  at org.eclipse.jetty.servlet.ServletHandler$CachedChain.doFilter(ServletHandler.java:1652)  at org.eclipse.jetty.servlets.UserAgentFilter.doFilter(UserAgentFilter.java:83)  at org.eclipse.jetty.servlets.GzipFilter.doFilter(GzipFilter.java:300)  at org.eclipse.jetty.servlet.ServletHandler$CachedChain.doFilter(ServletHandler.java:1652)  at org.eclipse.jetty.servlet.ServletHandler.doHandle(ServletHandler.java:585)  at org.eclipse.jetty.server.session.SessionHandler.doHandle(SessionHandler.java:221)  at org.eclipse.jetty.server.handler.ContextHandler.doHandle(ContextHandler.java:1127)  at org.eclipse.jetty.servlet.ServletHandler.doScope(ServletHandler.java:515)  at org.eclipse.jetty.server.session.SessionHandler.doScope(SessionHandler.java:185)  at org.eclipse.jetty.server.handler.ContextHandler.doScope(ContextHandler.java:1061)  at org.eclipse.jetty.server.handler.ScopedHandler.handle(ScopedHandler.java:141)  at org.eclipse.jetty.server.handler.HandlerWrapper.handle(HandlerWrapper.java:97)  at org.eclipse.jetty.server.Server.handle(Server.java:499)  at org.eclipse.jetty.server.HttpChannel.handle(HttpChannel.java:310)  at org.eclipse.jetty.server.HttpConnection.onFillable(HttpConnection.java:257)  at org.eclipse.jetty.io.AbstractConnection$2.run(AbstractConnection.java:540)  at org.eclipse.jetty.util.thread.QueuedThreadPool.runJob(QueuedThreadPool.java:635)  at org.eclipse.jetty.util.thread.QueuedThreadPool$3.run(QueuedThreadPool.java:555)  at java.lang.Thread.run(Thread.java:745) </str>   <int name="code">500</int> </lst> </response> 

Stack Trace:
java.lang.AssertionError: QUERY FAILED: xpath=/response/lst[@name='responseHeader']/int[@name='status'][.='0']  request=/schema/fieldtypes/newfieldtypePut12?wt=xml&updateTimeoutSecs=15  response=<?xml version="1.0" encoding="UTF-8"?>
<response>

<lst name="responseHeader">
  <int name="status">500</int>
  <int name="QTime">15570</int>
</lst>
<lst name="error">
  <str name="msg">6 out of 8 replicas failed to update their schema to version 83 within 15 seconds! Failed cores: [http://127.0.0.1:58910/collection1/, http://127.0.0.1:46483/collection1/, http://127.0.0.1:44303/collection1/, http://127.0.0.1:34415/collection1/, http://127.0.0.1:43603/collection1/, http://127.0.0.1:36992/collection1/]</str>
  <str name="trace">org.apache.solr.common.SolrException: 6 out of 8 replicas failed to update their schema to version 83 within 15 seconds! Failed cores: [http://127.0.0.1:58910/collection1/, http://127.0.0.1:46483/collection1/, http://127.0.0.1:44303/collection1/, http://127.0.0.1:34415/collection1/, http://127.0.0.1:43603/collection1/, http://127.0.0.1:36992/collection1/]
	at org.apache.solr.schema.ManagedIndexSchema.waitForSchemaZkVersionAgreement(ManagedIndexSchema.java:260)
	at org.apache.solr.rest.schema.BaseFieldTypeResource.addNewFieldTypes(BaseFieldTypeResource.java:91)
	at org.apache.solr.rest.schema.FieldTypeResource.addOrUpdateFieldType(FieldTypeResource.java:167)
	at org.apache.solr.rest.schema.FieldTypeResource.put(FieldTypeResource.java:154)
	at org.restlet.resource.ServerResource.doHandle(ServerResource.java:447)
	at org.restlet.resource.ServerResource.doConditionalHandle(ServerResource.java:359)
	at org.restlet.resource.ServerResource.handle(ServerResource.java:1044)
	at org.restlet.resource.Finder.handle(Finder.java:236)
	at org.restlet.routing.Filter.doHandle(Filter.java:150)
	at org.restlet.routing.Filter.handle(Filter.java:197)
	at org.restlet.routing.Router.doHandle(Router.java:422)
	at org.restlet.routing.Router.handle(Router.java:639)
	at org.restlet.routing.Filter.doHandle(Filter.java:150)
	at org.restlet.routing.Filter.handle(Filter.java:197)
	at org.restlet.routing.Filter.doHandle(Filter.java:150)
	at org.restlet.routing.Filter.handle(Filter.java:197)
	at org.restlet.routing.Filter.doHandle(Filter.java:150)
	at org.restlet.engine.application.StatusFilter.doHandle(StatusFilter.java:140)
	at org.restlet.routing.Filter.handle(Filter.java:197)
	at org.restlet.routing.Filter.doHandle(Filter.java:150)
	at org.restlet.routing.Filter.handle(Filter.java:197)
	at org.restlet.engine.CompositeHelper.handle(CompositeHelper.java:202)
	at org.restlet.engine.application.ApplicationHelper.handle(ApplicationHelper.java:75)
	at org.restlet.Application.handle(Application.java:385)
	at org.restlet.routing.Filter.doHandle(Filter.java:150)
	at org.restlet.routing.Filter.handle(Filter.java:197)
	at org.restlet.routing.Router.doHandle(Router.java:422)
	at org.restlet.routing.Router.handle(Router.java:639)
	at org.restlet.routing.Filter.doHandle(Filter.java:150)
	at org.restlet.routing.Filter.handle(Filter.java:197)
	at org.restlet.routing.Router.doHandle(Router.java:422)
	at org.restlet.routing.Router.handle(Router.java:639)
	at org.restlet.routing.Filter.doHandle(Filter.java:150)
	at org.restlet.routing.Filter.handle(Filter.java:197)
	at org.restlet.engine.CompositeHelper.handle(CompositeHelper.java:202)
	at org.restlet.Component.handle(Component.java:408)
	at org.restlet.Server.handle(Server.java:507)
	at org.restlet.engine.connector.ServerHelper.handle(ServerHelper.java:63)
	at org.restlet.engine.adapter.HttpServerHelper.handle(HttpServerHelper.java:143)
	at org.restlet.ext.servlet.ServerServlet.service(ServerServlet.java:1117)
	at javax.servlet.http.HttpServlet.service(HttpServlet.java:790)
	at org.eclipse.jetty.servlet.ServletHolder.handle(ServletHolder.java:808)
	at org.eclipse.jetty.servlet.ServletHandler.doHandle(ServletHandler.java:587)
	at org.eclipse.jetty.server.session.SessionHandler.doHandle(SessionHandler.java:221)
	at org.eclipse.jetty.server.handler.ContextHandler.doHandle(ContextHandler.java:1127)
	at org.eclipse.jetty.servlet.ServletHandler.doScope(ServletHandler.java:515)
	at org.eclipse.jetty.server.session.SessionHandler.doScope(SessionHandler.java:185)
	at org.eclipse.jetty.server.handler.ContextHandler.doScope(ContextHandler.java:1061)
	at org.eclipse.jetty.server.handler.ScopedHandler.handle(ScopedHandler.java:141)
	at org.eclipse.jetty.server.Dispatcher.forward(Dispatcher.java:191)
	at org.eclipse.jetty.server.Dispatcher.forward(Dispatcher.java:72)
	at org.apache.solr.servlet.SolrDispatchFilter.doFilter(SolrDispatchFilter.java:229)
	at org.apache.solr.servlet.SolrDispatchFilter.doFilter(SolrDispatchFilter.java:179)
	at org.eclipse.jetty.servlet.ServletHandler$CachedChain.doFilter(ServletHandler.java:1652)
	at org.apache.solr.client.solrj.embedded.JettySolrRunner$DebugFilter.doFilter(JettySolrRunner.java:109)
	at org.eclipse.jetty.servlet.ServletHandler$CachedChain.doFilter(ServletHandler.java:1652)
	at org.eclipse.jetty.servlets.UserAgentFilter.doFilter(UserAgentFilter.java:83)
	at org.eclipse.jetty.servlets.GzipFilter.doFilter(GzipFilter.java:300)
	at org.eclipse.jetty.servlet.ServletHandler$CachedChain.doFilter(ServletHandler.java:1652)
	at org.eclipse.jetty.servlet.ServletHandler.doHandle(ServletHandler.java:585)
	at org.eclipse.jetty.server.session.SessionHandler.doHandle(SessionHandler.java:221)
	at org.eclipse.jetty.server.handler.ContextHandler.doHandle(ContextHandler.java:1127)
	at org.eclipse.jetty.servlet.ServletHandler.doScope(ServletHandler.java:515)
	at org.eclipse.jetty.server.session.SessionHandler.doScope(SessionHandler.java:185)
	at org.eclipse.jetty.server.handler.ContextHandler.doScope(ContextHandler.java:1061)
	at org.eclipse.jetty.server.handler.ScopedHandler.handle(ScopedHandler.java:141)
	at org.eclipse.jetty.server.handler.HandlerWrapper.handle(HandlerWrapper.java:97)
	at org.eclipse.jetty.server.Server.handle(Server.java:499)
	at org.eclipse.jetty.server.HttpChannel.handle(HttpChannel.java:310)
	at org.eclipse.jetty.server.HttpConnection.onFillable(HttpConnection.java:257)
	at org.eclipse.jetty.io.AbstractConnection$2.run(AbstractConnection.java:540)
	at org.eclipse.jetty.util.thread.QueuedThreadPool.runJob(QueuedThreadPool.java:635)
	at org.eclipse.jetty.util.thread.QueuedThreadPool$3.run(QueuedThreadPool.java:555)
	at java.lang.Thread.run(Thread.java:745)
</str>
  <int name="code">500</int>
</lst>
</response>

	at __randomizedtesting.SeedInfo.seed([628DB96865AB7A13:EAD986B2CB5717EB]:0)
	at org.junit.Assert.fail(Assert.java:93)
	at org.apache.solr.schema.TestCloudManagedSchemaConcurrent.verifySuccess(TestCloudManagedSchemaConcurrent.java:107)
	at org.apache.solr.schema.TestCloudManagedSchemaConcurrent.addFieldTypePut(TestCloudManagedSchemaConcurrent.java:162)
	at org.apache.solr.schema.TestCloudManagedSchemaConcurrent.access$600(TestCloudManagedSchemaConcurrent.java:45)
	at org.apache.solr.schema.TestCloudManagedSchemaConcurrent$Operation$6.execute(TestCloudManagedSchemaConcurrent.java:327)
	at org.apache.solr.schema.TestCloudManagedSchemaConcurrent.concurrentOperationsTest(TestCloudManagedSchemaConcurrent.java:450)
	at org.apache.solr.schema.TestCloudManagedSchemaConcurrent.test(TestCloudManagedSchemaConcurrent.java:252)
	at sun.reflect.NativeMethodAccessorImpl.invoke0(Native Method)
	at sun.reflect.NativeMethodAccessorImpl.invoke(NativeMethodAccessorImpl.java:57)
	at sun.reflect.DelegatingMethodAccessorImpl.invoke(DelegatingMethodAccessorImpl.java:43)
	at java.lang.reflect.Method.invoke(Method.java:606)
	at com.carrotsearch.randomizedtesting.RandomizedRunner.invoke(RandomizedRunner.java:1665)
	at com.carrotsearch.randomizedtesting.RandomizedRunner$8.evaluate(RandomizedRunner.java:864)
	at com.carrotsearch.randomizedtesting.RandomizedRunner$9.evaluate(RandomizedRunner.java:900)
	at com.carrotsearch.randomizedtesting.RandomizedRunner$10.evaluate(RandomizedRunner.java:914)
	at org.apache.solr.BaseDistributedSearchTestCase$ShardsRepeatRule$ShardsFixedStatement.callStatement(BaseDistributedSearchTestCase.java:963)
	at org.apache.solr.BaseDistributedSearchTestCase$ShardsRepeatRule$ShardsStatement.evaluate(BaseDistributedSearchTestCase.java:938)
	at com.carrotsearch.randomizedtesting.rules.SystemPropertiesRestoreRule$1.evaluate(SystemPropertiesRestoreRule.java:57)
	at org.apache.lucene.util.TestRuleSetupTeardownChained$1.evaluate(TestRuleSetupTeardownChained.java:50)
	at org.apache.lucene.util.AbstractBeforeAfterRule$1.evaluate(AbstractBeforeAfterRule.java:46)
	at org.apache.lucene.util.TestRuleThreadAndTestName$1.evaluate(TestRuleThreadAndTestName.java:49)
	at org.apache.lucene.util.TestRuleIgnoreAfterMaxFailures$1.evaluate(TestRuleIgnoreAfterMaxFailures.java:65)
	at org.apache.lucene.util.TestRuleMarkFailure$1.evaluate(TestRuleMarkFailure.java:48)
	at com.carrotsearch.randomizedtesting.rules.StatementAdapter.evaluate(StatementAdapter.java:36)
	at com.carrotsearch.randomizedtesting.ThreadLeakControl$StatementRunner.run(ThreadLeakControl.java:367)
	at com.carrotsearch.randomizedtesting.ThreadLeakControl.forkTimeoutingTask(ThreadLeakControl.java:809)
	at com.carrotsearch.randomizedtesting.ThreadLeakControl$3.evaluate(ThreadLeakControl.java:460)
	at com.carrotsearch.randomizedtesting.RandomizedRunner.runSingleTest(RandomizedRunner.java:873)
	at com.carrotsearch.randomizedtesting.RandomizedRunner$5.evaluate(RandomizedRunner.java:775)
	at com.carrotsearch.randomizedtesting.RandomizedRunner$6.evaluate(RandomizedRunner.java:809)
	at com.carrotsearch.randomizedtesting.RandomizedRunner$7.evaluate(RandomizedRunner.java:820)
	at com.carrotsearch.randomizedtesting.rules.StatementAdapter.evaluate(StatementAdapter.java:36)
	at com.carrotsearch.randomizedtesting.rules.SystemPropertiesRestoreRule$1.evaluate(SystemPropertiesRestoreRule.java:57)
	at org.apache.lucene.util.AbstractBeforeAfterRule$1.evaluate(AbstractBeforeAfterRule.java:46)
	at com.carrotsearch.randomizedtesting.rules.StatementAdapter.evaluate(StatementAdapter.java:36)
	at org.apache.lucene.util.TestRuleStoreClassName$1.evaluate(TestRuleStoreClassName.java:42)
	at com.carrotsearch.randomizedtesting.rules.NoShadowingOrOverridesOnMethodsRule$1.evaluate(NoShadowingOrOverridesOnMethodsRule.java:39)
	at com.carrotsearch.randomizedtesting.rules.NoShadowingOrOverridesOnMethodsRule$1.evaluate(NoShadowingOrOverridesOnMethodsRule.java:39)
	at com.carrotsearch.randomizedtesting.rules.StatementAdapter.evaluate(StatementAdapter.java:36)
	at com.carrotsearch.randomizedtesting.rules.StatementAdapter.evaluate(StatementAdapter.java:36)
	at com.carrotsearch.randomizedtesting.rules.StatementAdapter.evaluate(StatementAdapter.java:36)
	at org.apache.lucene.util.TestRuleAssertionsRequired$1.evaluate(TestRuleAssertionsRequired.java:54)
	at org.apache.lucene.util.TestRuleMarkFailure$1.evaluate(TestRuleMarkFailure.java:48)
	at org.apache.lucene.util.TestRuleIgnoreAfterMaxFailures$1.evaluate(TestRuleIgnoreAfterMaxFailures.java:65)
	at org.apache.lucene.util.TestRuleIgnoreTestSuites$1.evaluate(TestRuleIgnoreTestSuites.java:55)
	at com.carrotsearch.randomizedtesting.rules.StatementAdapter.evaluate(StatementAdapter.java:36)
	at com.carrotsearch.randomizedtesting.ThreadLeakControl$StatementRunner.run(ThreadLeakControl.java:367)
	at java.lang.Thread.run(Thread.java:745)


FAILED:  junit.framework.TestSuite.org.apache.solr.update.SolrCmdDistributorTest

Error Message:
Java heap space

Stack Trace:
java.lang.OutOfMemoryError: Java heap space


FAILED:  junit.framework.TestSuite.org.apache.solr.util.hll.BigEndianAscendingWordSerializerTest

Error Message:
The test or suite printed 362170 bytes to stdout and stderr, even though the limit was set to 8192 bytes. Increase the limit with @Limit, ignore it completely with @SuppressSysoutChecks or run with -Dtests.verbose=true

Stack Trace:
java.lang.AssertionError: The test or suite printed 362170 bytes to stdout and stderr, even though the limit was set to 8192 bytes. Increase the limit with @Limit, ignore it completely with @SuppressSysoutChecks or run with -Dtests.verbose=true
	at __randomizedtesting.SeedInfo.seed([628DB96865AB7A13]:0)
	at org.apache.lucene.util.TestRuleLimitSysouts.afterIfSuccessful(TestRuleLimitSysouts.java:212)
	at com.carrotsearch.randomizedtesting.rules.TestRuleAdapter$1.afterIfSuccessful(TestRuleAdapter.java:36)
	at com.carrotsearch.randomizedtesting.rules.StatementAdapter.evaluate(StatementAdapter.java:37)
	at org.apache.lucene.util.TestRuleAssertionsRequired$1.evaluate(TestRuleAssertionsRequired.java:54)
	at org.apache.lucene.util.TestRuleMarkFailure$1.evaluate(TestRuleMarkFailure.java:48)
	at org.apache.lucene.util.TestRuleIgnoreAfterMaxFailures$1.evaluate(TestRuleIgnoreAfterMaxFailures.java:65)
	at org.apache.lucene.util.TestRuleIgnoreTestSuites$1.evaluate(TestRuleIgnoreTestSuites.java:55)
	at com.carrotsearch.randomizedtesting.rules.StatementAdapter.evaluate(StatementAdapter.java:36)
	at com.carrotsearch.randomizedtesting.ThreadLeakControl$StatementRunner.run(ThreadLeakControl.java:367)
	at java.lang.Thread.run(Thread.java:745)


FAILED:  org.apache.solr.cloud.hdfs.HdfsCollectionsAPIDistributedZkTest.test

Error Message:
Captured an uncaught exception in thread: Thread[id=92125, name=collection5, state=RUNNABLE, group=TGRP-HdfsCollectionsAPIDistributedZkTest]

Stack Trace:
com.carrotsearch.randomizedtesting.UncaughtExceptionError: Captured an uncaught exception in thread: Thread[id=92125, name=collection5, state=RUNNABLE, group=TGRP-HdfsCollectionsAPIDistributedZkTest]
Caused by: org.apache.solr.client.solrj.impl.HttpSolrClient$RemoteSolrException: Error from server at http://127.0.0.1:57759/nagv: collection already exists: awholynewstresscollection_collection5_1
	at __randomizedtesting.SeedInfo.seed([628DB96865AB7A13]:0)
	at org.apache.solr.client.solrj.impl.HttpSolrClient.executeMethod(HttpSolrClient.java:575)
	at org.apache.solr.client.solrj.impl.HttpSolrClient.request(HttpSolrClient.java:241)
	at org.apache.solr.client.solrj.impl.HttpSolrClient.request(HttpSolrClient.java:230)
	at org.apache.solr.client.solrj.impl.LBHttpSolrClient.doRequest(LBHttpSolrClient.java:372)
	at org.apache.solr.client.solrj.impl.LBHttpSolrClient.request(LBHttpSolrClient.java:325)
	at org.apache.solr.client.solrj.impl.CloudSolrClient.sendRequest(CloudSolrClient.java:1099)
	at org.apache.solr.client.solrj.impl.CloudSolrClient.requestWithRetryOnStaleState(CloudSolrClient.java:870)
	at org.apache.solr.client.solrj.impl.CloudSolrClient.request(CloudSolrClient.java:806)
	at org.apache.solr.client.solrj.SolrClient.request(SolrClient.java:1220)
	at org.apache.solr.cloud.AbstractFullDistribZkTestBase.createCollection(AbstractFullDistribZkTestBase.java:1574)
	at org.apache.solr.cloud.AbstractFullDistribZkTestBase.createCollection(AbstractFullDistribZkTestBase.java:1595)
	at org.apache.solr.cloud.CollectionsAPIDistributedZkTest$1CollectionThread.run(CollectionsAPIDistributedZkTest.java:888)


FAILED:  org.apache.solr.cloud.LeaderInitiatedRecoveryOnShardRestartTest.testRestartWithAllInLIR

Error Message:
Captured an uncaught exception in thread: Thread[id=19036, name=coreZkRegister-6554-thread-1, state=RUNNABLE, group=TGRP-LeaderInitiatedRecoveryOnShardRestartTest]

Stack Trace:
com.carrotsearch.randomizedtesting.UncaughtExceptionError: Captured an uncaught exception in thread: Thread[id=19036, name=coreZkRegister-6554-thread-1, state=RUNNABLE, group=TGRP-LeaderInitiatedRecoveryOnShardRestartTest]
Caused by: java.lang.AssertionError
	at __randomizedtesting.SeedInfo.seed([628DB96865AB7A13]:0)
	at org.apache.solr.cloud.ZkController.updateLeaderInitiatedRecoveryState(ZkController.java:2133)
	at org.apache.solr.cloud.ShardLeaderElectionContext.runLeaderProcess(ElectionContext.java:434)
	at org.apache.solr.cloud.LeaderElector.runIamLeaderProcess(LeaderElector.java:197)
	at org.apache.solr.cloud.LeaderElector.checkIfIamLeader(LeaderElector.java:157)
	at org.apache.solr.cloud.LeaderElector.joinElection(LeaderElector.java:346)
	at org.apache.solr.cloud.ZkController.joinElection(ZkController.java:1113)
	at org.apache.solr.cloud.ZkController.register(ZkController.java:926)
	at org.apache.solr.cloud.ZkController.register(ZkController.java:881)
	at org.apache.solr.core.ZkContainer$2.run(ZkContainer.java:183)
	at org.apache.solr.common.util.ExecutorUtil$MDCAwareThreadPoolExecutor$1.run(ExecutorUtil.java:231)
	at java.util.concurrent.ThreadPoolExecutor.runWorker(ThreadPoolExecutor.java:1145)
	at java.util.concurrent.ThreadPoolExecutor$Worker.run(ThreadPoolExecutor.java:615)
	at java.lang.Thread.run(Thread.java:745)




Build Log:
[...truncated 11191 lines...]
   [junit4] Suite: org.apache.solr.cloud.LeaderInitiatedRecoveryOnShardRestartTest
   [junit4]   2> Creating dataDir: /x1/jenkins/jenkins-slave/workspace/Lucene-Solr-NightlyTests-5.x/solr/build/solr-core/test/J2/temp/solr.cloud.LeaderInitiatedRecoveryOnShardRestartTest_628DB96865AB7A13-001/init-core-data-001
   [junit4]   2> 3617295 INFO  (SUITE-LeaderInitiatedRecoveryOnShardRestartTest-seed#[628DB96865AB7A13]-worker) [    ] o.a.s.BaseDistributedSearchTestCase Setting hostContext system property: /
   [junit4]   2> 3617298 INFO  (TEST-LeaderInitiatedRecoveryOnShardRestartTest.testRestartWithAllInLIR-seed#[628DB96865AB7A13]) [    ] o.a.s.c.ZkTestServer STARTING ZK TEST SERVER
   [junit4]   2> 3617313 INFO  (Thread-9426) [    ] o.a.s.c.ZkTestServer client port:0.0.0.0/0.0.0.0:0
   [junit4]   2> 3617313 INFO  (Thread-9426) [    ] o.a.s.c.ZkTestServer Starting server
   [junit4]   2> 3617410 INFO  (TEST-LeaderInitiatedRecoveryOnShardRestartTest.testRestartWithAllInLIR-seed#[628DB96865AB7A13]) [    ] o.a.s.c.ZkTestServer start zk server on port:51025
   [junit4]   2> 3617410 INFO  (TEST-LeaderInitiatedRecoveryOnShardRestartTest.testRestartWithAllInLIR-seed#[628DB96865AB7A13]) [    ] o.a.s.c.c.SolrZkClient Using default ZkCredentialsProvider
   [junit4]   2> 3617434 INFO  (TEST-LeaderInitiatedRecoveryOnShardRestartTest.testRestartWithAllInLIR-seed#[628DB96865AB7A13]) [    ] o.a.s.c.c.ConnectionManager Waiting for client to connect to ZooKeeper
   [junit4]   2> 3617458 INFO  (zkCallback-1857-thread-1) [    ] o.a.s.c.c.ConnectionManager Watcher org.apache.solr.common.cloud.ConnectionManager@81185d1 name:ZooKeeperConnection Watcher:127.0.0.1:51025 got event WatchedEvent state:SyncConnected type:None path:null path:null type:None
   [junit4]   2> 3617458 INFO  (TEST-LeaderInitiatedRecoveryOnShardRestartTest.testRestartWithAllInLIR-seed#[628DB96865AB7A13]) [    ] o.a.s.c.c.ConnectionManager Client is connected to ZooKeeper
   [junit4]   2> 3617458 INFO  (TEST-LeaderInitiatedRecoveryOnShardRestartTest.testRestartWithAllInLIR-seed#[628DB96865AB7A13]) [    ] o.a.s.c.c.SolrZkClient Using default ZkACLProvider
   [junit4]   2> 3617458 INFO  (TEST-LeaderInitiatedRecoveryOnShardRestartTest.testRestartWithAllInLIR-seed#[628DB96865AB7A13]) [    ] o.a.s.c.c.SolrZkClient makePath: /solr
   [junit4]   2> 3617461 INFO  (TEST-LeaderInitiatedRecoveryOnShardRestartTest.testRestartWithAllInLIR-seed#[628DB96865AB7A13]) [    ] o.a.s.c.c.SolrZkClient Using default ZkCredentialsProvider
   [junit4]   2> 3617470 INFO  (TEST-LeaderInitiatedRecoveryOnShardRestartTest.testRestartWithAllInLIR-seed#[628DB96865AB7A13]) [    ] o.a.s.c.c.ConnectionManager Waiting for client to connect to ZooKeeper
   [junit4]   2> 3617478 INFO  (zkCallback-1858-thread-1) [    ] o.a.s.c.c.ConnectionManager Watcher org.apache.solr.common.cloud.ConnectionManager@603f1f8e name:ZooKeeperConnection Watcher:127.0.0.1:51025/solr got event WatchedEvent state:SyncConnected type:None path:null path:null type:None
   [junit4]   2> 3617478 INFO  (TEST-LeaderInitiatedRecoveryOnShardRestartTest.testRestartWithAllInLIR-seed#[628DB96865AB7A13]) [    ] o.a.s.c.c.ConnectionManager Client is connected to ZooKeeper
   [junit4]   2> 3617478 INFO  (TEST-LeaderInitiatedRecoveryOnShardRestartTest.testRestartWithAllInLIR-seed#[628DB96865AB7A13]) [    ] o.a.s.c.c.SolrZkClient Using default ZkACLProvider
   [junit4]   2> 3617478 INFO  (TEST-LeaderInitiatedRecoveryOnShardRestartTest.testRestartWithAllInLIR-seed#[628DB96865AB7A13]) [    ] o.a.s.c.c.SolrZkClient makePath: /collections/collection1
   [junit4]   2> 3617480 INFO  (TEST-LeaderInitiatedRecoveryOnShardRestartTest.testRestartWithAllInLIR-seed#[628DB96865AB7A13]) [    ] o.a.s.c.c.SolrZkClient makePath: /collections/collection1/shards
   [junit4]   2> 3617481 INFO  (TEST-LeaderInitiatedRecoveryOnShardRestartTest.testRestartWithAllInLIR-seed#[628DB96865AB7A13]) [    ] o.a.s.c.c.SolrZkClient makePath: /collections/control_collection
   [junit4]   2> 3617482 INFO  (TEST-LeaderInitiatedRecoveryOnShardRestartTest.testRestartWithAllInLIR-seed#[628DB96865AB7A13]) [    ] o.a.s.c.c.SolrZkClient makePath: /collections/control_collection/shards
   [junit4]   2> 3617483 INFO  (TEST-LeaderInitiatedRecoveryOnShardRestartTest.testRestartWithAllInLIR-seed#[628DB96865AB7A13]) [    ] o.a.s.c.AbstractZkTestCase put /x1/jenkins/jenkins-slave/workspace/Lucene-Solr-NightlyTests-5.x/solr/core/src/test-files/solr/collection1/conf/solrconfig-tlog.xml to /configs/conf1/solrconfig.xml
   [junit4]   2> 3617483 INFO  (TEST-LeaderInitiatedRecoveryOnShardRestartTest.testRestartWithAllInLIR-seed#[628DB96865AB7A13]) [    ] o.a.s.c.c.SolrZkClient makePath: /configs/conf1/solrconfig.xml
   [junit4]   2> 3617485 INFO  (TEST-LeaderInitiatedRecoveryOnShardRestartTest.testRestartWithAllInLIR-seed#[628DB96865AB7A13]) [    ] o.a.s.c.AbstractZkTestCase put /x1/jenkins/jenkins-slave/workspace/Lucene-Solr-NightlyTests-5.x/solr/core/src/test-files/solr/collection1/conf/schema.xml to /configs/conf1/schema.xml
   [junit4]   2> 3617485 INFO  (TEST-LeaderInitiatedRecoveryOnShardRestartTest.testRestartWithAllInLIR-seed#[628DB96865AB7A13]) [    ] o.a.s.c.c.SolrZkClient makePath: /configs/conf1/schema.xml
   [junit4]   2> 3617487 INFO  (TEST-LeaderInitiatedRecoveryOnShardRestartTest.testRestartWithAllInLIR-seed#[628DB96865AB7A13]) [    ] o.a.s.c.AbstractZkTestCase put /x1/jenkins/jenkins-slave/workspace/Lucene-Solr-NightlyTests-5.x/solr/core/src/test-files/solr/collection1/conf/solrconfig.snippet.randomindexconfig.xml to /configs/conf1/solrconfig.snippet.randomindexconfig.xml
   [junit4]   2> 3617487 INFO  (TEST-LeaderInitiatedRecoveryOnShardRestartTest.testRestartWithAllInLIR-seed#[628DB96865AB7A13]) [    ] o.a.s.c.c.SolrZkClient makePath: /configs/conf1/solrconfig.snippet.randomindexconfig.xml
   [junit4]   2> 3617488 INFO  (TEST-LeaderInitiatedRecoveryOnShardRestartTest.testRestartWithAllInLIR-seed#[628DB96865AB7A13]) [    ] o.a.s.c.AbstractZkTestCase put /x1/jenkins/jenkins-slave/workspace/Lucene-Solr-NightlyTests-5.x/solr/core/src/test-files/solr/collection1/conf/stopwords.txt to /configs/conf1/stopwords.txt
   [junit4]   2> 3617488 INFO  (TEST-LeaderInitiatedRecoveryOnShardRestartTest.testRestartWithAllInLIR-seed#[628DB96865AB7A13]) [    ] o.a.s.c.c.SolrZkClient makePath: /configs/conf1/stopwords.txt
   [junit4]   2> 3617489 INFO  (TEST-LeaderInitiatedRecoveryOnShardRestartTest.testRestartWithAllInLIR-seed#[628DB96865AB7A13]) [    ] o.a.s.c.AbstractZkTestCase put /x1/jenkins/jenkins-slave/workspace/Lucene-Solr-NightlyTests-5.x/solr/core/src/test-files/solr/collection1/conf/protwords.txt to /configs/conf1/protwords.txt
   [junit4]   2> 3617490 INFO  (TEST-LeaderInitiatedRecoveryOnShardRestartTest.testRestartWithAllInLIR-seed#[628DB96865AB7A13]) [    ] o.a.s.c.c.SolrZkClient makePath: /configs/conf1/protwords.txt
   [junit4]   2> 3617491 INFO  (TEST-LeaderInitiatedRecoveryOnShardRestartTest.testRestartWithAllInLIR-seed#[628DB96865AB7A13]) [    ] o.a.s.c.AbstractZkTestCase put /x1/jenkins/jenkins-slave/workspace/Lucene-Solr-NightlyTests-5.x/solr/core/src/test-files/solr/collection1/conf/currency.xml to /configs/conf1/currency.xml
   [junit4]   2> 3617491 INFO  (TEST-LeaderInitiatedRecoveryOnShardRestartTest.testRestartWithAllInLIR-seed#[628DB96865AB7A13]) [    ] o.a.s.c.c.SolrZkClient makePath: /configs/conf1/currency.xml
   [junit4]   2> 3617492 INFO  (TEST-LeaderInitiatedRecoveryOnShardRestartTest.testRestartWithAllInLIR-seed#[628DB96865AB7A13]) [    ] o.a.s.c.AbstractZkTestCase put /x1/jenkins/jenkins-slave/workspace/Lucene-Solr-NightlyTests-5.x/solr/core/src/test-files/solr/collection1/conf/enumsConfig.xml to /configs/conf1/enumsConfig.xml
   [junit4]   2> 3617493 INFO  (TEST-LeaderInitiatedRecoveryOnShardRestartTest.testRestartWithAllInLIR-seed#[628DB96865AB7A13]) [    ] o.a.s.c.c.SolrZkClient makePath: /configs/conf1/enumsConfig.xml
   [junit4]   2> 3617494 INFO  (TEST-LeaderInitiatedRecoveryOnShardRestartTest.testRestartWithAllInLIR-seed#[628DB96865AB7A13]) [    ] o.a.s.c.AbstractZkTestCase put /x1/jenkins/jenkins-slave/workspace/Lucene-Solr-NightlyTests-5.x/solr/core/src/test-files/solr/collection1/conf/open-exchange-rates.json to /configs/conf1/open-exchange-rates.json
   [junit4]   2> 3617494 INFO  (TEST-LeaderInitiatedRecoveryOnShardRestartTest.testRestartWithAllInLIR-seed#[628DB96865AB7A13]) [    ] o.a.s.c.c.SolrZkClient makePath: /configs/conf1/open-exchange-rates.json
   [junit4]   2> 3617495 INFO  (TEST-LeaderInitiatedRecoveryOnShardRestartTest.testRestartWithAllInLIR-seed#[628DB96865AB7A13]) [    ] o.a.s.c.AbstractZkTestCase put /x1/jenkins/jenkins-slave/workspace/Lucene-Solr-NightlyTests-5.x/solr/core/src/test-files/solr/collection1/conf/mapping-ISOLatin1Accent.txt to /configs/conf1/mapping-ISOLatin1Accent.txt
   [junit4]   2> 3617495 INFO  (TEST-LeaderInitiatedRecoveryOnShardRestartTest.testRestartWithAllInLIR-seed#[628DB96865AB7A13]) [    ] o.a.s.c.c.SolrZkClient makePath: /configs/conf1/mapping-ISOLatin1Accent.txt
   [junit4]   2> 3617496 INFO  (TEST-LeaderInitiatedRecoveryOnShardRestartTest.testRestartWithAllInLIR-seed#[628DB96865AB7A13]) [    ] o.a.s.c.AbstractZkTestCase put /x1/jenkins/jenkins-slave/workspace/Lucene-Solr-NightlyTests-5.x/solr/core/src/test-files/solr/collection1/conf/old_synonyms.txt to /configs/conf1/old_synonyms.txt
   [junit4]   2> 3617497 INFO  (TEST-LeaderInitiatedRecoveryOnShardRestartTest.testRestartWithAllInLIR-seed#[628DB96865AB7A13]) [    ] o.a.s.c.c.SolrZkClient makePath: /configs/conf1/old_synonyms.txt
   [junit4]   2> 3617498 INFO  (TEST-LeaderInitiatedRecoveryOnShardRestartTest.testRestartWithAllInLIR-seed#[628DB96865AB7A13]) [    ] o.a.s.c.AbstractZkTestCase put /x1/jenkins/jenkins-slave/workspace/Lucene-Solr-NightlyTests-5.x/solr/core/src/test-files/solr/collection1/conf/synonyms.txt to /configs/conf1/synonyms.txt
   [junit4]   2> 3617498 INFO  (TEST-LeaderInitiatedRecoveryOnShardRestartTest.testRestartWithAllInLIR-seed#[628DB96865AB7A13]) [    ] o.a.s.c.c.SolrZkClient makePath: /configs/conf1/synonyms.txt
   [junit4]   2> 3617902 INFO  (TEST-LeaderInitiatedRecoveryOnShardRestartTest.testRestartWithAllInLIR-seed#[628DB96865AB7A13]) [    ] o.a.s.SolrTestCaseJ4 Writing core.properties file to /x1/jenkins/jenkins-slave/workspace/Lucene-Solr-NightlyTests-5.x/solr/build/solr-core/test/J2/temp/solr.cloud.LeaderInitiatedRecoveryOnShardRestartTest_628DB96865AB7A13-001/control-001/cores/collection1
   [junit4]   2> 3617904 INFO  (TEST-LeaderInitiatedRecoveryOnShardRestartTest.testRestartWithAllInLIR-seed#[628DB96865AB7A13]) [    ] o.e.j.s.Server jetty-9.2.13.v20150730
   [junit4]   2> 3617906 INFO  (TEST-LeaderInitiatedRecoveryOnShardRestartTest.testRestartWithAllInLIR-seed#[628DB96865AB7A13]) [    ] o.e.j.s.h.ContextHandler Started o.e.j.s.ServletContextHandler@2ceed70d{/,null,AVAILABLE}
   [junit4]   2> 3617908 INFO  (TEST-LeaderInitiatedRecoveryOnShardRestartTest.testRestartWithAllInLIR-seed#[628DB96865AB7A13]) [    ] o.e.j.s.ServerConnector Started ServerConnector@458741f{HTTP/1.1}{127.0.0.1:48234}
   [junit4]   2> 3617908 INFO  (TEST-LeaderInitiatedRecoveryOnShardRestartTest.testRestartWithAllInLIR-seed#[628DB96865AB7A13]) [    ] o.e.j.s.Server Started @3620790ms
   [junit4]   2> 3617908 INFO  (TEST-LeaderInitiatedRecoveryOnShardRestartTest.testRestartWithAllInLIR-seed#[628DB96865AB7A13]) [    ] o.a.s.c.s.e.JettySolrRunner Jetty properties: {hostContext=/, solr.data.dir=/x1/jenkins/jenkins-slave/workspace/Lucene-Solr-NightlyTests-5.x/solr/build/solr-core/test/J2/temp/solr.cloud.LeaderInitiatedRecoveryOnShardRestartTest_628DB96865AB7A13-001/tempDir-001/control/data, hostPort=48234, coreRootDirectory=/x1/jenkins/jenkins-slave/workspace/Lucene-Solr-NightlyTests-5.x/solr/build/solr-core/test/J2/temp/solr.cloud.LeaderInitiatedRecoveryOnShardRestartTest_628DB96865AB7A13-001/control-001/cores}
   [junit4]   2> 3617909 INFO  (TEST-LeaderInitiatedRecoveryOnShardRestartTest.testRestartWithAllInLIR-seed#[628DB96865AB7A13]) [    ] o.a.s.s.SolrDispatchFilter SolrDispatchFilter.init(): sun.misc.Launcher$AppClassLoader@1fe91485
   [junit4]   2> 3617909 INFO  (TEST-LeaderInitiatedRecoveryOnShardRestartTest.testRestartWithAllInLIR-seed#[628DB96865AB7A13]) [    ] o.a.s.c.SolrResourceLoader new SolrResourceLoader for directory: '/x1/jenkins/jenkins-slave/workspace/Lucene-Solr-NightlyTests-5.x/solr/build/solr-core/test/J2/temp/solr.cloud.LeaderInitiatedRecoveryOnShardRestartTest_628DB96865AB7A13-001/control-001/'
   [junit4]   2> 3617909 INFO  (TEST-LeaderInitiatedRecoveryOnShardRestartTest.testRestartWithAllInLIR-seed#[628DB96865AB7A13]) [    ] o.a.s.c.SolrResourceLoader JNDI not configured for solr (NoInitialContextEx)
   [junit4]   2> 3617909 INFO  (TEST-LeaderInitiatedRecoveryOnShardRestartTest.testRestartWithAllInLIR-seed#[628DB96865AB7A13]) [    ] o.a.s.c.SolrResourceLoader solr home defaulted to 'solr/' (could not find system property or JNDI)
   [junit4]   2> 3617925 INFO  (TEST-LeaderInitiatedRecoveryOnShardRestartTest.testRestartWithAllInLIR-seed#[628DB96865AB7A13]) [    ] o.a.s.c.c.SolrZkClient Using default ZkCredentialsProvider
   [junit4]   2> 3617926 INFO  (TEST-LeaderInitiatedRecoveryOnShardRestartTest.testRestartWithAllInLIR-seed#[628DB96865AB7A13]) [    ] o.a.s.c.c.ConnectionManager Waiting for client to connect to ZooKeeper
   [junit4]   2> 3617946 INFO  (zkCallback-1859-thread-1) [    ] o.a.s.c.c.ConnectionManager Watcher org.apache.solr.common.cloud.ConnectionManager@1384cafd name:ZooKeeperConnection Watcher:127.0.0.1:51025/solr got event WatchedEvent state:SyncConnected type:None path:null path:null type:None
   [junit4]   2> 3617946 INFO  (TEST-LeaderInitiatedRecoveryOnShardRestartTest.testRestartWithAllInLIR-seed#[628DB96865AB7A13]) [    ] o.a.s.c.c.ConnectionManager Client is connected to ZooKeeper
   [junit4]   2> 3617946 INFO  (TEST-LeaderInitiatedRecoveryOnShardRestartTest.testRestartWithAllInLIR-seed#[628DB96865AB7A13]) [    ] o.a.s.c.c.SolrZkClient Using default ZkACLProvider
   [junit4]   2> 3617947 INFO  (TEST-LeaderInitiatedRecoveryOnShardRestartTest.testRestartWithAllInLIR-seed#[628DB96865AB7A13]) [    ] o.a.s.s.SolrDispatchFilter Loading solr.xml from SolrHome (not found in ZooKeeper)
   [junit4]   2> 3617947 INFO  (TEST-LeaderInitiatedRecoveryOnShardRestartTest.testRestartWithAllInLIR-seed#[628DB96865AB7A13]) [    ] o.a.s.c.SolrXmlConfig Loading container configuration from /x1/jenkins/jenkins-slave/workspace/Lucene-Solr-NightlyTests-5.x/solr/build/solr-core/test/J2/temp/solr.cloud.LeaderInitiatedRecoveryOnShardRestartTest_628DB96865AB7A13-001/control-001/solr.xml
   [junit4]   2> 3617970 INFO  (TEST-LeaderInitiatedRecoveryOnShardRestartTest.testRestartWithAllInLIR-seed#[628DB96865AB7A13]) [    ] o.a.s.c.CoresLocator Config-defined core root directory: /x1/jenkins/jenkins-slave/workspace/Lucene-Solr-NightlyTests-5.x/solr/build/solr-core/test/J2/temp/solr.cloud.LeaderInitiatedRecoveryOnShardRestartTest_628DB96865AB7A13-001/control-001/cores
   [junit4]   2> 3617970 INFO  (TEST-LeaderInitiatedRecoveryOnShardRestartTest.testRestartWithAllInLIR-seed#[628DB96865AB7A13]) [    ] o.a.s.c.CoreContainer New CoreContainer 827989123
   [junit4]   2> 3617970 INFO  (TEST-LeaderInitiatedRecoveryOnShardRestartTest.testRestartWithAllInLIR-seed#[628DB96865AB7A13]) [    ] o.a.s.c.CoreContainer Loading cores into CoreContainer [instanceDir=/x1/jenkins/jenkins-slave/workspace/Lucene-Solr-NightlyTests-5.x/solr/build/solr-core/test/J2/temp/solr.cloud.LeaderInitiatedRecoveryOnShardRestartTest_628DB96865AB7A13-001/control-001/]
   [junit4]   2> 3617970 INFO  (TEST-LeaderInitiatedRecoveryOnShardRestartTest.testRestartWithAllInLIR-seed#[628DB96865AB7A13]) [    ] o.a.s.c.CoreContainer loading shared library: /x1/jenkins/jenkins-slave/workspace/Lucene-Solr-NightlyTests-5.x/solr/build/solr-core/test/J2/temp/solr.cloud.LeaderInitiatedRecoveryOnShardRestartTest_628DB96865AB7A13-001/control-001/lib
   [junit4]   2> 3617971 WARN  (TEST-LeaderInitiatedRecoveryOnShardRestartTest.testRestartWithAllInLIR-seed#[628DB96865AB7A13]) [    ] o.a.s.c.SolrResourceLoader Can't find (or read) directory to add to classloader: lib (resolved as: /x1/jenkins/jenkins-slave/workspace/Lucene-Solr-NightlyTests-5.x/solr/build/solr-core/test/J2/temp/solr.cloud.LeaderInitiatedRecoveryOnShardRestartTest_628DB96865AB7A13-001/control-001/lib).
   [junit4]   2> 3617987 INFO  (TEST-LeaderInitiatedRecoveryOnShardRestartTest.testRestartWithAllInLIR-seed#[628DB96865AB7A13]) [    ] o.a.s.h.c.HttpShardHandlerFactory created with socketTimeout : 90000,urlScheme : ,connTimeout : 15000,maxConnectionsPerHost : 20,maxConnections : 10000,corePoolSize : 0,maximumPoolSize : 2147483647,maxThreadIdleTime : 5,sizeOfQueue : -1,fairnessPolicy : false,useRetries : false,
   [junit4]   2> 3617989 INFO  (TEST-LeaderInitiatedRecoveryOnShardRestartTest.testRestartWithAllInLIR-seed#[628DB96865AB7A13]) [    ] o.a.s.u.UpdateShardHandler Creating UpdateShardHandler HTTP client with params: socketTimeout=340000&connTimeout=45000&retry=true
   [junit4]   2> 3617989 INFO  (TEST-LeaderInitiatedRecoveryOnShardRestartTest.testRestartWithAllInLIR-seed#[628DB96865AB7A13]) [    ] o.a.s.l.LogWatcher SLF4J impl is org.slf4j.impl.Log4jLoggerFactory
   [junit4]   2> 3617989 INFO  (TEST-LeaderInitiatedRecoveryOnShardRestartTest.testRestartWithAllInLIR-seed#[628DB96865AB7A13]) [    ] o.a.s.l.LogWatcher Registering Log Listener [Log4j (org.slf4j.impl.Log4jLoggerFactory)]
   [junit4]   2> 3617989 INFO  (TEST-LeaderInitiatedRecoveryOnShardRestartTest.testRestartWithAllInLIR-seed#[628DB96865AB7A13]) [    ] o.a.s.c.ZkContainer Zookeeper client=127.0.0.1:51025/solr
   [junit4]   2> 3617989 INFO  (TEST-LeaderInitiatedRecoveryOnShardRestartTest.testRestartWithAllInLIR-seed#[628DB96865AB7A13]) [    ] o.a.s.c.ZkController zkHost includes chroot
   [junit4]   2> 3617990 INFO  (TEST-LeaderInitiatedRecoveryOnShardRestartTest.testRestartWithAllInLIR-seed#[628DB96865AB7A13]) [    ] o.a.s.c.c.SolrZkClient Using default ZkCredentialsProvider
   [junit4]   2> 3618014 INFO  (TEST-LeaderInitiatedRecoveryOnShardRestartTest.testRestartWithAllInLIR-seed#[628DB96865AB7A13]) [    ] o.a.s.c.c.ConnectionManager Waiting for client to connect to ZooKeeper
   [junit4]   2> 3618034 INFO  (zkCallback-1861-thread-1) [    ] o.a.s.c.c.ConnectionManager Watcher org.apache.solr.common.cloud.ConnectionManager@11f8e7a3 name:ZooKeeperConnection Watcher:127.0.0.1:51025 got event WatchedEvent state:SyncConnected type:None path:null path:null type:None
   [junit4]   2> 3618034 INFO  (TEST-LeaderInitiatedRecoveryOnShardRestartTest.testRestartWithAllInLIR-seed#[628DB96865AB7A13]) [    ] o.a.s.c.c.ConnectionManager Client is connected to ZooKeeper
   [junit4]   2> 3618035 INFO  (TEST-LeaderInitiatedRecoveryOnShardRestartTest.testRestartWithAllInLIR-seed#[628DB96865AB7A13]) [    ] o.a.s.c.c.SolrZkClient Using default ZkACLProvider
   [junit4]   2> 3618054 INFO  (TEST-LeaderInitiatedRecoveryOnShardRestartTest.testRestartWithAllInLIR-seed#[628DB96865AB7A13]) [n:127.0.0.1:48234_    ] o.a.s.c.c.ConnectionManager Waiting for client to connect to ZooKeeper
   [junit4]   2> 3618070 INFO  (zkCallback-1862-thread-1-processing-n:127.0.0.1:48234_) [n:127.0.0.1:48234_    ] o.a.s.c.c.ConnectionManager Watcher org.apache.solr.common.cloud.ConnectionManager@1147ff06 name:ZooKeeperConnection Watcher:127.0.0.1:51025/solr got event WatchedEvent state:SyncConnected type:None path:null path:null type:None
   [junit4]   2> 3618070 INFO  (TEST-LeaderInitiatedRecoveryOnShardRestartTest.testRestartWithAllInLIR-seed#[628DB96865AB7A13]) [n:127.0.0.1:48234_    ] o.a.s.c.c.ConnectionManager Client is connected to ZooKeeper
   [junit4]   2> 3618071 INFO  (TEST-LeaderInitiatedRecoveryOnShardRestartTest.testRestartWithAllInLIR-seed#[628DB96865AB7A13]) [n:127.0.0.1:48234_    ] o.a.s.c.c.SolrZkClient makePath: /overseer/queue
   [junit4]   2> 3618072 INFO  (TEST-LeaderInitiatedRecoveryOnShardRestartTest.testRestartWithAllInLIR-seed#[628DB96865AB7A13]) [n:127.0.0.1:48234_    ] o.a.s.c.c.SolrZkClient makePath: /overseer/collection-queue-work
   [junit4]   2> 3618075 INFO  (TEST-LeaderInitiatedRecoveryOnShardRestartTest.testRestartWithAllInLIR-seed#[628DB96865AB7A13]) [n:127.0.0.1:48234_    ] o.a.s.c.c.SolrZkClient makePath: /overseer/collection-map-running
   [junit4]   2> 3618076 INFO  (TEST-LeaderInitiatedRecoveryOnShardRestartTest.testRestartWithAllInLIR-seed#[628DB96865AB7A13]) [n:127.0.0.1:48234_    ] o.a.s.c.c.SolrZkClient makePath: /overseer/collection-map-completed
   [junit4]   2> 3618077 INFO  (TEST-LeaderInitiatedRecoveryOnShardRestartTest.testRestartWithAllInLIR-seed#[628DB96865AB7A13]) [n:127.0.0.1:48234_    ] o.a.s.c.c.SolrZkClient makePath: /overseer/collection-map-failure
   [junit4]   2> 3618079 INFO  (TEST-LeaderInitiatedRecoveryOnShardRestartTest.testRestartWithAllInLIR-seed#[628DB96865AB7A13]) [n:127.0.0.1:48234_    ] o.a.s.c.c.SolrZkClient makePath: /live_nodes
   [junit4]   2> 3618080 INFO  (TEST-LeaderInitiatedRecoveryOnShardRestartTest.testRestartWithAllInLIR-seed#[628DB96865AB7A13]) [n:127.0.0.1:48234_    ] o.a.s.c.c.SolrZkClient makePath: /aliases.json
   [junit4]   2> 3618081 INFO  (TEST-LeaderInitiatedRecoveryOnShardRestartTest.testRestartWithAllInLIR-seed#[628DB96865AB7A13]) [n:127.0.0.1:48234_    ] o.a.s.c.c.SolrZkClient makePath: /clusterstate.json
   [junit4]   2> 3618082 INFO  (TEST-LeaderInitiatedRecoveryOnShardRestartTest.testRestartWithAllInLIR-seed#[628DB96865AB7A13]) [n:127.0.0.1:48234_    ] o.a.s.c.c.SolrZkClient makePath: /security.json
   [junit4]   2> 3618082 INFO  (TEST-LeaderInitiatedRecoveryOnShardRestartTest.testRestartWithAllInLIR-seed#[628DB96865AB7A13]) [n:127.0.0.1:48234_    ] o.a.s.c.ZkController Register node as live in ZooKeeper:/live_nodes/127.0.0.1:48234_
   [junit4]   2> 3618083 INFO  (TEST-LeaderInitiatedRecoveryOnShardRestartTest.testRestartWithAllInLIR-seed#[628DB96865AB7A13]) [n:127.0.0.1:48234_    ] o.a.s.c.c.SolrZkClient makePath: /live_nodes/127.0.0.1:48234_
   [junit4]   2> 3618084 INFO  (TEST-LeaderInitiatedRecoveryOnShardRestartTest.testRestartWithAllInLIR-seed#[628DB96865AB7A13]) [n:127.0.0.1:48234_    ] o.a.s.c.c.SolrZkClient makePath: /overseer_elect
   [junit4]   2> 3618085 INFO  (TEST-LeaderInitiatedRecoveryOnShardRestartTest.testRestartWithAllInLIR-seed#[628DB96865AB7A13]) [n:127.0.0.1:48234_    ] o.a.s.c.c.SolrZkClient makePath: /overseer_elect/election
   [junit4]   2> 3618086 INFO  (TEST-LeaderInitiatedRecoveryOnShardRestartTest.testRestartWithAllInLIR-seed#[628DB96865AB7A13]) [n:127.0.0.1:48234_    ] o.a.s.c.Overseer Overseer (id=null) closing
   [junit4]   2> 3618086 INFO  (TEST-LeaderInitiatedRecoveryOnShardRestartTest.testRestartWithAllInLIR-seed#[628DB96865AB7A13]) [n:127.0.0.1:48234_    ] o.a.s.c.LeaderElector Joined leadership election with path: /overseer_elect/election/94673823303925764-127.0.0.1:48234_-n_0000000000
   [junit4]   2> 3618086 INFO  (TEST-LeaderInitiatedRecoveryOnShardRestartTest.testRestartWithAllInLIR-seed#[628DB96865AB7A13]) [n:127.0.0.1:48234_    ] o.a.s.c.OverseerElectionContext I am going to be the leader 127.0.0.1:48234_
   [junit4]   2> 3618086 INFO  (TEST-LeaderInitiatedRecoveryOnShardRestartTest.testRestartWithAllInLIR-seed#[628DB96865AB7A13]) [n:127.0.0.1:48234_    ] o.a.s.c.c.SolrZkClient makePath: /overseer_elect/leader
   [junit4]   2> 3618087 INFO  (TEST-LeaderInitiatedRecoveryOnShardRestartTest.testRestartWithAllInLIR-seed#[628DB96865AB7A13]) [n:127.0.0.1:48234_    ] o.a.s.c.Overseer Overseer (id=94673823303925764-127.0.0.1:48234_-n_0000000000) starting
   [junit4]   2> 3618089 INFO  (TEST-LeaderInitiatedRecoveryOnShardRestartTest.testRestartWithAllInLIR-seed#[628DB96865AB7A13]) [n:127.0.0.1:48234_    ] o.a.s.c.c.SolrZkClient makePath: /overseer/queue-work
   [junit4]   2> 3618093 INFO  (TEST-LeaderInitiatedRecoveryOnShardRestartTest.testRestartWithAllInLIR-seed#[628DB96865AB7A13]) [n:127.0.0.1:48234_    ] o.a.s.c.OverseerAutoReplicaFailoverThread Starting OverseerAutoReplicaFailoverThread autoReplicaFailoverWorkLoopDelay=10000 autoReplicaFailoverWaitAfterExpiration=30000 autoReplicaFailoverBadNodeExpiration=60000
   [junit4]   2> 3618106 INFO  (OverseerStateUpdate-94673823303925764-127.0.0.1:48234_-n_0000000000) [n:127.0.0.1:48234_    ] o.a.s.c.Overseer Starting to work on the main queue
   [junit4]   2> 3618106 INFO  (OverseerStateUpdate-94673823303925764-127.0.0.1:48234_-n_0000000000) [n:127.0.0.1:48234_    ] o.a.s.c.c.ZkStateReader Updating cluster state from ZooKeeper... 
   [junit4]   2> 3618114 INFO  (OverseerCollectionConfigSetProcessor-94673823303925764-127.0.0.1:48234_-n_0000000000) [n:127.0.0.1:48234_    ] o.a.s.c.OverseerTaskProcessor Process current queue of overseer operations
   [junit4]   2> 3618130 INFO  (TEST-LeaderInitiatedRecoveryOnShardRestartTest.testRestartWithAllInLIR-seed#[628DB96865AB7A13]) [n:127.0.0.1:48234_    ] o.a.s.c.c.ZkStateReader Updating cluster state from ZooKeeper... 
   [junit4]   2> 3618144 INFO  (TEST-LeaderInitiatedRecoveryOnShardRestartTest.testRestartWithAllInLIR-seed#[628DB96865AB7A13]) [n:127.0.0.1:48234_    ] o.a.s.c.CoreContainer Security conf doesn't exist. Skipping setup for authorization module.
   [junit4]   2> 3618144 INFO  (TEST-LeaderInitiatedRecoveryOnShardRestartTest.testRestartWithAllInLIR-seed#[628DB96865AB7A13]) [n:127.0.0.1:48234_    ] o.a.s.c.CoreContainer No authentication plugin used.
   [junit4]   2> 3618184 INFO  (TEST-LeaderInitiatedRecoveryOnShardRestartTest.testRestartWithAllInLIR-seed#[628DB96865AB7A13]) [n:127.0.0.1:48234_    ] o.a.s.c.CoresLocator Looking for core definitions underneath /x1/jenkins/jenkins-slave/workspace/Lucene-Solr-NightlyTests-5.x/solr/build/solr-core/test/J2/temp/solr.cloud.LeaderInitiatedRecoveryOnShardRestartTest_628DB96865AB7A13-001/control-001/cores
   [junit4]   2> 3618185 INFO  (TEST-LeaderInitiatedRecoveryOnShardRestartTest.testRestartWithAllInLIR-seed#[628DB96865AB7A13]) [n:127.0.0.1:48234_    ] o.a.s.c.SolrCore Created CoreDescriptor: {instanceDir=/x1/jenkins/jenkins-slave/workspace/Lucene-Solr-NightlyTests-5.x/solr/build/solr-core/test/J2/temp/solr.cloud.LeaderInitiatedRecoveryOnShardRestartTest_628DB96865AB7A13-001/control-001/cores/collection1, collection=control_collection, loadOnStartup=true, absoluteInstDir=/x1/jenkins/jenkins-slave/workspace/Lucene-Solr-NightlyTests-5.x/solr/build/solr-core/test/J2/temp/solr.cloud.LeaderInitiatedRecoveryOnShardRestartTest_628DB96865AB7A13-001/control-001/cores/collection1/, dataDir=data/, schema=schema.xml, configSetProperties=configsetprops.json, shard=, coreNodeName=, name=collection1, transient=false, config=solrconfig.xml}
   [junit4]   2> 3618185 INFO  (TEST-LeaderInitiatedRecoveryOnShardRestartTest.testRestartWithAllInLIR-seed#[628DB96865AB7A13]) [n:127.0.0.1:48234_    ] o.a.s.c.CoresLocator Found core collection1 in /x1/jenkins/jenkins-slave/workspace/Lucene-Solr-NightlyTests-5.x/solr/build/solr-core/test/J2/temp/solr.cloud.LeaderInitiatedRecoveryOnShardRestartTest_628DB96865AB7A13-001/control-001/cores/collection1/
   [junit4]   2> 3618185 INFO  (TEST-LeaderInitiatedRecoveryOnShardRestartTest.testRestartWithAllInLIR-seed#[628DB96865AB7A13]) [n:127.0.0.1:48234_    ] o.a.s.c.CoresLocator Found 1 core definitions
   [junit4]   2> 3618195 INFO  (coreLoadExecutor-6516-thread-1-processing-n:127.0.0.1:48234_) [n:127.0.0.1:48234_ c:control_collection   x:collection1] o.a.s.c.ZkController publishing state=down
   [junit4]   2> 3618195 INFO  (coreLoadExecutor-6516-thread-1-processing-n:127.0.0.1:48234_) [n:127.0.0.1:48234_ c:control_collection   x:collection1] o.a.s.c.ZkController numShards not found on descriptor - reading it from system property
   [junit4]   2> 3618201 INFO  (coreLoadExecutor-6516-thread-1-processing-n:127.0.0.1:48234_) [n:127.0.0.1:48234_ c:control_collection   x:collection1] o.a.s.c.ZkController look for our core node name
   [junit4]   2> 3618206 INFO  (TEST-LeaderInitiatedRecoveryOnShardRestartTest.testRestartWithAllInLIR-seed#[628DB96865AB7A13]) [n:127.0.0.1:48234_    ] o.a.s.s.SolrDispatchFilter user.dir=/x1/jenkins/jenkins-slave/workspace/Lucene-Solr-NightlyTests-5.x/solr/build/solr-core/test/J2
   [junit4]   2> 3618206 INFO  (TEST-LeaderInitiatedRecoveryOnShardRestartTest.testRestartWithAllInLIR-seed#[628DB96865AB7A13]) [n:127.0.0.1:48234_    ] o.a.s.s.SolrDispatchFilter SolrDispatchFilter.init() done
   [junit4]   2> 3618207 INFO  (OverseerStateUpdate-94673823303925764-127.0.0.1:48234_-n_0000000000) [n:127.0.0.1:48234_    ] o.a.s.c.Overseer processMessage: queueSize: 1, message = {
   [junit4]   2>   "shard":null,
   [junit4]   2>   "node_name":"127.0.0.1:48234_",
   [junit4]   2>   "operation":"state",
   [junit4]   2>   "base_url":"http://127.0.0.1:48234",
   [junit4]   2>   "core":"collection1",
   [junit4]   2>   "numShards":"1",
   [junit4]   2>   "collection":"control_collection",
   [junit4]   2>   "state":"down",
   [junit4]   2>   "roles":null} current state version: 0
   [junit4]   2> 3618207 INFO  (OverseerStateUpdate-94673823303925764-127.0.0.1:48234_-n_0000000000) [n:127.0.0.1:48234_    ] o.a.s.c.o.ReplicaMutator Update state numShards=1 message={
   [junit4]   2>   "shard":null,
   [junit4]   2>   "node_name":"127.0.0.1:48234_",
   [junit4]   2>   "operation":"state",
   [junit4]   2>   "base_url":"http://127.0.0.1:48234",
   [junit4]   2>   "core":"collection1",
   [junit4]   2>   "numShards":"1",
   [junit4]   2>   "collection":"control_collection",
   [junit4]   2>   "state":"down",
   [junit4]   2>   "roles":null}
   [junit4]   2> 3618207 INFO  (OverseerStateUpdate-94673823303925764-127.0.0.1:48234_-n_0000000000) [n:127.0.0.1:48234_    ] o.a.s.c.o.ClusterStateMutator building a new cName: control_collection
   [junit4]   2> 3618208 INFO  (OverseerStateUpdate-94673823303925764-127.0.0.1:48234_-n_0000000000) [n:127.0.0.1:48234_    ] o.a.s.c.o.ReplicaMutator Assigning new node to shard shard=shard1
   [junit4]   2> 3618209 INFO  (zkCallback-1862-thread-1-processing-n:127.0.0.1:48234_) [n:127.0.0.1:48234_    ] o.a.s.c.c.ZkStateReader A cluster state change: WatchedEvent state:SyncConnected type:NodeDataChanged path:/clusterstate.json, has occurred - updating... (live nodes size: 1)
   [junit4]   2> 3618222 INFO  (zkCallback-1862-thread-2-processing-n:127.0.0.1:48234_) [n:127.0.0.1:48234_    ] o.a.s.c.c.ZkStateReader A cluster state change: WatchedEvent state:SyncConnected type:NodeDataChanged path:/clusterstate.json, has occurred - updating... (live nodes size: 1)
   [junit4]   2> 3619201 INFO  (coreLoadExecutor-6516-thread-1-processing-n:127.0.0.1:48234_) [n:127.0.0.1:48234_ c:control_collection   x:collection1] o.a.s.c.ZkController waiting to find shard id in clusterstate for collection1
   [junit4]   2> 3619201 INFO  (coreLoadExecutor-6516-thread-1-processing-n:127.0.0.1:48234_) [n:127.0.0.1:48234_ c:control_collection   x:collection1] o.a.s.c.ZkController Check for collection zkNode:control_collection
   [junit4]   2> 3619203 INFO  (coreLoadExecutor-6516-thread-1-processing-n:127.0.0.1:48234_) [n:127.0.0.1:48234_ c:control_collection   x:collection1] o.a.s.c.ZkController Collection zkNode exists
   [junit4]   2> 3619203 INFO  (coreLoadExecutor-6516-thread-1-processing-n:127.0.0.1:48234_) [n:127.0.0.1:48234_ c:control_collection   x:collection1] o.a.s.c.c.ZkStateReader Load collection config from:/collections/control_collection
   [junit4]   2> 3619203 INFO  (coreLoadExecutor-6516-thread-1-processing-n:127.0.0.1:48234_) [n:127.0.0.1:48234_ c:control_collection   x:collection1] o.a.s.c.c.ZkStateReader path=/collections/control_collection configName=conf1 specified config exists in ZooKeeper
   [junit4]   2> 3619203 INFO  (coreLoadExecutor-6516-thread-1-processing-n:127.0.0.1:48234_) [n:127.0.0.1:48234_ c:control_collection   x:collection1] o.a.s.c.SolrResourceLoader new SolrResourceLoader for directory: '/x1/jenkins/jenkins-slave/workspace/Lucene-Solr-NightlyTests-5.x/solr/build/solr-core/test/J2/temp/solr.cloud.LeaderInitiatedRecoveryOnShardRestartTest_628DB96865AB7A13-001/control-001/cores/collection1/'
   [junit4]   2> 3619203 INFO  (coreLoadExecutor-6516-thread-1-processing-n:127.0.0.1:48234_) [n:127.0.0.1:48234_ c:control_collection   x:collection1] o.a.s.c.SolrResourceLoader JNDI not configured for solr (NoInitialContextEx)
   [junit4]   2> 3619203 INFO  (coreLoadExecutor-6516-thread-1-processing-n:127.0.0.1:48234_) [n:127.0.0.1:48234_ c:control_collection   x:collection1] o.a.s.c.SolrResourceLoader solr home defaulted to 'solr/' (could not find system property or JNDI)
   [junit4]   2> 3619230 INFO  (coreLoadExecutor-6516-thread-1-processing-n:127.0.0.1:48234_) [n:127.0.0.1:48234_ c:control_collection   x:collection1] o.a.s.c.Config loaded config solrconfig.xml with version 0 
   [junit4]   2> 3619236 INFO  (coreLoadExecutor-6516-thread-1-processing-n:127.0.0.1:48234_) [n:127.0.0.1:48234_ c:control_collection   x:collection1] o.a.s.c.SolrConfig current version of requestparams : -1
   [junit4]   2> 3619257 INFO  (coreLoadExecutor-6516-thread-1-processing-n:127.0.0.1:48234_) [n:127.0.0.1:48234_ c:control_collection   x:collection1] o.a.s.c.SolrConfig Using Lucene MatchVersion: 5.4.0
   [junit4]   2> 3619312 INFO  (coreLoadExecutor-6516-thread-1-processing-n:127.0.0.1:48234_) [n:127.0.0.1:48234_ c:control_collection   x:collection1] o.a.s.c.Config Loaded SolrConfig: solrconfig.xml
   [junit4]   2> 3619317 INFO  (coreLoadExecutor-6516-thread-1-processing-n:127.0.0.1:48234_) [n:127.0.0.1:48234_ c:control_collection   x:collection1] o.a.s.s.IndexSchema Reading Solr Schema from /configs/conf1/schema.xml
   [junit4]   2> 3619324 INFO  (coreLoadExecutor-6516-thread-1-processing-n:127.0.0.1:48234_) [n:127.0.0.1:48234_ c:control_collection   x:collection1] o.a.s.s.IndexSchema [collection1] Schema name=test
   [junit4]   2> 3619683 INFO  (coreLoadExecutor-6516-thread-1-processing-n:127.0.0.1:48234_) [n:127.0.0.1:48234_ c:control_collection   x:collection1] o.a.s.s.OpenExchangeRatesOrgProvider Initialized with rates=open-exchange-rates.json, refreshInterval=1440.
   [junit4]   2> 3619692 INFO  (coreLoadExecutor-6516-thread-1-processing-n:127.0.0.1:48234_) [n:127.0.0.1:48234_ c:control_collection   x:collection1] o.a.s.s.IndexSchema default search field in schema is text
   [junit4]   2> 3619694 INFO  (coreLoadExecutor-6516-thread-1-processing-n:127.0.0.1:48234_) [n:127.0.0.1:48234_ c:control_collection   x:collection1] o.a.s.s.IndexSchema unique key field: id
   [junit4]   2> 3619703 INFO  (coreLoadExecutor-6516-thread-1-processing-n:127.0.0.1:48234_) [n:127.0.0.1:48234_ c:control_collection   x:collection1] o.a.s.s.FileExchangeRateProvider Reloading exchange rates from file currency.xml
   [junit4]   2> 3619706 INFO  (coreLoadExecutor-6516-thread-1-processing-n:127.0.0.1:48234_) [n:127.0.0.1:48234_ c:control_collection   x:collection1] o.a.s.s.FileExchangeRateProvider Reloading exchange rates from file currency.xml
   [junit4]   2> 3619709 INFO  (coreLoadExecutor-6516-thread-1-processing-n:127.0.0.1:48234_) [n:127.0.0.1:48234_ c:control_collection   x:collection1] o.a.s.s.OpenExchangeRatesOrgProvider Reloading exchange rates from open-exchange-rates.json
   [junit4]   2> 3619710 WARN  (coreLoadExecutor-6516-thread-1-processing-n:127.0.0.1:48234_) [n:127.0.0.1:48234_ c:control_collection   x:collection1] o.a.s.s.OpenExchangeRatesOrgProvider Unknown key IMPORTANT NOTE
   [junit4]   2> 3619710 WARN  (coreLoadExecutor-6516-thread-1-processing-n:127.0.0.1:48234_) [n:127.0.0.1:48234_ c:control_collection   x:collection1] o.a.s.s.OpenExchangeRatesOrgProvider Expected key, got STRING
   [junit4]   2> 3619710 INFO  (coreLoadExecutor-6516-thread-1-processing-n:127.0.0.1:48234_) [n:127.0.0.1:48234_ c:control_collection   x:collection1] o.a.s.s.OpenExchangeRatesOrgProvider Reloading exchange rates from open-exchange-rates.json
   [junit4]   2> 3619710 WARN  (coreLoadExecutor-6516-thread-1-processing-n:127.0.0.1:48234_) [n:127.0.0.1:48234_ c:control_collection   x:collection1] o.a.s.s.OpenExchangeRatesOrgProvider Unknown key IMPORTANT NOTE
   [junit4]   2> 3619711 WARN  (coreLoadExecutor-6516-thread-1-processing-n:127.0.0.1:48234_) [n:127.0.0.1:48234_ c:control_collection   x:collection1] o.a.s.s.OpenExchangeRatesOrgProvider Expected key, got STRING
   [junit4]   2> 3619712 INFO  (coreLoadExecutor-6516-thread-1-processing-n:127.0.0.1:48234_) [n:127.0.0.1:48234_ c:control_collection   x:collection1] o.a.s.c.ConfigSetProperties Did not find ConfigSet properties, assuming default properties: Can't find resource 'configsetprops.json' in classpath or '/configs/conf1', cwd=/x1/jenkins/jenkins-slave/workspace/Lucene-Solr-NightlyTests-5.x/solr/build/solr-core/test/J2
   [junit4]   2> 3619712 INFO  (coreLoadExecutor-6516-thread-1-processing-n:127.0.0.1:48234_) [n:127.0.0.1:48234_ c:control_collection   x:collection1] o.a.s.c.CoreContainer Creating SolrCore 'collection1' using configuration from collection control_collection
   [junit4]   2> 3619712 INFO  (coreLoadExecutor-6516-thread-1-processing-n:127.0.0.1:48234_) [n:127.0.0.1:48234_ c:control_collection s:shard1 r:core_node1 x:collection1] o.a.s.c.SolrCore org.apache.solr.core.MockDirectoryFactory
   [junit4]   2> 3619712 INFO  (coreLoadExecutor-6516-thread-1-processing-n:127.0.0.1:48234_) [n:127.0.0.1:48234_ c:control_collection s:shard1 r:core_node1 x:collection1] o.a.s.c.SolrCore [[collection1] ] Opening new SolrCore at [/x1/jenkins/jenkins-slave/workspace/Lucene-Solr-NightlyTests-5.x/solr/build/solr-core/test/J2/temp/solr.cloud.LeaderInitiatedRecoveryOnShardRestartTest_628DB96865AB7A13-001/control-001/cores/collection1/], dataDir=[null]
   [junit4]   2> 3619712 INFO  (coreLoadExecutor-6516-thread-1-processing-n:127.0.0.1:48234_) [n:127.0.0.1:48234_ c:control_collection s:shard1 r:core_node1 x:collection1] o.a.s.c.JmxMonitoredMap JMX monitoring is enabled. Adding Solr mbeans to JMX Server: com.sun.jmx.mbeanserver.JmxMBeanServer@448abbbc
   [junit4]   2> 3619713 INFO  (coreLoadExecutor-6516-thread-1-processing-n:127.0.0.1:48234_) [n:127.0.0.1:48234_ c:control_collection s:shard1 r:core_node1 x:collection1] o.a.s.c.CachingDirectoryFactory return new directory for /x1/jenkins/jenkins-slave/workspace/Lucene-Solr-NightlyTests-5.x/solr/build/solr-core/test/J2/temp/solr.cloud.LeaderInitiatedRecoveryOnShardRestartTest_628DB96865AB7A13-001/control-001/cores/collection1/data
   [junit4]   2> 3619713 INFO  (coreLoadExecutor-6516-thread-1-processing-n:127.0.0.1:48234_) [n:127.0.0.1:48234_ c:control_collection s:shard1 r:core_node1 x:collection1] o.a.s.c.SolrCore New index directory detected: old=null new=/x1/jenkins/jenkins-slave/workspace/Lucene-Solr-NightlyTests-5.x/solr/build/solr-core/test/J2/temp/solr.cloud.LeaderInitiatedRecoveryOnShardRestartTest_628DB96865AB7A13-001/control-001/cores/collection1/data/index/
   [junit4]   2> 3619713 WARN  (coreLoadExecutor-6516-thread-1-processing-n:127.0.0.1:48234_) [n:127.0.0.1:48234_ c:control_collection s:shard1 r:core_node1 x:collection1] o.a.s.c.SolrCore [collection1] Solr index directory '/x1/jenkins/jenkins-slave/workspace/Lucene-Solr-NightlyTests-5.x/solr/build/solr-core/test/J2/temp/solr.cloud.LeaderInitiatedRecoveryOnShardRestartTest_628DB96865AB7A13-001/control-001/cores/collection1/data/index' doesn't exist. Creating new index...
   [junit4]   2> 3619713 INFO  (coreLoadExecutor-6516-thread-1-processing-n:127.0.0.1:48234_) [n:127.0.0.1:48234_ c:control_collection s:shard1 r:core_node1 x:collection1] o.a.s.c.CachingDirectoryFactory return new directory for /x1/jenkins/jenkins-slave/workspace/Lucene-Solr-NightlyTests-5.x/solr/build/solr-core/test/J2/temp/solr.cloud.LeaderInitiatedRecoveryOnShardRestartTest_628DB96865AB7A13-001/control-001/cores/collection1/data/index
   [junit4]   2> 3619713 INFO  (coreLoadExecutor-6516-thread-1-processing-n:127.0.0.1:48234_) [n:127.0.0.1:48234_ c:control_collection s:shard1 r:core_node1 x:collection1] o.a.s.u.RandomMergePolicy RandomMergePolicy wrapping class org.apache.lucene.index.MockRandomMergePolicy: org.apache.lucene.index.MockRandomMergePolicy@28009f39
   [junit4]   2> 3619714 INFO  (coreLoadExecutor-6516-thread-1-processing-n:127.0.0.1:48234_) [n:127.0.0.1:48234_ c:control_collection s:shard1 r:core_node1 x:collection1] o.a.s.c.SolrCore SolrDeletionPolicy.onCommit: commits: num=1
   [junit4]   2> 	commit{dir=MockDirectoryWrapper(RAMDirectory@40d56bb3 lockFactory=org.apache.lucene.store.SingleInstanceLockFactory@7b91d605),segFN=segments_1,generation=1}
   [junit4]   2> 3619714 INFO  (coreLoadExecutor-6516-

[...truncated too long message...]

.apache.zookeeper.ClientCnxnSocketNIO.doTransport(ClientCnxnSocketNIO.java:361)
   [junit4]   2> 	at org.apache.zookeeper.ClientCnxn$SendThread.run(ClientCnxn.java:1081)
   [junit4]   2> 55493875 WARN  (zkCallback-611-thread-1-SendThread(127.0.0.1:53595)) [    ] o.a.z.ClientCnxn Session 0x1505c21201f0014 for server null, unexpected error, closing socket connection and attempting reconnect
   [junit4]   2> java.net.ConnectException: Connection refused
   [junit4]   2> 	at sun.nio.ch.SocketChannelImpl.checkConnect(Native Method)
   [junit4]   2> 	at sun.nio.ch.SocketChannelImpl.finishConnect(SocketChannelImpl.java:739)
   [junit4]   2> 	at org.apache.zookeeper.ClientCnxnSocketNIO.doTransport(ClientCnxnSocketNIO.java:361)
   [junit4]   2> 	at org.apache.zookeeper.ClientCnxn$SendThread.run(ClientCnxn.java:1081)
   [junit4]   2> 55494024 WARN  (TEST-CollectionsAPIDistributedZkTest.test-seed#[628DB96865AB7A13]-SendThread(127.0.0.1:49536)) [n:127.0.0.1:55628_    ] o.a.z.ClientCnxn Session 0x1505929c215000f for server null, unexpected error, closing socket connection and attempting reconnect
   [junit4]   2> java.net.ConnectException: Connection refused
   [junit4]   2> 	at sun.nio.ch.SocketChannelImpl.checkConnect(Native Method)
   [junit4]   2> 	at sun.nio.ch.SocketChannelImpl.finishConnect(SocketChannelImpl.java:739)
   [junit4]   2> 	at org.apache.zookeeper.ClientCnxnSocketNIO.doTransport(ClientCnxnSocketNIO.java:361)
   [junit4]   2> 	at org.apache.zookeeper.ClientCnxn$SendThread.run(ClientCnxn.java:1081)
   [junit4]   2> 55495633 WARN  (TEST-CollectionsAPIDistributedZkTest.test-seed#[628DB96865AB7A13]-SendThread(127.0.0.1:49536)) [n:127.0.0.1:55628_    ] o.a.z.ClientCnxn Session 0x1505929c215000f for server null, unexpected error, closing socket connection and attempting reconnect
   [junit4]   2> java.net.ConnectException: Connection refused
   [junit4]   2> 	at sun.nio.ch.SocketChannelImpl.checkConnect(Native Method)
   [junit4]   2> 	at sun.nio.ch.SocketChannelImpl.finishConnect(SocketChannelImpl.java:739)
   [junit4]   2> 	at org.apache.zookeeper.ClientCnxnSocketNIO.doTransport(ClientCnxnSocketNIO.java:361)
   [junit4]   2> 	at org.apache.zookeeper.ClientCnxn$SendThread.run(ClientCnxn.java:1081)
   [junit4]   2> 55495847 WARN  (zkCallback-611-thread-1-SendThread(127.0.0.1:53595)) [    ] o.a.z.ClientCnxn Session 0x1505c21201f0014 for server null, unexpected error, closing socket connection and attempting reconnect
   [junit4]   2> java.net.ConnectException: Connection refused
   [junit4]   2> 	at sun.nio.ch.SocketChannelImpl.checkConnect(Native Method)
   [junit4]   2> 	at sun.nio.ch.SocketChannelImpl.finishConnect(SocketChannelImpl.java:739)
   [junit4]   2> 	at org.apache.zookeeper.ClientCnxnSocketNIO.doTransport(ClientCnxnSocketNIO.java:361)
   [junit4]   2> 	at org.apache.zookeeper.ClientCnxn$SendThread.run(ClientCnxn.java:1081)
   [junit4]   2> 55497046 WARN  (TEST-CollectionsAPIDistributedZkTest.test-seed#[628DB96865AB7A13]-SendThread(127.0.0.1:49536)) [n:127.0.0.1:55628_    ] o.a.z.ClientCnxn Session 0x1505929c215000f for server null, unexpected error, closing socket connection and attempting reconnect
   [junit4]   2> java.net.ConnectException: Connection refused
   [junit4]   2> 	at sun.nio.ch.SocketChannelImpl.checkConnect(Native Method)
   [junit4]   2> 	at sun.nio.ch.SocketChannelImpl.finishConnect(SocketChannelImpl.java:739)
   [junit4]   2> 	at org.apache.zookeeper.ClientCnxnSocketNIO.doTransport(ClientCnxnSocketNIO.java:361)
   [junit4]   2> 	at org.apache.zookeeper.ClientCnxn$SendThread.run(ClientCnxn.java:1081)
   [junit4]   2> 55497064 WARN  (zkCallback-611-thread-1-SendThread(127.0.0.1:53595)) [    ] o.a.z.ClientCnxn Session 0x1505c21201f0014 for server null, unexpected error, closing socket connection and attempting reconnect
   [junit4]   2> java.net.ConnectException: Connection refused
   [junit4]   2> 	at sun.nio.ch.SocketChannelImpl.checkConnect(Native Method)
   [junit4]   2> 	at sun.nio.ch.SocketChannelImpl.finishConnect(SocketChannelImpl.java:739)
   [junit4]   2> 	at org.apache.zookeeper.ClientCnxnSocketNIO.doTransport(ClientCnxnSocketNIO.java:361)
   [junit4]   2> 	at org.apache.zookeeper.ClientCnxn$SendThread.run(ClientCnxn.java:1081)
   [junit4]   2> 55498288 ERROR (SUITE-MoreLikeThisHandlerTest-seed#[628DB96865AB7A13]-worker) [    x:collection1] o.a.s.SolrTestCaseJ4 ERROR: SolrIndexSearcher opens=2 closes=20
   [junit4]   2> NOTE: test params are: codec=Asserting(Lucene53): {_version_=PostingsFormat(name=LuceneFixedGap), multiDefault=PostingsFormat(name=Memory doPackFST= true), subword=PostingsFormat(name=LuceneFixedGap), intDefault=PostingsFormat(name=LuceneFixedGap), name=TestBloomFilteredLucenePostings(BloomFilteringPostingsFormat(Lucene50(blocksize=128))), range_facet_l=PostingsFormat(name=Memory doPackFST= true), range_facet_i_dv=PostingsFormat(name=Memory doPackFST= true), foo_ti=PostingsFormat(name=LuceneFixedGap), timestamp=PostingsFormat(name=Memory doPackFST= true), range_facet_l_dv=TestBloomFilteredLucenePostings(BloomFilteringPostingsFormat(Lucene50(blocksize=128))), id=TestBloomFilteredLucenePostings(BloomFilteringPostingsFormat(Lucene50(blocksize=128)))}, docValues:{range_facet_i_dv=DocValuesFormat(name=Memory), timestamp=DocValuesFormat(name=Memory), range_facet_l_dv=DocValuesFormat(name=Lucene50)}, sim=RandomSimilarityProvider(queryNorm=true,coord=yes): {}, locale=bg_BG, timezone=Asia/Bangkok
   [junit4]   2> NOTE: Linux 3.13.0-52-generic amd64/Oracle Corporation 1.7.0_72 (64-bit)/cpus=4,threads=1,free=147835040,total=516423680
   [junit4]   2> NOTE: All tests run in this JVM: [TestOverriddenPrefixQueryForCustomFieldType, TestTolerantSearch, IndexBasedSpellCheckerTest, TestSimpleQParserPlugin, DocumentBuilderTest, RollingRestartTest, TestSerializedLuceneMatchVersion, TestMiniSolrCloudCluster, IgnoreCommitOptimizeUpdateProcessorFactoryTest, DirectSolrSpellCheckerTest, TestRTGBase, TestUpdate, TestRestManager, TestWordDelimiterFilterFactory, ChaosMonkeyNothingIsSafeTest, OutOfBoxZkACLAndCredentialsProvidersTest, TestSolrConfigHandler, TestLFUCache, HLLUtilTest, SaslZkACLProviderTest, CollectionsAPIDistributedZkTest, SolrCmdDistributorTest, TestCodecSupport, DeleteLastCustomShardedReplicaTest, BigEndianAscendingWordSerializerTest, TestSolrCoreProperties, TestManagedSchemaFieldTypeResource, CircularListTest, CSVRequestHandlerTest, TestConfigSets, TestFiltering, TestFieldTypeCollectionResource, TestFastOutputStream, AnalyticsQueryTest, URLClassifyProcessorTest, SolrInfoMBeanTest, TestNamedUpdateProcessors, SolrIndexSplitterTest, DistributedFacetPivotSmallTest, DistanceUnitsTest, TestExactStatsCache, VMParamsZkACLAndCredentialsProvidersTest, TestSolr4Spatial2, DocValuesMissingTest, TestMissingGroups, SimpleCollectionCreateDeleteTest, TestManagedSynonymFilterFactory, HdfsNNFailoverTest, TestReloadDeadlock, SimpleMLTQParserTest, NumericFieldsTest, DOMUtilTest, TermVectorComponentTest, TestFieldCollectionResource, SolrCloudExampleTest, TestCloudManagedSchemaConcurrent, MoreLikeThisHandlerTest]
   [junit4]   2> NOTE: download the large Jenkins line-docs file by running 'ant get-jenkins-line-docs' in the lucene directory.
   [junit4]   2> NOTE: reproduce with: ant test  -Dtestcase=MoreLikeThisHandlerTest -Dtests.seed=628DB96865AB7A13 -Dtests.multiplier=2 -Dtests.nightly=true -Dtests.slow=true -Dtests.linedocsfile=/x1/jenkins/lucene-data/enwiki.random.lines.txt -Dtests.locale=bg_BG -Dtests.timezone=Asia/Bangkok -Dtests.asserts=true -Dtests.file.encoding=UTF-8
   [junit4] ERROR   0.00s J1 | MoreLikeThisHandlerTest (suite) <<<
   [junit4]    > Throwable #1: java.lang.AssertionError: ERROR: SolrIndexSearcher opens=2 closes=20
   [junit4]    > 	at __randomizedtesting.SeedInfo.seed([628DB96865AB7A13]:0)
   [junit4]    > 	at org.apache.solr.SolrTestCaseJ4.endTrackingSearchers(SolrTestCaseJ4.java:467)
   [junit4]    > 	at org.apache.solr.SolrTestCaseJ4.afterClass(SolrTestCaseJ4.java:233)
   [junit4]    > 	at java.lang.Thread.run(Thread.java:745)
   [junit4] Completed [509/540] on J1 in 122.59s, 1 test, 1 failure <<< FAILURES!

[...truncated 95 lines...]
   [junit4] JVM J1: stdout was not empty, see: /x1/jenkins/jenkins-slave/workspace/Lucene-Solr-NightlyTests-5.x/solr/build/solr-core/test/temp/junit4-J1-20151011_185759_184.sysout
   [junit4] >>> JVM J1: stdout (verbatim) ----
   [junit4] java.lang.OutOfMemoryError: Java heap space
   [junit4] Dumping heap to /x1/jenkins/jenkins-slave/workspace/Lucene-Solr-NightlyTests-5.x/heapdumps/java_pid20628.hprof ...
   [junit4] Heap dump file created [653927027 bytes in 25.330 secs]
   [junit4] <<< JVM J1: EOF ----

[...truncated 19 lines...]
BUILD FAILED
/x1/jenkins/jenkins-slave/workspace/Lucene-Solr-NightlyTests-5.x/build.xml:792: The following error occurred while executing this line:
/x1/jenkins/jenkins-slave/workspace/Lucene-Solr-NightlyTests-5.x/build.xml:729: The following error occurred while executing this line:
/x1/jenkins/jenkins-slave/workspace/Lucene-Solr-NightlyTests-5.x/build.xml:59: The following error occurred while executing this line:
/x1/jenkins/jenkins-slave/workspace/Lucene-Solr-NightlyTests-5.x/solr/build.xml:233: The following error occurred while executing this line:
/x1/jenkins/jenkins-slave/workspace/Lucene-Solr-NightlyTests-5.x/solr/common-build.xml:526: The following error occurred while executing this line:
/x1/jenkins/jenkins-slave/workspace/Lucene-Solr-NightlyTests-5.x/lucene/common-build.xml:1452: The following error occurred while executing this line:
/x1/jenkins/jenkins-slave/workspace/Lucene-Solr-NightlyTests-5.x/lucene/common-build.xml:1006: There were test failures: 540 suites (7 ignored), 2126 tests, 9 suite-level errors, 3 errors, 2 failures, 29 ignored (17 assumptions) [seed: 628DB96865AB7A13]

Total time: 1055 minutes 21 seconds
Build step 'Invoke Ant' marked build as failure
Archiving artifacts
Recording test results
Email was triggered for: Failure - Any
Sending email for trigger: Failure - Any



Mime
View raw message