lucene-dev mailing list archives

Site index · List index
Message view « Date » · « Thread »
Top « Date » · « Thread »
From Apache Jenkins Server <jenk...@builds.apache.org>
Subject [JENKINS] Lucene-Solr-NightlyTests-trunk - Build # 830 - Still Failing
Date Fri, 23 Oct 2015 18:38:32 GMT
Build: https://builds.apache.org/job/Lucene-Solr-NightlyTests-trunk/830/

4 tests failed.
FAILED:  org.apache.solr.cloud.CdcrReplicationDistributedZkTest.doTests

Error Message:
There are still nodes recoverying - waited for 330 seconds

Stack Trace:
java.lang.AssertionError: There are still nodes recoverying - waited for 330 seconds
	at __randomizedtesting.SeedInfo.seed([1DD2ACE0381532AA:15B2D9CC371B1AA1]:0)
	at org.junit.Assert.fail(Assert.java:93)
	at org.apache.solr.cloud.AbstractDistribZkTestBase.waitForRecoveriesToFinish(AbstractDistribZkTestBase.java:172)
	at org.apache.solr.cloud.AbstractDistribZkTestBase.waitForRecoveriesToFinish(AbstractDistribZkTestBase.java:133)
	at org.apache.solr.cloud.AbstractDistribZkTestBase.waitForRecoveriesToFinish(AbstractDistribZkTestBase.java:128)
	at org.apache.solr.cloud.BaseCdcrDistributedZkTest.waitForRecoveriesToFinish(BaseCdcrDistributedZkTest.java:465)
	at org.apache.solr.cloud.BaseCdcrDistributedZkTest.clearSourceCollection(BaseCdcrDistributedZkTest.java:319)
	at org.apache.solr.cloud.CdcrReplicationDistributedZkTest.doTestOps(CdcrReplicationDistributedZkTest.java:430)
	at org.apache.solr.cloud.CdcrReplicationDistributedZkTest.doTests(CdcrReplicationDistributedZkTest.java:54)
	at sun.reflect.NativeMethodAccessorImpl.invoke0(Native Method)
	at sun.reflect.NativeMethodAccessorImpl.invoke(NativeMethodAccessorImpl.java:62)
	at sun.reflect.DelegatingMethodAccessorImpl.invoke(DelegatingMethodAccessorImpl.java:43)
	at java.lang.reflect.Method.invoke(Method.java:497)
	at com.carrotsearch.randomizedtesting.RandomizedRunner.invoke(RandomizedRunner.java:1665)
	at com.carrotsearch.randomizedtesting.RandomizedRunner$8.evaluate(RandomizedRunner.java:864)
	at com.carrotsearch.randomizedtesting.RandomizedRunner$9.evaluate(RandomizedRunner.java:900)
	at com.carrotsearch.randomizedtesting.RandomizedRunner$10.evaluate(RandomizedRunner.java:914)
	at org.apache.solr.BaseDistributedSearchTestCase$ShardsRepeatRule$ShardsFixedStatement.callStatement(BaseDistributedSearchTestCase.java:963)
	at org.apache.solr.BaseDistributedSearchTestCase$ShardsRepeatRule$ShardsStatement.evaluate(BaseDistributedSearchTestCase.java:938)
	at com.carrotsearch.randomizedtesting.rules.SystemPropertiesRestoreRule$1.evaluate(SystemPropertiesRestoreRule.java:57)
	at org.apache.lucene.util.TestRuleSetupTeardownChained$1.evaluate(TestRuleSetupTeardownChained.java:50)
	at org.apache.lucene.util.AbstractBeforeAfterRule$1.evaluate(AbstractBeforeAfterRule.java:46)
	at org.apache.lucene.util.TestRuleThreadAndTestName$1.evaluate(TestRuleThreadAndTestName.java:49)
	at org.apache.lucene.util.TestRuleIgnoreAfterMaxFailures$1.evaluate(TestRuleIgnoreAfterMaxFailures.java:65)
	at org.apache.lucene.util.TestRuleMarkFailure$1.evaluate(TestRuleMarkFailure.java:48)
	at com.carrotsearch.randomizedtesting.rules.StatementAdapter.evaluate(StatementAdapter.java:36)
	at com.carrotsearch.randomizedtesting.ThreadLeakControl$StatementRunner.run(ThreadLeakControl.java:367)
	at com.carrotsearch.randomizedtesting.ThreadLeakControl.forkTimeoutingTask(ThreadLeakControl.java:809)
	at com.carrotsearch.randomizedtesting.ThreadLeakControl$3.evaluate(ThreadLeakControl.java:460)
	at com.carrotsearch.randomizedtesting.RandomizedRunner.runSingleTest(RandomizedRunner.java:873)
	at com.carrotsearch.randomizedtesting.RandomizedRunner$5.evaluate(RandomizedRunner.java:775)
	at com.carrotsearch.randomizedtesting.RandomizedRunner$6.evaluate(RandomizedRunner.java:809)
	at com.carrotsearch.randomizedtesting.RandomizedRunner$7.evaluate(RandomizedRunner.java:820)
	at com.carrotsearch.randomizedtesting.rules.StatementAdapter.evaluate(StatementAdapter.java:36)
	at com.carrotsearch.randomizedtesting.rules.SystemPropertiesRestoreRule$1.evaluate(SystemPropertiesRestoreRule.java:57)
	at org.apache.lucene.util.AbstractBeforeAfterRule$1.evaluate(AbstractBeforeAfterRule.java:46)
	at com.carrotsearch.randomizedtesting.rules.StatementAdapter.evaluate(StatementAdapter.java:36)
	at org.apache.lucene.util.TestRuleStoreClassName$1.evaluate(TestRuleStoreClassName.java:42)
	at com.carrotsearch.randomizedtesting.rules.NoShadowingOrOverridesOnMethodsRule$1.evaluate(NoShadowingOrOverridesOnMethodsRule.java:39)
	at com.carrotsearch.randomizedtesting.rules.NoShadowingOrOverridesOnMethodsRule$1.evaluate(NoShadowingOrOverridesOnMethodsRule.java:39)
	at com.carrotsearch.randomizedtesting.rules.StatementAdapter.evaluate(StatementAdapter.java:36)
	at com.carrotsearch.randomizedtesting.rules.StatementAdapter.evaluate(StatementAdapter.java:36)
	at com.carrotsearch.randomizedtesting.rules.StatementAdapter.evaluate(StatementAdapter.java:36)
	at org.apache.lucene.util.TestRuleAssertionsRequired$1.evaluate(TestRuleAssertionsRequired.java:54)
	at org.apache.lucene.util.TestRuleMarkFailure$1.evaluate(TestRuleMarkFailure.java:48)
	at org.apache.lucene.util.TestRuleIgnoreAfterMaxFailures$1.evaluate(TestRuleIgnoreAfterMaxFailures.java:65)
	at org.apache.lucene.util.TestRuleIgnoreTestSuites$1.evaluate(TestRuleIgnoreTestSuites.java:55)
	at com.carrotsearch.randomizedtesting.rules.StatementAdapter.evaluate(StatementAdapter.java:36)
	at com.carrotsearch.randomizedtesting.ThreadLeakControl$StatementRunner.run(ThreadLeakControl.java:367)
	at java.lang.Thread.run(Thread.java:745)


FAILED:  org.apache.solr.cloud.CollectionsAPIDistributedZkTest.test

Error Message:
Captured an uncaught exception in thread: Thread[id=5946, name=collection2, state=RUNNABLE, group=TGRP-CollectionsAPIDistributedZkTest]

Stack Trace:
com.carrotsearch.randomizedtesting.UncaughtExceptionError: Captured an uncaught exception in thread: Thread[id=5946, name=collection2, state=RUNNABLE, group=TGRP-CollectionsAPIDistributedZkTest]
Caused by: org.apache.solr.client.solrj.impl.HttpSolrClient$RemoteSolrException: Error from server at http://127.0.0.1:51371: Could not find collection : awholynewstresscollection_collection2_1
	at __randomizedtesting.SeedInfo.seed([1DD2ACE0381532AA]:0)
	at org.apache.solr.client.solrj.impl.HttpSolrClient.executeMethod(HttpSolrClient.java:575)
	at org.apache.solr.client.solrj.impl.HttpSolrClient.request(HttpSolrClient.java:241)
	at org.apache.solr.client.solrj.impl.HttpSolrClient.request(HttpSolrClient.java:230)
	at org.apache.solr.client.solrj.impl.LBHttpSolrClient.doRequest(LBHttpSolrClient.java:372)
	at org.apache.solr.client.solrj.impl.LBHttpSolrClient.request(LBHttpSolrClient.java:325)
	at org.apache.solr.client.solrj.impl.CloudSolrClient.sendRequest(CloudSolrClient.java:1099)
	at org.apache.solr.client.solrj.impl.CloudSolrClient.requestWithRetryOnStaleState(CloudSolrClient.java:870)
	at org.apache.solr.client.solrj.impl.CloudSolrClient.request(CloudSolrClient.java:806)
	at org.apache.solr.client.solrj.SolrClient.request(SolrClient.java:1220)
	at org.apache.solr.cloud.CollectionsAPIDistributedZkTest$1CollectionThread.run(CollectionsAPIDistributedZkTest.java:895)


FAILED:  org.apache.solr.cloud.LeaderInitiatedRecoveryOnShardRestartTest.testRestartWithAllInLIR

Error Message:
Captured an uncaught exception in thread: Thread[id=23831, name=coreZkRegister-5662-thread-1, state=RUNNABLE, group=TGRP-LeaderInitiatedRecoveryOnShardRestartTest]

Stack Trace:
com.carrotsearch.randomizedtesting.UncaughtExceptionError: Captured an uncaught exception in thread: Thread[id=23831, name=coreZkRegister-5662-thread-1, state=RUNNABLE, group=TGRP-LeaderInitiatedRecoveryOnShardRestartTest]
Caused by: java.lang.AssertionError
	at __randomizedtesting.SeedInfo.seed([1DD2ACE0381532AA]:0)
	at org.apache.solr.cloud.ZkController.updateLeaderInitiatedRecoveryState(ZkController.java:2126)
	at org.apache.solr.cloud.ShardLeaderElectionContext.runLeaderProcess(ElectionContext.java:433)
	at org.apache.solr.cloud.LeaderElector.runIamLeaderProcess(LeaderElector.java:197)
	at org.apache.solr.cloud.LeaderElector.checkIfIamLeader(LeaderElector.java:157)
	at org.apache.solr.cloud.LeaderElector.joinElection(LeaderElector.java:346)
	at org.apache.solr.cloud.ZkController.joinElection(ZkController.java:1113)
	at org.apache.solr.cloud.ZkController.register(ZkController.java:926)
	at org.apache.solr.cloud.ZkController.register(ZkController.java:881)
	at org.apache.solr.core.ZkContainer$2.run(ZkContainer.java:183)
	at org.apache.solr.common.util.ExecutorUtil$MDCAwareThreadPoolExecutor$1.run(ExecutorUtil.java:231)
	at java.util.concurrent.ThreadPoolExecutor.runWorker(ThreadPoolExecutor.java:1142)
	at java.util.concurrent.ThreadPoolExecutor$Worker.run(ThreadPoolExecutor.java:617)
	at java.lang.Thread.run(Thread.java:745)


FAILED:  org.apache.solr.handler.TestReplicationHandler.doTestStressReplication

Error Message:
timed out waiting for collection1 startAt time to exceed: Sat Oct 24 08:10:09 WSDT 2015

Stack Trace:
java.lang.AssertionError: timed out waiting for collection1 startAt time to exceed: Sat Oct 24 08:10:09 WSDT 2015
	at __randomizedtesting.SeedInfo.seed([1DD2ACE0381532AA:C679AC263D3D5B19]:0)
	at org.junit.Assert.fail(Assert.java:93)
	at org.apache.solr.handler.TestReplicationHandler.watchCoreStartAt(TestReplicationHandler.java:1417)
	at org.apache.solr.handler.TestReplicationHandler.doTestStressReplication(TestReplicationHandler.java:769)
	at sun.reflect.NativeMethodAccessorImpl.invoke0(Native Method)
	at sun.reflect.NativeMethodAccessorImpl.invoke(NativeMethodAccessorImpl.java:62)
	at sun.reflect.DelegatingMethodAccessorImpl.invoke(DelegatingMethodAccessorImpl.java:43)
	at java.lang.reflect.Method.invoke(Method.java:497)
	at com.carrotsearch.randomizedtesting.RandomizedRunner.invoke(RandomizedRunner.java:1665)
	at com.carrotsearch.randomizedtesting.RandomizedRunner$8.evaluate(RandomizedRunner.java:864)
	at com.carrotsearch.randomizedtesting.RandomizedRunner$9.evaluate(RandomizedRunner.java:900)
	at com.carrotsearch.randomizedtesting.RandomizedRunner$10.evaluate(RandomizedRunner.java:914)
	at com.carrotsearch.randomizedtesting.rules.SystemPropertiesRestoreRule$1.evaluate(SystemPropertiesRestoreRule.java:57)
	at org.apache.lucene.util.TestRuleSetupTeardownChained$1.evaluate(TestRuleSetupTeardownChained.java:50)
	at org.apache.lucene.util.AbstractBeforeAfterRule$1.evaluate(AbstractBeforeAfterRule.java:46)
	at org.apache.lucene.util.TestRuleThreadAndTestName$1.evaluate(TestRuleThreadAndTestName.java:49)
	at org.apache.lucene.util.TestRuleIgnoreAfterMaxFailures$1.evaluate(TestRuleIgnoreAfterMaxFailures.java:65)
	at org.apache.lucene.util.TestRuleMarkFailure$1.evaluate(TestRuleMarkFailure.java:48)
	at com.carrotsearch.randomizedtesting.rules.StatementAdapter.evaluate(StatementAdapter.java:36)
	at com.carrotsearch.randomizedtesting.ThreadLeakControl$StatementRunner.run(ThreadLeakControl.java:367)
	at com.carrotsearch.randomizedtesting.ThreadLeakControl.forkTimeoutingTask(ThreadLeakControl.java:809)
	at com.carrotsearch.randomizedtesting.ThreadLeakControl$3.evaluate(ThreadLeakControl.java:460)
	at com.carrotsearch.randomizedtesting.RandomizedRunner.runSingleTest(RandomizedRunner.java:873)
	at com.carrotsearch.randomizedtesting.RandomizedRunner$5.evaluate(RandomizedRunner.java:775)
	at com.carrotsearch.randomizedtesting.RandomizedRunner$6.evaluate(RandomizedRunner.java:809)
	at com.carrotsearch.randomizedtesting.RandomizedRunner$7.evaluate(RandomizedRunner.java:820)
	at com.carrotsearch.randomizedtesting.rules.StatementAdapter.evaluate(StatementAdapter.java:36)
	at com.carrotsearch.randomizedtesting.rules.SystemPropertiesRestoreRule$1.evaluate(SystemPropertiesRestoreRule.java:57)
	at org.apache.lucene.util.AbstractBeforeAfterRule$1.evaluate(AbstractBeforeAfterRule.java:46)
	at com.carrotsearch.randomizedtesting.rules.StatementAdapter.evaluate(StatementAdapter.java:36)
	at org.apache.lucene.util.TestRuleStoreClassName$1.evaluate(TestRuleStoreClassName.java:42)
	at com.carrotsearch.randomizedtesting.rules.NoShadowingOrOverridesOnMethodsRule$1.evaluate(NoShadowingOrOverridesOnMethodsRule.java:39)
	at com.carrotsearch.randomizedtesting.rules.NoShadowingOrOverridesOnMethodsRule$1.evaluate(NoShadowingOrOverridesOnMethodsRule.java:39)
	at com.carrotsearch.randomizedtesting.rules.StatementAdapter.evaluate(StatementAdapter.java:36)
	at com.carrotsearch.randomizedtesting.rules.StatementAdapter.evaluate(StatementAdapter.java:36)
	at com.carrotsearch.randomizedtesting.rules.StatementAdapter.evaluate(StatementAdapter.java:36)
	at org.apache.lucene.util.TestRuleAssertionsRequired$1.evaluate(TestRuleAssertionsRequired.java:54)
	at org.apache.lucene.util.TestRuleMarkFailure$1.evaluate(TestRuleMarkFailure.java:48)
	at org.apache.lucene.util.TestRuleIgnoreAfterMaxFailures$1.evaluate(TestRuleIgnoreAfterMaxFailures.java:65)
	at org.apache.lucene.util.TestRuleIgnoreTestSuites$1.evaluate(TestRuleIgnoreTestSuites.java:55)
	at com.carrotsearch.randomizedtesting.rules.StatementAdapter.evaluate(StatementAdapter.java:36)
	at com.carrotsearch.randomizedtesting.ThreadLeakControl$StatementRunner.run(ThreadLeakControl.java:367)
	at java.lang.Thread.run(Thread.java:745)




Build Log:
[...truncated 10190 lines...]
   [junit4] Suite: org.apache.solr.cloud.CollectionsAPIDistributedZkTest
   [junit4]   2> Creating dataDir: /x1/jenkins/jenkins-slave/workspace/Lucene-Solr-NightlyTests-trunk/solr/build/solr-core/test/J1/temp/solr.cloud.CollectionsAPIDistributedZkTest_1DD2ACE0381532AA-001/init-core-data-001
   [junit4]   2> 864473 INFO  (SUITE-CollectionsAPIDistributedZkTest-seed#[1DD2ACE0381532AA]-worker) [    ] o.a.s.SolrTestCaseJ4 Randomized ssl (false) and clientAuth (false)
   [junit4]   2> 864473 INFO  (SUITE-CollectionsAPIDistributedZkTest-seed#[1DD2ACE0381532AA]-worker) [    ] o.a.s.BaseDistributedSearchTestCase Setting hostContext system property: /
   [junit4]   2> 864475 INFO  (TEST-CollectionsAPIDistributedZkTest.test-seed#[1DD2ACE0381532AA]) [    ] o.a.s.c.ZkTestServer STARTING ZK TEST SERVER
   [junit4]   2> 864478 INFO  (Thread-2343) [    ] o.a.s.c.ZkTestServer client port:0.0.0.0/0.0.0.0:0
   [junit4]   2> 864478 INFO  (Thread-2343) [    ] o.a.s.c.ZkTestServer Starting server
   [junit4]   2> 864578 INFO  (TEST-CollectionsAPIDistributedZkTest.test-seed#[1DD2ACE0381532AA]) [    ] o.a.s.c.ZkTestServer start zk server on port:41201
   [junit4]   2> 864578 INFO  (TEST-CollectionsAPIDistributedZkTest.test-seed#[1DD2ACE0381532AA]) [    ] o.a.s.c.c.SolrZkClient Using default ZkCredentialsProvider
   [junit4]   2> 864580 INFO  (TEST-CollectionsAPIDistributedZkTest.test-seed#[1DD2ACE0381532AA]) [    ] o.a.s.c.c.ConnectionManager Waiting for client to connect to ZooKeeper
   [junit4]   2> 864584 INFO  (zkCallback-808-thread-1) [    ] o.a.s.c.c.ConnectionManager Watcher org.apache.solr.common.cloud.ConnectionManager@7af897cc name:ZooKeeperConnection Watcher:127.0.0.1:41201 got event WatchedEvent state:SyncConnected type:None path:null path:null type:None
   [junit4]   2> 864584 INFO  (TEST-CollectionsAPIDistributedZkTest.test-seed#[1DD2ACE0381532AA]) [    ] o.a.s.c.c.ConnectionManager Client is connected to ZooKeeper
   [junit4]   2> 864584 INFO  (TEST-CollectionsAPIDistributedZkTest.test-seed#[1DD2ACE0381532AA]) [    ] o.a.s.c.c.SolrZkClient Using default ZkACLProvider
   [junit4]   2> 864584 INFO  (TEST-CollectionsAPIDistributedZkTest.test-seed#[1DD2ACE0381532AA]) [    ] o.a.s.c.c.SolrZkClient makePath: /solr
   [junit4]   2> 864590 INFO  (TEST-CollectionsAPIDistributedZkTest.test-seed#[1DD2ACE0381532AA]) [    ] o.a.s.c.c.SolrZkClient Using default ZkCredentialsProvider
   [junit4]   2> 864594 INFO  (TEST-CollectionsAPIDistributedZkTest.test-seed#[1DD2ACE0381532AA]) [    ] o.a.s.c.c.ConnectionManager Waiting for client to connect to ZooKeeper
   [junit4]   2> 864595 INFO  (zkCallback-809-thread-1) [    ] o.a.s.c.c.ConnectionManager Watcher org.apache.solr.common.cloud.ConnectionManager@67397cdc name:ZooKeeperConnection Watcher:127.0.0.1:41201/solr got event WatchedEvent state:SyncConnected type:None path:null path:null type:None
   [junit4]   2> 864595 INFO  (TEST-CollectionsAPIDistributedZkTest.test-seed#[1DD2ACE0381532AA]) [    ] o.a.s.c.c.ConnectionManager Client is connected to ZooKeeper
   [junit4]   2> 864595 INFO  (TEST-CollectionsAPIDistributedZkTest.test-seed#[1DD2ACE0381532AA]) [    ] o.a.s.c.c.SolrZkClient Using default ZkACLProvider
   [junit4]   2> 864595 INFO  (TEST-CollectionsAPIDistributedZkTest.test-seed#[1DD2ACE0381532AA]) [    ] o.a.s.c.c.SolrZkClient makePath: /collections/collection1
   [junit4]   2> 864597 INFO  (TEST-CollectionsAPIDistributedZkTest.test-seed#[1DD2ACE0381532AA]) [    ] o.a.s.c.c.SolrZkClient makePath: /collections/collection1/shards
   [junit4]   2> 864598 INFO  (TEST-CollectionsAPIDistributedZkTest.test-seed#[1DD2ACE0381532AA]) [    ] o.a.s.c.c.SolrZkClient makePath: /collections/control_collection
   [junit4]   2> 864599 INFO  (TEST-CollectionsAPIDistributedZkTest.test-seed#[1DD2ACE0381532AA]) [    ] o.a.s.c.c.SolrZkClient makePath: /collections/control_collection/shards
   [junit4]   2> 864600 INFO  (TEST-CollectionsAPIDistributedZkTest.test-seed#[1DD2ACE0381532AA]) [    ] o.a.s.c.AbstractZkTestCase put /x1/jenkins/jenkins-slave/workspace/Lucene-Solr-NightlyTests-trunk/solr/core/src/test-files/solr/collection1/conf/solrconfig-tlog.xml to /configs/conf1/solrconfig.xml
   [junit4]   2> 864601 INFO  (TEST-CollectionsAPIDistributedZkTest.test-seed#[1DD2ACE0381532AA]) [    ] o.a.s.c.c.SolrZkClient makePath: /configs/conf1/solrconfig.xml
   [junit4]   2> 864603 INFO  (TEST-CollectionsAPIDistributedZkTest.test-seed#[1DD2ACE0381532AA]) [    ] o.a.s.c.AbstractZkTestCase put /x1/jenkins/jenkins-slave/workspace/Lucene-Solr-NightlyTests-trunk/solr/core/src/test-files/solr/collection1/conf/schema.xml to /configs/conf1/schema.xml
   [junit4]   2> 864603 INFO  (TEST-CollectionsAPIDistributedZkTest.test-seed#[1DD2ACE0381532AA]) [    ] o.a.s.c.c.SolrZkClient makePath: /configs/conf1/schema.xml
   [junit4]   2> 864610 INFO  (TEST-CollectionsAPIDistributedZkTest.test-seed#[1DD2ACE0381532AA]) [    ] o.a.s.c.AbstractZkTestCase put /x1/jenkins/jenkins-slave/workspace/Lucene-Solr-NightlyTests-trunk/solr/core/src/test-files/solr/collection1/conf/solrconfig.snippet.randomindexconfig.xml to /configs/conf1/solrconfig.snippet.randomindexconfig.xml
   [junit4]   2> 864610 INFO  (TEST-CollectionsAPIDistributedZkTest.test-seed#[1DD2ACE0381532AA]) [    ] o.a.s.c.c.SolrZkClient makePath: /configs/conf1/solrconfig.snippet.randomindexconfig.xml
   [junit4]   2> 864611 INFO  (TEST-CollectionsAPIDistributedZkTest.test-seed#[1DD2ACE0381532AA]) [    ] o.a.s.c.AbstractZkTestCase put /x1/jenkins/jenkins-slave/workspace/Lucene-Solr-NightlyTests-trunk/solr/core/src/test-files/solr/collection1/conf/stopwords.txt to /configs/conf1/stopwords.txt
   [junit4]   2> 864612 INFO  (TEST-CollectionsAPIDistributedZkTest.test-seed#[1DD2ACE0381532AA]) [    ] o.a.s.c.c.SolrZkClient makePath: /configs/conf1/stopwords.txt
   [junit4]   2> 864613 INFO  (TEST-CollectionsAPIDistributedZkTest.test-seed#[1DD2ACE0381532AA]) [    ] o.a.s.c.AbstractZkTestCase put /x1/jenkins/jenkins-slave/workspace/Lucene-Solr-NightlyTests-trunk/solr/core/src/test-files/solr/collection1/conf/protwords.txt to /configs/conf1/protwords.txt
   [junit4]   2> 864613 INFO  (TEST-CollectionsAPIDistributedZkTest.test-seed#[1DD2ACE0381532AA]) [    ] o.a.s.c.c.SolrZkClient makePath: /configs/conf1/protwords.txt
   [junit4]   2> 864626 INFO  (TEST-CollectionsAPIDistributedZkTest.test-seed#[1DD2ACE0381532AA]) [    ] o.a.s.c.AbstractZkTestCase put /x1/jenkins/jenkins-slave/workspace/Lucene-Solr-NightlyTests-trunk/solr/core/src/test-files/solr/collection1/conf/currency.xml to /configs/conf1/currency.xml
   [junit4]   2> 864626 INFO  (TEST-CollectionsAPIDistributedZkTest.test-seed#[1DD2ACE0381532AA]) [    ] o.a.s.c.c.SolrZkClient makePath: /configs/conf1/currency.xml
   [junit4]   2> 864627 INFO  (TEST-CollectionsAPIDistributedZkTest.test-seed#[1DD2ACE0381532AA]) [    ] o.a.s.c.AbstractZkTestCase put /x1/jenkins/jenkins-slave/workspace/Lucene-Solr-NightlyTests-trunk/solr/core/src/test-files/solr/collection1/conf/enumsConfig.xml to /configs/conf1/enumsConfig.xml
   [junit4]   2> 864628 INFO  (TEST-CollectionsAPIDistributedZkTest.test-seed#[1DD2ACE0381532AA]) [    ] o.a.s.c.c.SolrZkClient makePath: /configs/conf1/enumsConfig.xml
   [junit4]   2> 864629 INFO  (TEST-CollectionsAPIDistributedZkTest.test-seed#[1DD2ACE0381532AA]) [    ] o.a.s.c.AbstractZkTestCase put /x1/jenkins/jenkins-slave/workspace/Lucene-Solr-NightlyTests-trunk/solr/core/src/test-files/solr/collection1/conf/open-exchange-rates.json to /configs/conf1/open-exchange-rates.json
   [junit4]   2> 864629 INFO  (TEST-CollectionsAPIDistributedZkTest.test-seed#[1DD2ACE0381532AA]) [    ] o.a.s.c.c.SolrZkClient makePath: /configs/conf1/open-exchange-rates.json
   [junit4]   2> 864631 INFO  (TEST-CollectionsAPIDistributedZkTest.test-seed#[1DD2ACE0381532AA]) [    ] o.a.s.c.AbstractZkTestCase put /x1/jenkins/jenkins-slave/workspace/Lucene-Solr-NightlyTests-trunk/solr/core/src/test-files/solr/collection1/conf/mapping-ISOLatin1Accent.txt to /configs/conf1/mapping-ISOLatin1Accent.txt
   [junit4]   2> 864631 INFO  (TEST-CollectionsAPIDistributedZkTest.test-seed#[1DD2ACE0381532AA]) [    ] o.a.s.c.c.SolrZkClient makePath: /configs/conf1/mapping-ISOLatin1Accent.txt
   [junit4]   2> 864632 INFO  (TEST-CollectionsAPIDistributedZkTest.test-seed#[1DD2ACE0381532AA]) [    ] o.a.s.c.AbstractZkTestCase put /x1/jenkins/jenkins-slave/workspace/Lucene-Solr-NightlyTests-trunk/solr/core/src/test-files/solr/collection1/conf/old_synonyms.txt to /configs/conf1/old_synonyms.txt
   [junit4]   2> 864632 INFO  (TEST-CollectionsAPIDistributedZkTest.test-seed#[1DD2ACE0381532AA]) [    ] o.a.s.c.c.SolrZkClient makePath: /configs/conf1/old_synonyms.txt
   [junit4]   2> 864633 INFO  (TEST-CollectionsAPIDistributedZkTest.test-seed#[1DD2ACE0381532AA]) [    ] o.a.s.c.AbstractZkTestCase put /x1/jenkins/jenkins-slave/workspace/Lucene-Solr-NightlyTests-trunk/solr/core/src/test-files/solr/collection1/conf/synonyms.txt to /configs/conf1/synonyms.txt
   [junit4]   2> 864634 INFO  (TEST-CollectionsAPIDistributedZkTest.test-seed#[1DD2ACE0381532AA]) [    ] o.a.s.c.c.SolrZkClient makePath: /configs/conf1/synonyms.txt
   [junit4]   2> 864636 INFO  (TEST-CollectionsAPIDistributedZkTest.test-seed#[1DD2ACE0381532AA]) [    ] o.a.s.c.c.SolrZkClient Using default ZkCredentialsProvider
   [junit4]   2> 864637 INFO  (TEST-CollectionsAPIDistributedZkTest.test-seed#[1DD2ACE0381532AA]) [    ] o.a.s.c.c.ConnectionManager Waiting for client to connect to ZooKeeper
   [junit4]   2> 864662 INFO  (zkCallback-810-thread-1) [    ] o.a.s.c.c.ConnectionManager Watcher org.apache.solr.common.cloud.ConnectionManager@116b9e61 name:ZooKeeperConnection Watcher:127.0.0.1:41201 got event WatchedEvent state:SyncConnected type:None path:null path:null type:None
   [junit4]   2> 864662 INFO  (TEST-CollectionsAPIDistributedZkTest.test-seed#[1DD2ACE0381532AA]) [    ] o.a.s.c.c.ConnectionManager Client is connected to ZooKeeper
   [junit4]   2> 864663 INFO  (TEST-CollectionsAPIDistributedZkTest.test-seed#[1DD2ACE0381532AA]) [    ] o.a.s.c.c.SolrZkClient Using default ZkACLProvider
   [junit4]   2> 864663 INFO  (TEST-CollectionsAPIDistributedZkTest.test-seed#[1DD2ACE0381532AA]) [    ] o.a.s.c.c.SolrZkClient makePath: /solr
   [junit4]   2> 864665 INFO  (TEST-CollectionsAPIDistributedZkTest.test-seed#[1DD2ACE0381532AA]) [    ] o.a.s.c.c.SolrZkClient Using default ZkCredentialsProvider
   [junit4]   2> 864667 INFO  (TEST-CollectionsAPIDistributedZkTest.test-seed#[1DD2ACE0381532AA]) [    ] o.a.s.c.c.ConnectionManager Waiting for client to connect to ZooKeeper
   [junit4]   2> 864680 INFO  (zkCallback-811-thread-1) [    ] o.a.s.c.c.ConnectionManager Watcher org.apache.solr.common.cloud.ConnectionManager@5a261bbe name:ZooKeeperConnection Watcher:127.0.0.1:41201/solr got event WatchedEvent state:SyncConnected type:None path:null path:null type:None
   [junit4]   2> 864680 INFO  (TEST-CollectionsAPIDistributedZkTest.test-seed#[1DD2ACE0381532AA]) [    ] o.a.s.c.c.ConnectionManager Client is connected to ZooKeeper
   [junit4]   2> 864680 INFO  (TEST-CollectionsAPIDistributedZkTest.test-seed#[1DD2ACE0381532AA]) [    ] o.a.s.c.c.SolrZkClient Using default ZkACLProvider
   [junit4]   2> 864680 INFO  (TEST-CollectionsAPIDistributedZkTest.test-seed#[1DD2ACE0381532AA]) [    ] o.a.s.c.AbstractZkTestCase put /x1/jenkins/jenkins-slave/workspace/Lucene-Solr-NightlyTests-trunk/solr/core/src/test-files/solr/collection1/conf/solrconfig-tlog.xml to /configs/conf2/solrconfig.xml
   [junit4]   2> 864681 INFO  (TEST-CollectionsAPIDistributedZkTest.test-seed#[1DD2ACE0381532AA]) [    ] o.a.s.c.c.SolrZkClient makePath: /configs/conf2/solrconfig.xml
   [junit4]   2> 864683 INFO  (TEST-CollectionsAPIDistributedZkTest.test-seed#[1DD2ACE0381532AA]) [    ] o.a.s.c.AbstractZkTestCase put /x1/jenkins/jenkins-slave/workspace/Lucene-Solr-NightlyTests-trunk/solr/core/src/test-files/solr/collection1/conf/schema.xml to /configs/conf2/schema.xml
   [junit4]   2> 864683 INFO  (TEST-CollectionsAPIDistributedZkTest.test-seed#[1DD2ACE0381532AA]) [    ] o.a.s.c.c.SolrZkClient makePath: /configs/conf2/schema.xml
   [junit4]   2> 864685 INFO  (TEST-CollectionsAPIDistributedZkTest.test-seed#[1DD2ACE0381532AA]) [    ] o.a.s.c.AbstractZkTestCase put /x1/jenkins/jenkins-slave/workspace/Lucene-Solr-NightlyTests-trunk/solr/core/src/test-files/solr/collection1/conf/enumsConfig.xml to /configs/conf2/enumsConfig.xml
   [junit4]   2> 864685 INFO  (TEST-CollectionsAPIDistributedZkTest.test-seed#[1DD2ACE0381532AA]) [    ] o.a.s.c.c.SolrZkClient makePath: /configs/conf2/enumsConfig.xml
   [junit4]   2> 864687 INFO  (TEST-CollectionsAPIDistributedZkTest.test-seed#[1DD2ACE0381532AA]) [    ] o.a.s.c.AbstractZkTestCase put /x1/jenkins/jenkins-slave/workspace/Lucene-Solr-NightlyTests-trunk/solr/core/src/test-files/solr/collection1/conf/solrconfig.snippet.randomindexconfig.xml to /configs/conf2/solrconfig.snippet.randomindexconfig.xml
   [junit4]   2> 864687 INFO  (TEST-CollectionsAPIDistributedZkTest.test-seed#[1DD2ACE0381532AA]) [    ] o.a.s.c.c.SolrZkClient makePath: /configs/conf2/solrconfig.snippet.randomindexconfig.xml
   [junit4]   2> 864688 INFO  (TEST-CollectionsAPIDistributedZkTest.test-seed#[1DD2ACE0381532AA]) [    ] o.a.s.c.AbstractZkTestCase put /x1/jenkins/jenkins-slave/workspace/Lucene-Solr-NightlyTests-trunk/solr/core/src/test-files/solr/collection1/conf/stopwords.txt to /configs/conf2/stopwords.txt
   [junit4]   2> 864689 INFO  (TEST-CollectionsAPIDistributedZkTest.test-seed#[1DD2ACE0381532AA]) [    ] o.a.s.c.c.SolrZkClient makePath: /configs/conf2/stopwords.txt
   [junit4]   2> 864690 INFO  (TEST-CollectionsAPIDistributedZkTest.test-seed#[1DD2ACE0381532AA]) [    ] o.a.s.c.AbstractZkTestCase put /x1/jenkins/jenkins-slave/workspace/Lucene-Solr-NightlyTests-trunk/solr/core/src/test-files/solr/collection1/conf/protwords.txt to /configs/conf2/protwords.txt
   [junit4]   2> 864690 INFO  (TEST-CollectionsAPIDistributedZkTest.test-seed#[1DD2ACE0381532AA]) [    ] o.a.s.c.c.SolrZkClient makePath: /configs/conf2/protwords.txt
   [junit4]   2> 864692 INFO  (TEST-CollectionsAPIDistributedZkTest.test-seed#[1DD2ACE0381532AA]) [    ] o.a.s.c.AbstractZkTestCase put /x1/jenkins/jenkins-slave/workspace/Lucene-Solr-NightlyTests-trunk/solr/core/src/test-files/solr/collection1/conf/currency.xml to /configs/conf2/currency.xml
   [junit4]   2> 864692 INFO  (TEST-CollectionsAPIDistributedZkTest.test-seed#[1DD2ACE0381532AA]) [    ] o.a.s.c.c.SolrZkClient makePath: /configs/conf2/currency.xml
   [junit4]   2> 864693 INFO  (TEST-CollectionsAPIDistributedZkTest.test-seed#[1DD2ACE0381532AA]) [    ] o.a.s.c.AbstractZkTestCase put /x1/jenkins/jenkins-slave/workspace/Lucene-Solr-NightlyTests-trunk/solr/core/src/test-files/solr/collection1/conf/open-exchange-rates.json to /configs/conf2/open-exchange-rates.json
   [junit4]   2> 864693 INFO  (TEST-CollectionsAPIDistributedZkTest.test-seed#[1DD2ACE0381532AA]) [    ] o.a.s.c.c.SolrZkClient makePath: /configs/conf2/open-exchange-rates.json
   [junit4]   2> 864695 INFO  (TEST-CollectionsAPIDistributedZkTest.test-seed#[1DD2ACE0381532AA]) [    ] o.a.s.c.AbstractZkTestCase put /x1/jenkins/jenkins-slave/workspace/Lucene-Solr-NightlyTests-trunk/solr/core/src/test-files/solr/collection1/conf/mapping-ISOLatin1Accent.txt to /configs/conf2/mapping-ISOLatin1Accent.txt
   [junit4]   2> 864695 INFO  (TEST-CollectionsAPIDistributedZkTest.test-seed#[1DD2ACE0381532AA]) [    ] o.a.s.c.c.SolrZkClient makePath: /configs/conf2/mapping-ISOLatin1Accent.txt
   [junit4]   2> 864697 INFO  (TEST-CollectionsAPIDistributedZkTest.test-seed#[1DD2ACE0381532AA]) [    ] o.a.s.c.AbstractZkTestCase put /x1/jenkins/jenkins-slave/workspace/Lucene-Solr-NightlyTests-trunk/solr/core/src/test-files/solr/collection1/conf/old_synonyms.txt to /configs/conf2/old_synonyms.txt
   [junit4]   2> 864697 INFO  (TEST-CollectionsAPIDistributedZkTest.test-seed#[1DD2ACE0381532AA]) [    ] o.a.s.c.c.SolrZkClient makePath: /configs/conf2/old_synonyms.txt
   [junit4]   2> 864698 INFO  (TEST-CollectionsAPIDistributedZkTest.test-seed#[1DD2ACE0381532AA]) [    ] o.a.s.c.AbstractZkTestCase put /x1/jenkins/jenkins-slave/workspace/Lucene-Solr-NightlyTests-trunk/solr/core/src/test-files/solr/collection1/conf/synonyms.txt to /configs/conf2/synonyms.txt
   [junit4]   2> 864698 INFO  (TEST-CollectionsAPIDistributedZkTest.test-seed#[1DD2ACE0381532AA]) [    ] o.a.s.c.c.SolrZkClient makePath: /configs/conf2/synonyms.txt
   [junit4]   2> 864700 INFO  (TEST-CollectionsAPIDistributedZkTest.test-seed#[1DD2ACE0381532AA]) [    ] o.a.s.c.AbstractZkTestCase put /x1/jenkins/jenkins-slave/workspace/Lucene-Solr-NightlyTests-trunk/solr/core/src/test-files/solr/collection1/conf/elevate.xml to /configs/conf2/elevate.xml
   [junit4]   2> 864700 INFO  (TEST-CollectionsAPIDistributedZkTest.test-seed#[1DD2ACE0381532AA]) [    ] o.a.s.c.c.SolrZkClient makePath: /configs/conf2/elevate.xml
   [junit4]   2> 865040 INFO  (TEST-CollectionsAPIDistributedZkTest.test-seed#[1DD2ACE0381532AA]) [    ] o.a.s.SolrTestCaseJ4 Writing core.properties file to /x1/jenkins/jenkins-slave/workspace/Lucene-Solr-NightlyTests-trunk/solr/build/solr-core/test/J1/temp/solr.cloud.CollectionsAPIDistributedZkTest_1DD2ACE0381532AA-001/control-001/cores/collection1
   [junit4]   2> 865042 INFO  (TEST-CollectionsAPIDistributedZkTest.test-seed#[1DD2ACE0381532AA]) [    ] o.e.j.s.Server jetty-9.2.13.v20150730
   [junit4]   2> 865044 INFO  (TEST-CollectionsAPIDistributedZkTest.test-seed#[1DD2ACE0381532AA]) [    ] o.e.j.s.h.ContextHandler Started o.e.j.s.ServletContextHandler@37e3f681{/,null,AVAILABLE}
   [junit4]   2> 865044 INFO  (TEST-CollectionsAPIDistributedZkTest.test-seed#[1DD2ACE0381532AA]) [    ] o.e.j.s.ServerConnector Started ServerConnector@71e67775{HTTP/1.1}{127.0.0.1:56475}
   [junit4]   2> 865044 INFO  (TEST-CollectionsAPIDistributedZkTest.test-seed#[1DD2ACE0381532AA]) [    ] o.e.j.s.Server Started @868422ms
   [junit4]   2> 865044 INFO  (TEST-CollectionsAPIDistributedZkTest.test-seed#[1DD2ACE0381532AA]) [    ] o.a.s.c.s.e.JettySolrRunner Jetty properties: {solr.data.dir=/x1/jenkins/jenkins-slave/workspace/Lucene-Solr-NightlyTests-trunk/solr/build/solr-core/test/J1/temp/solr.cloud.CollectionsAPIDistributedZkTest_1DD2ACE0381532AA-001/tempDir-001/control/data, hostContext=/, hostPort=56475, coreRootDirectory=/x1/jenkins/jenkins-slave/workspace/Lucene-Solr-NightlyTests-trunk/solr/build/solr-core/test/J1/../../../../../../../../../../x1/jenkins/jenkins-slave/workspace/Lucene-Solr-NightlyTests-trunk/solr/build/solr-core/test/J1/temp/solr.cloud.CollectionsAPIDistributedZkTest_1DD2ACE0381532AA-001/control-001/cores}
   [junit4]   2> 865045 INFO  (TEST-CollectionsAPIDistributedZkTest.test-seed#[1DD2ACE0381532AA]) [    ] o.a.s.s.SolrDispatchFilter SolrDispatchFilter.init(): sun.misc.Launcher$AppClassLoader@4e0e2f2a
   [junit4]   2> 865045 INFO  (TEST-CollectionsAPIDistributedZkTest.test-seed#[1DD2ACE0381532AA]) [    ] o.a.s.c.SolrResourceLoader new SolrResourceLoader for directory: '/x1/jenkins/jenkins-slave/workspace/Lucene-Solr-NightlyTests-trunk/solr/build/solr-core/test/J1/../../../../../../../../../../x1/jenkins/jenkins-slave/workspace/Lucene-Solr-NightlyTests-trunk/solr/build/solr-core/test/J1/temp/solr.cloud.CollectionsAPIDistributedZkTest_1DD2ACE0381532AA-001/control-001/'
   [junit4]   2> 865045 INFO  (TEST-CollectionsAPIDistributedZkTest.test-seed#[1DD2ACE0381532AA]) [    ] o.a.s.c.SolrResourceLoader JNDI not configured for solr (NoInitialContextEx)
   [junit4]   2> 865045 INFO  (TEST-CollectionsAPIDistributedZkTest.test-seed#[1DD2ACE0381532AA]) [    ] o.a.s.c.SolrResourceLoader solr home defaulted to 'solr/' (could not find system property or JNDI)
   [junit4]   2> 865070 INFO  (TEST-CollectionsAPIDistributedZkTest.test-seed#[1DD2ACE0381532AA]) [    ] o.a.s.c.c.SolrZkClient Using default ZkCredentialsProvider
   [junit4]   2> 865071 INFO  (TEST-CollectionsAPIDistributedZkTest.test-seed#[1DD2ACE0381532AA]) [    ] o.a.s.c.c.ConnectionManager Waiting for client to connect to ZooKeeper
   [junit4]   2> 865090 INFO  (zkCallback-812-thread-1) [    ] o.a.s.c.c.ConnectionManager Watcher org.apache.solr.common.cloud.ConnectionManager@69008aa5 name:ZooKeeperConnection Watcher:127.0.0.1:41201/solr got event WatchedEvent state:SyncConnected type:None path:null path:null type:None
   [junit4]   2> 865090 INFO  (TEST-CollectionsAPIDistributedZkTest.test-seed#[1DD2ACE0381532AA]) [    ] o.a.s.c.c.ConnectionManager Client is connected to ZooKeeper
   [junit4]   2> 865090 INFO  (TEST-CollectionsAPIDistributedZkTest.test-seed#[1DD2ACE0381532AA]) [    ] o.a.s.c.c.SolrZkClient Using default ZkACLProvider
   [junit4]   2> 865092 INFO  (TEST-CollectionsAPIDistributedZkTest.test-seed#[1DD2ACE0381532AA]) [    ] o.a.s.s.SolrDispatchFilter Loading solr.xml from SolrHome (not found in ZooKeeper)
   [junit4]   2> 865092 INFO  (TEST-CollectionsAPIDistributedZkTest.test-seed#[1DD2ACE0381532AA]) [    ] o.a.s.c.SolrXmlConfig Loading container configuration from /x1/jenkins/jenkins-slave/workspace/Lucene-Solr-NightlyTests-trunk/solr/build/solr-core/test/J1/../../../../../../../../../../x1/jenkins/jenkins-slave/workspace/Lucene-Solr-NightlyTests-trunk/solr/build/solr-core/test/J1/temp/solr.cloud.CollectionsAPIDistributedZkTest_1DD2ACE0381532AA-001/control-001/solr.xml
   [junit4]   2> 865098 INFO  (TEST-CollectionsAPIDistributedZkTest.test-seed#[1DD2ACE0381532AA]) [    ] o.a.s.c.CoresLocator Config-defined core root directory: /x1/jenkins/jenkins-slave/workspace/Lucene-Solr-NightlyTests-trunk/solr/build/solr-core/test/J1/../../../../../../../../../../x1/jenkins/jenkins-slave/workspace/Lucene-Solr-NightlyTests-trunk/solr/build/solr-core/test/J1/temp/solr.cloud.CollectionsAPIDistributedZkTest_1DD2ACE0381532AA-001/control-001/cores
   [junit4]   2> 865098 INFO  (TEST-CollectionsAPIDistributedZkTest.test-seed#[1DD2ACE0381532AA]) [    ] o.a.s.c.CoreContainer New CoreContainer 314641124
   [junit4]   2> 865098 INFO  (TEST-CollectionsAPIDistributedZkTest.test-seed#[1DD2ACE0381532AA]) [    ] o.a.s.c.CoreContainer Loading cores into CoreContainer [instanceDir=/x1/jenkins/jenkins-slave/workspace/Lucene-Solr-NightlyTests-trunk/solr/build/solr-core/test/J1/../../../../../../../../../../x1/jenkins/jenkins-slave/workspace/Lucene-Solr-NightlyTests-trunk/solr/build/solr-core/test/J1/temp/solr.cloud.CollectionsAPIDistributedZkTest_1DD2ACE0381532AA-001/control-001/]
   [junit4]   2> 865098 INFO  (TEST-CollectionsAPIDistributedZkTest.test-seed#[1DD2ACE0381532AA]) [    ] o.a.s.c.CoreContainer loading shared library: /x1/jenkins/jenkins-slave/workspace/Lucene-Solr-NightlyTests-trunk/solr/build/solr-core/test/J1/../../../../../../../../../../x1/jenkins/jenkins-slave/workspace/Lucene-Solr-NightlyTests-trunk/solr/build/solr-core/test/J1/temp/solr.cloud.CollectionsAPIDistributedZkTest_1DD2ACE0381532AA-001/control-001/lib
   [junit4]   2> 865099 WARN  (TEST-CollectionsAPIDistributedZkTest.test-seed#[1DD2ACE0381532AA]) [    ] o.a.s.c.SolrResourceLoader Can't find (or read) directory to add to classloader: lib (resolved as: /x1/jenkins/jenkins-slave/workspace/Lucene-Solr-NightlyTests-trunk/solr/build/solr-core/test/J1/../../../../../../../../../../x1/jenkins/jenkins-slave/workspace/Lucene-Solr-NightlyTests-trunk/solr/build/solr-core/test/J1/temp/solr.cloud.CollectionsAPIDistributedZkTest_1DD2ACE0381532AA-001/control-001/lib).
   [junit4]   2> 865115 INFO  (TEST-CollectionsAPIDistributedZkTest.test-seed#[1DD2ACE0381532AA]) [    ] o.a.s.h.c.HttpShardHandlerFactory created with socketTimeout : 90000,urlScheme : ,connTimeout : 15000,maxConnectionsPerHost : 20,maxConnections : 10000,corePoolSize : 0,maximumPoolSize : 2147483647,maxThreadIdleTime : 5,sizeOfQueue : -1,fairnessPolicy : false,useRetries : false,
   [junit4]   2> 865116 INFO  (TEST-CollectionsAPIDistributedZkTest.test-seed#[1DD2ACE0381532AA]) [    ] o.a.s.u.UpdateShardHandler Creating UpdateShardHandler HTTP client with params: socketTimeout=340000&connTimeout=45000&retry=true
   [junit4]   2> 865117 INFO  (TEST-CollectionsAPIDistributedZkTest.test-seed#[1DD2ACE0381532AA]) [    ] o.a.s.l.LogWatcher SLF4J impl is org.slf4j.impl.Log4jLoggerFactory
   [junit4]   2> 865117 INFO  (TEST-CollectionsAPIDistributedZkTest.test-seed#[1DD2ACE0381532AA]) [    ] o.a.s.l.LogWatcher Registering Log Listener [Log4j (org.slf4j.impl.Log4jLoggerFactory)]
   [junit4]   2> 865117 INFO  (TEST-CollectionsAPIDistributedZkTest.test-seed#[1DD2ACE0381532AA]) [    ] o.a.s.c.ZkContainer Zookeeper client=127.0.0.1:41201/solr
   [junit4]   2> 865117 INFO  (TEST-CollectionsAPIDistributedZkTest.test-seed#[1DD2ACE0381532AA]) [    ] o.a.s.c.ZkController zkHost includes chroot
   [junit4]   2> 865117 INFO  (TEST-CollectionsAPIDistributedZkTest.test-seed#[1DD2ACE0381532AA]) [    ] o.a.s.c.c.SolrZkClient Using default ZkCredentialsProvider
   [junit4]   2> 865119 INFO  (TEST-CollectionsAPIDistributedZkTest.test-seed#[1DD2ACE0381532AA]) [    ] o.a.s.c.c.ConnectionManager Waiting for client to connect to ZooKeeper
   [junit4]   2> 865119 INFO  (zkCallback-814-thread-1) [    ] o.a.s.c.c.ConnectionManager Watcher org.apache.solr.common.cloud.ConnectionManager@19c02ef4 name:ZooKeeperConnection Watcher:127.0.0.1:41201 got event WatchedEvent state:SyncConnected type:None path:null path:null type:None
   [junit4]   2> 865120 INFO  (TEST-CollectionsAPIDistributedZkTest.test-seed#[1DD2ACE0381532AA]) [    ] o.a.s.c.c.ConnectionManager Client is connected to ZooKeeper
   [junit4]   2> 865121 INFO  (TEST-CollectionsAPIDistributedZkTest.test-seed#[1DD2ACE0381532AA]) [    ] o.a.s.c.c.SolrZkClient Using default ZkACLProvider
   [junit4]   2> 865126 INFO  (TEST-CollectionsAPIDistributedZkTest.test-seed#[1DD2ACE0381532AA]) [n:127.0.0.1:56475_    ] o.a.s.c.c.ConnectionManager Waiting for client to connect to ZooKeeper
   [junit4]   2> 865127 INFO  (zkCallback-815-thread-1-processing-n:127.0.0.1:56475_) [n:127.0.0.1:56475_    ] o.a.s.c.c.ConnectionManager Watcher org.apache.solr.common.cloud.ConnectionManager@491bed59 name:ZooKeeperConnection Watcher:127.0.0.1:41201/solr got event WatchedEvent state:SyncConnected type:None path:null path:null type:None
   [junit4]   2> 865127 INFO  (TEST-CollectionsAPIDistributedZkTest.test-seed#[1DD2ACE0381532AA]) [n:127.0.0.1:56475_    ] o.a.s.c.c.ConnectionManager Client is connected to ZooKeeper
   [junit4]   2> 865128 INFO  (TEST-CollectionsAPIDistributedZkTest.test-seed#[1DD2ACE0381532AA]) [n:127.0.0.1:56475_    ] o.a.s.c.c.SolrZkClient makePath: /overseer/queue
   [junit4]   2> 865130 INFO  (TEST-CollectionsAPIDistributedZkTest.test-seed#[1DD2ACE0381532AA]) [n:127.0.0.1:56475_    ] o.a.s.c.c.SolrZkClient makePath: /overseer/collection-queue-work
   [junit4]   2> 865133 INFO  (TEST-CollectionsAPIDistributedZkTest.test-seed#[1DD2ACE0381532AA]) [n:127.0.0.1:56475_    ] o.a.s.c.c.SolrZkClient makePath: /overseer/collection-map-running
   [junit4]   2> 865135 INFO  (TEST-CollectionsAPIDistributedZkTest.test-seed#[1DD2ACE0381532AA]) [n:127.0.0.1:56475_    ] o.a.s.c.c.SolrZkClient makePath: /overseer/collection-map-completed
   [junit4]   2> 865137 INFO  (TEST-CollectionsAPIDistributedZkTest.test-seed#[1DD2ACE0381532AA]) [n:127.0.0.1:56475_    ] o.a.s.c.c.SolrZkClient makePath: /overseer/collection-map-failure
   [junit4]   2> 865139 INFO  (TEST-CollectionsAPIDistributedZkTest.test-seed#[1DD2ACE0381532AA]) [n:127.0.0.1:56475_    ] o.a.s.c.c.SolrZkClient makePath: /live_nodes
   [junit4]   2> 865141 INFO  (TEST-CollectionsAPIDistributedZkTest.test-seed#[1DD2ACE0381532AA]) [n:127.0.0.1:56475_    ] o.a.s.c.c.SolrZkClient makePath: /aliases.json
   [junit4]   2> 865142 INFO  (TEST-CollectionsAPIDistributedZkTest.test-seed#[1DD2ACE0381532AA]) [n:127.0.0.1:56475_    ] o.a.s.c.c.SolrZkClient makePath: /clusterstate.json
   [junit4]   2> 865143 INFO  (TEST-CollectionsAPIDistributedZkTest.test-seed#[1DD2ACE0381532AA]) [n:127.0.0.1:56475_    ] o.a.s.c.c.SolrZkClient makePath: /security.json
   [junit4]   2> 865144 INFO  (TEST-CollectionsAPIDistributedZkTest.test-seed#[1DD2ACE0381532AA]) [n:127.0.0.1:56475_    ] o.a.s.c.ZkController Register node as live in ZooKeeper:/live_nodes/127.0.0.1:56475_
   [junit4]   2> 865144 INFO  (TEST-CollectionsAPIDistributedZkTest.test-seed#[1DD2ACE0381532AA]) [n:127.0.0.1:56475_    ] o.a.s.c.c.SolrZkClient makePath: /live_nodes/127.0.0.1:56475_
   [junit4]   2> 865146 INFO  (TEST-CollectionsAPIDistributedZkTest.test-seed#[1DD2ACE0381532AA]) [n:127.0.0.1:56475_    ] o.a.s.c.c.SolrZkClient makePath: /overseer_elect
   [junit4]   2> 865147 INFO  (TEST-CollectionsAPIDistributedZkTest.test-seed#[1DD2ACE0381532AA]) [n:127.0.0.1:56475_    ] o.a.s.c.c.SolrZkClient makePath: /overseer_elect/election
   [junit4]   2> 865148 INFO  (TEST-CollectionsAPIDistributedZkTest.test-seed#[1DD2ACE0381532AA]) [n:127.0.0.1:56475_    ] o.a.s.c.Overseer Overseer (id=null) closing
   [junit4]   2> 865148 INFO  (TEST-CollectionsAPIDistributedZkTest.test-seed#[1DD2ACE0381532AA]) [n:127.0.0.1:56475_    ] o.a.s.c.LeaderElector Joined leadership election with path: /overseer_elect/election/94740302080770054-127.0.0.1:56475_-n_0000000000
   [junit4]   2> 865149 INFO  (TEST-CollectionsAPIDistributedZkTest.test-seed#[1DD2ACE0381532AA]) [n:127.0.0.1:56475_    ] o.a.s.c.OverseerElectionContext I am going to be the leader 127.0.0.1:56475_
   [junit4]   2> 865149 INFO  (TEST-CollectionsAPIDistributedZkTest.test-seed#[1DD2ACE0381532AA]) [n:127.0.0.1:56475_    ] o.a.s.c.c.SolrZkClient makePath: /overseer_elect/leader
   [junit4]   2> 865151 INFO  (TEST-CollectionsAPIDistributedZkTest.test-seed#[1DD2ACE0381532AA]) [n:127.0.0.1:56475_    ] o.a.s.c.Overseer Overseer (id=94740302080770054-127.0.0.1:56475_-n_0000000000) starting
   [junit4]   2> 865152 INFO  (TEST-CollectionsAPIDistributedZkTest.test-seed#[1DD2ACE0381532AA]) [n:127.0.0.1:56475_    ] o.a.s.c.c.SolrZkClient makePath: /overseer/queue-work
   [junit4]   2> 865158 INFO  (TEST-CollectionsAPIDistributedZkTest.test-seed#[1DD2ACE0381532AA]) [n:127.0.0.1:56475_    ] o.a.s.c.OverseerAutoReplicaFailoverThread Starting OverseerAutoReplicaFailoverThread autoReplicaFailoverWorkLoopDelay=10000 autoReplicaFailoverWaitAfterExpiration=10000 autoReplicaFailoverBadNodeExpiration=60000
   [junit4]   2> 865166 INFO  (OverseerCollectionConfigSetProcessor-94740302080770054-127.0.0.1:56475_-n_0000000000) [n:127.0.0.1:56475_    ] o.a.s.c.OverseerTaskProcessor Process current queue of overseer operations
   [junit4]   2> 865166 INFO  (OverseerStateUpdate-94740302080770054-127.0.0.1:56475_-n_0000000000) [n:127.0.0.1:56475_    ] o.a.s.c.Overseer Starting to work on the main queue
   [junit4]   2> 865166 INFO  (TEST-CollectionsAPIDistributedZkTest.test-seed#[1DD2ACE0381532AA]) [n:127.0.0.1:56475_    ] o.a.s.c.c.ZkStateReader Updating cluster state from ZooKeeper... 
   [junit4]   2> 865184 INFO  (TEST-CollectionsAPIDistributedZkTest.test-seed#[1DD2ACE0381532AA]) [n:127.0.0.1:56475_    ] o.a.s.c.CoreContainer Security conf doesn't exist. Skipping setup for authorization module.
   [junit4]   2> 865185 INFO  (TEST-CollectionsAPIDistributedZkTest.test-seed#[1DD2ACE0381532AA]) [n:127.0.0.1:56475_    ] o.a.s.c.CoreContainer No authentication plugin used.
   [junit4]   2> 865185 INFO  (TEST-CollectionsAPIDistributedZkTest.test-seed#[1DD2ACE0381532AA]) [n:127.0.0.1:56475_    ] o.a.s.c.CoresLocator Looking for core definitions underneath /x1/jenkins/jenkins-slave/workspace/Lucene-Solr-NightlyTests-trunk/solr/build/solr-core/test/J1/../../../../../../../../../../x1/jenkins/jenkins-slave/workspace/Lucene-Solr-NightlyTests-trunk/solr/build/solr-core/test/J1/temp/solr.cloud.CollectionsAPIDistributedZkTest_1DD2ACE0381532AA-001/control-001/cores
   [junit4]   2> 865186 INFO  (TEST-CollectionsAPIDistributedZkTest.test-seed#[1DD2ACE0381532AA]) [n:127.0.0.1:56475_    ] o.a.s.c.SolrCore Created CoreDescriptor: {name=collection1, config=solrconfig.xml, transient=false, schema=schema.xml, loadOnStartup=true, configSetProperties=configsetprops.json, instanceDir=/x1/jenkins/jenkins-slave/workspace/Lucene-Solr-NightlyTests-trunk/solr/build/solr-core/test/J1/../../../../../../../../../../x1/jenkins/jenkins-slave/workspace/Lucene-Solr-NightlyTests-trunk/solr/build/solr-core/test/J1/temp/solr.cloud.CollectionsAPIDistributedZkTest_1DD2ACE0381532AA-001/control-001/cores/collection1, collection=control_collection, absoluteInstDir=/x1/jenkins/jenkins-slave/workspace/Lucene-Solr-NightlyTests-trunk/solr/build/solr-core/test/J1/../../../../../../../../../../x1/jenkins/jenkins-slave/workspace/Lucene-Solr-NightlyTests-trunk/solr/build/solr-core/test/J1/temp/solr.cloud.CollectionsAPIDistributedZkTest_1DD2ACE0381532AA-001/control-001/cores/collection1/, coreNodeName=, dataDir=data/, shard=}
   [junit4]   2> 865186 INFO  (TEST-CollectionsAPIDistributedZkTest.test-seed#[1DD2ACE0381532AA]) [n:127.0.0.1:56475_    ] o.a.s.c.CoresLocator Found core collection1 in /x1/jenkins/jenkins-slave/workspace/Lucene-Solr-NightlyTests-trunk/solr/build/solr-core/test/J1/../../../../../../../../../../x1/jenkins/jenkins-slave/workspace/Lucene-Solr-NightlyTests-trunk/solr/build/solr-core/test/J1/temp/solr.cloud.CollectionsAPIDistributedZkTest_1DD2ACE0381532AA-001/control-001/cores/collection1/
   [junit4]   2> 865187 INFO  (TEST-CollectionsAPIDistributedZkTest.test-seed#[1DD2ACE0381532AA]) [n:127.0.0.1:56475_    ] o.a.s.c.CoresLocator Found 1 core definitions
   [junit4]   2> 865197 INFO  (coreLoadExecutor-1630-thread-1-processing-n:127.0.0.1:56475_) [n:127.0.0.1:56475_ c:control_collection   x:collection1] o.a.s.c.ZkController publishing state=down
   [junit4]   2> 865197 INFO  (coreLoadExecutor-1630-thread-1-processing-n:127.0.0.1:56475_) [n:127.0.0.1:56475_ c:control_collection   x:collection1] o.a.s.c.ZkController numShards not found on descriptor - reading it from system property
   [junit4]   2> 865197 INFO  (TEST-CollectionsAPIDistributedZkTest.test-seed#[1DD2ACE0381532AA]) [n:127.0.0.1:56475_    ] o.a.s.s.SolrDispatchFilter user.dir=/x1/jenkins/jenkins-slave/workspace/Lucene-Solr-NightlyTests-trunk/solr/build/solr-core/test/J1
   [junit4]   2> 865197 INFO  (TEST-CollectionsAPIDistributedZkTest.test-seed#[1DD2ACE0381532AA]) [n:127.0.0.1:56475_    ] o.a.s.s.SolrDispatchFilter SolrDispatchFilter.init() done
   [junit4]   2> 865208 INFO  (OverseerStateUpdate-94740302080770054-127.0.0.1:56475_-n_0000000000) [n:127.0.0.1:56475_    ] o.a.s.c.Overseer processMessage: queueSize: 1, message = {
   [junit4]   2>   "core":"collection1",
   [junit4]   2>   "roles":null,
   [junit4]   2>   "base_url":"http://127.0.0.1:56475",
   [junit4]   2>   "node_name":"127.0.0.1:56475_",
   [junit4]   2>   "numShards":"1",
   [junit4]   2>   "state":"down",
   [junit4]   2>   "shard":null,
   [junit4]   2>   "collection":"control_collection",
   [junit4]   2>   "operation":"state"} current state version: 0
   [junit4]   2> 865208 INFO  (coreLoadExecutor-1630-thread-1-processing-n:127.0.0.1:56475_) [n:127.0.0.1:56475_ c:control_collection   x:collection1] o.a.s.c.ZkController look for our core node name
   [junit4]   2> 865209 INFO  (OverseerStateUpdate-94740302080770054-127.0.0.1:56475_-n_0000000000) [n:127.0.0.1:56475_    ] o.a.s.c.o.ReplicaMutator Update state numShards=1 message={
   [junit4]   2>   "core":"collection1",
   [junit4]   2>   "roles":null,
   [junit4]   2>   "base_url":"http://127.0.0.1:56475",
   [junit4]   2>   "node_name":"127.0.0.1:56475_",
   [junit4]   2>   "numShards":"1",
   [junit4]   2>   "state":"down",
   [junit4]   2>   "shard":null,
   [junit4]   2>   "collection":"control_collection",
   [junit4]   2>   "operation":"state"}
   [junit4]   2> 865209 INFO  (OverseerStateUpdate-94740302080770054-127.0.0.1:56475_-n_0000000000) [n:127.0.0.1:56475_    ] o.a.s.c.o.ClusterStateMutator building a new cName: control_collection
   [junit4]   2> 865210 INFO  (OverseerStateUpdate-94740302080770054-127.0.0.1:56475_-n_0000000000) [n:127.0.0.1:56475_    ] o.a.s.c.o.ReplicaMutator Assigning new node to shard shard=shard1
   [junit4]   2> 865211 INFO  (zkCallback-815-thread-1-processing-n:127.0.0.1:56475_) [n:127.0.0.1:56475_    ] o.a.s.c.c.ZkStateReader A cluster state change: WatchedEvent state:SyncConnected type:NodeDataChanged path:/clusterstate.json, has occurred - updating... (live nodes size: 1)
   [junit4]   2> 866209 INFO  (coreLoadExecutor-1630-thread-1-processing-n:127.0.0.1:56475_) [n:127.0.0.1:56475_ c:control_collection   x:collection1] o.a.s.c.ZkController waiting to find shard id in clusterstate for collection1
   [junit4]   2> 866209 INFO  (coreLoadExecutor-1630-thread-1-processing-n:127.0.0.1:56475_) [n:127.0.0.1:56475_ c:control_collection   x:collection1] o.a.s.c.ZkController Check for collection zkNode:control_collection
   [junit4]   2> 866210 INFO  (coreLoadExecutor-1630-thread-1-processing-n:127.0.0.1:56475_) [n:127.0.0.1:56475_ c:control_collection   x:collection1] o.a.s.c.ZkController Collection zkNode exists
   [junit4]   2> 866210 INFO  (coreLoadExecutor-1630-thread-1-processing-n:127.0.0.1:56475_) [n:127.0.0.1:56475_ c:control_collection   x:collection1] o.a.s.c.c.ZkStateReader Load collection config from:/collections/control_collection
   [junit4]   2> 866211 INFO  (coreLoadExecutor-1630-thread-1-processing-n:127.0.0.1:56475_) [n:127.0.0.1:56475_ c:control_collection   x:collection1] o.a.s.c.c.ZkStateReader path=/collections/control_collection configName=conf1 specified config exists in ZooKeeper
   [junit4]   2> 866211 INFO  (coreLoadExecutor-1630-thread-1-processing-n:127.0.0.1:56475_) [n:127.0.0.1:56475_ c:control_collection   x:collection1] o.a.s.c.SolrResourceLoader new SolrResourceLoader for directory: '/x1/jenkins/jenkins-slave/workspace/Lucene-Solr-NightlyTests-trunk/solr/build/solr-core/test/J1/../../../../../../../../../../x1/jenkins/jenkins-slave/workspace/Lucene-Solr-NightlyTests-trunk/solr/build/solr-core/test/J1/temp/solr.cloud.CollectionsAPIDistributedZkTest_1DD2ACE0381532AA-001/control-001/cores/collection1/'
   [junit4]   2> 866211 INFO  (coreLoadExecutor-1630-thread-1-processing-n:127.0.0.1:56475_) [n:127.0.0.1:56475_ c:control_collection   x:collection1] o.a.s.c.SolrResourceLoader JNDI not configured for solr (NoInitialContextEx)
   [junit4]   2> 866211 INFO  (coreLoadExecutor-1630-thread-1-processing-n:127.0.0.1:56475_) [n:127.0.0.1:56475_ c:control_collection   x:collection1] o.a.s.c.SolrResourceLoader solr home defaulted to 'solr/' (could not find system property or JNDI)
   [junit4]   2> 866226 INFO  (coreLoadExecutor-1630-thread-1-processing-n:127.0.0.1:56475_) [n:127.0.0.1:56475_ c:control_collection   x:collection1] o.a.s.c.Config loaded config solrconfig.xml with version 0 
   [junit4]   2> 866231 INFO  (coreLoadExecutor-1630-thread-1-processing-n:127.0.0.1:56475_) [n:127.0.0.1:56475_ c:control_collection   x:collection1] o.a.s.c.SolrConfig current version of requestparams : -1
   [junit4]   2> 866235 INFO  (coreLoadExecutor-1630-thread-1-processing-n:127.0.0.1:56475_) [n:127.0.0.1:56475_ c:control_collection   x:collection1] o.a.s.c.SolrConfig Using Lucene MatchVersion: 6.0.0
   [junit4]   2> 866243 INFO  (coreLoadExecutor-1630-thread-1-processing-n:127.0.0.1:56475_) [n:127.0.0.1:56475_ c:control_collection   x:collection1] o.a.s.c.Config Loaded SolrConfig: solrconfig.xml
   [junit4]   2> 866245 INFO  (coreLoadExecutor-1630-thread-1-processing-n:127.0.0.1:56475_) [n:127.0.0.1:56475_ c:control_collection   x:collection1] o.a.s.s.IndexSchema Reading Solr Schema from /configs/conf1/schema.xml
   [junit4]   2> 866249 INFO  (coreLoadExecutor-1630-thread-1-processing-n:127.0.0.1:56475_) [n:127.0.0.1:56475_ c:control_collection   x:collection1] o.a.s.s.IndexSchema [collection1] Schema name=test
   [junit4]   2> 866343 INFO  (coreLoadExecutor-1630-thread-1-processing-n:127.0.0.1:56475_) [n:127.0.0.1:56475_ c:control_collection   x:collection1] o.a.s.s.OpenExchangeRatesOrgProvider Initialized with rates=open-exchange-rates.json, refreshInterval=1440.
   [junit4]   2> 866349 INFO  (coreLoadExecutor-1630-thread-1-processing-n:127.0.0.1:56475_) [n:127.0.0.1:56475_ c:control_collection   x:collection1] o.a.s.s.IndexSchema default search field in schema is text
   [junit4]   2> 866350 INFO  (coreLoadExecutor-1630-thread-1-processing-n:127.0.0.1:56475_) [n:127.0.0.1:56475_ c:control_collection   x:collection1] o.a.s.s.IndexSchema unique key field: id
   [junit4]   2> 866360 INFO  (coreLoadExecutor-1630-thread-1-processing-n:127.0.0.1:56475_) [n:127.0.0.1:56475_ c:control_collection   x:collection1] o.a.s.s.FileExchangeRateProvider Reloading exchange rates from file currency.xml
   [junit4]   2> 866363 INFO  (coreLoadExecutor-1630-thread-1-processing-n:127.0.0.1:56475_) [n:127.0.0.1:56475_ c:control_collection   x:collection1] o.a.s.s.FileExchangeRateProvider Reloading exchange rates from file currency.xml
   [junit4]   2> 866365 INFO  (coreLoadExecutor-1630-thread-1-processing-n:127.0.0.1:56475_) [n:127.0.0.1:56475_ c:control_collection   x:collection1] o.a.s.s.OpenExchangeRatesOrgProvider Reloading exchange rates from open-exchange-rates.json
   [junit4]   2> 866366 WARN  (coreLoadExecutor-1630-thread-1-processing-n:127.0.0.1:56475_) [n:127.0.0.1:56475_ c:control_collection   x:collection1] o.a.s.s.OpenExchangeRatesOrgProvider Unknown key IMPORTANT NOTE
   [junit4]   2> 866366 WARN  (coreLoadExecutor-1630-thread-1-processing-n:127.0.0.1:56475_) [n:127.0.0.1:56475_ c:control_collection   x:collection1] o.a.s.s.OpenExchangeRatesOrgProvider Expected key, got STRING
   [junit4]   2> 866366 INFO  (coreLoadExecutor-1630-thread-1-processing-n:127.0.0.1:56475_) [n:127.0.0.1:56475_ c:control_collection   x:collection1] o.a.s.s.OpenExchangeRatesOrgProvider Reloading exchange rates from open-exchange-rates.json
   [junit4]   2> 866367 WARN  (coreLoadExecutor-1630-thread-1-processing-n:127.0.0.1:56475_) [n:127.0.0.1:56475_ c:control_collection   x:collection1] o.a.s.s.OpenExchangeRatesOrgProvider Unknown key IMPORTANT NOTE
   [junit4]   2> 866367 WARN  (coreLoadExecutor-1630-thread-1-processing-n:127.0.0.1:56475_) [n:127.0.0.1:56475_ c:control_collection   x:collection1] o.a.s.s.OpenExchangeRatesOrgProvider Expected key, got STRING
   [junit4]   2> 866368 INFO  (coreLoadExecutor-1630-thread-1-processing-n:127.0.0.1:56475_) [n:127.0.0.1:56475_ c:control_collection   x:collection1] o.a.s.c.ConfigSetProperties Did not find ConfigSet properties, assuming default properties: Can't find resource 'configsetprops.json' in classpath or '/configs/conf1', cwd=/x1/jenkins/jenkins-slave/workspace/Lucene-Solr-NightlyTests-trunk/solr/build/solr-core/test/J1
   [junit4]   2> 866368 INFO  (coreLoadExecutor-1630-thread-1-processing-n:127.0.0.1:56475_) [n:127.0.0.1:56475_ c:control_collection   x:collection1] o.a.s.c.CoreContainer Creating SolrCore 'collection1' using configuration from collection control_collection
   [junit4]   2> 866368 INFO  (coreLoadExecutor-1630-thread-1-processing-n:127.0.0.1:56475_) [n:127.0.0.1:56475_ c:control_collection s:shard1 r:core_node1 x:collection1] o.a.s.c.SolrCore org.apache.solr.core.MockDirectoryFactory
   [junit4]   2> 866368 INFO  (coreLoadExecutor-1630-thread-1-processing-n:127.0.0.1:56475_) [n:127.0.0.1:56475_ c:control_collection s:shard1 r:core_node1 x:collection1] o.a.s.c.SolrCore [[collection1] ] Opening new SolrCore at [/x1/jenkins/jenkins-slave/workspace/Lucene-Solr-NightlyTests-trunk/solr/build/solr-core/test/J1/../../../../../../../../../../x1/jenkins/jenkins-slave/workspace/Lucene-Solr-NightlyTests-trunk/solr/build/solr-core/test/J1/temp/solr.cloud.CollectionsAPIDistributedZkTest_1DD2ACE0381532AA-001/control-001/cores/collection1/], dataDir=[null]
   [junit4]   2> 866368 INFO  (coreLoadExecutor-1630-thread-1-processing-n:127.0.0.1:56475_) [n:127.0.0.1:56475_ c:control_collection s:shard1 r:core_node1 x:collection1] o.a.s.c.JmxMonitoredMap JMX monitoring is enabled. Adding Solr mbeans to JMX Server: com.sun.jmx.mbeanserver.JmxMBeanServer@55fd9a7b
   [junit4]   2> 866369 INFO  (coreLoadExecutor-1630-thread-1-processing-n:127.0.0.1:56475_) [n:127.0.0.1:56475_ c:control_collection s:shard1 r:core_node1 x:collection1] o.a.s.c.CachingDirectoryFactory return new directory for /x1/jenkins/jenkins-slave/workspace/Lucene-Solr-NightlyTests-trunk/solr/build/solr-core/test/J1/../../../../../../../../../../x1/jenkins/jenkins-slave/workspace/Lucene-Solr-NightlyTests-trunk/solr/build/solr-core/test/J1/temp/solr.cloud.CollectionsAPIDistributedZkTest_1DD2ACE0381532AA-001/control-001/cores/collection1/data
   [junit4]   2> 866369 INFO  (coreLoadExecutor-1630-thread-1-processing-n:127.0.0.1:56475_) [n:127.0.0.1:56475_ c:control_collection s:shard1 r:core_node1 x:collection1] o.a.s.c.SolrCore New index directory detected: old=null new=/x1/jenkins/jenkins-slave/workspace/Lucene-Solr-NightlyTests-trunk/solr/build/solr-core/test/J1/../../../../../../../../../../x1/jenkins/jenkins-slave/workspace/Lucene-Solr-NightlyTests-trunk/solr/build/solr-core/test/J1/temp/solr.cloud.CollectionsAPIDistributedZkTest_1DD2ACE0381532AA-001/control-001/cores/collection1/data/index/
   [junit4]   2> 866369 WARN  (coreLoadExecutor-1630-thread-1-processing-n:127.0.0.1:56475_) [n:127.0.0.1:56475_ c:control_collection s:shard1 r:core_node1 x:collection1] o.a.s.c.SolrCore [collection1] Solr index directory '/x1/jenkins/jenkins-slave/workspace/Lucene-Solr-NightlyTests-trunk/solr/build/solr-core/test/J1/../../../../../../../../../../x1/jenkins/jenkins-slave/workspace/Lucene-Solr-NightlyTests-trunk/solr/build/solr-core/test/J1/temp/solr.cloud.CollectionsAPIDistributedZkTest_1DD2ACE0381532AA-001/control-001/cores/collection1/data/index' doesn't exist. Creating new index...
   [junit4]   2> 866369 INFO  (coreLoadExecutor-1630-thread-1-processing-n:127.0.0.1:56475_) [n:127.0.0.1:56475_ c:control_collection s:shard1 r:core_node1 x:collection1] o.a.s.c.CachingDirectoryFactory return new directory for /x1/jenkins/jenkins-slave/workspace/Lucene-Solr-NightlyTests-trunk/solr/build/solr-core/test/J1/../../../../../../../../../../x1/jenkins/jenkins-slave/workspace/Lucene-Solr-NightlyTests-trunk/solr/build/solr-core/test/J1/temp/solr.cloud.CollectionsAPIDistributedZkTest_1DD2ACE0381532AA-001/control-001/cores/collection1/data/index
   [junit4]   2> 866369 INFO  (coreLoadExecutor-1630-thread-1-processing-n:127.0.0.1:56475_) [n:127.0.0.1:56475_ c:control_collection s:shard1 r:core_node1 x:collection1] o.a.s.u.RandomMergePolicy RandomMergePolicy wrapping class org.apache.lucene.index.LogDocMergePolicy: [LogDocMergePolicy: minMergeSize=1000, mergeFactor=26, maxMergeSize=9223372036854775807, maxMergeSizeForForcedMerge=9223372036854775807, calibrateSizeByDeletes=true, maxMergeDocs=2147483647, maxCFSSegmentSizeMB=0.98046875, noCFSRatio=0.497874104473354]
   [junit4]   2> 866370 INFO  (coreLoadExecutor-1630-thread-1-processing-n:127.0.0.1:56475_) [n:127.0.0.1:56475_ c:control_collection s:shard1 r:core_node1 x:collection1] o.a.s.c.SolrCore SolrDeletionPolicy.onCommit: commits: num=1
   [junit4]   2> 	commit{dir=MockDirectoryWrapper(RAMDirectory@5f684b1d lockFactory=org.apache.lucene.store.SingleInstanceLockFactory@2f5f743),segFN=segments_1,generation=1}
   [junit4]   2> 866370 INFO  (coreLoadExecutor-1630-thread-1-processing-n:127.0.0.1:56475_) [n:127.0.0.1:56475_ c:control_collection s:shard1 r:core_node1 x:collection1] o.a.s.c.SolrCore newest commit generation = 1
   [junit4]   2> 866371 INFO  (OldIndexDirectoryCleanupThreadForCore-collection1) [n:127.0.0.1:56475_ c:control_collection s:shard1 r:core_node1 x:collection1] o.a.s.c.SolrCore Looking for old index directories to cleanup for core collection1 in /x1/jenkins/jenkins-slave/workspace/Lucene-Solr-NightlyTests-trunk/solr/build/solr-core/test/J1/../../../../../../../../../../x1/jenkins/jenkins-slave/workspace/Lucene-Solr-NightlyTests-trunk/solr/build/solr-core/test/J1/temp/solr.cloud.CollectionsAPIDistributedZkTest_1DD2ACE0381532AA-001/control-001/cores/collection1/data/
   [junit4]   2> 866371 WARN  (OldIndexDirectoryCleanupThreadForCore-collection1) [n:127.0.0.1:56475_ c:control_collection s:shard1 r:core_node1 x:collection1] o.a.s.c.DirectoryFactory /x1/jenkins/jenkins-slave/workspace/Lucene-Solr-NightlyTests-trunk/solr/build/solr-core/test/J1/../../../../../../../../../../x1/jenkins/jenkins-slave/workspace/Lucene-Solr-NightlyTests-trunk/solr/build/solr-core/test/J1/temp/solr.cloud.CollectionsAPIDistributedZkTest_1DD2ACE0381532AA-001/control-001/cores/collection1/data/ does not point to a valid data directory; skipping clean-up of old index directories.
   [junit4]   2> 866374 INFO  (coreLoadExecutor-1630-thread-1-processing-n:127.0.0.1:56475_) [n:127.0.0.1:56475_ c:control_collection s:shard1 r:core_node1 x:collection1] o.a.s.u.p.UpdateRequestProcessorChain creating updateRequestProcessorChain "nodistrib"
   [junit4]   2> 866375 INFO  (coreLoadExecutor-1630-thread-1-processing-n:127.0.0.1:56475_) [n:127.0.0.1:56475_ c:control_collection s:shard1 r:core_node1 x:collection1] o.a.s.u.p.UpdateRequestProcessorChain creating updateRequestProcessorChain "dedupe"
   [junit4]   2> 866375 INFO  (coreLoadExecutor-1630-thread-1-processing-n:127.0.0.1:56475_) [n:127.0.0.1:56475_ c:control_collection s:shard1 r:core_node1 x:collection1] o.a.s.u.p.UpdateRequestProcessorChain inserting DistributedUpdateProcessorFactory into updateRequestProcessorChain "dedupe"
   [junit4]   2> 866375 INFO  (coreLoadExecutor-1630-thread-1-processing-n:127.0.0.1:56475_) [n:127.0.0.1:56475_ c:control_collection s:shard1 r:core_node1 x:collection1] o.a.s.u.p.UpdateRequestProcessorChain creating updateRequestProcessorChain "stored_sig"
   [junit4]   2> 866375 INFO  (coreLoadExecutor-1630-thread-1-processing-n:127.0.0.1:56475_) [n:127.0.0.1:56475_ c:control_collection s:shard1 r:core_node1 x:collection1] o.a.s.u.p.UpdateRequestProcessorChain inserting DistributedUpdateProcessorFactory into updateRequestProcessorChain "stored_sig"
   [junit4]   2> 866375 INFO  (coreLoadExecutor-1630-thread-1-processing-n:127.0.0.1:56475_) [n:127.0.0.1:56475_ c:control_collection s:shard1 r:core_node1 x:collection1] o.a.s.u.p.UpdateRequestProcessorChain creating updateRequestProcessorChain "distrib-dup-test-chain-explicit"
   [junit4]   2> 866375 INFO  (coreLoadExecutor-1630-thread-1-processing-n:127.0.0.1:56475_) [n:127.0.0.1:56475_ c:control_collection s:shard1 r:core_node1 x:collection1] o.a.s.u.p.UpdateRequestProcessorChain creating updateRequestProcessorChain "distrib-dup-test-chain-implicit"
   [junit4]   2> 866375 INFO  (coreLoadExecutor-1630-thread-1-processing-n:127.0.0.1:56475_) [n:127.0.0.1:56475_ c:control_collection s:shard1 r:core_node1 x:collection1] o.a.s.u.p.UpdateRequestProcessorChain inserting DistributedUpdateProcessorFactory into updateRequestProcessorChain "distrib-dup-test-chain-implicit"
   [junit4]   2> 866375 INFO  (coreLoadExecutor-1630-thread-1-processing-n:127.0.0.1:56475_) [n:127.0.0.1:56475_ c:control_collection s:shard1 r:core_node1 x:collection1] o.a.s.c.SolrCore no updateRequestProcessorChain defined as default, creating implicit default
   [junit4]   2> 866377 INFO  (coreLoadExecutor-1630-thread-1-processing-n:127.0.0.1:56475_) [n:127.0.0.1:56475_ c:control_collection s:shard1 r:core_node1 x:collection1] o.a.s.h.l.XMLLoader xsltCacheLifetimeSeconds=60
   [junit4]   2> 866378 INFO  (coreLoadExecutor-1630-thread-1-processing-n:127.0.0.1:56475_) [n:127.0.0.1:56475_ c:control_collection s:shard1 r:core_node1 x:collection1] o.a.s.h.l.XMLLoader xsltCacheLifetimeSeconds=60
   [junit4]   2> 866379 INFO  (coreLoadExecutor-1630-thread-1-processing-n:127.0.0.1:56475_) [n:127.0.0.1:56475_ c:control_collection s:shard1 r:core_node1 x:collection1] o.a.s.h.l.XMLLoader xsltCacheLifetimeSeconds=60
   [junit4]   2> 866380 INFO  (coreLoadExecutor-1630-thread-1-processing-n:127.0.0.1:56475_) [n:127.0.0.1:56475_ c:control_collection s:shard1 r:core_node1 x:collection1] o.a.s.h.l.XMLLoader xsltCacheLifetimeSeconds=60
   [junit4]   2> 866383 INFO  (coreLoadExecutor-1630-thread-1-processing-n:127.0.0.1:56475_) [n:127.0.0.1:56475_ c:control_collection s:shard1 r:core_node1 x:collection1] o.a.s.c.RequestHandlers Registered paths: /admin/mbeans,standard,/update/csv,/update/json/docs,/admin/luke,/admin/segments,/get,/admin/system,/replication,/admin/properties,/config,/schema,/admin/plugins,/admin/logging,/update/json,/admin/threads,/admin/ping,/update,/admin/file
   [junit4]   2> 866383 INFO  (coreLoadExecutor-1630-thread-1-processing-n:127.0.0.1:56475_) [n:127.0.0.1:56475_ c:control_collection s:shard1 r:core_node1 x:collection1] o.a.s.c.SolrCore Using default statsCache cache: org.apache.solr.search.stats.LocalStatsCache
   [junit4]   2> 866384 INFO  (coreLoadExecutor-1630-thread-1-processing-n:127.0.0.1:56475_) [n:127.0.0.1:56475_ c:control_collection s:shard1 r:core_node1 x:collection1] o.a.s.u.UpdateHandler Using UpdateLog implementation: org.apache.solr.update.UpdateLog
   [junit4]   2> 866384 INFO  (coreLoadExecutor-1630-thread-1-processing-n:127.0.0.1:56475_) [n:127.0.0.1:56475_ c:control_collection s:shard1 r:core_node1 x:collection1] o.a.s.u.UpdateLog Initializing UpdateLog: dataDir= defaultSyncLevel=FLUSH numRecordsToKeep=100 maxNumLogsToKeep=10 numVersionBuckets=65536
   [junit4]   2> 866385 INFO  (coreLoadExecutor-1630-thread-1-processing-n:127.0.0.1:56475_) [n:127.0.0.1:56475_ c:control_collection s:shard1 r:core_node1 x:collection1] o.a.s.c.SolrCore Hard AutoCommit: disabled
   [junit4]   2> 866385 INFO  (coreLoadExecutor-1630-thread-1-processing-n:127.0.0.1:56475_) [n:127.0.0.1:56475_ c:control_collection s:shard1 r:core_node1 x:collection1] o.a.s.c.SolrCore Soft AutoCommit: disabled
   [junit4]   2> 866385 INFO  (coreLoadExecutor-1630-thread-1-processing-n:127.0.0.1:56475_) [n:127.0.0.1:56475_ c:control_collection s:shard1 r:core_node1 x:collection1] o.a.s.u.RandomMergePolicy RandomMergePolicy wrapping class org.apache.lucene.index.LogByteSizeMergePolicy: [LogByteSizeMergePolicy: minMergeSize=1677721, mergeFactor=31, maxMergeSize=2147483648, maxMergeSizeForForcedMerge=9223372036854775807, calibrateSizeByDeletes=false, maxMergeDocs=2147483647, maxCFSSegmentSizeMB=8.796093022207999E12, noCFSRatio=0.0]
   [junit4]   2> 866386 INFO  (coreLoadExecutor-1630-thread-1-processing-n:127.0.0.1:56475_) [n:127.0.0.1:56475_ c:control_collection s:shard1 r:core_node1 x:collection1] o.a.s.c.SolrCore SolrDeletionPolicy.onInit: commits: num=1
   [junit4]   2> 	commit{dir=MockDirectoryWrapper(RAMDirectory@5f684b1d lockFactory=org.apache.lucene.store.SingleInstanceLockFactory@2f5f743),segFN=segments_1,generation=1}
   [junit4]   2> 866386 INFO  (coreLoadExecutor-1630-thread-1-processing-n:127.0.0.1:56475_) [n:127.0.0.1:56475_ c:control_collection s:shard1 r:core_node1 x:collection1] o.a.s.c.SolrCore newest commit generation = 1
   [junit4]   2> 866386 INFO  (coreLoadExecutor-1630-thread-1-processing-n:127.0.0.1:56475_) [n:127.0.0.1:56475_ c:control_collection s:shard1 r:core_node1 x:collection1] o.a.s.s.SolrIndexSearcher Opening Searcher@698350a9[collection1] main
   [junit4]   2> 866386 INFO  (coreLoadExecutor-1630-thread-1-processing-n:127.0.0.1:56475_) [n:127.0.0.1:56475_ c:control_collection s:shard1 r:core_node1 x:collection1] o.a.s.c.c.ZkStateReader Load collection config from:/collections/control_collection
   [junit4]   2> 866387 INFO  (coreLoadExecutor-1630-thread-1-processing-n:127.0.0.1:56475_) [n:127.0.0.1:56475_ c:control_collection s:shard1 r:core_node1 x:collection1] o.a.s.c.c.ZkStateReader path=/collections/control_collection configName=conf1 specified config exists in ZooKeeper
   [junit4]   2> 866387 INFO  (coreLoadExecutor-1630-thread-1-processing-n:127.0.0.1:56475_) [n:127.0.0.1:56475_ c:control_collection s:shard1 r:core_node1 x:collection1] o.a.s.r.ManagedResourceStorage Setting up ZooKeeper-based storage for the RestManager with znodeBase: /configs/conf1
   [junit4]   2> 866387 INFO  (coreLoadExecutor-1630-thread-1-processing-n:127.0.0.1:56475_) [n:127.0.0.1:56475_ c:control_collection s:shard1 r:core_node1 x:collection1] o.a.s.r.ManagedResourceStorage Configured ZooKeeperStorageIO with znodeBase: /configs/conf1
   [junit4]   2> 866387 INFO  (coreLoadExecutor-1630-thread-1-processing-n:127.0.0.1:56475_) [n:127.0.0.1:56475_ c:control_collection s:shard1 r:core_node1 x:collection1] o.a.s.r.RestManager Initializing RestManager with initArgs: {}
   [junit4]   2> 866387 INFO  (coreLoadExecutor-1630-thread-1-processing-n:127.0.0.1:56475_) [n:127.0.0.1:56475_ c:control_collection s:shard1 r:core_node1 x:collection1] o.a.s.r.ManagedResourceStorage Reading _rest_managed.json using ZooKeeperStorageIO:path=/configs/conf1
   [junit4]   2> 866388 INFO  (coreLoadExecutor-1630-thread-1-processing-n:127.0.0.1:56475_) [n:127.0.0.1:56475_ c:control_collection s:shard1 r:core_node1 x:collection1] o.a.s.r.ManagedResourceStorage No data found for znode /configs/conf1/_rest_managed.json
   [junit4]   2> 866388 INFO  (coreLoadExecutor-1630-thread-1-processing-n:127.0.0.1:56475_) [n:127.0.0.1:56475_ c:control_collection s:shard1 r:core_node1 x:collection1] o.a.s.r.ManagedResourceStorage Loaded null at path _rest_managed.json using ZooKeeperStorageIO:path=/configs/conf1
   [junit4]   2> 866388 INFO  (coreLoadExecutor-1630-thread-1-processing-n:127.0.0.1:56475_) [n:127.0.0.1:56475_ c:control_collection s:shard1 r:core_node1 x:collection1] o.a.s.r.RestManager Initializing 0 registered ManagedResources
   [junit4]   2> 866388 INFO  (coreLoadExecutor-1630-thread-1-processing-n:127.0.0.1:56475_) [n:127.0.0.1:56475_ c:control_collection s:shard1 r:core_node1 x:collection1] o.a.s.h.ReplicationHandler Commits will be reserved for  10000
   [junit4]   2> 866388 INFO  (searcherExecutor-1631-thread-1-processing-n:127.0.0.1:56475_ x:collection1 s:shard1 c:control_collection r:core_node1) [n:127.0.0.1:56475_ c:control_collection s:shard1 r:core_node1 x:collection1] o.a.s.c.SolrCore [collection1] Registered new searcher Searcher@698350a9[collection1] main{ExitableDirectoryReader(UninvertingDirectoryReader())}
   [junit4]   2> 866388 INFO  (coreLoadExecutor-1630-thread-1-processing-n:127.0.0.1:56475_) [n:127.0.0.1:56475_ c:control_collection s:shard1 r:core_node1 x:collection1] o.a.s.u.UpdateLog Looking up max value of version field to seed version buckets
   [junit4]   2> 866389 INFO  (coreLoadExecutor-1630-thread-1-processing-n:127.0.0.1:56475_) [n:127.0.0.1:56475_ c:control_collection s:shard1 r:core_node1 x:collection1] o.a.s.u.VersionInfo Refreshing highest value of _version_ for 65536 version buckets from index
   [junit4]   2> 866389 INFO  (coreLoadExecutor-1630-thread-1-processing-n:127.0.0.1:56475_) [n:127.0.0.1:56475_ c:control_collection s:shard1 r:core_node1 x:collection1] o.a.s.u.VersionInfo No terms found for _version_, cannot seed version bucket highest value from index
   [junit4]   2> 866389 INFO  (coreLoadExecutor-1630-thread-1-processing-n:127.0.0.1:56475_) [n:127.0.0.1:56475_ c:control_collection s:shard1 r:core_node1 x:collection1] o.a.s.u.UpdateLog Could not find max version in index or recent updates, using new clock 1515844835282518016
   [junit4]   2> 866391 INFO  (coreLoadExecutor-1630-thread-1-processing-n:127.0.0.1:56475_) [n:127.0.0.1:56475_ c:control_collection s:shard1 r:core_node1 x:collection1] o.a.s.u.UpdateLog Took 2.0ms to seed version buckets with highest version 1515844835282518016
   [junit4]   2> 866391 INFO  (coreLoadExecutor-1630-thread-1-processing-n:127.0.0.1:56475_) [n:127.0.0.1:56475_ c:control_collection s:shard1 r:core_node1 x:collection1] o.a.s.c.ZkController watch zkdir /configs/conf1
   [junit4]   2> 866391 INFO  (coreLoadExecutor-1630-thread-1-processing-n:127.0.0.1:56475_) [n:127.0.0.1:56475_ c:control_collection s:shard1 r:core_node1 x:collection1] o.a.s.c.CoreContainer registering core: collection1
   [junit4]   2> 866392 INFO  (coreZkRegister-1624-thread-1-processing-n:127.0.0.1:56475_ x:collection1 s:shard1 c:control_collection r:core_node1) [n:127.0.0.1:56475_ c:control_collection s:shard1 r:core_node1 x:collection1] o.a.s.c.ZkController Register replica - core:collection1 address:http://127.0.0.1:56475 collection:control_collection shard:shard1
   [junit4]   2> 866392 INFO  (coreZkRegister-1624-thread-1-processing-n:127.0.0.1:56475_ x:collection1 s:shard1 c:control_collection r:core_node1) [n:127.0.0.1:56475_ c:control_collection s:shard1 r:core_node1 x:collection1] o.a.s.c.c.SolrZkClient makePath: /collections/control_collection/leader_elect/shard1/election
   [junit4]   2> 866396 INFO  (coreZkRegister-1624-thread-1-processing-n:127.0.0.1:56475_ x:collection1 s:shard1 c:control_collection r:core_node1) [n:127.0.0.1:56475_ c:control_collection s:shard1 r:core_node1 x:collection1] o.a.s.c.LeaderElector Joined leadership election with path: /collections/control_collection/leader_elect/shard1/election/94740302080770054-core_node1-n_0000000000
   [junit4]   2> 866396 INFO  (coreZkRegister-1624-thread-1-processing-n:127.0.0.1:56475_ x:collection1 s:shard1 c:control_collection r:core_node1) [n:127.0.0.1:56475_ c:control_collection s:shard1 r:core_node1 x:collection1] o.a.s.c.ShardLeaderElectionContext Running the leader process for shard shard1
   [junit4]   2> 866398 INFO  (coreZkRegister-1624-thread-1-processing-n:127.0.0.1:56475_ x:collection1 s:shard1 c:control_collection r:core_node1) [n:127.0.0.1:56475_ c:control_collection s:shard1 r:core_node1 x:collection1] o.a.s.c.ShardLeaderElectionContext Enough replicas found to continue.
   [junit4]   2> 866398 INFO  (coreZkRegister-1624-thread-1-processing-n:127.0.0.1:56475_ x:collection1 s:shard1 c:control_collection r:core_node1) [n:127.0.0.1:56475_ c:control_collection s:shard1 r:core_node1 x:collection1] o.a.s.c.ShardLeaderElectionContext I may be the new leader - try and sync
   [junit4]   2> 866398 INFO  (coreZkRegister-1624-thread-1-processing-n:127.0.0.1:56475_ x:collection1 s:shard1 c:control_collection r:core_node1) [n:127.0.0.1:56475_ c:control_collection s:shard1 r:core_node1 x:collection1] o.a.s.c.SyncStrategy Sync replicas to http://127.0.0.1:56475/collection1/
   [junit4]   2> 866398 INFO  (coreZkRegister-1624-thread-1-processing-n:127.0.0.1:56475_ x:collection1 s:shard1 c:control_collection r:core_node1) [n:127.0.0.1:56475_ c:control_collection s:shard1 r:core_node1 x:collection1] o.a.s.c.SyncStrategy Sync Success - now sync replicas to me
   [junit4]   2> 866398 INFO  (coreZkRegister-1624-thread-1-processing-n:127.0.0.1:56475_ x:collection1 s:shard1 c:control_collection r:core_node1) [n:127.0.0.1:56475_ c:control_collection s:shard1 r:core_node1 x:collection1] o.a.s.c.SyncStrategy http://127.0.0.1:56475/collection1/ has no replicas
   [junit4]   2> 866398 INFO  (coreZkRegister-1624-thread-1-processing-n:127.0.0.1:56475_ x:collection1 s:shard1 c:control_collection r:core_node1) [n:127.0.0.1:56475_ c:control_collection s:shard1 r:core_node1 x:collection1] o.a.s.c.ShardLeaderElectionContext I am the new leader: http://127.0.0.1:56475/collection1/ shard1
   [junit4]   2> 866398 INFO  (OverseerStateUpdate-94740302080770054-127.0.0.1:56475_-n_0000000000) [n:127.0.0.1:56475_    ] o.a.s.c.Overseer processMessage: queueSize: 1, message = {
   [junit4]   2>   "operation":"leader",
   [junit4]   2>   "shard":"shard1",
   [junit4]   2>   "collection":"control_collection"} current state version: 1
   [junit4]   2> 866398 INFO  (coreZkRegister-1624-thread-1-processing-n:127.0.0.1:56475_ x:collection1 s:shard1 c:control_collection r:core_node1) [n:127.0.0.1:56475_ c:control_collection s:shard1 r:core_node1 x:collection1] o.a.s.c.c.SolrZkClient makePath: /collections/control_collection/leaders/shard1
   [junit4]   2> 866401 INFO  (coreZkRegister-1624-thread-1-processing-n:127.0.0.1:56475_ x:collection1 s:shard1 c:control_collection r:core_node1) [n:127.0.0.1:56475_ c:control_collection s:shard1 r:core_node1 x:collection1] o.a.s.c.ShardLeaderElectionContextBase Creating leader registration node
   [junit4]   2> 866404 INFO  (OverseerStateUpdate-94740302080770054-127.0.0.1:56475_-n_0000000000) [n:127.0.0.1:56475_    ] o.a.s.c.Overseer processMessage: queueSize: 1, message = {
   [junit4]   2>   "operation":"leader",
   [junit4]   2>   "shard":"shard1",
   [junit4]   2>   "collection":"control_collection",
   [junit4]   2>   "base_url":"http://127.0.0.1:56475",
   [junit4]   2>   "core":"collection1",
   [junit4]   2>   "state":"active"} current state version: 1
   [junit4]   2> 866507 INFO  (zkCallback-815-thread-1-processing-n:127.0.0.1:56475_) [n:127.0.0.1:56475_    ] o.a.s.c.c.ZkStateReader A cluster state change: WatchedEvent state:SyncConnected type:NodeDataChanged path:/clusterstate.json, has occurred - updating... (live nodes size: 1)
   [junit4]   2> 866555 INFO  (coreZkRegister-1624-thread-1-processing-n:127.0.0.1:56475_ x:collection1 s:shard1 c:control_collection r:core_node1) [n:127.0.0.1:56475_ c:control_collection s:shard1 r:core_node1 x:collection1] o.a.s.c.ZkController We are http://127.0.0.1:56475/collection1/ and leader is http://127.0.0.1:56475/collection1/
   [junit4]   2> 866555 INFO  (coreZkRegister-1624-thread-1-processing-n:127.0.0.1:56475_ x:collection1 s:shard1 c:control_collection r:core_node1) [n:127.0.0.1:56475_ c:control_collection s:shard1 r:core_node1 x:collection1] o.a.s.c.ZkController No LogReplay needed for core=collection1 baseURL=http://127.0.0.1:56475
   [junit4]   2> 866555 INFO  (coreZkRegister-1624-thread-1-processing-n:127.0.0.1:56475_ x:collection1 s:shard1 c:control_collection r:core_node1) [n:127.0.0.1:56475_ c:control_collection s:shard1 r:core_node1 x:collection1] o.a.s.c.ZkController I am the leader, no recovery necessary
   [junit4]   2> 866555 INFO  (coreZkRegister-1624-thread-1-processing-n:127.0.0.1:56475_ x:collection1 s:shard1 c:control_collection r:core_node1) [n:127.0.0.1:56475_ c:control_collection s:shard1 r:core_node1 x:collection1] o.a.s.c.ZkController publishing state=active
   [junit4]   2> 866555 INFO  (coreZkRegister-1624-thread-1-processing-n:127.0.0.1:56475_ x:collection1 s:shard1 c:control_collection r:core_node1) [n:127.0.0.1:56475_ c:control_collection s:shard1 r:core_node1 x:collection1] o.a.s.c.ZkController numShards not found on descriptor - reading it from system property
   [junit4]   2> 866557 INFO  (OverseerStateUpdate-94740302080770054-127.0.0.1:56475_-n_0000000000) [n:127.0.0.1:56475_    ] o.a.s.c.Overseer processMessage: queueSize: 1, message = {
   [junit4]   2>   "core":"collection1",
   [junit4]   2>   "core_node_name":"core_node1",
   [junit4]   2>   "roles":null,
   [junit4]   2>   "base_url":"http://127.0.0.1:56475",
   [junit4]   2>   "node_name":"127.0.0.1:56475_",
   [junit4]   2>   "numShards":"1",
   [junit4]   2>   "state":"active",
   [junit4]   2>   "shard":"shard1",
   [junit4]   2>   "collection":"control_collection",
   [junit4]   2>   "operation":"state"} current state version: 2
   [junit4]   2> 866558 INFO  (OverseerStateUpdate-94740302080770054-127.0.0.1:56475_-n_0000000000) [n:127.0.0.1:56475_    ] o.a.s.c.o.ReplicaMutator Update state numShards=1 message={
   [junit4]   2>   "core":"collection1",
   [junit4]   2>   "core_node_name":"core_node1",
   [junit4]   2>   "roles":null,
   [junit4]   2>   "base_url":"http://127.0.0.1:56475",
   [junit4]   2>   "node_name":"127.0.0.1:56475_",
   [junit4]   2>   "numShards":"1",
   [junit4]   2>   "state":"active",
   [junit4]   2>   "shard":"shard1",
   [junit4]   2>   "collection":"control_collection",
   [junit4]   2>   "operation":"state"}
   [junit4]   2> 866661 INFO  (zkCallback-815-thread-1-processing-n:127.0.0.1:56475_) [n:127.0.0.1:56475_    ] o.a.s.c.c.ZkStateReader A cluster state change: WatchedEvent state:SyncConnected type:NodeDataChanged path:/clusterstate.json, has occurred - updating... (live nodes size: 1)
   [junit4]   2> 866699 INFO  (TEST-CollectionsAPIDistributedZkTest.test-seed#[1DD2ACE0381532AA]) [    ] o.a.s.c.c.SolrZkClient Using default ZkCredentialsProvider
   [junit4]   2> 866700 INFO  (TEST-CollectionsAPIDistributedZkTest.test-seed#[1DD2ACE0381532AA]) [    ] o.a.s.c.c.ConnectionManager Waiting for client to connect to ZooKeeper
   [junit4]   2> 866701 INFO  (zkCallback-817-thread-1) [    ] o.a.s.c.c.ConnectionManager Watcher org.apache.solr.common.cloud.ConnectionManager@5f9b158 name:ZooKeeperConnection Watcher:127.0.0.1:41201/solr got event WatchedEvent state:SyncConnected type:None path:null path:null type:None
   [junit4]   2> 866701 INFO  (TEST-CollectionsAPIDistributedZkTest.test-seed#[1DD2ACE0381532AA]) [    ] o.a.s.c.c.ConnectionManager Client is connected to ZooKeeper
   [junit4]   2> 866701 INFO  (TEST-CollectionsAPIDistributedZkTest.test-seed#[1DD2ACE0381532AA]) [    ] o.a.s.c.c.SolrZkClient Using default ZkACLProvider
   [junit4]   2> 866702 INFO  (TEST-CollectionsAPIDistributedZkTest.test-seed#[1DD2ACE0381532AA]) [    ] o.a.s.c.c.ZkStateReader Updating cluster state from ZooKeeper... 
   [junit4]   2> 866704 INFO  (TEST-CollectionsAPIDistributedZkTest.test-seed#[1DD2ACE0381532AA]) [    ] o.a.s.c.ChaosMonkey monkey: init - expire sessions:false cause connection loss:false
   [junit4]   2> 866704 INFO  (TEST-CollectionsAPIDistributedZkTest.test-seed#[1DD2ACE0381532AA]) [    ] o.a.s.c.AbstractFullDistribZkTestBase Creating collection1 with stateFormat=2
   [junit4]   2> 866704 INFO  (TEST-CollectionsAPIDistributedZkTest.test-seed#[1DD2ACE0381532AA]) [    ] o.a.s.c.c.SolrZkClient Using default ZkCredentialsProvider
   [junit4]   2> 866704 INFO  (TEST-CollectionsAPIDistributedZkTest.test-seed#[1DD2ACE0381532AA]) [    ] o.a.s.c.c.ConnectionManager Waiting for client to connect to ZooKeeper
   [junit4]   2> 866705 INFO  (zkCallback-818-thread-1) [    ] o.a.s.c.c.ConnectionManager Watcher org.apache.solr.common.cloud.ConnectionManager@58625d64 name:ZooKeeperConnection Watcher:127.0.0.1:41201/solr got event WatchedEvent state:SyncConnected type:None path:null path:null type:None
   [junit4]   2> 866705 INFO  (TEST-CollectionsAPIDistributedZkTest.test-seed#[1DD2ACE0381532AA]) [    ] o.a.s.c.c.ConnectionManager Client is connected to ZooKeeper
   [junit4]   2> 866706 INFO  (TEST-CollectionsAPIDistributedZkTest.test-seed#[1DD2ACE0381532AA]) [    ] o.a.s.c.c.SolrZkClient Using default ZkACLProvider
   [junit4]   2> 866708 INFO  (OverseerStateUpdate-94740302080770054-127.0.0.1:56475_-n_0000000000) [n:127.0.0.1:56475_    ] o.a.s.c.Overseer processMessage: queueSize: 1, message = {
   [junit4]   2>   "operation":"create",
   [junit4]   2>   "name":"collection1",
   [junit4]   2>   "numShards":"2",
   [junit4]   2>   "stateFormat":"2"} current state version: 3
   [junit4]   2> 866708 INFO  (OverseerStateUpdate-94740302080770054-127.0.0.1:56475_-n_0000000000) [n:127.0.0.1:56475_    ] o.a.s.c.o.ClusterStateMutator building a new cName: collection1
   [junit4]   2> 866816 INFO  (OverseerStateUpdate-94740302080770054-127.0.0.1:56475_-n_0000000000) [n:127.0.0.1:56475_    ] o.a.s.c.o.ZkStateWriter going to create_collection /collections/collection1/state.json
   [junit4]   2> 867019 INFO  (TEST-CollectionsAPIDistributedZkTest.test-seed#[1DD2ACE0381532AA]) [    ] o.a.s.SolrTestCaseJ4 Writing core.properties file to /x1/jenkins/jenkins-slave/workspace/Lucene-Solr-NightlyTests-trunk/solr/build/solr-core/test/J1/temp/solr.cloud.CollectionsAPIDistributedZkTest_1DD2ACE0381532AA-001/shard-1-001/cores/collection1
   [junit4]   2> 867020 INFO  (TEST-CollectionsAPIDistributedZkTest.test-seed#[1DD2ACE0381532AA]) [    ] o.a.s.c.AbstractFullDistribZkTestBase create jetty 1 in directory /x1/jenkins/jenkins-slave/workspace/Lucene-Solr-NightlyTests-trunk/solr/build/solr-core/test/J1/temp/solr.cloud.CollectionsAPIDistributedZkTest_1DD2ACE0381532AA-001/shard-1-001
   [junit4]   2> 867021 INFO  (TEST-CollectionsAPIDistributedZkTest.test-seed#[1DD2ACE0381532AA]) [    ] o.e.j.s.Server jetty-9.2.13.v20150730
   [junit4]   2> 867023 INFO  (TEST-CollectionsAPIDistributedZkTest.test-seed#[1DD2ACE0381532AA]) [    ] o.e.j.s.h.ContextHandler Started o.e.j.s.ServletContextHandler@1a4aad84{/,null,AVAILABLE}
   [junit4]   2> 867023 INFO  (TEST-CollectionsAPIDistributedZkTest.test-seed#[1DD2ACE0381532AA]) [    ] o.e.j.s.ServerConnector Started ServerConnector@4c221d7c{HTTP/1.1}{127.0.0.1:58376}
   [junit4]   2> 867023 INFO  (TEST-CollectionsAPIDistributedZkTest.test-seed#[1DD2ACE0381532AA]) [    ] o.e.j.s.Server Started @870401ms
   [junit4]   2> 867023 INFO  (TEST-CollectionsAPIDistributedZkTest.test-seed#[1DD2ACE0381532AA]) [    ] o.a.s.c.s.e.JettySolrRunner Jetty properties: {solr.data.dir=/x1/jenkins/jenkins-slave/workspace/Lucene-Solr-NightlyTests-trunk/solr/build/solr-core/test/J1/temp/solr.cloud.CollectionsAPIDistributedZkTest_1DD2ACE0381532AA-001/tempDir-001/jetty1, solrconfig=solrconfig.xml, hostContext=/, hostPort=58376, coreRootDirectory=/x1/jenkins/jenkins-slave/workspace/Lucene-Solr-NightlyTests-trunk/solr/build/solr-core/test/J1/temp/solr.cloud.CollectionsAPIDistributedZkTest_1DD2ACE0381532AA-001/shard-1-001/cores}
   [junit4]   2> 867023 INFO  (TEST-CollectionsAPIDistributedZkTest.test-seed#[1DD2ACE0381532AA]) [    ] o.a.s.s.SolrDispatchFilter SolrDispatchFilter.init(): sun.misc.Launcher$AppClassLoader@4e0e2f2a
   [junit4]   2> 867024 INFO  (TEST-CollectionsAPIDistributedZkTest.test-seed#[1DD2ACE0381532AA]) [    ] o.a.s.c.SolrResourceLoader new SolrResourceLoader for directory: '/x1/jenkins/jenkins-slave/workspace/Lucene-Solr-NightlyTests-trunk/solr/build/solr-core/test/J1/temp/solr.cloud.CollectionsAPIDistributedZkTest_1DD2ACE0381532AA-001/shard-1-001/'
   [junit4]   2> 867024 INFO  (TEST-CollectionsAPIDistributedZkTest.test-seed#[1DD2ACE0381532AA]) [    ] o.a.s.c.SolrResourceLoader JNDI not configured for solr (NoInitialContextEx)
   [junit4]   2> 867024 INFO  (TEST-CollectionsAPIDistributedZkTest.test-seed#[1DD2ACE0381532AA]) [    ] o.a.s.c.SolrResourceLoader solr home defaulted to 'solr/' (could not find system property or JNDI)
   [junit4]   2> 867040 INFO  (TEST-CollectionsAPIDistributedZkTest.test-seed#[1DD2ACE0381532AA]) [    ] o.a.s.c.c.SolrZkClient Using default ZkCredentialsProvider
   [junit4]   2> 867041 INFO  (TEST-CollectionsAPIDistributedZkTest.test-seed#[1DD2ACE0381532AA]) [    ] o.a.s.c.c.ConnectionManager Waiting for client to connect to ZooKeeper
   [junit4]   2> 867043 INFO  (zkCallback-819-thread-1) [    ] o.a.s.c.c.ConnectionManager Watcher org.apache.solr.common.cloud.ConnectionManager@53bec78d name:ZooKeeperConnection Watcher:127.0.0.1:41201/solr got event WatchedEvent state:SyncConnected type:None path:null path:null type:None
   [junit4]   2> 867043 INFO  (TEST-CollectionsAPIDistributedZkTest.test-seed#[1DD2ACE0381532AA]) [    ] o.a.s.c.c.ConnectionManager Client is connected to ZooKeeper
   [junit4]   2> 867043 INFO  (TEST-CollectionsAPIDistributedZkTest.test-seed#[1DD2ACE0381532AA]) [    ] o.a.s.c.c.SolrZkClient Using default ZkACLProvider
   [junit4]   2> 867044 INFO  (TEST-CollectionsAPIDistributedZkTest.test-seed#[1DD2ACE0381532AA]) [    ] o.a.s.s.SolrDispatchFilter Loading solr.xml from SolrHome (not found in ZooKeeper)
   [junit4]   2> 867044 INFO  (TEST-CollectionsAPIDistributedZkTest.test-seed#[1DD2ACE0381532AA]) [    ] o.a.s.c.SolrXmlConfig Loading container configuration from /x1/jenkins/jenkins-slave/workspace/Lucene-Solr-NightlyTests-trunk/solr/build/solr-core/test/J1/temp/solr.cloud.CollectionsAPIDistributedZkTest_1DD2ACE0381532AA-001/shard-1-001/solr.xml
   [junit4]   2> 867051 INFO  (TEST-CollectionsAPIDistributedZkTest.test-seed#[1DD2ACE0381532AA]) [    ] o.a.s.c.CoresLocator Config-defined core root directory: /x1/jenkins/jenkins-slave/workspace/Lucene-Solr-NightlyTests-trunk/solr/build/solr-core/test/J1/temp/solr.cloud.CollectionsAPIDistributedZkTest_1DD2ACE0381532AA-001/shard-1-001/cores
   [junit4]   2> 867051 INFO  (TEST-CollectionsAPIDistributedZkTest.test-seed#[1DD2ACE0381532AA]) [    ] o.a.s.c.CoreContainer New CoreContainer 818231722
   [junit4]   2> 867052 INFO  (TEST-CollectionsAPIDistributedZkTest.test-seed#[1DD2ACE0381532AA]) [    ] o.a.s.c.CoreContainer Loading cores into CoreContainer [instanceDir=/x1/jenkins/jenkins-slave/workspace/Lucene-Solr-NightlyTests-trunk/solr/build/solr-core/test/J1/temp/solr.cloud.CollectionsAPIDistributedZkTest_1DD2ACE0381532AA-001/shard-1-001/]
   [junit4]   2> 867052 INFO  (TEST-CollectionsAPIDistributedZkTest.test-seed#[1DD2ACE0381532AA]) [    ] o.a.s.c.CoreContainer loading shared library: /x1/jenkins/jenkins-slave/workspace/Lucene-Solr-NightlyTests-trunk/solr/build/solr-core/test/J1/temp/solr.cloud.CollectionsAPIDistributedZkTest_1DD2ACE0381532AA-001/shard-1-001/lib
   [junit4]   2> 867052 WARN  (TEST-CollectionsAPIDistributedZkTest.test-seed#[1DD2ACE0381532AA]) [    ] o.a.s.c.SolrResourceLoader Can't find (or read) directory to add to classloader: lib (resolved as: /x1/jenkins/jenkins-slave/workspace/Lucene-Solr-NightlyTests-trunk/solr/build/solr-core/test/J1/temp/solr.cloud.CollectionsAPIDistributedZkTest_1DD2ACE0381532AA-001/shard-1-001/lib).
   [junit4]   2> 867060 INFO  (TEST-CollectionsAPIDistributedZkTe

[...truncated too long message...]

json
   [junit4]   2> 	5	/solr/configs/conf1
   [junit4]   2> 
   [junit4]   2> Maximum concurrent data watches above limit:
   [junit4]   2> 
   [junit4]   2> 	6	/solr/clusterstate.json
   [junit4]   2> 	3	/solr/overseer_elect/election/94740429052248068-127.0.0.1:51475_-n_0000000000
   [junit4]   2> 
   [junit4]   2> Maximum concurrent children watches above limit:
   [junit4]   2> 
   [junit4]   2> 	6	/solr/collections
   [junit4]   2> 	4	/solr/live_nodes
   [junit4]   2> 	3	/solr/overseer/queue
   [junit4]   2> 	3	/solr/overseer/collection-queue-work
   [junit4]   2> 
   [junit4]   2> NOTE: download the large Jenkins line-docs file by running 'ant get-jenkins-line-docs' in the lucene directory.
   [junit4]   2> NOTE: reproduce with: ant test  -Dtestcase=LeaderInitiatedRecoveryOnShardRestartTest -Dtests.method=testRestartWithAllInLIR -Dtests.seed=1DD2ACE0381532AA -Dtests.multiplier=2 -Dtests.nightly=true -Dtests.slow=true -Dtests.linedocsfile=/x1/jenkins/lucene-data/enwiki.random.lines.txt -Dtests.locale=hi -Dtests.timezone=Asia/Baghdad -Dtests.asserts=true -Dtests.file.encoding=UTF-8
   [junit4] ERROR    367s J2 | LeaderInitiatedRecoveryOnShardRestartTest.testRestartWithAllInLIR <<<
   [junit4]    > Throwable #1: java.lang.AssertionError: There are still nodes recoverying - waited for 330 seconds
   [junit4]    > 	at org.apache.solr.cloud.AbstractDistribZkTestBase.waitForRecoveriesToFinish(AbstractDistribZkTestBase.java:172)
   [junit4]    > 	at org.apache.solr.cloud.AbstractDistribZkTestBase.waitForRecoveriesToFinish(AbstractDistribZkTestBase.java:133)
   [junit4]    > 	at org.apache.solr.cloud.AbstractDistribZkTestBase.waitForRecoveriesToFinish(AbstractDistribZkTestBase.java:128)
   [junit4]    > 	at org.apache.solr.cloud.AbstractFullDistribZkTestBase.waitForRecoveriesToFinish(AbstractFullDistribZkTestBase.java:830)
   [junit4]    > 	at org.apache.solr.cloud.LeaderInitiatedRecoveryOnShardRestartTest.testRestartWithAllInLIR(LeaderInitiatedRecoveryOnShardRestartTest.java:81)
   [junit4]    > 	at org.apache.solr.BaseDistributedSearchTestCase$ShardsRepeatRule$ShardsFixedStatement.callStatement(BaseDistributedSearchTestCase.java:963)
   [junit4]    > 	at org.apache.solr.BaseDistributedSearchTestCase$ShardsRepeatRule$ShardsStatement.evaluate(BaseDistributedSearchTestCase.java:938)
   [junit4]    > 	at java.lang.Thread.run(Thread.java:745)Throwable #2: com.carrotsearch.randomizedtesting.UncaughtExceptionError: Captured an uncaught exception in thread: Thread[id=23831, name=coreZkRegister-5662-thread-1, state=RUNNABLE, group=TGRP-LeaderInitiatedRecoveryOnShardRestartTest]
   [junit4]    > Caused by: java.lang.AssertionError
   [junit4]    > 	at __randomizedtesting.SeedInfo.seed([1DD2ACE0381532AA]:0)
   [junit4]    > 	at org.apache.solr.cloud.ZkController.updateLeaderInitiatedRecoveryState(ZkController.java:2126)
   [junit4]    > 	at org.apache.solr.cloud.ShardLeaderElectionContext.runLeaderProcess(ElectionContext.java:433)
   [junit4]    > 	at org.apache.solr.cloud.LeaderElector.runIamLeaderProcess(LeaderElector.java:197)
   [junit4]    > 	at org.apache.solr.cloud.LeaderElector.checkIfIamLeader(LeaderElector.java:157)
   [junit4]    > 	at org.apache.solr.cloud.LeaderElector.joinElection(LeaderElector.java:346)
   [junit4]    > 	at org.apache.solr.cloud.ZkController.joinElection(ZkController.java:1113)
   [junit4]    > 	at org.apache.solr.cloud.ZkController.register(ZkController.java:926)
   [junit4]    > 	at org.apache.solr.cloud.ZkController.register(ZkController.java:881)
   [junit4]    > 	at org.apache.solr.core.ZkContainer$2.run(ZkContainer.java:183)
   [junit4]    > 	at org.apache.solr.common.util.ExecutorUtil$MDCAwareThreadPoolExecutor$1.run(ExecutorUtil.java:231)
   [junit4]    > 	at java.util.concurrent.ThreadPoolExecutor.runWorker(ThreadPoolExecutor.java:1142)
   [junit4]    > 	at java.util.concurrent.ThreadPoolExecutor$Worker.run(ThreadPoolExecutor.java:617)
   [junit4]    > 	at java.lang.Thread.run(Thread.java:745)
   [junit4]   2> 3168559 INFO  (SUITE-LeaderInitiatedRecoveryOnShardRestartTest-seed#[1DD2ACE0381532AA]-worker) [n:127.0.0.1:40215_ c:collection1 s:shard1 r:core_node2 x:collection1] o.a.s.SolrTestCaseJ4 ###deleteCore
   [junit4]   2> NOTE: leaving temporary files on disk at: /x1/jenkins/jenkins-slave/workspace/Lucene-Solr-NightlyTests-trunk/solr/build/solr-core/test/J2/temp/solr.cloud.LeaderInitiatedRecoveryOnShardRestartTest_1DD2ACE0381532AA-001
   [junit4]   2> Oct 23, 2015 2:23:09 PM com.carrotsearch.randomizedtesting.ThreadLeakControl checkThreadLeaks
   [junit4]   2> WARNING: Will linger awaiting termination of 1 leaked thread(s).
   [junit4]   2> NOTE: test params are: codec=Asserting(Lucene53): {}, docValues:{}, sim=ClassicSimilarity, locale=hi, timezone=Asia/Baghdad
   [junit4]   2> NOTE: Linux 3.13.0-52-generic amd64/Oracle Corporation 1.8.0_45 (64-bit)/cpus=4,threads=1,free=156379472,total=527958016
   [junit4]   2> NOTE: All tests run in this JVM: [ParsingFieldUpdateProcessorsTest, CloudExitableDirectoryReaderTest, DocValuesMultiTest, SampleTest, ClusterStateTest, AsyncMigrateRouteKeyTest, TestIndexSearcher, RegexBoostProcessorTest, BufferStoreTest, ResponseHeaderTest, SystemInfoHandlerTest, TestMiniSolrCloudClusterBase, AsyncCallRequestStatusResponseTest, BasicDistributedZk2Test, TestSweetSpotSimilarityFactory, SuggesterTSTTest, TestSearchPerf, ShowFileRequestHandlerTest, BinaryUpdateRequestHandlerTest, TestConfigReload, MergeStrategyTest, TestSystemIdResolver, TestSolrCLIRunExample, AutoCommitTest, RequestHandlersTest, TestPostingsSolrHighlighter, TestCloudManagedSchema, TestSolrDeletionPolicy1, TestImplicitCoreProperties, TestSha256AuthenticationProvider, CurrencyFieldXmlFileTest, QueryResultKeyTest, TestZkChroot, ZkStateReaderTest, StatsComponentTest, DistributedFacetPivotSmallAdvancedTest, TestCharFilters, SearchHandlerTest, FieldMutatingUpdateProcessorTest, OverriddenZkACLAndCredentialsProvidersTest, TestSolrQueryParser, TestFastWriter, AnalysisErrorHandlingTest, ScriptEngineTest, TestMinMaxOnMultiValuedField, TestTrieFacet, TriLevelCompositeIdRoutingTest, TestSolrIndexConfig, DirectUpdateHandlerOptimizeTest, TestXIncludeConfig, SuggesterWFSTTest, StatelessScriptUpdateProcessorFactoryTest, SuggestComponentContextFilterQueryTest, TestRecovery, TestCoreDiscovery, StressHdfsTest, TestShardHandlerFactory, RAMDirectoryFactoryTest, TestSolrCloudWithKerberosAlt, TermVectorComponentDistributedTest, TestPerFieldSimilarity, DebugComponentTest, TestStressReorder, DateRangeFieldTest, TestFuzzyAnalyzedSuggestions, TestLRUStatsCache, DistributedFacetPivotSmallTest, TestReqParamsAPI, TestSort, AddBlockUpdateTest, FullSolrCloudDistribCmdsTest, TestSearcherReuse, SecurityConfHandlerTest, TestElisionMultitermQuery, BadComponentTest, UnloadDistributedZkTest, ZkNodePropsTest, DistributedDebugComponentTest, TestReplicationHandlerBackup, HardAutoCommitTest, LukeRequestHandlerTest, TestLRUCache, TestCursorMarkWithoutUniqueKey, TestReRankQParserPlugin, TestManagedSchemaDynamicFieldResource, TestFastLRUCache, HdfsChaosMonkeySafeLeaderTest, SimpleFacetsTest, BasicDistributedZkTest, ChaosMonkeySafeLeaderTest, OpenCloseCoreStressTest, OverseerTest, ZkCLITest, TestDistributedGrouping, TestFaceting, TestHashPartitioner, SolrCoreTest, TestGroupingSearch, TestFunctionQuery, TestLazyCores, DirectUpdateHandlerTest, HighlighterTest, SoftAutoCommitTest, TestFoldingMultitermQuery, SuggesterTest, SpatialFilterTest, SolrCoreCheckLockOnStartupTest, TestUpdate, DefaultValueUpdateProcessorTest, TestRemoteStreaming, IndexBasedSpellCheckerTest, TestQueryUtils, TestWriterPerf, TestQueryTypes, TestOmitPositions, TermsComponentTest, TestIndexingPerformance, RequiredFieldsTest, FastVectorHighlighterTest, TestJmxIntegration, ReturnFieldsTest, MBeansHandlerTest, TestAnalyzedSuggestions, TestPartialUpdateDeduplication, TestPHPSerializedResponseWriter, CSVRequestHandlerTest, TestComponentsName, TestBinaryResponseWriter, TestLFUCache, PrimUtilsTest, TestSuggestSpellingConverter, SpellingQueryConverterTest, UUIDFieldTest, FileUtilsTest, CircularListTest, DistributedMLTComponentTest, TestRTGBase, CursorPagingTest, DistributedIntervalFacetingTest, CdcrVersionReplicationTest, CleanupOldIndexTest, CollectionStateFormat2Test, CollectionsAPIAsyncDistributedZkTest, ConcurrentDeleteAndCreateCollectionTest, DeleteShardTest, DistribDocExpirationUpdateProcessorTest, DistributedVersionInfoTest, LeaderFailoverAfterPartitionTest, LeaderInitiatedRecoveryOnShardRestartTest]
   [junit4] Completed [423/552] on J2 in 367.67s, 1 test, 1 error <<< FAILURES!

[...truncated 425 lines...]
BUILD FAILED
/x1/jenkins/jenkins-slave/workspace/Lucene-Solr-NightlyTests-trunk/build.xml:782: The following error occurred while executing this line:
/x1/jenkins/jenkins-slave/workspace/Lucene-Solr-NightlyTests-trunk/build.xml:719: The following error occurred while executing this line:
/x1/jenkins/jenkins-slave/workspace/Lucene-Solr-NightlyTests-trunk/build.xml:59: The following error occurred while executing this line:
/x1/jenkins/jenkins-slave/workspace/Lucene-Solr-NightlyTests-trunk/solr/build.xml:233: The following error occurred while executing this line:
/x1/jenkins/jenkins-slave/workspace/Lucene-Solr-NightlyTests-trunk/solr/common-build.xml:516: The following error occurred while executing this line:
/x1/jenkins/jenkins-slave/workspace/Lucene-Solr-NightlyTests-trunk/lucene/common-build.xml:1432: The following error occurred while executing this line:
/x1/jenkins/jenkins-slave/workspace/Lucene-Solr-NightlyTests-trunk/lucene/common-build.xml:987: There were test failures: 552 suites (8 ignored), 2172 tests, 2 errors, 2 failures, 31 ignored (18 assumptions) [seed: 1DD2ACE0381532AA]

Total time: 186 minutes 4 seconds
Build step 'Invoke Ant' marked build as failure
Archiving artifacts
No prior successful build to compare, so performing full copy of artifacts
Recording test results
Email was triggered for: Failure - Any
Sending email for trigger: Failure - Any



Mime
View raw message