lucene-dev mailing list archives

Site index · List index
Message view « Date » · « Thread »
Top « Date » · « Thread »
From Policeman Jenkins Server <jenk...@thetaphi.de>
Subject [JENKINS-EA] Lucene-Solr-trunk-Linux (64bit/jdk1.9.0-ea-b78) - Build # 14379 - Failure!
Date Fri, 02 Oct 2015 11:23:34 GMT
Build: http://jenkins.thetaphi.de/job/Lucene-Solr-trunk-Linux/14379/
Java: 64bit/jdk1.9.0-ea-b78 -XX:-UseCompressedOops -XX:+UseParallelGC

3 tests failed.
FAILED:  junit.framework.TestSuite.org.apache.solr.cloud.TestSolrCloudWithKerberosAlt

Error Message:
5 threads leaked from SUITE scope at org.apache.solr.cloud.TestSolrCloudWithKerberosAlt:     1) Thread[id=10455, name=changePwdReplayCache.data, state=TIMED_WAITING, group=TGRP-TestSolrCloudWithKerberosAlt]         at sun.misc.Unsafe.park(Native Method)         at java.util.concurrent.locks.LockSupport.parkNanos(LockSupport.java:215)         at java.util.concurrent.locks.AbstractQueuedSynchronizer$ConditionObject.awaitNanos(AbstractQueuedSynchronizer.java:2078)         at java.util.concurrent.ScheduledThreadPoolExecutor$DelayedWorkQueue.take(ScheduledThreadPoolExecutor.java:1093)         at java.util.concurrent.ScheduledThreadPoolExecutor$DelayedWorkQueue.take(ScheduledThreadPoolExecutor.java:809)         at java.util.concurrent.ThreadPoolExecutor.getTask(ThreadPoolExecutor.java:1067)         at java.util.concurrent.ThreadPoolExecutor.runWorker(ThreadPoolExecutor.java:1127)         at java.util.concurrent.ThreadPoolExecutor$Worker.run(ThreadPoolExecutor.java:617)         at java.lang.Thread.run(Thread.java:746)    2) Thread[id=10457, name=groupCache.data, state=TIMED_WAITING, group=TGRP-TestSolrCloudWithKerberosAlt]         at sun.misc.Unsafe.park(Native Method)         at java.util.concurrent.locks.LockSupport.parkNanos(LockSupport.java:215)         at java.util.concurrent.locks.AbstractQueuedSynchronizer$ConditionObject.awaitNanos(AbstractQueuedSynchronizer.java:2078)         at java.util.concurrent.ScheduledThreadPoolExecutor$DelayedWorkQueue.take(ScheduledThreadPoolExecutor.java:1093)         at java.util.concurrent.ScheduledThreadPoolExecutor$DelayedWorkQueue.take(ScheduledThreadPoolExecutor.java:809)         at java.util.concurrent.ThreadPoolExecutor.getTask(ThreadPoolExecutor.java:1067)         at java.util.concurrent.ThreadPoolExecutor.runWorker(ThreadPoolExecutor.java:1127)         at java.util.concurrent.ThreadPoolExecutor$Worker.run(ThreadPoolExecutor.java:617)         at java.lang.Thread.run(Thread.java:746)    3) Thread[id=10454, name=apacheds, state=WAITING, group=TGRP-TestSolrCloudWithKerberosAlt]         at java.lang.Object.wait(Native Method)         at java.lang.Object.wait(Object.java:516)         at java.util.TimerThread.mainLoop(Timer.java:526)         at java.util.TimerThread.run(Timer.java:505)    4) Thread[id=10458, name=ou=system.data, state=TIMED_WAITING, group=TGRP-TestSolrCloudWithKerberosAlt]         at sun.misc.Unsafe.park(Native Method)         at java.util.concurrent.locks.LockSupport.parkNanos(LockSupport.java:215)         at java.util.concurrent.locks.AbstractQueuedSynchronizer$ConditionObject.awaitNanos(AbstractQueuedSynchronizer.java:2078)         at java.util.concurrent.ScheduledThreadPoolExecutor$DelayedWorkQueue.take(ScheduledThreadPoolExecutor.java:1093)         at java.util.concurrent.ScheduledThreadPoolExecutor$DelayedWorkQueue.take(ScheduledThreadPoolExecutor.java:809)         at java.util.concurrent.ThreadPoolExecutor.getTask(ThreadPoolExecutor.java:1067)         at java.util.concurrent.ThreadPoolExecutor.runWorker(ThreadPoolExecutor.java:1127)         at java.util.concurrent.ThreadPoolExecutor$Worker.run(ThreadPoolExecutor.java:617)         at java.lang.Thread.run(Thread.java:746)    5) Thread[id=10456, name=kdcReplayCache.data, state=TIMED_WAITING, group=TGRP-TestSolrCloudWithKerberosAlt]         at sun.misc.Unsafe.park(Native Method)         at java.util.concurrent.locks.LockSupport.parkNanos(LockSupport.java:215)         at java.util.concurrent.locks.AbstractQueuedSynchronizer$ConditionObject.awaitNanos(AbstractQueuedSynchronizer.java:2078)         at java.util.concurrent.ScheduledThreadPoolExecutor$DelayedWorkQueue.take(ScheduledThreadPoolExecutor.java:1093)         at java.util.concurrent.ScheduledThreadPoolExecutor$DelayedWorkQueue.take(ScheduledThreadPoolExecutor.java:809)         at java.util.concurrent.ThreadPoolExecutor.getTask(ThreadPoolExecutor.java:1067)         at java.util.concurrent.ThreadPoolExecutor.runWorker(ThreadPoolExecutor.java:1127)         at java.util.concurrent.ThreadPoolExecutor$Worker.run(ThreadPoolExecutor.java:617)         at java.lang.Thread.run(Thread.java:746)

Stack Trace:
com.carrotsearch.randomizedtesting.ThreadLeakError: 5 threads leaked from SUITE scope at org.apache.solr.cloud.TestSolrCloudWithKerberosAlt: 
   1) Thread[id=10455, name=changePwdReplayCache.data, state=TIMED_WAITING, group=TGRP-TestSolrCloudWithKerberosAlt]
        at sun.misc.Unsafe.park(Native Method)
        at java.util.concurrent.locks.LockSupport.parkNanos(LockSupport.java:215)
        at java.util.concurrent.locks.AbstractQueuedSynchronizer$ConditionObject.awaitNanos(AbstractQueuedSynchronizer.java:2078)
        at java.util.concurrent.ScheduledThreadPoolExecutor$DelayedWorkQueue.take(ScheduledThreadPoolExecutor.java:1093)
        at java.util.concurrent.ScheduledThreadPoolExecutor$DelayedWorkQueue.take(ScheduledThreadPoolExecutor.java:809)
        at java.util.concurrent.ThreadPoolExecutor.getTask(ThreadPoolExecutor.java:1067)
        at java.util.concurrent.ThreadPoolExecutor.runWorker(ThreadPoolExecutor.java:1127)
        at java.util.concurrent.ThreadPoolExecutor$Worker.run(ThreadPoolExecutor.java:617)
        at java.lang.Thread.run(Thread.java:746)
   2) Thread[id=10457, name=groupCache.data, state=TIMED_WAITING, group=TGRP-TestSolrCloudWithKerberosAlt]
        at sun.misc.Unsafe.park(Native Method)
        at java.util.concurrent.locks.LockSupport.parkNanos(LockSupport.java:215)
        at java.util.concurrent.locks.AbstractQueuedSynchronizer$ConditionObject.awaitNanos(AbstractQueuedSynchronizer.java:2078)
        at java.util.concurrent.ScheduledThreadPoolExecutor$DelayedWorkQueue.take(ScheduledThreadPoolExecutor.java:1093)
        at java.util.concurrent.ScheduledThreadPoolExecutor$DelayedWorkQueue.take(ScheduledThreadPoolExecutor.java:809)
        at java.util.concurrent.ThreadPoolExecutor.getTask(ThreadPoolExecutor.java:1067)
        at java.util.concurrent.ThreadPoolExecutor.runWorker(ThreadPoolExecutor.java:1127)
        at java.util.concurrent.ThreadPoolExecutor$Worker.run(ThreadPoolExecutor.java:617)
        at java.lang.Thread.run(Thread.java:746)
   3) Thread[id=10454, name=apacheds, state=WAITING, group=TGRP-TestSolrCloudWithKerberosAlt]
        at java.lang.Object.wait(Native Method)
        at java.lang.Object.wait(Object.java:516)
        at java.util.TimerThread.mainLoop(Timer.java:526)
        at java.util.TimerThread.run(Timer.java:505)
   4) Thread[id=10458, name=ou=system.data, state=TIMED_WAITING, group=TGRP-TestSolrCloudWithKerberosAlt]
        at sun.misc.Unsafe.park(Native Method)
        at java.util.concurrent.locks.LockSupport.parkNanos(LockSupport.java:215)
        at java.util.concurrent.locks.AbstractQueuedSynchronizer$ConditionObject.awaitNanos(AbstractQueuedSynchronizer.java:2078)
        at java.util.concurrent.ScheduledThreadPoolExecutor$DelayedWorkQueue.take(ScheduledThreadPoolExecutor.java:1093)
        at java.util.concurrent.ScheduledThreadPoolExecutor$DelayedWorkQueue.take(ScheduledThreadPoolExecutor.java:809)
        at java.util.concurrent.ThreadPoolExecutor.getTask(ThreadPoolExecutor.java:1067)
        at java.util.concurrent.ThreadPoolExecutor.runWorker(ThreadPoolExecutor.java:1127)
        at java.util.concurrent.ThreadPoolExecutor$Worker.run(ThreadPoolExecutor.java:617)
        at java.lang.Thread.run(Thread.java:746)
   5) Thread[id=10456, name=kdcReplayCache.data, state=TIMED_WAITING, group=TGRP-TestSolrCloudWithKerberosAlt]
        at sun.misc.Unsafe.park(Native Method)
        at java.util.concurrent.locks.LockSupport.parkNanos(LockSupport.java:215)
        at java.util.concurrent.locks.AbstractQueuedSynchronizer$ConditionObject.awaitNanos(AbstractQueuedSynchronizer.java:2078)
        at java.util.concurrent.ScheduledThreadPoolExecutor$DelayedWorkQueue.take(ScheduledThreadPoolExecutor.java:1093)
        at java.util.concurrent.ScheduledThreadPoolExecutor$DelayedWorkQueue.take(ScheduledThreadPoolExecutor.java:809)
        at java.util.concurrent.ThreadPoolExecutor.getTask(ThreadPoolExecutor.java:1067)
        at java.util.concurrent.ThreadPoolExecutor.runWorker(ThreadPoolExecutor.java:1127)
        at java.util.concurrent.ThreadPoolExecutor$Worker.run(ThreadPoolExecutor.java:617)
        at java.lang.Thread.run(Thread.java:746)
	at __randomizedtesting.SeedInfo.seed([DFE79BF1850BBAA7]:0)


FAILED:  junit.framework.TestSuite.org.apache.solr.cloud.TestSolrCloudWithKerberosAlt

Error Message:
There are still zombie threads that couldn't be terminated:    1) Thread[id=10455, name=changePwdReplayCache.data, state=TIMED_WAITING, group=TGRP-TestSolrCloudWithKerberosAlt]         at sun.misc.Unsafe.park(Native Method)         at java.util.concurrent.locks.LockSupport.parkNanos(LockSupport.java:215)         at java.util.concurrent.locks.AbstractQueuedSynchronizer$ConditionObject.awaitNanos(AbstractQueuedSynchronizer.java:2078)         at java.util.concurrent.ScheduledThreadPoolExecutor$DelayedWorkQueue.take(ScheduledThreadPoolExecutor.java:1093)         at java.util.concurrent.ScheduledThreadPoolExecutor$DelayedWorkQueue.take(ScheduledThreadPoolExecutor.java:809)         at java.util.concurrent.ThreadPoolExecutor.getTask(ThreadPoolExecutor.java:1067)         at java.util.concurrent.ThreadPoolExecutor.runWorker(ThreadPoolExecutor.java:1127)         at java.util.concurrent.ThreadPoolExecutor$Worker.run(ThreadPoolExecutor.java:617)         at java.lang.Thread.run(Thread.java:746)    2) Thread[id=10457, name=groupCache.data, state=TIMED_WAITING, group=TGRP-TestSolrCloudWithKerberosAlt]         at sun.misc.Unsafe.park(Native Method)         at java.util.concurrent.locks.LockSupport.parkNanos(LockSupport.java:215)         at java.util.concurrent.locks.AbstractQueuedSynchronizer$ConditionObject.awaitNanos(AbstractQueuedSynchronizer.java:2078)         at java.util.concurrent.ScheduledThreadPoolExecutor$DelayedWorkQueue.take(ScheduledThreadPoolExecutor.java:1093)         at java.util.concurrent.ScheduledThreadPoolExecutor$DelayedWorkQueue.take(ScheduledThreadPoolExecutor.java:809)         at java.util.concurrent.ThreadPoolExecutor.getTask(ThreadPoolExecutor.java:1067)         at java.util.concurrent.ThreadPoolExecutor.runWorker(ThreadPoolExecutor.java:1127)         at java.util.concurrent.ThreadPoolExecutor$Worker.run(ThreadPoolExecutor.java:617)         at java.lang.Thread.run(Thread.java:746)    3) Thread[id=10454, name=apacheds, state=WAITING, group=TGRP-TestSolrCloudWithKerberosAlt]         at java.lang.Object.wait(Native Method)         at java.lang.Object.wait(Object.java:516)         at java.util.TimerThread.mainLoop(Timer.java:526)         at java.util.TimerThread.run(Timer.java:505)    4) Thread[id=10458, name=ou=system.data, state=TIMED_WAITING, group=TGRP-TestSolrCloudWithKerberosAlt]         at sun.misc.Unsafe.park(Native Method)         at java.util.concurrent.locks.LockSupport.parkNanos(LockSupport.java:215)         at java.util.concurrent.locks.AbstractQueuedSynchronizer$ConditionObject.awaitNanos(AbstractQueuedSynchronizer.java:2078)         at java.util.concurrent.ScheduledThreadPoolExecutor$DelayedWorkQueue.take(ScheduledThreadPoolExecutor.java:1093)         at java.util.concurrent.ScheduledThreadPoolExecutor$DelayedWorkQueue.take(ScheduledThreadPoolExecutor.java:809)         at java.util.concurrent.ThreadPoolExecutor.getTask(ThreadPoolExecutor.java:1067)         at java.util.concurrent.ThreadPoolExecutor.runWorker(ThreadPoolExecutor.java:1127)         at java.util.concurrent.ThreadPoolExecutor$Worker.run(ThreadPoolExecutor.java:617)         at java.lang.Thread.run(Thread.java:746)    5) Thread[id=10456, name=kdcReplayCache.data, state=TIMED_WAITING, group=TGRP-TestSolrCloudWithKerberosAlt]         at sun.misc.Unsafe.park(Native Method)         at java.util.concurrent.locks.LockSupport.parkNanos(LockSupport.java:215)         at java.util.concurrent.locks.AbstractQueuedSynchronizer$ConditionObject.awaitNanos(AbstractQueuedSynchronizer.java:2078)         at java.util.concurrent.ScheduledThreadPoolExecutor$DelayedWorkQueue.take(ScheduledThreadPoolExecutor.java:1093)         at java.util.concurrent.ScheduledThreadPoolExecutor$DelayedWorkQueue.take(ScheduledThreadPoolExecutor.java:809)         at java.util.concurrent.ThreadPoolExecutor.getTask(ThreadPoolExecutor.java:1067)         at java.util.concurrent.ThreadPoolExecutor.runWorker(ThreadPoolExecutor.java:1127)         at java.util.concurrent.ThreadPoolExecutor$Worker.run(ThreadPoolExecutor.java:617)         at java.lang.Thread.run(Thread.java:746)

Stack Trace:
com.carrotsearch.randomizedtesting.ThreadLeakError: There are still zombie threads that couldn't be terminated:
   1) Thread[id=10455, name=changePwdReplayCache.data, state=TIMED_WAITING, group=TGRP-TestSolrCloudWithKerberosAlt]
        at sun.misc.Unsafe.park(Native Method)
        at java.util.concurrent.locks.LockSupport.parkNanos(LockSupport.java:215)
        at java.util.concurrent.locks.AbstractQueuedSynchronizer$ConditionObject.awaitNanos(AbstractQueuedSynchronizer.java:2078)
        at java.util.concurrent.ScheduledThreadPoolExecutor$DelayedWorkQueue.take(ScheduledThreadPoolExecutor.java:1093)
        at java.util.concurrent.ScheduledThreadPoolExecutor$DelayedWorkQueue.take(ScheduledThreadPoolExecutor.java:809)
        at java.util.concurrent.ThreadPoolExecutor.getTask(ThreadPoolExecutor.java:1067)
        at java.util.concurrent.ThreadPoolExecutor.runWorker(ThreadPoolExecutor.java:1127)
        at java.util.concurrent.ThreadPoolExecutor$Worker.run(ThreadPoolExecutor.java:617)
        at java.lang.Thread.run(Thread.java:746)
   2) Thread[id=10457, name=groupCache.data, state=TIMED_WAITING, group=TGRP-TestSolrCloudWithKerberosAlt]
        at sun.misc.Unsafe.park(Native Method)
        at java.util.concurrent.locks.LockSupport.parkNanos(LockSupport.java:215)
        at java.util.concurrent.locks.AbstractQueuedSynchronizer$ConditionObject.awaitNanos(AbstractQueuedSynchronizer.java:2078)
        at java.util.concurrent.ScheduledThreadPoolExecutor$DelayedWorkQueue.take(ScheduledThreadPoolExecutor.java:1093)
        at java.util.concurrent.ScheduledThreadPoolExecutor$DelayedWorkQueue.take(ScheduledThreadPoolExecutor.java:809)
        at java.util.concurrent.ThreadPoolExecutor.getTask(ThreadPoolExecutor.java:1067)
        at java.util.concurrent.ThreadPoolExecutor.runWorker(ThreadPoolExecutor.java:1127)
        at java.util.concurrent.ThreadPoolExecutor$Worker.run(ThreadPoolExecutor.java:617)
        at java.lang.Thread.run(Thread.java:746)
   3) Thread[id=10454, name=apacheds, state=WAITING, group=TGRP-TestSolrCloudWithKerberosAlt]
        at java.lang.Object.wait(Native Method)
        at java.lang.Object.wait(Object.java:516)
        at java.util.TimerThread.mainLoop(Timer.java:526)
        at java.util.TimerThread.run(Timer.java:505)
   4) Thread[id=10458, name=ou=system.data, state=TIMED_WAITING, group=TGRP-TestSolrCloudWithKerberosAlt]
        at sun.misc.Unsafe.park(Native Method)
        at java.util.concurrent.locks.LockSupport.parkNanos(LockSupport.java:215)
        at java.util.concurrent.locks.AbstractQueuedSynchronizer$ConditionObject.awaitNanos(AbstractQueuedSynchronizer.java:2078)
        at java.util.concurrent.ScheduledThreadPoolExecutor$DelayedWorkQueue.take(ScheduledThreadPoolExecutor.java:1093)
        at java.util.concurrent.ScheduledThreadPoolExecutor$DelayedWorkQueue.take(ScheduledThreadPoolExecutor.java:809)
        at java.util.concurrent.ThreadPoolExecutor.getTask(ThreadPoolExecutor.java:1067)
        at java.util.concurrent.ThreadPoolExecutor.runWorker(ThreadPoolExecutor.java:1127)
        at java.util.concurrent.ThreadPoolExecutor$Worker.run(ThreadPoolExecutor.java:617)
        at java.lang.Thread.run(Thread.java:746)
   5) Thread[id=10456, name=kdcReplayCache.data, state=TIMED_WAITING, group=TGRP-TestSolrCloudWithKerberosAlt]
        at sun.misc.Unsafe.park(Native Method)
        at java.util.concurrent.locks.LockSupport.parkNanos(LockSupport.java:215)
        at java.util.concurrent.locks.AbstractQueuedSynchronizer$ConditionObject.awaitNanos(AbstractQueuedSynchronizer.java:2078)
        at java.util.concurrent.ScheduledThreadPoolExecutor$DelayedWorkQueue.take(ScheduledThreadPoolExecutor.java:1093)
        at java.util.concurrent.ScheduledThreadPoolExecutor$DelayedWorkQueue.take(ScheduledThreadPoolExecutor.java:809)
        at java.util.concurrent.ThreadPoolExecutor.getTask(ThreadPoolExecutor.java:1067)
        at java.util.concurrent.ThreadPoolExecutor.runWorker(ThreadPoolExecutor.java:1127)
        at java.util.concurrent.ThreadPoolExecutor$Worker.run(ThreadPoolExecutor.java:617)
        at java.lang.Thread.run(Thread.java:746)
	at __randomizedtesting.SeedInfo.seed([DFE79BF1850BBAA7]:0)


FAILED:  org.apache.solr.cloud.TestSolrCloudWithKerberosAlt.testBasics

Error Message:
org.apache.directory.api.ldap.model.exception.LdapOtherException: ERR_04447_CANNOT_NORMALIZE_VALUE Cannot normalize the wrapped value ERR_04473_NOT_VALID_VALUE Not a valid value '20090818022733Z' for the AttributeType 'ATTRIBUTE_TYPE ( 1.3.6.1.4.1.18060.0.4.1.2.35  NAME 'schemaModifyTimestamp'  DESC time which schema was modified  SUP modifyTimestamp  EQUALITY generalizedTimeMatch  ORDERING generalizedTimeOrderingMatch  SYNTAX 1.3.6.1.4.1.1466.115.121.1.24  USAGE directoryOperation  ) '

Stack Trace:
org.apache.directory.api.ldap.model.exception.LdapOtherException: org.apache.directory.api.ldap.model.exception.LdapOtherException: ERR_04447_CANNOT_NORMALIZE_VALUE Cannot normalize the wrapped value ERR_04473_NOT_VALID_VALUE Not a valid value '20090818022733Z' for the AttributeType 'ATTRIBUTE_TYPE ( 1.3.6.1.4.1.18060.0.4.1.2.35
 NAME 'schemaModifyTimestamp'
 DESC time which schema was modified
 SUP modifyTimestamp
 EQUALITY generalizedTimeMatch
 ORDERING generalizedTimeOrderingMatch
 SYNTAX 1.3.6.1.4.1.1466.115.121.1.24
 USAGE directoryOperation
 )
'
	at __randomizedtesting.SeedInfo.seed([DFE79BF1850BBAA7:E23F35DDBDE5E4D7]:0)
	at org.apache.directory.server.core.api.partition.AbstractPartition.initialize(AbstractPartition.java:84)
	at org.apache.directory.server.core.DefaultDirectoryService.initialize(DefaultDirectoryService.java:1808)
	at org.apache.directory.server.core.DefaultDirectoryService.startup(DefaultDirectoryService.java:1248)
	at org.apache.hadoop.minikdc.MiniKdc.initDirectoryService(MiniKdc.java:383)
	at org.apache.hadoop.minikdc.MiniKdc.start(MiniKdc.java:319)
	at org.apache.solr.cloud.TestSolrCloudWithKerberosAlt.setupMiniKdc(TestSolrCloudWithKerberosAlt.java:105)
	at org.apache.solr.cloud.TestSolrCloudWithKerberosAlt.setUp(TestSolrCloudWithKerberosAlt.java:94)
	at sun.reflect.GeneratedMethodAccessor8.invoke(Unknown Source)
	at sun.reflect.DelegatingMethodAccessorImpl.invoke(DelegatingMethodAccessorImpl.java:43)
	at java.lang.reflect.Method.invoke(Method.java:504)
	at com.carrotsearch.randomizedtesting.RandomizedRunner.invoke(RandomizedRunner.java:1665)
	at com.carrotsearch.randomizedtesting.RandomizedRunner$9.evaluate(RandomizedRunner.java:898)
	at com.carrotsearch.randomizedtesting.RandomizedRunner$10.evaluate(RandomizedRunner.java:914)
	at com.carrotsearch.randomizedtesting.rules.SystemPropertiesRestoreRule$1.evaluate(SystemPropertiesRestoreRule.java:57)
	at org.apache.lucene.util.TestRuleSetupTeardownChained$1.evaluate(TestRuleSetupTeardownChained.java:50)
	at org.apache.lucene.util.AbstractBeforeAfterRule$1.evaluate(AbstractBeforeAfterRule.java:46)
	at org.apache.lucene.util.TestRuleThreadAndTestName$1.evaluate(TestRuleThreadAndTestName.java:49)
	at org.apache.lucene.util.TestRuleIgnoreAfterMaxFailures$1.evaluate(TestRuleIgnoreAfterMaxFailures.java:65)
	at org.apache.lucene.util.TestRuleMarkFailure$1.evaluate(TestRuleMarkFailure.java:48)
	at com.carrotsearch.randomizedtesting.rules.StatementAdapter.evaluate(StatementAdapter.java:36)
	at com.carrotsearch.randomizedtesting.ThreadLeakControl$StatementRunner.run(ThreadLeakControl.java:367)
	at com.carrotsearch.randomizedtesting.ThreadLeakControl.forkTimeoutingTask(ThreadLeakControl.java:809)
	at com.carrotsearch.randomizedtesting.ThreadLeakControl$3.evaluate(ThreadLeakControl.java:460)
	at com.carrotsearch.randomizedtesting.RandomizedRunner.runSingleTest(RandomizedRunner.java:873)
	at com.carrotsearch.randomizedtesting.RandomizedRunner$5.evaluate(RandomizedRunner.java:775)
	at com.carrotsearch.randomizedtesting.RandomizedRunner$6.evaluate(RandomizedRunner.java:809)
	at com.carrotsearch.randomizedtesting.RandomizedRunner$7.evaluate(RandomizedRunner.java:820)
	at com.carrotsearch.randomizedtesting.rules.StatementAdapter.evaluate(StatementAdapter.java:36)
	at com.carrotsearch.randomizedtesting.rules.SystemPropertiesRestoreRule$1.evaluate(SystemPropertiesRestoreRule.java:57)
	at org.apache.lucene.util.AbstractBeforeAfterRule$1.evaluate(AbstractBeforeAfterRule.java:46)
	at com.carrotsearch.randomizedtesting.rules.StatementAdapter.evaluate(StatementAdapter.java:36)
	at org.apache.lucene.util.TestRuleStoreClassName$1.evaluate(TestRuleStoreClassName.java:42)
	at com.carrotsearch.randomizedtesting.rules.NoShadowingOrOverridesOnMethodsRule$1.evaluate(NoShadowingOrOverridesOnMethodsRule.java:39)
	at com.carrotsearch.randomizedtesting.rules.NoShadowingOrOverridesOnMethodsRule$1.evaluate(NoShadowingOrOverridesOnMethodsRule.java:39)
	at com.carrotsearch.randomizedtesting.rules.StatementAdapter.evaluate(StatementAdapter.java:36)
	at com.carrotsearch.randomizedtesting.rules.StatementAdapter.evaluate(StatementAdapter.java:36)
	at com.carrotsearch.randomizedtesting.rules.StatementAdapter.evaluate(StatementAdapter.java:36)
	at org.apache.lucene.util.TestRuleAssertionsRequired$1.evaluate(TestRuleAssertionsRequired.java:54)
	at org.apache.lucene.util.TestRuleMarkFailure$1.evaluate(TestRuleMarkFailure.java:48)
	at org.apache.lucene.util.TestRuleIgnoreAfterMaxFailures$1.evaluate(TestRuleIgnoreAfterMaxFailures.java:65)
	at org.apache.lucene.util.TestRuleIgnoreTestSuites$1.evaluate(TestRuleIgnoreTestSuites.java:55)
	at com.carrotsearch.randomizedtesting.rules.StatementAdapter.evaluate(StatementAdapter.java:36)
	at com.carrotsearch.randomizedtesting.ThreadLeakControl$StatementRunner.run(ThreadLeakControl.java:367)
	at java.lang.Thread.run(Thread.java:746)
Caused by: java.lang.RuntimeException: org.apache.directory.api.ldap.model.exception.LdapOtherException: ERR_04447_CANNOT_NORMALIZE_VALUE Cannot normalize the wrapped value ERR_04473_NOT_VALID_VALUE Not a valid value '20090818022733Z' for the AttributeType 'ATTRIBUTE_TYPE ( 1.3.6.1.4.1.18060.0.4.1.2.35
 NAME 'schemaModifyTimestamp'
 DESC time which schema was modified
 SUP modifyTimestamp
 EQUALITY generalizedTimeMatch
 ORDERING generalizedTimeOrderingMatch
 SYNTAX 1.3.6.1.4.1.1466.115.121.1.24
 USAGE directoryOperation
 )
'
	at org.apache.directory.server.core.api.schema.SchemaPartition.doInit(SchemaPartition.java:226)
	at org.apache.directory.server.core.api.partition.AbstractPartition.initialize(AbstractPartition.java:79)
	... 43 more
Caused by: org.apache.directory.api.ldap.model.exception.LdapOtherException: ERR_04447_CANNOT_NORMALIZE_VALUE Cannot normalize the wrapped value ERR_04473_NOT_VALID_VALUE Not a valid value '20090818022733Z' for the AttributeType 'ATTRIBUTE_TYPE ( 1.3.6.1.4.1.18060.0.4.1.2.35
 NAME 'schemaModifyTimestamp'
 DESC time which schema was modified
 SUP modifyTimestamp
 EQUALITY generalizedTimeMatch
 ORDERING generalizedTimeOrderingMatch
 SYNTAX 1.3.6.1.4.1.1466.115.121.1.24
 USAGE directoryOperation
 )
'
	at org.apache.directory.server.core.api.partition.AbstractPartition.initialize(AbstractPartition.java:84)
	at org.apache.directory.server.core.api.schema.SchemaPartition.doInit(SchemaPartition.java:219)
	... 44 more
Caused by: org.apache.directory.api.ldap.model.exception.LdapInvalidAttributeValueException: ERR_04447_CANNOT_NORMALIZE_VALUE Cannot normalize the wrapped value ERR_04473_NOT_VALID_VALUE Not a valid value '20090818022733Z' for the AttributeType 'ATTRIBUTE_TYPE ( 1.3.6.1.4.1.18060.0.4.1.2.35
 NAME 'schemaModifyTimestamp'
 DESC time which schema was modified
 SUP modifyTimestamp
 EQUALITY generalizedTimeMatch
 ORDERING generalizedTimeOrderingMatch
 SYNTAX 1.3.6.1.4.1.1466.115.121.1.24
 USAGE directoryOperation
 )
'
	at org.apache.directory.api.ldap.model.entry.AbstractValue.apply(AbstractValue.java:211)
	at org.apache.directory.api.ldap.model.entry.StringValue.<init>(StringValue.java:107)
	at org.apache.directory.api.ldap.model.entry.DefaultAttribute.<init>(DefaultAttribute.java:468)
	at org.apache.directory.api.ldap.model.entry.DefaultEntry.<init>(DefaultEntry.java:315)
	at org.apache.directory.server.core.partition.ldif.LdifPartition.loadEntries(LdifPartition.java:517)
	at org.apache.directory.server.core.partition.ldif.LdifPartition.loadEntries(LdifPartition.java:549)
	at org.apache.directory.server.core.partition.ldif.LdifPartition.doInit(LdifPartition.java:164)
	at org.apache.directory.server.core.api.partition.AbstractPartition.initialize(AbstractPartition.java:79)
	... 45 more
Caused by: org.apache.directory.api.ldap.model.exception.LdapInvalidAttributeValueException: ERR_04473_NOT_VALID_VALUE Not a valid value '20090818022733Z' for the AttributeType 'ATTRIBUTE_TYPE ( 1.3.6.1.4.1.18060.0.4.1.2.35
 NAME 'schemaModifyTimestamp'
 DESC time which schema was modified
 SUP modifyTimestamp
 EQUALITY generalizedTimeMatch
 ORDERING generalizedTimeOrderingMatch
 SYNTAX 1.3.6.1.4.1.1466.115.121.1.24
 USAGE directoryOperation
 )
'
	at org.apache.directory.api.ldap.model.entry.AbstractValue.apply(AbstractValue.java:204)
	... 52 more




Build Log:
[...truncated 10744 lines...]
   [junit4] Suite: org.apache.solr.cloud.TestSolrCloudWithKerberosAlt
   [junit4]   2> 1539045 WARN  (TEST-TestSolrCloudWithKerberosAlt.testBasics-seed#[DFE79BF1850BBAA7]) [    ] o.a.d.a.l.m.e.DefaultEntry The attribute 'schemamodifytimestamp' cannot be stored
   [junit4]   2> 1539045 ERROR (TEST-TestSolrCloudWithKerberosAlt.testBasics-seed#[DFE79BF1850BBAA7]) [    ] o.a.d.s.c.a.s.SchemaPartition ERR_90 Failed to initialize wrapped partition.
   [junit4]   2> org.apache.directory.api.ldap.model.exception.LdapOtherException: ERR_04447_CANNOT_NORMALIZE_VALUE Cannot normalize the wrapped value ERR_04473_NOT_VALID_VALUE Not a valid value '20090818022733Z' for the AttributeType 'ATTRIBUTE_TYPE ( 1.3.6.1.4.1.18060.0.4.1.2.35
   [junit4]   2>  NAME 'schemaModifyTimestamp'
   [junit4]   2>  DESC time which schema was modified
   [junit4]   2>  SUP modifyTimestamp
   [junit4]   2>  EQUALITY generalizedTimeMatch
   [junit4]   2>  ORDERING generalizedTimeOrderingMatch
   [junit4]   2>  SYNTAX 1.3.6.1.4.1.1466.115.121.1.24
   [junit4]   2>  USAGE directoryOperation
   [junit4]   2>  )
   [junit4]   2> '
   [junit4]   2> 	at org.apache.directory.server.core.api.partition.AbstractPartition.initialize(AbstractPartition.java:84)
   [junit4]   2> 	at org.apache.directory.server.core.api.schema.SchemaPartition.doInit(SchemaPartition.java:219)
   [junit4]   2> 	at org.apache.directory.server.core.api.partition.AbstractPartition.initialize(AbstractPartition.java:79)
   [junit4]   2> 	at org.apache.directory.server.core.DefaultDirectoryService.initialize(DefaultDirectoryService.java:1808)
   [junit4]   2> 	at org.apache.directory.server.core.DefaultDirectoryService.startup(DefaultDirectoryService.java:1248)
   [junit4]   2> 	at org.apache.hadoop.minikdc.MiniKdc.initDirectoryService(MiniKdc.java:383)
   [junit4]   2> 	at org.apache.hadoop.minikdc.MiniKdc.start(MiniKdc.java:319)
   [junit4]   2> 	at org.apache.solr.cloud.TestSolrCloudWithKerberosAlt.setupMiniKdc(TestSolrCloudWithKerberosAlt.java:105)
   [junit4]   2> 	at org.apache.solr.cloud.TestSolrCloudWithKerberosAlt.setUp(TestSolrCloudWithKerberosAlt.java:94)
   [junit4]   2> 	at sun.reflect.GeneratedMethodAccessor8.invoke(Unknown Source)
   [junit4]   2> 	at sun.reflect.DelegatingMethodAccessorImpl.invoke(DelegatingMethodAccessorImpl.java:43)
   [junit4]   2> 	at java.lang.reflect.Method.invoke(Method.java:504)
   [junit4]   2> 	at com.carrotsearch.randomizedtesting.RandomizedRunner.invoke(RandomizedRunner.java:1665)
   [junit4]   2> 	at com.carrotsearch.randomizedtesting.RandomizedRunner$9.evaluate(RandomizedRunner.java:898)
   [junit4]   2> 	at com.carrotsearch.randomizedtesting.RandomizedRunner$10.evaluate(RandomizedRunner.java:914)
   [junit4]   2> 	at com.carrotsearch.randomizedtesting.rules.SystemPropertiesRestoreRule$1.evaluate(SystemPropertiesRestoreRule.java:57)
   [junit4]   2> 	at org.apache.lucene.util.TestRuleSetupTeardownChained$1.evaluate(TestRuleSetupTeardownChained.java:50)
   [junit4]   2> 	at org.apache.lucene.util.AbstractBeforeAfterRule$1.evaluate(AbstractBeforeAfterRule.java:46)
   [junit4]   2> 	at org.apache.lucene.util.TestRuleThreadAndTestName$1.evaluate(TestRuleThreadAndTestName.java:49)
   [junit4]   2> 	at org.apache.lucene.util.TestRuleIgnoreAfterMaxFailures$1.evaluate(TestRuleIgnoreAfterMaxFailures.java:65)
   [junit4]   2> 	at org.apache.lucene.util.TestRuleMarkFailure$1.evaluate(TestRuleMarkFailure.java:48)
   [junit4]   2> 	at com.carrotsearch.randomizedtesting.rules.StatementAdapter.evaluate(StatementAdapter.java:36)
   [junit4]   2> 	at com.carrotsearch.randomizedtesting.ThreadLeakControl$StatementRunner.run(ThreadLeakControl.java:367)
   [junit4]   2> 	at com.carrotsearch.randomizedtesting.ThreadLeakControl.forkTimeoutingTask(ThreadLeakControl.java:809)
   [junit4]   2> 	at com.carrotsearch.randomizedtesting.ThreadLeakControl$3.evaluate(ThreadLeakControl.java:460)
   [junit4]   2> 	at com.carrotsearch.randomizedtesting.RandomizedRunner.runSingleTest(RandomizedRunner.java:873)
   [junit4]   2> 	at com.carrotsearch.randomizedtesting.RandomizedRunner$5.evaluate(RandomizedRunner.java:775)
   [junit4]   2> 	at com.carrotsearch.randomizedtesting.RandomizedRunner$6.evaluate(RandomizedRunner.java:809)
   [junit4]   2> 	at com.carrotsearch.randomizedtesting.RandomizedRunner$7.evaluate(RandomizedRunner.java:820)
   [junit4]   2> 	at com.carrotsearch.randomizedtesting.rules.StatementAdapter.evaluate(StatementAdapter.java:36)
   [junit4]   2> 	at com.carrotsearch.randomizedtesting.rules.SystemPropertiesRestoreRule$1.evaluate(SystemPropertiesRestoreRule.java:57)
   [junit4]   2> 	at org.apache.lucene.util.AbstractBeforeAfterRule$1.evaluate(AbstractBeforeAfterRule.java:46)
   [junit4]   2> 	at com.carrotsearch.randomizedtesting.rules.StatementAdapter.evaluate(StatementAdapter.java:36)
   [junit4]   2> 	at org.apache.lucene.util.TestRuleStoreClassName$1.evaluate(TestRuleStoreClassName.java:42)
   [junit4]   2> 	at com.carrotsearch.randomizedtesting.rules.NoShadowingOrOverridesOnMethodsRule$1.evaluate(NoShadowingOrOverridesOnMethodsRule.java:39)
   [junit4]   2> 	at com.carrotsearch.randomizedtesting.rules.NoShadowingOrOverridesOnMethodsRule$1.evaluate(NoShadowingOrOverridesOnMethodsRule.java:39)
   [junit4]   2> 	at com.carrotsearch.randomizedtesting.rules.StatementAdapter.evaluate(StatementAdapter.java:36)
   [junit4]   2> 	at com.carrotsearch.randomizedtesting.rules.StatementAdapter.evaluate(StatementAdapter.java:36)
   [junit4]   2> 	at com.carrotsearch.randomizedtesting.rules.StatementAdapter.evaluate(StatementAdapter.java:36)
   [junit4]   2> 	at org.apache.lucene.util.TestRuleAssertionsRequired$1.evaluate(TestRuleAssertionsRequired.java:54)
   [junit4]   2> 	at org.apache.lucene.util.TestRuleMarkFailure$1.evaluate(TestRuleMarkFailure.java:48)
   [junit4]   2> 	at org.apache.lucene.util.TestRuleIgnoreAfterMaxFailures$1.evaluate(TestRuleIgnoreAfterMaxFailures.java:65)
   [junit4]   2> 	at org.apache.lucene.util.TestRuleIgnoreTestSuites$1.evaluate(TestRuleIgnoreTestSuites.java:55)
   [junit4]   2> 	at com.carrotsearch.randomizedtesting.rules.StatementAdapter.evaluate(StatementAdapter.java:36)
   [junit4]   2> 	at com.carrotsearch.randomizedtesting.ThreadLeakControl$StatementRunner.run(ThreadLeakControl.java:367)
   [junit4]   2> 	at java.lang.Thread.run(Thread.java:746)
   [junit4]   2> Caused by: org.apache.directory.api.ldap.model.exception.LdapInvalidAttributeValueException: ERR_04447_CANNOT_NORMALIZE_VALUE Cannot normalize the wrapped value ERR_04473_NOT_VALID_VALUE Not a valid value '20090818022733Z' for the AttributeType 'ATTRIBUTE_TYPE ( 1.3.6.1.4.1.18060.0.4.1.2.35
   [junit4]   2>  NAME 'schemaModifyTimestamp'
   [junit4]   2>  DESC time which schema was modified
   [junit4]   2>  SUP modifyTimestamp
   [junit4]   2>  EQUALITY generalizedTimeMatch
   [junit4]   2>  ORDERING generalizedTimeOrderingMatch
   [junit4]   2>  SYNTAX 1.3.6.1.4.1.1466.115.121.1.24
   [junit4]   2>  USAGE directoryOperation
   [junit4]   2>  )
   [junit4]   2> '
   [junit4]   2> 	at org.apache.directory.api.ldap.model.entry.AbstractValue.apply(AbstractValue.java:211)
   [junit4]   2> 	at org.apache.directory.api.ldap.model.entry.StringValue.<init>(StringValue.java:107)
   [junit4]   2> 	at org.apache.directory.api.ldap.model.entry.DefaultAttribute.<init>(DefaultAttribute.java:468)
   [junit4]   2> 	at org.apache.directory.api.ldap.model.entry.DefaultEntry.<init>(DefaultEntry.java:315)
   [junit4]   2> 	at org.apache.directory.server.core.partition.ldif.LdifPartition.loadEntries(LdifPartition.java:517)
   [junit4]   2> 	at org.apache.directory.server.core.partition.ldif.LdifPartition.loadEntries(LdifPartition.java:549)
   [junit4]   2> 	at org.apache.directory.server.core.partition.ldif.LdifPartition.doInit(LdifPartition.java:164)
   [junit4]   2> 	at org.apache.directory.server.core.api.partition.AbstractPartition.initialize(AbstractPartition.java:79)
   [junit4]   2> 	... 45 more
   [junit4]   2> Caused by: org.apache.directory.api.ldap.model.exception.LdapInvalidAttributeValueException: ERR_04473_NOT_VALID_VALUE Not a valid value '20090818022733Z' for the AttributeType 'ATTRIBUTE_TYPE ( 1.3.6.1.4.1.18060.0.4.1.2.35
   [junit4]   2>  NAME 'schemaModifyTimestamp'
   [junit4]   2>  DESC time which schema was modified
   [junit4]   2>  SUP modifyTimestamp
   [junit4]   2>  EQUALITY generalizedTimeMatch
   [junit4]   2>  ORDERING generalizedTimeOrderingMatch
   [junit4]   2>  SYNTAX 1.3.6.1.4.1.1466.115.121.1.24
   [junit4]   2>  USAGE directoryOperation
   [junit4]   2>  )
   [junit4]   2> '
   [junit4]   2> 	at org.apache.directory.api.ldap.model.entry.AbstractValue.apply(AbstractValue.java:204)
   [junit4]   2> 	... 52 more
   [junit4]   2> NOTE: reproduce with: ant test  -Dtestcase=TestSolrCloudWithKerberosAlt -Dtests.method=testBasics -Dtests.seed=DFE79BF1850BBAA7 -Dtests.multiplier=3 -Dtests.slow=true -Dtests.locale=fa_IR -Dtests.timezone=Africa/Harare -Dtests.asserts=true -Dtests.file.encoding=UTF-8
   [junit4] ERROR   1.23s J2 | TestSolrCloudWithKerberosAlt.testBasics <<<
   [junit4]    > Throwable #1: org.apache.directory.api.ldap.model.exception.LdapOtherException: org.apache.directory.api.ldap.model.exception.LdapOtherException: ERR_04447_CANNOT_NORMALIZE_VALUE Cannot normalize the wrapped value ERR_04473_NOT_VALID_VALUE Not a valid value '20090818022733Z' for the AttributeType 'ATTRIBUTE_TYPE ( 1.3.6.1.4.1.18060.0.4.1.2.35
   [junit4]    >  NAME 'schemaModifyTimestamp'
   [junit4]    >  DESC time which schema was modified
   [junit4]    >  SUP modifyTimestamp
   [junit4]    >  EQUALITY generalizedTimeMatch
   [junit4]    >  ORDERING generalizedTimeOrderingMatch
   [junit4]    >  SYNTAX 1.3.6.1.4.1.1466.115.121.1.24
   [junit4]    >  USAGE directoryOperation
   [junit4]    >  )
   [junit4]    > '
   [junit4]    > 	at __randomizedtesting.SeedInfo.seed([DFE79BF1850BBAA7:E23F35DDBDE5E4D7]:0)
   [junit4]    > 	at org.apache.directory.server.core.api.partition.AbstractPartition.initialize(AbstractPartition.java:84)
   [junit4]    > 	at org.apache.directory.server.core.DefaultDirectoryService.initialize(DefaultDirectoryService.java:1808)
   [junit4]    > 	at org.apache.directory.server.core.DefaultDirectoryService.startup(DefaultDirectoryService.java:1248)
   [junit4]    > 	at org.apache.hadoop.minikdc.MiniKdc.initDirectoryService(MiniKdc.java:383)
   [junit4]    > 	at org.apache.hadoop.minikdc.MiniKdc.start(MiniKdc.java:319)
   [junit4]    > 	at org.apache.solr.cloud.TestSolrCloudWithKerberosAlt.setupMiniKdc(TestSolrCloudWithKerberosAlt.java:105)
   [junit4]    > 	at org.apache.solr.cloud.TestSolrCloudWithKerberosAlt.setUp(TestSolrCloudWithKerberosAlt.java:94)
   [junit4]    > 	at java.lang.Thread.run(Thread.java:746)
   [junit4]    > Caused by: java.lang.RuntimeException: org.apache.directory.api.ldap.model.exception.LdapOtherException: ERR_04447_CANNOT_NORMALIZE_VALUE Cannot normalize the wrapped value ERR_04473_NOT_VALID_VALUE Not a valid value '20090818022733Z' for the AttributeType 'ATTRIBUTE_TYPE ( 1.3.6.1.4.1.18060.0.4.1.2.35
   [junit4]    >  NAME 'schemaModifyTimestamp'
   [junit4]    >  DESC time which schema was modified
   [junit4]    >  SUP modifyTimestamp
   [junit4]    >  EQUALITY generalizedTimeMatch
   [junit4]    >  ORDERING generalizedTimeOrderingMatch
   [junit4]    >  SYNTAX 1.3.6.1.4.1.1466.115.121.1.24
   [junit4]    >  USAGE directoryOperation
   [junit4]    >  )
   [junit4]    > '
   [junit4]    > 	at org.apache.directory.server.core.api.schema.SchemaPartition.doInit(SchemaPartition.java:226)
   [junit4]    > 	at org.apache.directory.server.core.api.partition.AbstractPartition.initialize(AbstractPartition.java:79)
   [junit4]    > 	... 43 more
   [junit4]    > Caused by: org.apache.directory.api.ldap.model.exception.LdapOtherException: ERR_04447_CANNOT_NORMALIZE_VALUE Cannot normalize the wrapped value ERR_04473_NOT_VALID_VALUE Not a valid value '20090818022733Z' for the AttributeType 'ATTRIBUTE_TYPE ( 1.3.6.1.4.1.18060.0.4.1.2.35
   [junit4]    >  NAME 'schemaModifyTimestamp'
   [junit4]    >  DESC time which schema was modified
   [junit4]    >  SUP modifyTimestamp
   [junit4]    >  EQUALITY generalizedTimeMatch
   [junit4]    >  ORDERING generalizedTimeOrderingMatch
   [junit4]    >  SYNTAX 1.3.6.1.4.1.1466.115.121.1.24
   [junit4]    >  USAGE directoryOperation
   [junit4]    >  )
   [junit4]    > '
   [junit4]    > 	at org.apache.directory.server.core.api.partition.AbstractPartition.initialize(AbstractPartition.java:84)
   [junit4]    > 	at org.apache.directory.server.core.api.schema.SchemaPartition.doInit(SchemaPartition.java:219)
   [junit4]    > 	... 44 more
   [junit4]    > Caused by: org.apache.directory.api.ldap.model.exception.LdapInvalidAttributeValueException: ERR_04447_CANNOT_NORMALIZE_VALUE Cannot normalize the wrapped value ERR_04473_NOT_VALID_VALUE Not a valid value '20090818022733Z' for the AttributeType 'ATTRIBUTE_TYPE ( 1.3.6.1.4.1.18060.0.4.1.2.35
   [junit4]    >  NAME 'schemaModifyTimestamp'
   [junit4]    >  DESC time which schema was modified
   [junit4]    >  SUP modifyTimestamp
   [junit4]    >  EQUALITY generalizedTimeMatch
   [junit4]    >  ORDERING generalizedTimeOrderingMatch
   [junit4]    >  SYNTAX 1.3.6.1.4.1.1466.115.121.1.24
   [junit4]    >  USAGE directoryOperation
   [junit4]    >  )
   [junit4]    > '
   [junit4]    > 	at org.apache.directory.api.ldap.model.entry.AbstractValue.apply(AbstractValue.java:211)
   [junit4]    > 	at org.apache.directory.api.ldap.model.entry.StringValue.<init>(StringValue.java:107)
   [junit4]    > 	at org.apache.directory.api.ldap.model.entry.DefaultAttribute.<init>(DefaultAttribute.java:468)
   [junit4]    > 	at org.apache.directory.api.ldap.model.entry.DefaultEntry.<init>(DefaultEntry.java:315)
   [junit4]    > 	at org.apache.directory.server.core.partition.ldif.LdifPartition.loadEntries(LdifPartition.java:517)
   [junit4]    > 	at org.apache.directory.server.core.partition.ldif.LdifPartition.loadEntries(LdifPartition.java:549)
   [junit4]    > 	at org.apache.directory.server.core.partition.ldif.LdifPartition.doInit(LdifPartition.java:164)
   [junit4]    > 	at org.apache.directory.server.core.api.partition.AbstractPartition.initialize(AbstractPartition.java:79)
   [junit4]    > 	... 45 more
   [junit4]    > Caused by: org.apache.directory.api.ldap.model.exception.LdapInvalidAttributeValueException: ERR_04473_NOT_VALID_VALUE Not a valid value '20090818022733Z' for the AttributeType 'ATTRIBUTE_TYPE ( 1.3.6.1.4.1.18060.0.4.1.2.35
   [junit4]    >  NAME 'schemaModifyTimestamp'
   [junit4]    >  DESC time which schema was modified
   [junit4]    >  SUP modifyTimestamp
   [junit4]    >  EQUALITY generalizedTimeMatch
   [junit4]    >  ORDERING generalizedTimeOrderingMatch
   [junit4]    >  SYNTAX 1.3.6.1.4.1.1466.115.121.1.24
   [junit4]    >  USAGE directoryOperation
   [junit4]    >  )
   [junit4]    > '
   [junit4]    > 	at org.apache.directory.api.ldap.model.entry.AbstractValue.apply(AbstractValue.java:204)
   [junit4]    > 	... 52 more
   [junit4]   2> NOTE: leaving temporary files on disk at: /home/jenkins/workspace/Lucene-Solr-trunk-Linux/solr/build/solr-core/test/J2/temp/solr.cloud.TestSolrCloudWithKerberosAlt_DFE79BF1850BBAA7-001
   [junit4]   2> Oct 02, 2015 11:21:23 AM com.carrotsearch.randomizedtesting.ThreadLeakControl checkThreadLeaks
   [junit4]   2> WARNING: Will linger awaiting termination of 5 leaked thread(s).
   [junit4]   2> Oct 02, 2015 11:21:43 AM com.carrotsearch.randomizedtesting.ThreadLeakControl checkThreadLeaks
   [junit4]   2> SEVERE: 5 threads leaked from SUITE scope at org.apache.solr.cloud.TestSolrCloudWithKerberosAlt: 
   [junit4]   2>    1) Thread[id=10455, name=changePwdReplayCache.data, state=TIMED_WAITING, group=TGRP-TestSolrCloudWithKerberosAlt]
   [junit4]   2>         at sun.misc.Unsafe.park(Native Method)
   [junit4]   2>         at java.util.concurrent.locks.LockSupport.parkNanos(LockSupport.java:215)
   [junit4]   2>         at java.util.concurrent.locks.AbstractQueuedSynchronizer$ConditionObject.awaitNanos(AbstractQueuedSynchronizer.java:2078)
   [junit4]   2>         at java.util.concurrent.ScheduledThreadPoolExecutor$DelayedWorkQueue.take(ScheduledThreadPoolExecutor.java:1093)
   [junit4]   2>         at java.util.concurrent.ScheduledThreadPoolExecutor$DelayedWorkQueue.take(ScheduledThreadPoolExecutor.java:809)
   [junit4]   2>         at java.util.concurrent.ThreadPoolExecutor.getTask(ThreadPoolExecutor.java:1067)
   [junit4]   2>         at java.util.concurrent.ThreadPoolExecutor.runWorker(ThreadPoolExecutor.java:1127)
   [junit4]   2>         at java.util.concurrent.ThreadPoolExecutor$Worker.run(ThreadPoolExecutor.java:617)
   [junit4]   2>         at java.lang.Thread.run(Thread.java:746)
   [junit4]   2>    2) Thread[id=10457, name=groupCache.data, state=TIMED_WAITING, group=TGRP-TestSolrCloudWithKerberosAlt]
   [junit4]   2>         at sun.misc.Unsafe.park(Native Method)
   [junit4]   2>         at java.util.concurrent.locks.LockSupport.parkNanos(LockSupport.java:215)
   [junit4]   2>         at java.util.concurrent.locks.AbstractQueuedSynchronizer$ConditionObject.awaitNanos(AbstractQueuedSynchronizer.java:2078)
   [junit4]   2>         at java.util.concurrent.ScheduledThreadPoolExecutor$DelayedWorkQueue.take(ScheduledThreadPoolExecutor.java:1093)
   [junit4]   2>         at java.util.concurrent.ScheduledThreadPoolExecutor$DelayedWorkQueue.take(ScheduledThreadPoolExecutor.java:809)
   [junit4]   2>         at java.util.concurrent.ThreadPoolExecutor.getTask(ThreadPoolExecutor.java:1067)
   [junit4]   2>         at java.util.concurrent.ThreadPoolExecutor.runWorker(ThreadPoolExecutor.java:1127)
   [junit4]   2>         at java.util.concurrent.ThreadPoolExecutor$Worker.run(ThreadPoolExecutor.java:617)
   [junit4]   2>         at java.lang.Thread.run(Thread.java:746)
   [junit4]   2>    3) Thread[id=10454, name=apacheds, state=WAITING, group=TGRP-TestSolrCloudWithKerberosAlt]
   [junit4]   2>         at java.lang.Object.wait(Native Method)
   [junit4]   2>         at java.lang.Object.wait(Object.java:516)
   [junit4]   2>         at java.util.TimerThread.mainLoop(Timer.java:526)
   [junit4]   2>         at java.util.TimerThread.run(Timer.java:505)
   [junit4]   2>    4) Thread[id=10458, name=ou=system.data, state=TIMED_WAITING, group=TGRP-TestSolrCloudWithKerberosAlt]
   [junit4]   2>         at sun.misc.Unsafe.park(Native Method)
   [junit4]   2>         at java.util.concurrent.locks.LockSupport.parkNanos(LockSupport.java:215)
   [junit4]   2>         at java.util.concurrent.locks.AbstractQueuedSynchronizer$ConditionObject.awaitNanos(AbstractQueuedSynchronizer.java:2078)
   [junit4]   2>         at java.util.concurrent.ScheduledThreadPoolExecutor$DelayedWorkQueue.take(ScheduledThreadPoolExecutor.java:1093)
   [junit4]   2>         at java.util.concurrent.ScheduledThreadPoolExecutor$DelayedWorkQueue.take(ScheduledThreadPoolExecutor.java:809)
   [junit4]   2>         at java.util.concurrent.ThreadPoolExecutor.getTask(ThreadPoolExecutor.java:1067)
   [junit4]   2>         at java.util.concurrent.ThreadPoolExecutor.runWorker(ThreadPoolExecutor.java:1127)
   [junit4]   2>         at java.util.concurrent.ThreadPoolExecutor$Worker.run(ThreadPoolExecutor.java:617)
   [junit4]   2>         at java.lang.Thread.run(Thread.java:746)
   [junit4]   2>    5) Thread[id=10456, name=kdcReplayCache.data, state=TIMED_WAITING, group=TGRP-TestSolrCloudWithKerberosAlt]
   [junit4]   2>         at sun.misc.Unsafe.park(Native Method)
   [junit4]   2>         at java.util.concurrent.locks.LockSupport.parkNanos(LockSupport.java:215)
   [junit4]   2>         at java.util.concurrent.locks.AbstractQueuedSynchronizer$ConditionObject.awaitNanos(AbstractQueuedSynchronizer.java:2078)
   [junit4]   2>         at java.util.concurrent.ScheduledThreadPoolExecutor$DelayedWorkQueue.take(ScheduledThreadPoolExecutor.java:1093)
   [junit4]   2>         at java.util.concurrent.ScheduledThreadPoolExecutor$DelayedWorkQueue.take(ScheduledThreadPoolExecutor.java:809)
   [junit4]   2>         at java.util.concurrent.ThreadPoolExecutor.getTask(ThreadPoolExecutor.java:1067)
   [junit4]   2>         at java.util.concurrent.ThreadPoolExecutor.runWorker(ThreadPoolExecutor.java:1127)
   [junit4]   2>         at java.util.concurrent.ThreadPoolExecutor$Worker.run(ThreadPoolExecutor.java:617)
   [junit4]   2>         at java.lang.Thread.run(Thread.java:746)
   [junit4]   2> Oct 02, 2015 11:21:43 AM com.carrotsearch.randomizedtesting.ThreadLeakControl tryToInterruptAll
   [junit4]   2> INFO: Starting to interrupt leaked threads:
   [junit4]   2>    1) Thread[id=10455, name=changePwdReplayCache.data, state=TIMED_WAITING, group=TGRP-TestSolrCloudWithKerberosAlt]
   [junit4]   2>    2) Thread[id=10457, name=groupCache.data, state=TIMED_WAITING, group=TGRP-TestSolrCloudWithKerberosAlt]
   [junit4]   2>    3) Thread[id=10454, name=apacheds, state=WAITING, group=TGRP-TestSolrCloudWithKerberosAlt]
   [junit4]   2>    4) Thread[id=10458, name=ou=system.data, state=TIMED_WAITING, group=TGRP-TestSolrCloudWithKerberosAlt]
   [junit4]   2>    5) Thread[id=10456, name=kdcReplayCache.data, state=TIMED_WAITING, group=TGRP-TestSolrCloudWithKerberosAlt]
   [junit4]   2> Oct 02, 2015 11:21:46 AM com.carrotsearch.randomizedtesting.ThreadLeakControl tryToInterruptAll
   [junit4]   2> SEVERE: There are still zombie threads that couldn't be terminated:
   [junit4]   2>    1) Thread[id=10455, name=changePwdReplayCache.data, state=TIMED_WAITING, group=TGRP-TestSolrCloudWithKerberosAlt]
   [junit4]   2>         at sun.misc.Unsafe.park(Native Method)
   [junit4]   2>         at java.util.concurrent.locks.LockSupport.parkNanos(LockSupport.java:215)
   [junit4]   2>         at java.util.concurrent.locks.AbstractQueuedSynchronizer$ConditionObject.awaitNanos(AbstractQueuedSynchronizer.java:2078)
   [junit4]   2>         at java.util.concurrent.ScheduledThreadPoolExecutor$DelayedWorkQueue.take(ScheduledThreadPoolExecutor.java:1093)
   [junit4]   2>         at java.util.concurrent.ScheduledThreadPoolExecutor$DelayedWorkQueue.take(ScheduledThreadPoolExecutor.java:809)
   [junit4]   2>         at java.util.concurrent.ThreadPoolExecutor.getTask(ThreadPoolExecutor.java:1067)
   [junit4]   2>         at java.util.concurrent.ThreadPoolExecutor.runWorker(ThreadPoolExecutor.java:1127)
   [junit4]   2>         at java.util.concurrent.ThreadPoolExecutor$Worker.run(ThreadPoolExecutor.java:617)
   [junit4]   2>         at java.lang.Thread.run(Thread.java:746)
   [junit4]   2>    2) Thread[id=10457, name=groupCache.data, state=TIMED_WAITING, group=TGRP-TestSolrCloudWithKerberosAlt]
   [junit4]   2>         at sun.misc.Unsafe.park(Native Method)
   [junit4]   2>         at java.util.concurrent.locks.LockSupport.parkNanos(LockSupport.java:215)
   [junit4]   2>         at java.util.concurrent.locks.AbstractQueuedSynchronizer$ConditionObject.awaitNanos(AbstractQueuedSynchronizer.java:2078)
   [junit4]   2>         at java.util.concurrent.ScheduledThreadPoolExecutor$DelayedWorkQueue.take(ScheduledThreadPoolExecutor.java:1093)
   [junit4]   2>         at java.util.concurrent.ScheduledThreadPoolExecutor$DelayedWorkQueue.take(ScheduledThreadPoolExecutor.java:809)
   [junit4]   2>         at java.util.concurrent.ThreadPoolExecutor.getTask(ThreadPoolExecutor.java:1067)
   [junit4]   2>         at java.util.concurrent.ThreadPoolExecutor.runWorker(ThreadPoolExecutor.java:1127)
   [junit4]   2>         at java.util.concurrent.ThreadPoolExecutor$Worker.run(ThreadPoolExecutor.java:617)
   [junit4]   2>         at java.lang.Thread.run(Thread.java:746)
   [junit4]   2>    3) Thread[id=10454, name=apacheds, state=WAITING, group=TGRP-TestSolrCloudWithKerberosAlt]
   [junit4]   2>         at java.lang.Object.wait(Native Method)
   [junit4]   2>         at java.lang.Object.wait(Object.java:516)
   [junit4]   2>         at java.util.TimerThread.mainLoop(Timer.java:526)
   [junit4]   2>         at java.util.TimerThread.run(Timer.java:505)
   [junit4]   2>    4) Thread[id=10458, name=ou=system.data, state=TIMED_WAITING, group=TGRP-TestSolrCloudWithKerberosAlt]
   [junit4]   2>         at sun.misc.Unsafe.park(Native Method)
   [junit4]   2>         at java.util.concurrent.locks.LockSupport.parkNanos(LockSupport.java:215)
   [junit4]   2>         at java.util.concurrent.locks.AbstractQueuedSynchronizer$ConditionObject.awaitNanos(AbstractQueuedSynchronizer.java:2078)
   [junit4]   2>         at java.util.concurrent.ScheduledThreadPoolExecutor$DelayedWorkQueue.take(ScheduledThreadPoolExecutor.java:1093)
   [junit4]   2>         at java.util.concurrent.ScheduledThreadPoolExecutor$DelayedWorkQueue.take(ScheduledThreadPoolExecutor.java:809)
   [junit4]   2>         at java.util.concurrent.ThreadPoolExecutor.getTask(ThreadPoolExecutor.java:1067)
   [junit4]   2>         at java.util.concurrent.ThreadPoolExecutor.runWorker(ThreadPoolExecutor.java:1127)
   [junit4]   2>         at java.util.concurrent.ThreadPoolExecutor$Worker.run(ThreadPoolExecutor.java:617)
   [junit4]   2>         at java.lang.Thread.run(Thread.java:746)
   [junit4]   2>    5) Thread[id=10456, name=kdcReplayCache.data, state=TIMED_WAITING, group=TGRP-TestSolrCloudWithKerberosAlt]
   [junit4]   2>         at sun.misc.Unsafe.park(Native Method)
   [junit4]   2>         at java.util.concurrent.locks.LockSupport.parkNanos(LockSupport.java:215)
   [junit4]   2>         at java.util.concurrent.locks.AbstractQueuedSynchronizer$ConditionObject.awaitNanos(AbstractQueuedSynchronizer.java:2078)
   [junit4]   2>         at java.util.concurrent.ScheduledThreadPoolExecutor$DelayedWorkQueue.take(ScheduledThreadPoolExecutor.java:1093)
   [junit4]   2>         at java.util.concurrent.ScheduledThreadPoolExecutor$DelayedWorkQueue.take(ScheduledThreadPoolExecutor.java:809)
   [junit4]   2>         at java.util.concurrent.ThreadPoolExecutor.getTask(ThreadPoolExecutor.java:1067)
   [junit4]   2>         at java.util.concurrent.ThreadPoolExecutor.runWorker(ThreadPoolExecutor.java:1127)
   [junit4]   2>         at java.util.concurrent.ThreadPoolExecutor$Worker.run(ThreadPoolExecutor.java:617)
   [junit4]   2>         at java.lang.Thread.run(Thread.java:746)
   [junit4]   2> NOTE: test params are: codec=Lucene53, sim=ClassicSimilarity, locale=fa_IR, timezone=Africa/Harare
   [junit4]   2> NOTE: Linux 3.19.0-28-generic amd64/Oracle Corporation 1.9.0-ea (64-bit)/cpus=12,threads=6,free=135286920,total=520617984
   [junit4]   2> NOTE: All tests run in this JVM: [TestMissingGroups, TestSolr4Spatial2, TestXIncludeConfig, TestSolrConfigHandler, BigEndianAscendingWordDeserializerTest, TestExtendedDismaxParser, QueryResultKeyTest, UUIDFieldTest, CursorMarkTest, TestLeaderInitiatedRecoveryThread, TestSearchPerf, StatelessScriptUpdateProcessorFactoryTest, SystemInfoHandlerTest, SuggesterTSTTest, TestFastWriter, TestClassNameShortening, TestHashQParserPlugin, NoCacheHeaderTest, AutoCommitTest, TestElisionMultitermQuery, QueryParsingTest, StatsComponentTest, TestSmileRequest, TestRecovery, TestScoreJoinQPNoScore, TestManagedResource, TestCharFilters, HighlighterConfigTest, TestConfigReload, AsyncMigrateRouteKeyTest, TestManagedSynonymFilterFactory, AddBlockUpdateTest, HdfsBasicDistributedZkTest, SolrCoreCheckLockOnStartupTest, TestSort, TestDocBasedVersionConstraints, RequestHandlersTest, TestUniqueKeyFieldResource, MigrateRouteKeyTest, HdfsThreadLeakTest, TestPHPSerializedResponseWriter, TestConfigSetProperties, CloudExitableDirectoryReaderTest, UpdateParamsTest, AnalyticsQueryTest, TestCSVResponseWriter, ParsingFieldUpdateProcessorsTest, CollectionsAPIAsyncDistributedZkTest, TestMiniSolrCloudClusterBase, TestNamedUpdateProcessors, TestDefaultSimilarityFactory, TestManagedSchemaDynamicFieldResource, TestPostingsSolrHighlighter, DistributedFacetPivotSmallAdvancedTest, SuggesterWFSTTest, XmlUpdateRequestHandlerTest, TestExactSharedStatsCache, TestSha256AuthenticationProvider, HdfsDirectoryFactoryTest, FullSolrCloudDistribCmdsTest, LeaderElectionTest, TestSolrDynamicMBean, HdfsSyncSliceTest, DirectUpdateHandlerOptimizeTest, ZkNodePropsTest, TestHighFrequencyDictionaryFactory, TestZkChroot, SharedFSAutoReplicaFailoverTest, TestMinMaxOnMultiValuedField, MultiThreadedOCPTest, DebugComponentTest, TestCollationField, BasicAuthIntegrationTest, TestDynamicFieldCollectionResource, BadComponentTest, PluginInfoTest, ShowFileRequestHandlerTest, TestFieldResource, LukeRequestHandlerTest, TestManagedStopFilterFactory, TestManagedResourceStorage, DistributedDebugComponentTest, BasicDistributedZk2Test, BadIndexSchemaTest, SearchHandlerTest, HdfsDirectoryTest, DocValuesMultiTest, HdfsCollectionsAPIDistributedZkTest, TestDistributedStatsComponentCardinality, ChaosMonkeySafeLeaderTest, CollectionsAPIDistributedZkTest, LeaderElectionIntegrationTest, BasicZkTest, RecoveryZkTest, ZkCLITest, TestDistributedSearch, RegexBoostProcessorTest, UpdateRequestProcessorFactoryTest, JsonLoaderTest, PingRequestHandlerTest, TestPerFieldSimilarity, ResourceLoaderTest, URLClassifyProcessorTest, TestFastLRUCache, SpellingQueryConverterTest, RAMDirectoryFactoryTest, TestSolrJ, TestLRUCache, DistributedMLTComponentTest, TestEmbeddedSolrServerConstructors, ActionThrottleTest, AssignTest, AsyncCallRequestStatusResponseTest, CdcrVersionReplicationTest, CollectionReloadTest, DeleteInactiveReplicaTest, DeleteShardTest, DistribCursorPagingTest, LeaderFailoverAfterPartitionTest, OutOfBoxZkACLAndCredentialsProvidersTest, OverriddenZkACLAndCredentialsProvidersTest, OverseerCollectionConfigSetProcessorTest, OverseerRolesTest, OverseerTaskQueueTest, RecoveryAfterSoftCommitTest, SSLMigrationTest, SaslZkACLProviderTest, SharedFSAutoReplicaFailoverUtilsTest, SolrXmlInZkTest, TestCloudPivotFacet, TestDownShardTolerantSearch, TestMiniSolrCloudClusterSSL, TestRandomRequestDistribution, TestSolrCloudWithKerberosAlt]
   [junit4]   2> NOTE: reproduce with: ant test  -Dtestcase=TestSolrCloudWithKerberosAlt -Dtests.seed=DFE79BF1850BBAA7 -Dtests.multiplier=3 -Dtests.slow=true -Dtests.locale=fa_IR -Dtests.timezone=Africa/Harare -Dtests.asserts=true -Dtests.file.encoding=UTF-8
   [junit4] ERROR   0.00s J2 | TestSolrCloudWithKerberosAlt (suite) <<<
   [junit4]    > Throwable #1: com.carrotsearch.randomizedtesting.ThreadLeakError: 5 threads leaked from SUITE scope at org.apache.solr.cloud.TestSolrCloudWithKerberosAlt: 
   [junit4]    >    1) Thread[id=10455, name=changePwdReplayCache.data, state=TIMED_WAITING, group=TGRP-TestSolrCloudWithKerberosAlt]
   [junit4]    >         at sun.misc.Unsafe.park(Native Method)
   [junit4]    >         at java.util.concurrent.locks.LockSupport.parkNanos(LockSupport.java:215)
   [junit4]    >         at java.util.concurrent.locks.AbstractQueuedSynchronizer$ConditionObject.awaitNanos(AbstractQueuedSynchronizer.java:2078)
   [junit4]    >         at java.util.concurrent.ScheduledThreadPoolExecutor$DelayedWorkQueue.take(ScheduledThreadPoolExecutor.java:1093)
   [junit4]    >         at java.util.concurrent.ScheduledThreadPoolExecutor$DelayedWorkQueue.take(ScheduledThreadPoolExecutor.java:809)
   [junit4]    >         at java.util.concurrent.ThreadPoolExecutor.getTask(ThreadPoolExecutor.java:1067)
   [junit4]    >         at java.util.concurrent.ThreadPoolExecutor.runWorker(ThreadPoolExecutor.java:1127)
   [junit4]    >         at java.util.concurrent.ThreadPoolExecutor$Worker.run(ThreadPoolExecutor.java:617)
   [junit4]    >         at java.lang.Thread.run(Thread.java:746)
   [junit4]    >    2) Thread[id=10457, name=groupCache.data, state=TIMED_WAITING, group=TGRP-TestSolrCloudWithKerberosAlt]
   [junit4]    >         at sun.misc.Unsafe.park(Native Method)
   [junit4]    >         at java.util.concurrent.locks.LockSupport.parkNanos(LockSupport.java:215)
   [junit4]    >         at java.util.concurrent.locks.AbstractQueuedSynchronizer$ConditionObject.awaitNanos(AbstractQueuedSynchronizer.java:2078)
   [junit4]    >         at java.util.concurrent.ScheduledThreadPoolExecutor$DelayedWorkQueue.take(ScheduledThreadPoolExecutor.java:1093)
   [junit4]    >         at java.util.concurrent.ScheduledThreadPoolExecutor$DelayedWorkQueue.take(ScheduledThreadPoolExecutor.java:809)
   [junit4]    >         at java.util.concurrent.ThreadPoolExecutor.getTask(ThreadPoolExecutor.java:1067)
   [junit4]    >         at java.util.concurrent.ThreadPoolExecutor.runWorker(ThreadPoolExecutor.java:1127)
   [junit4]    >         at java.util.concurrent.ThreadPoolExecutor$Worker.run(ThreadPoolExecutor.java:617)
   [junit4]    >         at java.lang.Thread.run(Thread.java:746)
   [junit4]    >    3) Thread[id=10454, name=apacheds, state=WAITING, group=TGRP-TestSolrCloudWithKerberosAlt]
   [junit4]    >         at java.lang.Object.wait(Native Method)
   [junit4]    >         at java.lang.Object.wait(Object.java:516)
   [junit4]    >         at java.util.TimerThread.mainLoop(Timer.java:526)
   [junit4]    >         at java.util.TimerThread.run(Timer.java:505)
   [junit4]    >    4) Thread[id=10458, name=ou=system.data, state=TIMED_WAITING, group=TGRP-TestSolrCloudWithKerberosAlt]
   [junit4]    >         at sun.misc.Unsafe.park(Native Method)
   [junit4]    >         at java.util.concurrent.locks.LockSupport.parkNanos(LockSupport.java:215)
   [junit4]    >         at java.util.concurrent.locks.AbstractQueuedSynchronizer$ConditionObject.awaitNanos(AbstractQueuedSynchronizer.java:2078)
   [junit4]    >         at java.util.concurrent.ScheduledThreadPoolExecutor$DelayedWorkQueue.take(ScheduledThreadPoolExecutor.java:1093)
   [junit4]    >         at java.util.concurrent.ScheduledThreadPoolExecutor$DelayedWorkQueue.take(ScheduledThreadPoolExecutor.java:809)
   [junit4]    >         at java.util.concurrent.ThreadPoolExecutor.getTask(ThreadPoolExecutor.java:1067)
   [junit4]    >         at java.util.concurrent.ThreadPoolExecutor.runWorker(ThreadPoolExecutor.java:1127)
   [junit4]    >         at java.util.concurrent.ThreadPoolExecutor$Worker.run(ThreadPoolExecutor.java:617)
   [junit4]    >         at java.lang.Thread.run(Thread.java:746)
   [junit4]    >    5) Thread[id=10456, name=kdcReplayCache.data, state=TIMED_WAITING, group=TGRP-TestSolrCloudWithKerberosAlt]
   [junit4]    >         at sun.misc.Unsafe.park(Native Method)
   [junit4]    >         at java.util.concurrent.locks.LockSupport.parkNanos(LockSupport.java:215)
   [junit4]    >         at java.util.concurrent.locks.AbstractQueuedSynchronizer$ConditionObject.awaitNanos(AbstractQueuedSynchronizer.java:2078)
   [junit4]    >         at java.util.concurrent.ScheduledThreadPoolExecutor$DelayedWorkQueue.take(ScheduledThreadPoolExecutor.java:1093)
   [junit4]    >         at java.util.concurrent.ScheduledThreadPoolExecutor$DelayedWorkQueue.take(ScheduledThreadPoolExecutor.java:809)
   [junit4]    >         at java.util.concurrent.ThreadPoolExecutor.getTask(ThreadPoolExecutor.java:1067)
   [junit4]    >         at java.util.concurrent.ThreadPoolExecutor.runWorker(ThreadPoolExecutor.java:1127)
   [junit4]    >         at java.util.concurrent.ThreadPoolExecutor$Worker.run(ThreadPoolExecutor.java:617)
   [junit4]    >         at java.lang.Thread.run(Thread.java:746)
   [junit4]    > 	at __randomizedtesting.SeedInfo.seed([DFE79BF1850BBAA7]:0)Throwable #2: com.carrotsearch.randomizedtesting.ThreadLeakError: There are still zombie threads that couldn't be terminated:
   [junit4]    >    1) Thread[id=10455, name=changePwdReplayCache.data, state=TIMED_WAITING, group=TGRP-TestSolrCloudWithKerberosAlt]
   [junit4]    >         at sun.misc.Unsafe.park(Native Method)
   [junit4]    >         at java.util.concurrent.locks.LockSupport.parkNanos(LockSupport.java:215)
   [junit4]    >         at java.util.concurrent.locks.AbstractQueuedSynchronizer$ConditionObject.awaitNanos(AbstractQueuedSynchronizer.java:2078)
   [junit4]    >         at java.util.concurrent.ScheduledThreadPoolExecutor$DelayedWorkQueue.take(ScheduledThreadPoolExecutor.java:1093)
   [junit4]    >         at java.util.concurrent.ScheduledThreadPoolExecutor$DelayedWorkQueue.take(ScheduledThreadPoolExecutor.java:809)
   [junit4]    >         at java.util.concurrent.ThreadPoolExecutor.getTask(ThreadPoolExecutor.java:1067)
   [junit4]    >         at java.util.concurrent.ThreadPoolExecutor.runWorker(ThreadPoolExecutor.java:1127)
   [junit4]    >         at java.util.concurrent.ThreadPoolExecutor$Worker.run(ThreadPoolExecutor.java:617)
   [junit4]    >         at java.lang.Thread.run(Thread.java:746)
   [junit4]    >    2) Thread[id=10457, name=groupCache.data, state=TIMED_WAITING, group=TGRP-TestSolrCloudWithKerberosAlt]
   [junit4]    >         at sun.misc.Unsafe.park(Native Method)
   [junit4]    >         at java.util.concurrent.locks.LockSupport.parkNanos(LockSupport.java:215)
   [junit4]    >         at java.util.concurrent.locks.AbstractQueuedSynchronizer$ConditionObject.awaitNanos(AbstractQueuedSynchronizer.java:2078)
   [junit4]    >         at java.util.concurrent.ScheduledThreadPoolExecutor$DelayedWorkQueue.take(ScheduledThreadPoolExecutor.java:1093)
   [junit4]    >         at java.util.concurrent.ScheduledThreadPoolExecutor$DelayedWorkQueue.take(ScheduledThreadPoolExecutor.java:809)
   [junit4]    >         at java.util.concurrent.ThreadPoolExecutor.getTask(ThreadPoolExecutor.java:1067)
   [junit4]    >         at java.util.concurrent.ThreadPoolExecutor.runWorker(ThreadPoolExecutor.java:1127)
   [junit4]    >         at java.util.concurrent.ThreadPoolExecutor$Worker.run(ThreadPoolExecutor.java:617)
   [junit4]    >         at java.lang.Thread.run(Thread.java:746)
   [junit4]    >    3) Thread[id=10454, name=apacheds, state=WAITING, group=TGRP-TestSolrCloudWithKerberosAlt]
   [junit4]    >         at java.lang.Object.wait(Native Method)
   [junit4]    >         at java.lang.Object.wait(Object.java:516)
   [junit4]    >         at java.util.TimerThread.mainLoop(Timer.java:526)
   [junit4]    >         at java.util.TimerThread.run(Timer.java:505)
   [junit4]    >    4) Thread[id=10458, name=ou=system.data, state=TIMED_WAITING, group=TGRP-TestSolrCloudWithKerberosAlt]
   [junit4]    >         at sun.misc.Unsafe.park(Native Method)
   [junit4]    >         at java.util.concurrent.locks.LockSupport.parkNanos(LockSupport.java:215)
   [junit4]    >         at java.util.concurrent.locks.AbstractQueuedSynchronizer$ConditionObject.awaitNanos(AbstractQueuedSynchronizer.java:2078)
   [junit4]    >         at java.util.concurrent.ScheduledThreadPoolExecutor$DelayedWorkQueue.take(ScheduledThreadPoolExecutor.java:1093)
   [junit4]    >         at java.util.concurrent.ScheduledThreadPoolExecutor$DelayedWorkQueue.take(ScheduledThreadPoolExecutor.java:809)
   [junit4]    >         at java.util.concurrent.ThreadPoolExecutor.getTask(ThreadPoolExecutor.java:1067)
   [junit4]    >         at java.util.concurrent.ThreadPoolExecutor.runWorker(ThreadPoolExecutor.java:1127)
   [junit4]    >         at java.util.concurrent.ThreadPoolExecutor$Worker.run(ThreadPoolExecutor.java:617)
   [junit4]    >         at java.lang.Thread.run(Thread.java:746)
   [junit4]    >    5) Thread[id=10456, name=kdcReplayCache.data, state=TIMED_WAITING, group=TGRP-TestSolrCloudWithKerberosAlt]
   [junit4]    >         at sun.misc.Unsafe.park(Native Method)
   [junit4]    >         at java.util.concurrent.locks.LockSupport.parkNanos(LockSupport.java:215)
   [junit4]    >         at java.util.concurrent.locks.AbstractQueuedSynchronizer$ConditionObject.awaitNanos(AbstractQueuedSynchronizer.java:2078)
   [junit4]    >         at java.util.concurrent.ScheduledThreadPoolExecutor$DelayedWorkQueue.take(ScheduledThreadPoolExecutor.java:1093)
   [junit4]    >         at java.util.concurrent.ScheduledThreadPoolExecutor$DelayedWorkQueue.take(ScheduledThreadPoolExecutor.java:809)
   [junit4]    >         at java.util.concurrent.ThreadPoolExecutor.getTask(ThreadPoolExecutor.java:1067)
   [junit4]    >         at java.util.concurrent.ThreadPoolExecutor.runWorker(ThreadPoolExecutor.java:1127)
   [junit4]    >         at java.util.concurrent.ThreadPoolExecutor$Worker.run(ThreadPoolExecutor.java:617)
   [junit4]    >         at java.lang.Thread.run(Thread.java:746)
   [junit4]    > 	at __randomizedtesting.SeedInfo.seed([DFE79BF1850BBAA7]:0)
   [junit4] Completed [461/546] on J2 in 24.31s, 1 test, 3 errors <<< FAILURES!

[...truncated 275 lines...]
BUILD FAILED
/home/jenkins/workspace/Lucene-Solr-trunk-Linux/build.xml:775: The following error occurred while executing this line:
/home/jenkins/workspace/Lucene-Solr-trunk-Linux/build.xml:719: The following error occurred while executing this line:
/home/jenkins/workspace/Lucene-Solr-trunk-Linux/build.xml:59: The following error occurred while executing this line:
/home/jenkins/workspace/Lucene-Solr-trunk-Linux/solr/build.xml:233: The following error occurred while executing this line:
/home/jenkins/workspace/Lucene-Solr-trunk-Linux/solr/common-build.xml:516: The following error occurred while executing this line:
/home/jenkins/workspace/Lucene-Solr-trunk-Linux/lucene/common-build.xml:1432: The following error occurred while executing this line:
/home/jenkins/workspace/Lucene-Solr-trunk-Linux/lucene/common-build.xml:987: There were test failures: 546 suites (8 ignored), 2145 tests, 2 suite-level errors, 1 error, 405 ignored (35 assumptions) [seed: DFE79BF1850BBAA7]

Total time: 46 minutes 7 seconds
Build step 'Invoke Ant' marked build as failure
Archiving artifacts
[WARNINGS] Skipping publisher since build result is FAILURE
Recording test results
Email was triggered for: Failure - Any
Sending email for trigger: Failure - Any



Mime
View raw message