lucene-dev mailing list archives

Site index · List index
Message view « Date » · « Thread »
Top « Date » · « Thread »
From Apache Jenkins Server <jenk...@builds.apache.org>
Subject [JENKINS] Lucene-Solr-NightlyTests-trunk - Build # 825 - Still Failing
Date Sun, 18 Oct 2015 10:17:23 GMT
Build: https://builds.apache.org/job/Lucene-Solr-NightlyTests-trunk/825/

2 tests failed.
FAILED:  org.apache.lucene.rangetree.TestRangeTree.testRandomBig

Error Message:
background merge hit exception: _0(6.0.0):c190033/1881:delGen=1 _1(6.0.0):c185641/571:delGen=1
_2(6.0.0):c185641/330:delGen=1 _3(6.0.0):c185377/273:delGen=1 _4(6.0.0):c184339/217:delGen=1
_5(6.0.0):c181707/140:delGen=1 _6(6.0.0):c45252/18:delGen=1 into _7 [maxNumSegments=1]

Stack Trace:
java.io.IOException: background merge hit exception: _0(6.0.0):c190033/1881:delGen=1 _1(6.0.0):c185641/571:delGen=1
_2(6.0.0):c185641/330:delGen=1 _3(6.0.0):c185377/273:delGen=1 _4(6.0.0):c184339/217:delGen=1
_5(6.0.0):c181707/140:delGen=1 _6(6.0.0):c45252/18:delGen=1 into _7 [maxNumSegments=1]
	at __randomizedtesting.SeedInfo.seed([7C0697500647D4E8:FB51EADF971EA868]:0)
	at org.apache.lucene.index.IndexWriter.forceMerge(IndexWriter.java:1765)
	at org.apache.lucene.index.IndexWriter.forceMerge(IndexWriter.java:1705)
	at org.apache.lucene.rangetree.TestRangeTree.verify(TestRangeTree.java:401)
	at org.apache.lucene.rangetree.TestRangeTree.doTestRandom(TestRangeTree.java:347)
	at org.apache.lucene.rangetree.TestRangeTree.testRandomBig(TestRangeTree.java:297)
	at sun.reflect.NativeMethodAccessorImpl.invoke0(Native Method)
	at sun.reflect.NativeMethodAccessorImpl.invoke(NativeMethodAccessorImpl.java:62)
	at sun.reflect.DelegatingMethodAccessorImpl.invoke(DelegatingMethodAccessorImpl.java:43)
	at java.lang.reflect.Method.invoke(Method.java:497)
	at com.carrotsearch.randomizedtesting.RandomizedRunner.invoke(RandomizedRunner.java:1665)
	at com.carrotsearch.randomizedtesting.RandomizedRunner$8.evaluate(RandomizedRunner.java:864)
	at com.carrotsearch.randomizedtesting.RandomizedRunner$9.evaluate(RandomizedRunner.java:900)
	at com.carrotsearch.randomizedtesting.RandomizedRunner$10.evaluate(RandomizedRunner.java:914)
	at org.apache.lucene.util.TestRuleSetupTeardownChained$1.evaluate(TestRuleSetupTeardownChained.java:50)
	at org.apache.lucene.util.AbstractBeforeAfterRule$1.evaluate(AbstractBeforeAfterRule.java:46)
	at org.apache.lucene.util.TestRuleThreadAndTestName$1.evaluate(TestRuleThreadAndTestName.java:49)
	at org.apache.lucene.util.TestRuleIgnoreAfterMaxFailures$1.evaluate(TestRuleIgnoreAfterMaxFailures.java:65)
	at org.apache.lucene.util.TestRuleMarkFailure$1.evaluate(TestRuleMarkFailure.java:48)
	at com.carrotsearch.randomizedtesting.rules.StatementAdapter.evaluate(StatementAdapter.java:36)
	at com.carrotsearch.randomizedtesting.ThreadLeakControl$StatementRunner.run(ThreadLeakControl.java:367)
	at com.carrotsearch.randomizedtesting.ThreadLeakControl.forkTimeoutingTask(ThreadLeakControl.java:809)
	at com.carrotsearch.randomizedtesting.ThreadLeakControl$3.evaluate(ThreadLeakControl.java:460)
	at com.carrotsearch.randomizedtesting.RandomizedRunner.runSingleTest(RandomizedRunner.java:873)
	at com.carrotsearch.randomizedtesting.RandomizedRunner$5.evaluate(RandomizedRunner.java:775)
	at com.carrotsearch.randomizedtesting.RandomizedRunner$6.evaluate(RandomizedRunner.java:809)
	at com.carrotsearch.randomizedtesting.RandomizedRunner$7.evaluate(RandomizedRunner.java:820)
	at org.apache.lucene.util.AbstractBeforeAfterRule$1.evaluate(AbstractBeforeAfterRule.java:46)
	at com.carrotsearch.randomizedtesting.rules.StatementAdapter.evaluate(StatementAdapter.java:36)
	at org.apache.lucene.util.TestRuleStoreClassName$1.evaluate(TestRuleStoreClassName.java:42)
	at com.carrotsearch.randomizedtesting.rules.NoShadowingOrOverridesOnMethodsRule$1.evaluate(NoShadowingOrOverridesOnMethodsRule.java:39)
	at com.carrotsearch.randomizedtesting.rules.NoShadowingOrOverridesOnMethodsRule$1.evaluate(NoShadowingOrOverridesOnMethodsRule.java:39)
	at com.carrotsearch.randomizedtesting.rules.StatementAdapter.evaluate(StatementAdapter.java:36)
	at com.carrotsearch.randomizedtesting.rules.StatementAdapter.evaluate(StatementAdapter.java:36)
	at com.carrotsearch.randomizedtesting.rules.StatementAdapter.evaluate(StatementAdapter.java:36)
	at org.apache.lucene.util.TestRuleAssertionsRequired$1.evaluate(TestRuleAssertionsRequired.java:54)
	at org.apache.lucene.util.TestRuleMarkFailure$1.evaluate(TestRuleMarkFailure.java:48)
	at org.apache.lucene.util.TestRuleIgnoreAfterMaxFailures$1.evaluate(TestRuleIgnoreAfterMaxFailures.java:65)
	at org.apache.lucene.util.TestRuleIgnoreTestSuites$1.evaluate(TestRuleIgnoreTestSuites.java:55)
	at com.carrotsearch.randomizedtesting.rules.StatementAdapter.evaluate(StatementAdapter.java:36)
	at com.carrotsearch.randomizedtesting.ThreadLeakControl$StatementRunner.run(ThreadLeakControl.java:367)
	at java.lang.Thread.run(Thread.java:745)
Caused by: java.io.IOException: cannot delete file: _71476557201.sort, a virus scanner has
it open
	at org.apache.lucene.store.MockDirectoryWrapper.deleteFile(MockDirectoryWrapper.java:523)
	at org.apache.lucene.store.MockDirectoryWrapper.deleteFile(MockDirectoryWrapper.java:471)
	at org.apache.lucene.store.LockValidatingDirectoryWrapper.deleteFile(LockValidatingDirectoryWrapper.java:38)
	at org.apache.lucene.store.FilterDirectory.deleteFile(FilterDirectory.java:62)
	at org.apache.lucene.store.TrackingDirectoryWrapper.deleteFile(TrackingDirectoryWrapper.java:37)
	at org.apache.lucene.rangetree.RangeTreeWriter.sort(RangeTreeWriter.java:296)
	at org.apache.lucene.rangetree.RangeTreeWriter.finish(RangeTreeWriter.java:350)
	at org.apache.lucene.rangetree.RangeTreeDocValuesConsumer.addSortedNumericField(RangeTreeDocValuesConsumer.java:107)
	at org.apache.lucene.codecs.perfield.PerFieldDocValuesFormat$FieldsWriter.addSortedNumericField(PerFieldDocValuesFormat.java:126)
	at org.apache.lucene.codecs.DocValuesConsumer.mergeSortedNumericField(DocValuesConsumer.java:417)
	at org.apache.lucene.codecs.DocValuesConsumer.merge(DocValuesConsumer.java:236)
	at org.apache.lucene.index.SegmentMerger.mergeDocValues(SegmentMerger.java:150)
	at org.apache.lucene.index.SegmentMerger.merge(SegmentMerger.java:105)
	at org.apache.lucene.index.IndexWriter.mergeMiddle(IndexWriter.java:4054)
	at org.apache.lucene.index.IndexWriter.merge(IndexWriter.java:3634)
	at org.apache.lucene.index.ConcurrentMergeScheduler.doMerge(ConcurrentMergeScheduler.java:588)
	at org.apache.lucene.index.ConcurrentMergeScheduler$MergeThread.run(ConcurrentMergeScheduler.java:626)


FAILED:  org.apache.lucene.rangetree.TestRangeTree.testMultiValued

Error Message:
Captured an uncaught exception in thread: Thread[id=27, name=Lucene Merge Thread #0, state=RUNNABLE,
group=TGRP-TestRangeTree]

Stack Trace:
com.carrotsearch.randomizedtesting.UncaughtExceptionError: Captured an uncaught exception
in thread: Thread[id=27, name=Lucene Merge Thread #0, state=RUNNABLE, group=TGRP-TestRangeTree]
	at __randomizedtesting.SeedInfo.seed([7C0697500647D4E8:A826F362C88594A0]:0)
Caused by: org.apache.lucene.index.MergePolicy$MergeException: java.io.IOException: cannot
delete file: _71476557201.sort, a virus scanner has it open
	at __randomizedtesting.SeedInfo.seed([7C0697500647D4E8]:0)
	at org.apache.lucene.index.ConcurrentMergeScheduler.handleMergeException(ConcurrentMergeScheduler.java:668)
	at org.apache.lucene.index.ConcurrentMergeScheduler$MergeThread.run(ConcurrentMergeScheduler.java:648)
Caused by: java.io.IOException: cannot delete file: _71476557201.sort, a virus scanner has
it open
	at org.apache.lucene.store.MockDirectoryWrapper.deleteFile(MockDirectoryWrapper.java:523)
	at org.apache.lucene.store.MockDirectoryWrapper.deleteFile(MockDirectoryWrapper.java:471)
	at org.apache.lucene.store.LockValidatingDirectoryWrapper.deleteFile(LockValidatingDirectoryWrapper.java:38)
	at org.apache.lucene.store.FilterDirectory.deleteFile(FilterDirectory.java:62)
	at org.apache.lucene.store.TrackingDirectoryWrapper.deleteFile(TrackingDirectoryWrapper.java:37)
	at org.apache.lucene.rangetree.RangeTreeWriter.sort(RangeTreeWriter.java:296)
	at org.apache.lucene.rangetree.RangeTreeWriter.finish(RangeTreeWriter.java:350)
	at org.apache.lucene.rangetree.RangeTreeDocValuesConsumer.addSortedNumericField(RangeTreeDocValuesConsumer.java:107)
	at org.apache.lucene.codecs.perfield.PerFieldDocValuesFormat$FieldsWriter.addSortedNumericField(PerFieldDocValuesFormat.java:126)
	at org.apache.lucene.codecs.DocValuesConsumer.mergeSortedNumericField(DocValuesConsumer.java:417)
	at org.apache.lucene.codecs.DocValuesConsumer.merge(DocValuesConsumer.java:236)
	at org.apache.lucene.index.SegmentMerger.mergeDocValues(SegmentMerger.java:150)
	at org.apache.lucene.index.SegmentMerger.merge(SegmentMerger.java:105)
	at org.apache.lucene.index.IndexWriter.mergeMiddle(IndexWriter.java:4054)
	at org.apache.lucene.index.IndexWriter.merge(IndexWriter.java:3634)
	at org.apache.lucene.index.ConcurrentMergeScheduler.doMerge(ConcurrentMergeScheduler.java:588)
	at org.apache.lucene.index.ConcurrentMergeScheduler$MergeThread.run(ConcurrentMergeScheduler.java:626)




Build Log:
[...truncated 7885 lines...]
   [junit4] Suite: org.apache.lucene.rangetree.TestRangeTree
   [junit4]   2> ?.?. 18, 2015 1:13:35 ?????????? com.carrotsearch.randomizedtesting.RandomizedRunner$QueueUncaughtExceptionsHandler
uncaughtException
   [junit4]   2> WARNING: Uncaught exception in thread: Thread[Lucene Merge Thread #0,5,TGRP-TestRangeTree]
   [junit4]   2> org.apache.lucene.index.MergePolicy$MergeException: java.io.IOException:
cannot delete file: _71476557201.sort, a virus scanner has it open
   [junit4]   2> 	at __randomizedtesting.SeedInfo.seed([7C0697500647D4E8]:0)
   [junit4]   2> 	at org.apache.lucene.index.ConcurrentMergeScheduler.handleMergeException(ConcurrentMergeScheduler.java:668)
   [junit4]   2> 	at org.apache.lucene.index.ConcurrentMergeScheduler$MergeThread.run(ConcurrentMergeScheduler.java:648)
   [junit4]   2> Caused by: java.io.IOException: cannot delete file: _71476557201.sort,
a virus scanner has it open
   [junit4]   2> 	at org.apache.lucene.store.MockDirectoryWrapper.deleteFile(MockDirectoryWrapper.java:523)
   [junit4]   2> 	at org.apache.lucene.store.MockDirectoryWrapper.deleteFile(MockDirectoryWrapper.java:471)
   [junit4]   2> 	at org.apache.lucene.store.LockValidatingDirectoryWrapper.deleteFile(LockValidatingDirectoryWrapper.java:38)
   [junit4]   2> 	at org.apache.lucene.store.FilterDirectory.deleteFile(FilterDirectory.java:62)
   [junit4]   2> 	at org.apache.lucene.store.TrackingDirectoryWrapper.deleteFile(TrackingDirectoryWrapper.java:37)
   [junit4]   2> 	at org.apache.lucene.rangetree.RangeTreeWriter.sort(RangeTreeWriter.java:296)
   [junit4]   2> 	at org.apache.lucene.rangetree.RangeTreeWriter.finish(RangeTreeWriter.java:350)
   [junit4]   2> 	at org.apache.lucene.rangetree.RangeTreeDocValuesConsumer.addSortedNumericField(RangeTreeDocValuesConsumer.java:107)
   [junit4]   2> 	at org.apache.lucene.codecs.perfield.PerFieldDocValuesFormat$FieldsWriter.addSortedNumericField(PerFieldDocValuesFormat.java:126)
   [junit4]   2> 	at org.apache.lucene.codecs.DocValuesConsumer.mergeSortedNumericField(DocValuesConsumer.java:417)
   [junit4]   2> 	at org.apache.lucene.codecs.DocValuesConsumer.merge(DocValuesConsumer.java:236)
   [junit4]   2> 	at org.apache.lucene.index.SegmentMerger.mergeDocValues(SegmentMerger.java:150)
   [junit4]   2> 	at org.apache.lucene.index.SegmentMerger.merge(SegmentMerger.java:105)
   [junit4]   2> 	at org.apache.lucene.index.IndexWriter.mergeMiddle(IndexWriter.java:4054)
   [junit4]   2> 	at org.apache.lucene.index.IndexWriter.merge(IndexWriter.java:3634)
   [junit4]   2> 	at org.apache.lucene.index.ConcurrentMergeScheduler.doMerge(ConcurrentMergeScheduler.java:588)
   [junit4]   2> 	at org.apache.lucene.index.ConcurrentMergeScheduler$MergeThread.run(ConcurrentMergeScheduler.java:626)
   [junit4]   2> 
   [junit4]   2> NOTE: download the large Jenkins line-docs file by running 'ant get-jenkins-line-docs'
in the lucene directory.
   [junit4]   2> NOTE: reproduce with: ant test  -Dtestcase=TestRangeTree -Dtests.method=testRandomBig
-Dtests.seed=7C0697500647D4E8 -Dtests.multiplier=2 -Dtests.nightly=true -Dtests.slow=true
-Dtests.linedocsfile=/x1/jenkins/lucene-data/enwiki.random.lines.txt -Dtests.locale=th -Dtests.timezone=Europe/Tallinn
-Dtests.asserts=true -Dtests.file.encoding=ISO-8859-1
   [junit4] ERROR   36.5s J0 | TestRangeTree.testRandomBig <<<
   [junit4]    > Throwable #1: java.io.IOException: background merge hit exception: _0(6.0.0):c190033/1881:delGen=1
_1(6.0.0):c185641/571:delGen=1 _2(6.0.0):c185641/330:delGen=1 _3(6.0.0):c185377/273:delGen=1
_4(6.0.0):c184339/217:delGen=1 _5(6.0.0):c181707/140:delGen=1 _6(6.0.0):c45252/18:delGen=1
into _7 [maxNumSegments=1]
   [junit4]    > 	at __randomizedtesting.SeedInfo.seed([7C0697500647D4E8:FB51EADF971EA868]:0)
   [junit4]    > 	at org.apache.lucene.index.IndexWriter.forceMerge(IndexWriter.java:1765)
   [junit4]    > 	at org.apache.lucene.index.IndexWriter.forceMerge(IndexWriter.java:1705)
   [junit4]    > 	at org.apache.lucene.rangetree.TestRangeTree.verify(TestRangeTree.java:401)
   [junit4]    > 	at org.apache.lucene.rangetree.TestRangeTree.doTestRandom(TestRangeTree.java:347)
   [junit4]    > 	at org.apache.lucene.rangetree.TestRangeTree.testRandomBig(TestRangeTree.java:297)
   [junit4]    > 	at java.lang.Thread.run(Thread.java:745)
   [junit4]    > Caused by: java.io.IOException: cannot delete file: _71476557201.sort,
a virus scanner has it open
   [junit4]    > 	at org.apache.lucene.store.MockDirectoryWrapper.deleteFile(MockDirectoryWrapper.java:523)
   [junit4]    > 	at org.apache.lucene.store.MockDirectoryWrapper.deleteFile(MockDirectoryWrapper.java:471)
   [junit4]    > 	at org.apache.lucene.store.LockValidatingDirectoryWrapper.deleteFile(LockValidatingDirectoryWrapper.java:38)
   [junit4]    > 	at org.apache.lucene.store.FilterDirectory.deleteFile(FilterDirectory.java:62)
   [junit4]    > 	at org.apache.lucene.store.TrackingDirectoryWrapper.deleteFile(TrackingDirectoryWrapper.java:37)
   [junit4]    > 	at org.apache.lucene.rangetree.RangeTreeWriter.sort(RangeTreeWriter.java:296)
   [junit4]    > 	at org.apache.lucene.rangetree.RangeTreeWriter.finish(RangeTreeWriter.java:350)
   [junit4]    > 	at org.apache.lucene.rangetree.RangeTreeDocValuesConsumer.addSortedNumericField(RangeTreeDocValuesConsumer.java:107)
   [junit4]    > 	at org.apache.lucene.codecs.perfield.PerFieldDocValuesFormat$FieldsWriter.addSortedNumericField(PerFieldDocValuesFormat.java:126)
   [junit4]    > 	at org.apache.lucene.codecs.DocValuesConsumer.mergeSortedNumericField(DocValuesConsumer.java:417)
   [junit4]    > 	at org.apache.lucene.codecs.DocValuesConsumer.merge(DocValuesConsumer.java:236)
   [junit4]    > 	at org.apache.lucene.index.SegmentMerger.mergeDocValues(SegmentMerger.java:150)
   [junit4]    > 	at org.apache.lucene.index.SegmentMerger.merge(SegmentMerger.java:105)
   [junit4]    > 	at org.apache.lucene.index.IndexWriter.mergeMiddle(IndexWriter.java:4054)
   [junit4]    > 	at org.apache.lucene.index.IndexWriter.merge(IndexWriter.java:3634)
   [junit4]    > 	at org.apache.lucene.index.ConcurrentMergeScheduler.doMerge(ConcurrentMergeScheduler.java:588)
   [junit4]    > 	at org.apache.lucene.index.ConcurrentMergeScheduler$MergeThread.run(ConcurrentMergeScheduler.java:626)
   [junit4]   2> NOTE: download the large Jenkins line-docs file by running 'ant get-jenkins-line-docs'
in the lucene directory.
   [junit4]   2> NOTE: reproduce with: ant test  -Dtestcase=TestRangeTree -Dtests.method=testMultiValued
-Dtests.seed=7C0697500647D4E8 -Dtests.multiplier=2 -Dtests.nightly=true -Dtests.slow=true
-Dtests.linedocsfile=/x1/jenkins/lucene-data/enwiki.random.lines.txt -Dtests.locale=th -Dtests.timezone=Europe/Tallinn
-Dtests.asserts=true -Dtests.file.encoding=ISO-8859-1
   [junit4] ERROR   75.1s J0 | TestRangeTree.testMultiValued <<<
   [junit4]    > Throwable #1: com.carrotsearch.randomizedtesting.UncaughtExceptionError:
Captured an uncaught exception in thread: Thread[id=27, name=Lucene Merge Thread #0, state=RUNNABLE,
group=TGRP-TestRangeTree]
   [junit4]    > 	at __randomizedtesting.SeedInfo.seed([7C0697500647D4E8:A826F362C88594A0]:0)
   [junit4]    > Caused by: org.apache.lucene.index.MergePolicy$MergeException: java.io.IOException:
cannot delete file: _71476557201.sort, a virus scanner has it open
   [junit4]    > 	at __randomizedtesting.SeedInfo.seed([7C0697500647D4E8]:0)
   [junit4]    > 	at org.apache.lucene.index.ConcurrentMergeScheduler.handleMergeException(ConcurrentMergeScheduler.java:668)
   [junit4]    > 	at org.apache.lucene.index.ConcurrentMergeScheduler$MergeThread.run(ConcurrentMergeScheduler.java:648)
   [junit4]    > Caused by: java.io.IOException: cannot delete file: _71476557201.sort,
a virus scanner has it open
   [junit4]    > 	at org.apache.lucene.store.MockDirectoryWrapper.deleteFile(MockDirectoryWrapper.java:523)
   [junit4]    > 	at org.apache.lucene.store.MockDirectoryWrapper.deleteFile(MockDirectoryWrapper.java:471)
   [junit4]    > 	at org.apache.lucene.store.LockValidatingDirectoryWrapper.deleteFile(LockValidatingDirectoryWrapper.java:38)
   [junit4]    > 	at org.apache.lucene.store.FilterDirectory.deleteFile(FilterDirectory.java:62)
   [junit4]    > 	at org.apache.lucene.store.TrackingDirectoryWrapper.deleteFile(TrackingDirectoryWrapper.java:37)
   [junit4]    > 	at org.apache.lucene.rangetree.RangeTreeWriter.sort(RangeTreeWriter.java:296)
   [junit4]    > 	at org.apache.lucene.rangetree.RangeTreeWriter.finish(RangeTreeWriter.java:350)
   [junit4]    > 	at org.apache.lucene.rangetree.RangeTreeDocValuesConsumer.addSortedNumericField(RangeTreeDocValuesConsumer.java:107)
   [junit4]    > 	at org.apache.lucene.codecs.perfield.PerFieldDocValuesFormat$FieldsWriter.addSortedNumericField(PerFieldDocValuesFormat.java:126)
   [junit4]    > 	at org.apache.lucene.codecs.DocValuesConsumer.mergeSortedNumericField(DocValuesConsumer.java:417)
   [junit4]    > 	at org.apache.lucene.codecs.DocValuesConsumer.merge(DocValuesConsumer.java:236)
   [junit4]    > 	at org.apache.lucene.index.SegmentMerger.mergeDocValues(SegmentMerger.java:150)
   [junit4]    > 	at org.apache.lucene.index.SegmentMerger.merge(SegmentMerger.java:105)
   [junit4]    > 	at org.apache.lucene.index.IndexWriter.mergeMiddle(IndexWriter.java:4054)
   [junit4]    > 	at org.apache.lucene.index.IndexWriter.merge(IndexWriter.java:3634)
   [junit4]    > 	at org.apache.lucene.index.ConcurrentMergeScheduler.doMerge(ConcurrentMergeScheduler.java:588)
   [junit4]    > 	at org.apache.lucene.index.ConcurrentMergeScheduler$MergeThread.run(ConcurrentMergeScheduler.java:626)
   [junit4]   2> NOTE: leaving temporary files on disk at: /x1/jenkins/jenkins-slave/workspace/Lucene-Solr-NightlyTests-trunk/lucene/build/sandbox/test/J0/temp/lucene.rangetree.TestRangeTree_7C0697500647D4E8-001
   [junit4]   2> NOTE: test params are: codec=Asserting(Lucene53): {}, docValues:{}, sim=ClassicSimilarity,
locale=th, timezone=Europe/Tallinn
   [junit4]   2> NOTE: Linux 3.13.0-52-generic amd64/Oracle Corporation 1.8.0_45 (64-bit)/cpus=4,threads=1,free=165013680,total=352321536
   [junit4]   2> NOTE: All tests run in this JVM: [TestRangeTree]
   [junit4] Completed [10/14] on J0 in 154.21s, 14 tests, 2 errors <<< FAILURES!

[...truncated 26 lines...]
BUILD FAILED
/x1/jenkins/jenkins-slave/workspace/Lucene-Solr-NightlyTests-trunk/build.xml:782: The following
error occurred while executing this line:
/x1/jenkins/jenkins-slave/workspace/Lucene-Solr-NightlyTests-trunk/build.xml:719: The following
error occurred while executing this line:
/x1/jenkins/jenkins-slave/workspace/Lucene-Solr-NightlyTests-trunk/build.xml:59: The following
error occurred while executing this line:
/x1/jenkins/jenkins-slave/workspace/Lucene-Solr-NightlyTests-trunk/lucene/build.xml:471: The
following error occurred while executing this line:
/x1/jenkins/jenkins-slave/workspace/Lucene-Solr-NightlyTests-trunk/lucene/common-build.xml:2162:
The following error occurred while executing this line:
/x1/jenkins/jenkins-slave/workspace/Lucene-Solr-NightlyTests-trunk/lucene/module-build.xml:58:
The following error occurred while executing this line:
/x1/jenkins/jenkins-slave/workspace/Lucene-Solr-NightlyTests-trunk/lucene/common-build.xml:1432:
The following error occurred while executing this line:
/x1/jenkins/jenkins-slave/workspace/Lucene-Solr-NightlyTests-trunk/lucene/common-build.xml:987:
There were test failures: 14 suites, 104 tests, 2 errors [seed: 7C0697500647D4E8]

Total time: 110 minutes 47 seconds
Build step 'Invoke Ant' marked build as failure
Archiving artifacts
No prior successful build to compare, so performing full copy of artifacts
Recording test results
Email was triggered for: Failure - Any
Sending email for trigger: Failure - Any



Mime
View raw message