lucene-dev mailing list archives

Site index · List index
Message view « Date » · « Thread »
Top « Date » · « Thread »
From Policeman Jenkins Server <jenk...@thetaphi.de>
Subject [JENKINS-EA] Lucene-Solr-trunk-Linux (32bit/jdk1.9.0-ea-b85) - Build # 14620 - Still Failing!
Date Thu, 22 Oct 2015 07:44:33 GMT
Build: http://jenkins.thetaphi.de/job/Lucene-Solr-trunk-Linux/14620/
Java: 32bit/jdk1.9.0-ea-b85 -client -XX:+UseConcMarkSweepGC

1 tests failed.
FAILED:  org.apache.lucene.bkdtree.TestBKDTree.testRandomMedium

Error Message:
refusing to delete any files: this IndexWriter hit an unrecoverable exception

Stack Trace:
org.apache.lucene.store.AlreadyClosedException: refusing to delete any files: this IndexWriter
hit an unrecoverable exception
	at org.apache.lucene.index.IndexFileDeleter.ensureOpen(IndexFileDeleter.java:341)
	at org.apache.lucene.index.IndexFileDeleter.deleteFile(IndexFileDeleter.java:725)
	at org.apache.lucene.index.IndexFileDeleter.deletePendingFiles(IndexFileDeleter.java:514)
	at org.apache.lucene.index.IndexFileDeleter.decRef(IndexFileDeleter.java:622)
	at org.apache.lucene.index.IndexFileDeleter.checkpoint(IndexFileDeleter.java:564)
	at org.apache.lucene.index.IndexWriter.checkpointNoSIS(IndexWriter.java:2315)
	at org.apache.lucene.index.IndexWriter$ReaderPool.commit(IndexWriter.java:632)
	at org.apache.lucene.index.IndexWriter.prepareCommitInternal(IndexWriter.java:2795)
	at org.apache.lucene.index.IndexWriter.commitInternal(IndexWriter.java:2947)
	at org.apache.lucene.index.IndexWriter.shutdown(IndexWriter.java:1066)
	at org.apache.lucene.index.IndexWriter.close(IndexWriter.java:1109)
	at org.apache.lucene.util.BaseGeoPointTestCase.verify(BaseGeoPointTestCase.java:591)
	at org.apache.lucene.util.BaseGeoPointTestCase.doTestRandom(BaseGeoPointTestCase.java:399)
	at org.apache.lucene.util.BaseGeoPointTestCase.testRandomMedium(BaseGeoPointTestCase.java:322)
	at sun.reflect.NativeMethodAccessorImpl.invoke0(Native Method)
	at sun.reflect.NativeMethodAccessorImpl.invoke(NativeMethodAccessorImpl.java:62)
	at sun.reflect.DelegatingMethodAccessorImpl.invoke(DelegatingMethodAccessorImpl.java:43)
	at java.lang.reflect.Method.invoke(Method.java:520)
	at com.carrotsearch.randomizedtesting.RandomizedRunner.invoke(RandomizedRunner.java:1665)
	at com.carrotsearch.randomizedtesting.RandomizedRunner$8.evaluate(RandomizedRunner.java:864)
	at com.carrotsearch.randomizedtesting.RandomizedRunner$9.evaluate(RandomizedRunner.java:900)
	at com.carrotsearch.randomizedtesting.RandomizedRunner$10.evaluate(RandomizedRunner.java:914)
	at org.apache.lucene.util.TestRuleSetupTeardownChained$1.evaluate(TestRuleSetupTeardownChained.java:50)
	at org.apache.lucene.util.AbstractBeforeAfterRule$1.evaluate(AbstractBeforeAfterRule.java:46)
	at org.apache.lucene.util.TestRuleThreadAndTestName$1.evaluate(TestRuleThreadAndTestName.java:49)
	at org.apache.lucene.util.TestRuleIgnoreAfterMaxFailures$1.evaluate(TestRuleIgnoreAfterMaxFailures.java:65)
	at org.apache.lucene.util.TestRuleMarkFailure$1.evaluate(TestRuleMarkFailure.java:48)
	at com.carrotsearch.randomizedtesting.rules.StatementAdapter.evaluate(StatementAdapter.java:36)
	at com.carrotsearch.randomizedtesting.ThreadLeakControl$StatementRunner.run(ThreadLeakControl.java:367)
	at com.carrotsearch.randomizedtesting.ThreadLeakControl.forkTimeoutingTask(ThreadLeakControl.java:809)
	at com.carrotsearch.randomizedtesting.ThreadLeakControl$3.evaluate(ThreadLeakControl.java:460)
	at com.carrotsearch.randomizedtesting.RandomizedRunner.runSingleTest(RandomizedRunner.java:873)
	at com.carrotsearch.randomizedtesting.RandomizedRunner$5.evaluate(RandomizedRunner.java:775)
	at com.carrotsearch.randomizedtesting.RandomizedRunner$6.evaluate(RandomizedRunner.java:809)
	at com.carrotsearch.randomizedtesting.RandomizedRunner$7.evaluate(RandomizedRunner.java:820)
	at org.apache.lucene.util.AbstractBeforeAfterRule$1.evaluate(AbstractBeforeAfterRule.java:46)
	at com.carrotsearch.randomizedtesting.rules.StatementAdapter.evaluate(StatementAdapter.java:36)
	at org.apache.lucene.util.TestRuleStoreClassName$1.evaluate(TestRuleStoreClassName.java:42)
	at com.carrotsearch.randomizedtesting.rules.NoShadowingOrOverridesOnMethodsRule$1.evaluate(NoShadowingOrOverridesOnMethodsRule.java:39)
	at com.carrotsearch.randomizedtesting.rules.NoShadowingOrOverridesOnMethodsRule$1.evaluate(NoShadowingOrOverridesOnMethodsRule.java:39)
	at com.carrotsearch.randomizedtesting.rules.StatementAdapter.evaluate(StatementAdapter.java:36)
	at com.carrotsearch.randomizedtesting.rules.StatementAdapter.evaluate(StatementAdapter.java:36)
	at com.carrotsearch.randomizedtesting.rules.StatementAdapter.evaluate(StatementAdapter.java:36)
	at org.apache.lucene.util.TestRuleAssertionsRequired$1.evaluate(TestRuleAssertionsRequired.java:54)
	at org.apache.lucene.util.TestRuleMarkFailure$1.evaluate(TestRuleMarkFailure.java:48)
	at org.apache.lucene.util.TestRuleIgnoreAfterMaxFailures$1.evaluate(TestRuleIgnoreAfterMaxFailures.java:65)
	at org.apache.lucene.util.TestRuleIgnoreTestSuites$1.evaluate(TestRuleIgnoreTestSuites.java:55)
	at com.carrotsearch.randomizedtesting.rules.StatementAdapter.evaluate(StatementAdapter.java:36)
	at com.carrotsearch.randomizedtesting.ThreadLeakControl$StatementRunner.run(ThreadLeakControl.java:367)
	at java.lang.Thread.run(Thread.java:747)
Caused by: java.io.IOException: cannot delete file: _191683293327.sort, a virus scanner has
it open
	at org.apache.lucene.store.MockDirectoryWrapper.deleteFile(MockDirectoryWrapper.java:522)
	at org.apache.lucene.store.MockDirectoryWrapper.deleteFile(MockDirectoryWrapper.java:470)
	at org.apache.lucene.store.LockValidatingDirectoryWrapper.deleteFile(LockValidatingDirectoryWrapper.java:38)
	at org.apache.lucene.store.FilterDirectory.deleteFile(FilterDirectory.java:62)
	at org.apache.lucene.store.TrackingDirectoryWrapper.deleteFile(TrackingDirectoryWrapper.java:37)
	at org.apache.lucene.bkdtree.BKDTreeWriter.sort(BKDTreeWriter.java:345)
	at org.apache.lucene.bkdtree.BKDTreeWriter.finish(BKDTreeWriter.java:399)
	at org.apache.lucene.bkdtree.BKDTreeDocValuesConsumer.addSortedNumericField(BKDTreeDocValuesConsumer.java:114)
	at org.apache.lucene.codecs.perfield.PerFieldDocValuesFormat$FieldsWriter.addSortedNumericField(PerFieldDocValuesFormat.java:126)
	at org.apache.lucene.codecs.DocValuesConsumer.mergeSortedNumericField(DocValuesConsumer.java:417)
	at org.apache.lucene.codecs.DocValuesConsumer.merge(DocValuesConsumer.java:236)
	at org.apache.lucene.index.SegmentMerger.mergeDocValues(SegmentMerger.java:150)
	at org.apache.lucene.index.SegmentMerger.merge(SegmentMerger.java:105)
	at org.apache.lucene.index.IndexWriter.mergeMiddle(IndexWriter.java:4054)
	at org.apache.lucene.index.IndexWriter.merge(IndexWriter.java:3634)
	at org.apache.lucene.index.ConcurrentMergeScheduler.doMerge(ConcurrentMergeScheduler.java:588)
	at org.apache.lucene.index.ConcurrentMergeScheduler$MergeThread.run(ConcurrentMergeScheduler.java:626)




Build Log:
[...truncated 7563 lines...]
   [junit4] Suite: org.apache.lucene.bkdtree.TestBKDTree
   [junit4]   2> NOTE: reproduce with: ant test  -Dtestcase=TestBKDTree -Dtests.method=testRandomMedium
-Dtests.seed=1356AB966905354E -Dtests.multiplier=3 -Dtests.slow=true -Dtests.locale=en_TZ
-Dtests.timezone=SystemV/CST6 -Dtests.asserts=true -Dtests.file.encoding=UTF-8
   [junit4] ERROR   1.37s J0 | TestBKDTree.testRandomMedium <<<
   [junit4]    > Throwable #1: org.apache.lucene.store.AlreadyClosedException: refusing
to delete any files: this IndexWriter hit an unrecoverable exception
   [junit4]    > 	at org.apache.lucene.index.IndexFileDeleter.ensureOpen(IndexFileDeleter.java:341)
   [junit4]    > 	at org.apache.lucene.index.IndexFileDeleter.deleteFile(IndexFileDeleter.java:725)
   [junit4]    > 	at org.apache.lucene.index.IndexFileDeleter.deletePendingFiles(IndexFileDeleter.java:514)
   [junit4]    > 	at org.apache.lucene.index.IndexFileDeleter.decRef(IndexFileDeleter.java:622)
   [junit4]    > 	at org.apache.lucene.index.IndexFileDeleter.checkpoint(IndexFileDeleter.java:564)
   [junit4]    > 	at org.apache.lucene.index.IndexWriter.checkpointNoSIS(IndexWriter.java:2315)
   [junit4]    > 	at org.apache.lucene.index.IndexWriter$ReaderPool.commit(IndexWriter.java:632)
   [junit4]    > 	at org.apache.lucene.index.IndexWriter.prepareCommitInternal(IndexWriter.java:2795)
   [junit4]    > 	at org.apache.lucene.index.IndexWriter.commitInternal(IndexWriter.java:2947)
   [junit4]    > 	at org.apache.lucene.index.IndexWriter.shutdown(IndexWriter.java:1066)
   [junit4]    > 	at org.apache.lucene.index.IndexWriter.close(IndexWriter.java:1109)
   [junit4]    > 	at org.apache.lucene.util.BaseGeoPointTestCase.verify(BaseGeoPointTestCase.java:591)
   [junit4]    > 	at org.apache.lucene.util.BaseGeoPointTestCase.doTestRandom(BaseGeoPointTestCase.java:399)
   [junit4]    > 	at org.apache.lucene.util.BaseGeoPointTestCase.testRandomMedium(BaseGeoPointTestCase.java:322)
   [junit4]    > 	at java.lang.Thread.run(Thread.java:747)
   [junit4]    > Caused by: java.io.IOException: cannot delete file: _191683293327.sort,
a virus scanner has it open
   [junit4]    > 	at org.apache.lucene.store.MockDirectoryWrapper.deleteFile(MockDirectoryWrapper.java:522)
   [junit4]    > 	at org.apache.lucene.store.MockDirectoryWrapper.deleteFile(MockDirectoryWrapper.java:470)
   [junit4]    > 	at org.apache.lucene.store.LockValidatingDirectoryWrapper.deleteFile(LockValidatingDirectoryWrapper.java:38)
   [junit4]    > 	at org.apache.lucene.store.FilterDirectory.deleteFile(FilterDirectory.java:62)
   [junit4]    > 	at org.apache.lucene.store.TrackingDirectoryWrapper.deleteFile(TrackingDirectoryWrapper.java:37)
   [junit4]    > 	at org.apache.lucene.bkdtree.BKDTreeWriter.sort(BKDTreeWriter.java:345)
   [junit4]    > 	at org.apache.lucene.bkdtree.BKDTreeWriter.finish(BKDTreeWriter.java:399)
   [junit4]    > 	at org.apache.lucene.bkdtree.BKDTreeDocValuesConsumer.addSortedNumericField(BKDTreeDocValuesConsumer.java:114)
   [junit4]    > 	at org.apache.lucene.codecs.perfield.PerFieldDocValuesFormat$FieldsWriter.addSortedNumericField(PerFieldDocValuesFormat.java:126)
   [junit4]    > 	at org.apache.lucene.codecs.DocValuesConsumer.mergeSortedNumericField(DocValuesConsumer.java:417)
   [junit4]    > 	at org.apache.lucene.codecs.DocValuesConsumer.merge(DocValuesConsumer.java:236)
   [junit4]    > 	at org.apache.lucene.index.SegmentMerger.mergeDocValues(SegmentMerger.java:150)
   [junit4]    > 	at org.apache.lucene.index.SegmentMerger.merge(SegmentMerger.java:105)
   [junit4]    > 	at org.apache.lucene.index.IndexWriter.mergeMiddle(IndexWriter.java:4054)
   [junit4]    > 	at org.apache.lucene.index.IndexWriter.merge(IndexWriter.java:3634)
   [junit4]    > 	at org.apache.lucene.index.ConcurrentMergeScheduler.doMerge(ConcurrentMergeScheduler.java:588)
   [junit4]    > 	at org.apache.lucene.index.ConcurrentMergeScheduler$MergeThread.run(ConcurrentMergeScheduler.java:626)Throwable
#2: com.carrotsearch.randomizedtesting.UncaughtExceptionError: Captured an uncaught exception
in thread: Thread[id=21, name=Lucene Merge Thread #0, state=RUNNABLE, group=TGRP-TestBKDTree]
   [junit4]    > Caused by: org.apache.lucene.index.MergePolicy$MergeException: java.io.IOException:
cannot delete file: _191683293327.sort, a virus scanner has it open
   [junit4]    > 	at __randomizedtesting.SeedInfo.seed([1356AB966905354E]:0)
   [junit4]    > 	at org.apache.lucene.index.ConcurrentMergeScheduler.handleMergeException(ConcurrentMergeScheduler.java:668)
   [junit4]    > 	at org.apache.lucene.index.ConcurrentMergeScheduler$MergeThread.run(ConcurrentMergeScheduler.java:648)
   [junit4]    > Caused by: java.io.IOException: cannot delete file: _191683293327.sort,
a virus scanner has it open
   [junit4]    > 	at org.apache.lucene.store.MockDirectoryWrapper.deleteFile(MockDirectoryWrapper.java:522)
   [junit4]    > 	at org.apache.lucene.store.MockDirectoryWrapper.deleteFile(MockDirectoryWrapper.java:470)
   [junit4]    > 	at org.apache.lucene.store.LockValidatingDirectoryWrapper.deleteFile(LockValidatingDirectoryWrapper.java:38)
   [junit4]    > 	at org.apache.lucene.store.FilterDirectory.deleteFile(FilterDirectory.java:62)
   [junit4]    > 	at org.apache.lucene.store.TrackingDirectoryWrapper.deleteFile(TrackingDirectoryWrapper.java:37)
   [junit4]    > 	at org.apache.lucene.bkdtree.BKDTreeWriter.sort(BKDTreeWriter.java:345)
   [junit4]    > 	at org.apache.lucene.bkdtree.BKDTreeWriter.finish(BKDTreeWriter.java:399)
   [junit4]    > 	at org.apache.lucene.bkdtree.BKDTreeDocValuesConsumer.addSortedNumericField(BKDTreeDocValuesConsumer.java:114)
   [junit4]    > 	at org.apache.lucene.codecs.perfield.PerFieldDocValuesFormat$FieldsWriter.addSortedNumericField(PerFieldDocValuesFormat.java:126)
   [junit4]    > 	at org.apache.lucene.codecs.DocValuesConsumer.mergeSortedNumericField(DocValuesConsumer.java:417)
   [junit4]    > 	at org.apache.lucene.codecs.DocValuesConsumer.merge(DocValuesConsumer.java:236)
   [junit4]    > 	at org.apache.lucene.index.SegmentMerger.mergeDocValues(SegmentMerger.java:150)
   [junit4]    > 	at org.apache.lucene.index.SegmentMerger.merge(SegmentMerger.java:105)
   [junit4]    > 	at org.apache.lucene.index.IndexWriter.mergeMiddle(IndexWriter.java:4054)
   [junit4]    > 	at org.apache.lucene.index.IndexWriter.merge(IndexWriter.java:3634)
   [junit4]    > 	at org.apache.lucene.index.ConcurrentMergeScheduler.doMerge(ConcurrentMergeScheduler.java:588)
   [junit4]    > 	at org.apache.lucene.index.ConcurrentMergeScheduler$MergeThread.run(ConcurrentMergeScheduler.java:626)
   [junit4] IGNOR/A 0.00s J0 | TestBKDTree.testRandomBig
   [junit4]    > Assumption #1: 'nightly' test group is disabled (@Nightly())
   [junit4] IGNOR/A 0.00s J0 | TestBKDTree.testAllLatEqual
   [junit4]    > Assumption #1: 'nightly' test group is disabled (@Nightly())
   [junit4] IGNOR/A 0.00s J0 | TestBKDTree.testMultiValued
   [junit4]    > Assumption #1: 'nightly' test group is disabled (@Nightly())
   [junit4]   2> Oct 22, 2015 1:43:44 AM com.carrotsearch.randomizedtesting.RandomizedRunner$QueueUncaughtExceptionsHandler
uncaughtException
   [junit4]   2> WARNING: Uncaught exception in thread: Thread[Lucene Merge Thread #0,5,TGRP-TestBKDTree]
   [junit4]   2> org.apache.lucene.index.MergePolicy$MergeException: java.io.IOException:
cannot delete file: _191683293327.sort, a virus scanner has it open
   [junit4]   2> 	at __randomizedtesting.SeedInfo.seed([1356AB966905354E]:0)
   [junit4]   2> 	at org.apache.lucene.index.ConcurrentMergeScheduler.handleMergeException(ConcurrentMergeScheduler.java:668)
   [junit4]   2> 	at org.apache.lucene.index.ConcurrentMergeScheduler$MergeThread.run(ConcurrentMergeScheduler.java:648)
   [junit4]   2> Caused by: java.io.IOException: cannot delete file: _191683293327.sort,
a virus scanner has it open
   [junit4]   2> 	at org.apache.lucene.store.MockDirectoryWrapper.deleteFile(MockDirectoryWrapper.java:522)
   [junit4]   2> 	at org.apache.lucene.store.MockDirectoryWrapper.deleteFile(MockDirectoryWrapper.java:470)
   [junit4]   2> 	at org.apache.lucene.store.LockValidatingDirectoryWrapper.deleteFile(LockValidatingDirectoryWrapper.java:38)
   [junit4]   2> 	at org.apache.lucene.store.FilterDirectory.deleteFile(FilterDirectory.java:62)
   [junit4]   2> 	at org.apache.lucene.store.TrackingDirectoryWrapper.deleteFile(TrackingDirectoryWrapper.java:37)
   [junit4]   2> 	at org.apache.lucene.bkdtree.BKDTreeWriter.sort(BKDTreeWriter.java:345)
   [junit4]   2> 	at org.apache.lucene.bkdtree.BKDTreeWriter.finish(BKDTreeWriter.java:399)
   [junit4]   2> 	at org.apache.lucene.bkdtree.BKDTreeDocValuesConsumer.addSortedNumericField(BKDTreeDocValuesConsumer.java:114)
   [junit4]   2> 	at org.apache.lucene.codecs.perfield.PerFieldDocValuesFormat$FieldsWriter.addSortedNumericField(PerFieldDocValuesFormat.java:126)
   [junit4]   2> 	at org.apache.lucene.codecs.DocValuesConsumer.mergeSortedNumericField(DocValuesConsumer.java:417)
   [junit4]   2> 	at org.apache.lucene.codecs.DocValuesConsumer.merge(DocValuesConsumer.java:236)
   [junit4]   2> 	at org.apache.lucene.index.SegmentMerger.mergeDocValues(SegmentMerger.java:150)
   [junit4]   2> 	at org.apache.lucene.index.SegmentMerger.merge(SegmentMerger.java:105)
   [junit4]   2> 	at org.apache.lucene.index.IndexWriter.mergeMiddle(IndexWriter.java:4054)
   [junit4]   2> 	at org.apache.lucene.index.IndexWriter.merge(IndexWriter.java:3634)
   [junit4]   2> 	at org.apache.lucene.index.ConcurrentMergeScheduler.doMerge(ConcurrentMergeScheduler.java:588)
   [junit4]   2> 	at org.apache.lucene.index.ConcurrentMergeScheduler$MergeThread.run(ConcurrentMergeScheduler.java:626)
   [junit4]   2> 
   [junit4] IGNOR/A 0.00s J0 | TestBKDTree.testSamePointManyTimes
   [junit4]    > Assumption #1: 'nightly' test group is disabled (@Nightly())
   [junit4] IGNOR/A 0.00s J0 | TestBKDTree.testAllLonEqual
   [junit4]    > Assumption #1: 'nightly' test group is disabled (@Nightly())
   [junit4]   2> NOTE: test params are: codec=CheapBastard, sim=ClassicSimilarity, locale=en_TZ,
timezone=SystemV/CST6
   [junit4]   2> NOTE: Linux 3.19.0-31-generic i386/Oracle Corporation 1.9.0-ea (32-bit)/cpus=12,threads=1,free=10819144,total=27971584
   [junit4]   2> NOTE: All tests run in this JVM: [TestDocValuesRangeQuery, FuzzyLikeThisQueryTest,
TestGeoUtils, TestSlowFuzzyQuery2, TestBKDTree]
   [junit4] Completed [7/14] on J0 in 1.55s, 10 tests, 1 error, 5 skipped <<< FAILURES!

[...truncated 44 lines...]
BUILD FAILED
/home/jenkins/workspace/Lucene-Solr-trunk-Linux/build.xml:775: The following error occurred
while executing this line:
/home/jenkins/workspace/Lucene-Solr-trunk-Linux/build.xml:719: The following error occurred
while executing this line:
/home/jenkins/workspace/Lucene-Solr-trunk-Linux/build.xml:59: The following error occurred
while executing this line:
/home/jenkins/workspace/Lucene-Solr-trunk-Linux/lucene/build.xml:471: The following error
occurred while executing this line:
/home/jenkins/workspace/Lucene-Solr-trunk-Linux/lucene/common-build.xml:2162: The following
error occurred while executing this line:
/home/jenkins/workspace/Lucene-Solr-trunk-Linux/lucene/module-build.xml:58: The following
error occurred while executing this line:
/home/jenkins/workspace/Lucene-Solr-trunk-Linux/lucene/common-build.xml:1432: The following
error occurred while executing this line:
/home/jenkins/workspace/Lucene-Solr-trunk-Linux/lucene/common-build.xml:987: There were test
failures: 14 suites, 112 tests, 1 error, 12 ignored (12 assumptions) [seed: 1356AB966905354E]

Total time: 18 minutes 39 seconds
Build step 'Invoke Ant' marked build as failure
Archiving artifacts
[WARNINGS] Skipping publisher since build result is FAILURE
Recording test results
Email was triggered for: Failure - Any
Sending email for trigger: Failure - Any



Mime
View raw message