lucene-dev mailing list archives

Site index · List index
Message view « Date » · « Thread »
Top « Date » · « Thread »
From Policeman Jenkins Server <jenk...@thetaphi.de>
Subject [JENKINS] Lucene-Solr-5.x-Solaris (64bit/jdk1.8.0) - Build # 279 - Failure!
Date Fri, 25 Dec 2015 08:00:36 GMT
Build: http://jenkins.thetaphi.de/job/Lucene-Solr-5.x-Solaris/279/
Java: 64bit/jdk1.8.0 -XX:-UseCompressedOops -XX:+UseSerialGC

1 tests failed.
FAILED:  junit.framework.TestSuite.org.apache.solr.client.solrj.embedded.LargeVolumeEmbeddedTest

Error Message:
ObjectTracker found 1 object(s) that were not released!!! [TransactionLog]

Stack Trace:
java.lang.AssertionError: ObjectTracker found 1 object(s) that were not released!!! [TransactionLog]
	at __randomizedtesting.SeedInfo.seed([616A35C6677EA7C2]:0)
	at org.junit.Assert.fail(Assert.java:93)
	at org.junit.Assert.assertTrue(Assert.java:43)
	at org.junit.Assert.assertNull(Assert.java:551)
	at org.apache.solr.SolrTestCaseJ4.afterClass(SolrTestCaseJ4.java:228)
	at sun.reflect.NativeMethodAccessorImpl.invoke0(Native Method)
	at sun.reflect.NativeMethodAccessorImpl.invoke(NativeMethodAccessorImpl.java:62)
	at sun.reflect.DelegatingMethodAccessorImpl.invoke(DelegatingMethodAccessorImpl.java:43)
	at java.lang.reflect.Method.invoke(Method.java:497)
	at com.carrotsearch.randomizedtesting.RandomizedRunner.invoke(RandomizedRunner.java:1764)
	at com.carrotsearch.randomizedtesting.RandomizedRunner$7.evaluate(RandomizedRunner.java:834)
	at com.carrotsearch.randomizedtesting.rules.StatementAdapter.evaluate(StatementAdapter.java:36)
	at com.carrotsearch.randomizedtesting.rules.SystemPropertiesRestoreRule$1.evaluate(SystemPropertiesRestoreRule.java:57)
	at org.apache.lucene.util.AbstractBeforeAfterRule$1.evaluate(AbstractBeforeAfterRule.java:46)
	at com.carrotsearch.randomizedtesting.rules.StatementAdapter.evaluate(StatementAdapter.java:36)
	at org.apache.lucene.util.TestRuleStoreClassName$1.evaluate(TestRuleStoreClassName.java:42)
	at com.carrotsearch.randomizedtesting.rules.NoShadowingOrOverridesOnMethodsRule$1.evaluate(NoShadowingOrOverridesOnMethodsRule.java:40)
	at com.carrotsearch.randomizedtesting.rules.NoShadowingOrOverridesOnMethodsRule$1.evaluate(NoShadowingOrOverridesOnMethodsRule.java:40)
	at com.carrotsearch.randomizedtesting.rules.StatementAdapter.evaluate(StatementAdapter.java:36)
	at com.carrotsearch.randomizedtesting.rules.StatementAdapter.evaluate(StatementAdapter.java:36)
	at com.carrotsearch.randomizedtesting.rules.StatementAdapter.evaluate(StatementAdapter.java:36)
	at org.apache.lucene.util.TestRuleAssertionsRequired$1.evaluate(TestRuleAssertionsRequired.java:54)
	at org.apache.lucene.util.TestRuleMarkFailure$1.evaluate(TestRuleMarkFailure.java:48)
	at org.apache.lucene.util.TestRuleIgnoreAfterMaxFailures$1.evaluate(TestRuleIgnoreAfterMaxFailures.java:65)
	at org.apache.lucene.util.TestRuleIgnoreTestSuites$1.evaluate(TestRuleIgnoreTestSuites.java:55)
	at com.carrotsearch.randomizedtesting.rules.StatementAdapter.evaluate(StatementAdapter.java:36)
	at com.carrotsearch.randomizedtesting.ThreadLeakControl$StatementRunner.run(ThreadLeakControl.java:367)
	at java.lang.Thread.run(Thread.java:745)




Build Log:
[...truncated 11875 lines...]
   [junit4] Suite: org.apache.solr.client.solrj.embedded.LargeVolumeEmbeddedTest
   [junit4]   2> Creating dataDir: /export/home/jenkins/workspace/Lucene-Solr-5.x-Solaris/solr/build/solr-solrj/test/J1/temp/solr.client.solrj.embedded.LargeVolumeEmbeddedTest_616A35C6677EA7C2-001/init-core-data-001
   [junit4]   2> 8976 INFO  (SUITE-LargeVolumeEmbeddedTest-seed#[616A35C6677EA7C2]-worker) [    ] o.a.s.SolrTestCaseJ4 Randomized ssl (false) and clientAuth (false)
   [junit4]   2> 9313 INFO  (SUITE-LargeVolumeEmbeddedTest-seed#[616A35C6677EA7C2]-worker) [    ] o.a.s.SolrTestCaseJ4 ####initCore
   [junit4]   2> 9314 INFO  (SUITE-LargeVolumeEmbeddedTest-seed#[616A35C6677EA7C2]-worker) [    ] o.a.s.c.SolrResourceLoader new SolrResourceLoader for directory: '/export/home/jenkins/workspace/Lucene-Solr-5.x-Solaris/solr/build/solr-solrj/test/J1/temp/solr.client.solrj.embedded.LargeVolumeEmbeddedTest_616A35C6677EA7C2-001/tempDir-001/collection1'
   [junit4]   2> 9314 INFO  (SUITE-LargeVolumeEmbeddedTest-seed#[616A35C6677EA7C2]-worker) [    ] o.a.s.c.SolrResourceLoader JNDI not configured for solr (NoInitialContextEx)
   [junit4]   2> 9314 INFO  (SUITE-LargeVolumeEmbeddedTest-seed#[616A35C6677EA7C2]-worker) [    ] o.a.s.c.SolrResourceLoader using system property solr.solr.home: /export/home/jenkins/workspace/Lucene-Solr-5.x-Solaris/solr/build/solr-solrj/test/J1/temp/solr.client.solrj.embedded.LargeVolumeEmbeddedTest_616A35C6677EA7C2-001/tempDir-001
   [junit4]   2> 9411 INFO  (SUITE-LargeVolumeEmbeddedTest-seed#[616A35C6677EA7C2]-worker) [    ] o.a.s.c.SolrConfig current version of requestparams : -1
   [junit4]   2> 9415 INFO  (SUITE-LargeVolumeEmbeddedTest-seed#[616A35C6677EA7C2]-worker) [    ] o.a.s.c.SolrConfig Adding specified lib dirs to ClassLoader
   [junit4]   2> 9418 WARN  (SUITE-LargeVolumeEmbeddedTest-seed#[616A35C6677EA7C2]-worker) [    ] o.a.s.c.SolrConfig Couldn't add files from /export/home/jenkins/workspace/Lucene-Solr-5.x-Solaris/solr/build/solr-solrj/test/J1/temp/solr.client.solrj.embedded.LargeVolumeEmbeddedTest_616A35C6677EA7C2-001/tempDir-001/collection1/../../../../contrib/extraction/lib filtered by .*\.jar to classpath: /export/home/jenkins/workspace/Lucene-Solr-5.x-Solaris/solr/build/solr-solrj/test/J1/temp/solr.client.solrj.embedded.LargeVolumeEmbeddedTest_616A35C6677EA7C2-001/tempDir-001/collection1/../../../../contrib/extraction/lib
   [junit4]   2> 9420 WARN  (SUITE-LargeVolumeEmbeddedTest-seed#[616A35C6677EA7C2]-worker) [    ] o.a.s.c.SolrConfig Couldn't add files from /export/home/jenkins/workspace/Lucene-Solr-5.x-Solaris/solr/build/solr-solrj/test/J1/temp/solr.client.solrj.embedded.LargeVolumeEmbeddedTest_616A35C6677EA7C2-001/tempDir-001/collection1/../../../../dist filtered by solr-cell-\d.*\.jar to classpath: /export/home/jenkins/workspace/Lucene-Solr-5.x-Solaris/solr/build/solr-solrj/test/J1/temp/solr.client.solrj.embedded.LargeVolumeEmbeddedTest_616A35C6677EA7C2-001/tempDir-001/collection1/../../../../dist
   [junit4]   2> 9420 WARN  (SUITE-LargeVolumeEmbeddedTest-seed#[616A35C6677EA7C2]-worker) [    ] o.a.s.c.SolrConfig Couldn't add files from /export/home/jenkins/workspace/Lucene-Solr-5.x-Solaris/solr/build/solr-solrj/test/J1/temp/solr.client.solrj.embedded.LargeVolumeEmbeddedTest_616A35C6677EA7C2-001/tempDir-001/collection1/../../../../contrib/clustering/lib filtered by .*\.jar to classpath: /export/home/jenkins/workspace/Lucene-Solr-5.x-Solaris/solr/build/solr-solrj/test/J1/temp/solr.client.solrj.embedded.LargeVolumeEmbeddedTest_616A35C6677EA7C2-001/tempDir-001/collection1/../../../../contrib/clustering/lib
   [junit4]   2> 9420 WARN  (SUITE-LargeVolumeEmbeddedTest-seed#[616A35C6677EA7C2]-worker) [    ] o.a.s.c.SolrConfig Couldn't add files from /export/home/jenkins/workspace/Lucene-Solr-5.x-Solaris/solr/build/solr-solrj/test/J1/temp/solr.client.solrj.embedded.LargeVolumeEmbeddedTest_616A35C6677EA7C2-001/tempDir-001/collection1/../../../../dist filtered by solr-clustering-\d.*\.jar to classpath: /export/home/jenkins/workspace/Lucene-Solr-5.x-Solaris/solr/build/solr-solrj/test/J1/temp/solr.client.solrj.embedded.LargeVolumeEmbeddedTest_616A35C6677EA7C2-001/tempDir-001/collection1/../../../../dist
   [junit4]   2> 9421 WARN  (SUITE-LargeVolumeEmbeddedTest-seed#[616A35C6677EA7C2]-worker) [    ] o.a.s.c.SolrConfig Couldn't add files from /export/home/jenkins/workspace/Lucene-Solr-5.x-Solaris/solr/build/solr-solrj/test/J1/temp/solr.client.solrj.embedded.LargeVolumeEmbeddedTest_616A35C6677EA7C2-001/tempDir-001/collection1/../../../../contrib/langid/lib filtered by .*\.jar to classpath: /export/home/jenkins/workspace/Lucene-Solr-5.x-Solaris/solr/build/solr-solrj/test/J1/temp/solr.client.solrj.embedded.LargeVolumeEmbeddedTest_616A35C6677EA7C2-001/tempDir-001/collection1/../../../../contrib/langid/lib
   [junit4]   2> 9421 WARN  (SUITE-LargeVolumeEmbeddedTest-seed#[616A35C6677EA7C2]-worker) [    ] o.a.s.c.SolrConfig Couldn't add files from /export/home/jenkins/workspace/Lucene-Solr-5.x-Solaris/solr/build/solr-solrj/test/J1/temp/solr.client.solrj.embedded.LargeVolumeEmbeddedTest_616A35C6677EA7C2-001/tempDir-001/collection1/../../../../dist filtered by solr-langid-\d.*\.jar to classpath: /export/home/jenkins/workspace/Lucene-Solr-5.x-Solaris/solr/build/solr-solrj/test/J1/temp/solr.client.solrj.embedded.LargeVolumeEmbeddedTest_616A35C6677EA7C2-001/tempDir-001/collection1/../../../../dist
   [junit4]   2> 9421 WARN  (SUITE-LargeVolumeEmbeddedTest-seed#[616A35C6677EA7C2]-worker) [    ] o.a.s.c.SolrConfig Couldn't add files from /export/home/jenkins/workspace/Lucene-Solr-5.x-Solaris/solr/build/solr-solrj/test/J1/temp/solr.client.solrj.embedded.LargeVolumeEmbeddedTest_616A35C6677EA7C2-001/tempDir-001/collection1/../../../../contrib/velocity/lib filtered by .*\.jar to classpath: /export/home/jenkins/workspace/Lucene-Solr-5.x-Solaris/solr/build/solr-solrj/test/J1/temp/solr.client.solrj.embedded.LargeVolumeEmbeddedTest_616A35C6677EA7C2-001/tempDir-001/collection1/../../../../contrib/velocity/lib
   [junit4]   2> 9421 WARN  (SUITE-LargeVolumeEmbeddedTest-seed#[616A35C6677EA7C2]-worker) [    ] o.a.s.c.SolrConfig Couldn't add files from /export/home/jenkins/workspace/Lucene-Solr-5.x-Solaris/solr/build/solr-solrj/test/J1/temp/solr.client.solrj.embedded.LargeVolumeEmbeddedTest_616A35C6677EA7C2-001/tempDir-001/collection1/../../../../dist filtered by solr-velocity-\d.*\.jar to classpath: /export/home/jenkins/workspace/Lucene-Solr-5.x-Solaris/solr/build/solr-solrj/test/J1/temp/solr.client.solrj.embedded.LargeVolumeEmbeddedTest_616A35C6677EA7C2-001/tempDir-001/collection1/../../../../dist
   [junit4]   2> 9439 INFO  (SUITE-LargeVolumeEmbeddedTest-seed#[616A35C6677EA7C2]-worker) [    ] o.a.s.u.SolrIndexConfig IndexWriter infoStream solr logging is enabled
   [junit4]   2> 9442 INFO  (SUITE-LargeVolumeEmbeddedTest-seed#[616A35C6677EA7C2]-worker) [    ] o.a.s.c.SolrConfig Using Lucene MatchVersion: 5.5.0
   [junit4]   2> 9519 INFO  (SUITE-LargeVolumeEmbeddedTest-seed#[616A35C6677EA7C2]-worker) [    ] o.a.s.c.SolrConfig Loaded SolrConfig: /export/home/jenkins/workspace/Lucene-Solr-5.x-Solaris/solr/build/solr-solrj/test/J1/temp/solr.client.solrj.embedded.LargeVolumeEmbeddedTest_616A35C6677EA7C2-001/tempDir-001/collection1/conf/solrconfig.xml
   [junit4]   2> 9574 INFO  (SUITE-LargeVolumeEmbeddedTest-seed#[616A35C6677EA7C2]-worker) [    ] o.a.s.s.IndexSchema [null] Schema name=example
   [junit4]   2> 10438 INFO  (SUITE-LargeVolumeEmbeddedTest-seed#[616A35C6677EA7C2]-worker) [    ] o.a.s.s.IndexSchema unique key field: id
   [junit4]   2> 10656 INFO  (SUITE-LargeVolumeEmbeddedTest-seed#[616A35C6677EA7C2]-worker) [    ] o.a.s.r.RestManager Registered ManagedResource impl org.apache.solr.rest.schema.analysis.ManagedWordSetResource for path /schema/analysis/stopwords/english
   [junit4]   2> 10658 INFO  (SUITE-LargeVolumeEmbeddedTest-seed#[616A35C6677EA7C2]-worker) [    ] o.a.s.r.RestManager Registered ManagedResource impl org.apache.solr.rest.schema.analysis.ManagedSynonymFilterFactory$SynonymManager for path /schema/analysis/synonyms/english
   [junit4]   2> 10669 INFO  (SUITE-LargeVolumeEmbeddedTest-seed#[616A35C6677EA7C2]-worker) [    ] o.a.s.r.RestManager Added observer of type org.apache.solr.rest.schema.analysis.ManagedStopFilterFactory to existing ManagedResource /schema/analysis/stopwords/english
   [junit4]   2> 10669 INFO  (SUITE-LargeVolumeEmbeddedTest-seed#[616A35C6677EA7C2]-worker) [    ] o.a.s.r.RestManager Added observer of type org.apache.solr.rest.schema.analysis.ManagedSynonymFilterFactory to existing ManagedResource /schema/analysis/synonyms/english
   [junit4]   2> 10685 INFO  (SUITE-LargeVolumeEmbeddedTest-seed#[616A35C6677EA7C2]-worker) [    ] o.a.s.s.FileExchangeRateProvider Reloading exchange rates from file currency.xml
   [junit4]   2> 10689 INFO  (SUITE-LargeVolumeEmbeddedTest-seed#[616A35C6677EA7C2]-worker) [    ] o.a.s.s.FileExchangeRateProvider Reloading exchange rates from file currency.xml
   [junit4]   2> 10713 INFO  (SUITE-LargeVolumeEmbeddedTest-seed#[616A35C6677EA7C2]-worker) [    ] o.a.s.c.SolrResourceLoader JNDI not configured for solr (NoInitialContextEx)
   [junit4]   2> 10713 INFO  (SUITE-LargeVolumeEmbeddedTest-seed#[616A35C6677EA7C2]-worker) [    ] o.a.s.c.SolrResourceLoader using system property solr.solr.home: /export/home/jenkins/workspace/Lucene-Solr-5.x-Solaris/solr/build/solr-solrj/test/J1/temp/solr.client.solrj.embedded.LargeVolumeEmbeddedTest_616A35C6677EA7C2-001/tempDir-001
   [junit4]   2> 10713 INFO  (SUITE-LargeVolumeEmbeddedTest-seed#[616A35C6677EA7C2]-worker) [    ] o.a.s.c.SolrResourceLoader new SolrResourceLoader for directory: '/export/home/jenkins/workspace/Lucene-Solr-5.x-Solaris/solr/build/solr-solrj/test/J1/temp/solr.client.solrj.embedded.LargeVolumeEmbeddedTest_616A35C6677EA7C2-001/tempDir-001'
   [junit4]   2> 10713 INFO  (SUITE-LargeVolumeEmbeddedTest-seed#[616A35C6677EA7C2]-worker) [    ] o.a.s.c.SolrResourceLoader JNDI not configured for solr (NoInitialContextEx)
   [junit4]   2> 10713 INFO  (SUITE-LargeVolumeEmbeddedTest-seed#[616A35C6677EA7C2]-worker) [    ] o.a.s.c.SolrResourceLoader using system property solr.solr.home: /export/home/jenkins/workspace/Lucene-Solr-5.x-Solaris/solr/build/solr-solrj/test/J1/temp/solr.client.solrj.embedded.LargeVolumeEmbeddedTest_616A35C6677EA7C2-001/tempDir-001
   [junit4]   2> 10718 INFO  (SUITE-LargeVolumeEmbeddedTest-seed#[616A35C6677EA7C2]-worker) [    ] o.a.s.c.CoreContainer New CoreContainer 790010339
   [junit4]   2> 10718 INFO  (SUITE-LargeVolumeEmbeddedTest-seed#[616A35C6677EA7C2]-worker) [    ] o.a.s.c.CoreContainer Loading cores into CoreContainer [instanceDir=/export/home/jenkins/workspace/Lucene-Solr-5.x-Solaris/solr/build/solr-solrj/test/J1/temp/solr.client.solrj.embedded.LargeVolumeEmbeddedTest_616A35C6677EA7C2-001/tempDir-001]
   [junit4]   2> 10719 WARN  (SUITE-LargeVolumeEmbeddedTest-seed#[616A35C6677EA7C2]-worker) [    ] o.a.s.c.CoreContainer Couldn't add files from /export/home/jenkins/workspace/Lucene-Solr-5.x-Solaris/solr/build/solr-solrj/test/J1/temp/solr.client.solrj.embedded.LargeVolumeEmbeddedTest_616A35C6677EA7C2-001/tempDir-001/lib to classpath: /export/home/jenkins/workspace/Lucene-Solr-5.x-Solaris/solr/build/solr-solrj/test/J1/temp/solr.client.solrj.embedded.LargeVolumeEmbeddedTest_616A35C6677EA7C2-001/tempDir-001/lib
   [junit4]   2> 10720 INFO  (SUITE-LargeVolumeEmbeddedTest-seed#[616A35C6677EA7C2]-worker) [    ] o.a.s.h.c.HttpShardHandlerFactory created with socketTimeout : 600000,connTimeout : 60000,maxConnectionsPerHost : 20,maxConnections : 10000,corePoolSize : 0,maximumPoolSize : 2147483647,maxThreadIdleTime : 5,sizeOfQueue : -1,fairnessPolicy : false,useRetries : false,
   [junit4]   2> 10724 INFO  (SUITE-LargeVolumeEmbeddedTest-seed#[616A35C6677EA7C2]-worker) [    ] o.a.s.u.UpdateShardHandler Creating UpdateShardHandler HTTP client with params: socketTimeout=30000&connTimeout=30000&retry=true
   [junit4]   2> 10725 INFO  (SUITE-LargeVolumeEmbeddedTest-seed#[616A35C6677EA7C2]-worker) [    ] o.a.s.l.LogWatcher SLF4J impl is org.slf4j.impl.Log4jLoggerFactory
   [junit4]   2> 10725 INFO  (SUITE-LargeVolumeEmbeddedTest-seed#[616A35C6677EA7C2]-worker) [    ] o.a.s.l.LogWatcher Registering Log Listener [Log4j (org.slf4j.impl.Log4jLoggerFactory)]
   [junit4]   2> 10725 INFO  (SUITE-LargeVolumeEmbeddedTest-seed#[616A35C6677EA7C2]-worker) [    ] o.a.s.c.CoreContainer Security conf doesn't exist. Skipping setup for authorization module.
   [junit4]   2> 10725 INFO  (SUITE-LargeVolumeEmbeddedTest-seed#[616A35C6677EA7C2]-worker) [    ] o.a.s.c.CoreContainer No authentication plugin used.
   [junit4]   2> 10727 INFO  (SUITE-LargeVolumeEmbeddedTest-seed#[616A35C6677EA7C2]-worker) [    ] o.a.s.c.CoreDescriptor Created CoreDescriptor: {name=collection1, config=/export/home/jenkins/workspace/Lucene-Solr-5.x-Solaris/solr/build/solr-solrj/test/J1/temp/solr.client.solrj.embedded.LargeVolumeEmbeddedTest_616A35C6677EA7C2-001/tempDir-001/collection1/conf/solrconfig.xml, transient=false, schema=managed-schema, loadOnStartup=true, configSetProperties=configsetprops.json, collection=collection1, dataDir=/export/home/jenkins/workspace/Lucene-Solr-5.x-Solaris/solr/build/solr-solrj/test/J1/temp/solr.client.solrj.embedded.LargeVolumeEmbeddedTest_616A35C6677EA7C2-001/init-core-data-001, shard=shard1}
   [junit4]   2> 10729 INFO  (coreLoadExecutor-54-thread-1) [    ] o.a.s.c.SolrResourceLoader new SolrResourceLoader for directory: '/export/home/jenkins/workspace/Lucene-Solr-5.x-Solaris/solr/build/solr-solrj/test/J1/temp/solr.client.solrj.embedded.LargeVolumeEmbeddedTest_616A35C6677EA7C2-001/tempDir-001/collection1'
   [junit4]   2> 10733 INFO  (coreLoadExecutor-54-thread-1) [    ] o.a.s.c.SolrResourceLoader JNDI not configured for solr (NoInitialContextEx)
   [junit4]   2> 10733 INFO  (coreLoadExecutor-54-thread-1) [    ] o.a.s.c.SolrResourceLoader using system property solr.solr.home: /export/home/jenkins/workspace/Lucene-Solr-5.x-Solaris/solr/build/solr-solrj/test/J1/temp/solr.client.solrj.embedded.LargeVolumeEmbeddedTest_616A35C6677EA7C2-001/tempDir-001
   [junit4]   2> 10751 INFO  (coreLoadExecutor-54-thread-1) [    ] o.a.s.c.SolrConfig current version of requestparams : -1
   [junit4]   2> 10752 INFO  (coreLoadExecutor-54-thread-1) [    ] o.a.s.c.SolrConfig Adding specified lib dirs to ClassLoader
   [junit4]   2> 10752 WARN  (coreLoadExecutor-54-thread-1) [    ] o.a.s.c.SolrConfig Couldn't add files from /export/home/jenkins/workspace/Lucene-Solr-5.x-Solaris/solr/build/solr-solrj/test/J1/temp/solr.client.solrj.embedded.LargeVolumeEmbeddedTest_616A35C6677EA7C2-001/tempDir-001/collection1/../../../../contrib/extraction/lib filtered by .*\.jar to classpath: /export/home/jenkins/workspace/Lucene-Solr-5.x-Solaris/solr/build/solr-solrj/test/J1/temp/solr.client.solrj.embedded.LargeVolumeEmbeddedTest_616A35C6677EA7C2-001/tempDir-001/collection1/../../../../contrib/extraction/lib
   [junit4]   2> 10752 WARN  (coreLoadExecutor-54-thread-1) [    ] o.a.s.c.SolrConfig Couldn't add files from /export/home/jenkins/workspace/Lucene-Solr-5.x-Solaris/solr/build/solr-solrj/test/J1/temp/solr.client.solrj.embedded.LargeVolumeEmbeddedTest_616A35C6677EA7C2-001/tempDir-001/collection1/../../../../dist filtered by solr-cell-\d.*\.jar to classpath: /export/home/jenkins/workspace/Lucene-Solr-5.x-Solaris/solr/build/solr-solrj/test/J1/temp/solr.client.solrj.embedded.LargeVolumeEmbeddedTest_616A35C6677EA7C2-001/tempDir-001/collection1/../../../../dist
   [junit4]   2> 10753 WARN  (coreLoadExecutor-54-thread-1) [    ] o.a.s.c.SolrConfig Couldn't add files from /export/home/jenkins/workspace/Lucene-Solr-5.x-Solaris/solr/build/solr-solrj/test/J1/temp/solr.client.solrj.embedded.LargeVolumeEmbeddedTest_616A35C6677EA7C2-001/tempDir-001/collection1/../../../../contrib/clustering/lib filtered by .*\.jar to classpath: /export/home/jenkins/workspace/Lucene-Solr-5.x-Solaris/solr/build/solr-solrj/test/J1/temp/solr.client.solrj.embedded.LargeVolumeEmbeddedTest_616A35C6677EA7C2-001/tempDir-001/collection1/../../../../contrib/clustering/lib
   [junit4]   2> 10753 WARN  (coreLoadExecutor-54-thread-1) [    ] o.a.s.c.SolrConfig Couldn't add files from /export/home/jenkins/workspace/Lucene-Solr-5.x-Solaris/solr/build/solr-solrj/test/J1/temp/solr.client.solrj.embedded.LargeVolumeEmbeddedTest_616A35C6677EA7C2-001/tempDir-001/collection1/../../../../dist filtered by solr-clustering-\d.*\.jar to classpath: /export/home/jenkins/workspace/Lucene-Solr-5.x-Solaris/solr/build/solr-solrj/test/J1/temp/solr.client.solrj.embedded.LargeVolumeEmbeddedTest_616A35C6677EA7C2-001/tempDir-001/collection1/../../../../dist
   [junit4]   2> 10753 WARN  (coreLoadExecutor-54-thread-1) [    ] o.a.s.c.SolrConfig Couldn't add files from /export/home/jenkins/workspace/Lucene-Solr-5.x-Solaris/solr/build/solr-solrj/test/J1/temp/solr.client.solrj.embedded.LargeVolumeEmbeddedTest_616A35C6677EA7C2-001/tempDir-001/collection1/../../../../contrib/langid/lib filtered by .*\.jar to classpath: /export/home/jenkins/workspace/Lucene-Solr-5.x-Solaris/solr/build/solr-solrj/test/J1/temp/solr.client.solrj.embedded.LargeVolumeEmbeddedTest_616A35C6677EA7C2-001/tempDir-001/collection1/../../../../contrib/langid/lib
   [junit4]   2> 10753 WARN  (coreLoadExecutor-54-thread-1) [    ] o.a.s.c.SolrConfig Couldn't add files from /export/home/jenkins/workspace/Lucene-Solr-5.x-Solaris/solr/build/solr-solrj/test/J1/temp/solr.client.solrj.embedded.LargeVolumeEmbeddedTest_616A35C6677EA7C2-001/tempDir-001/collection1/../../../../dist filtered by solr-langid-\d.*\.jar to classpath: /export/home/jenkins/workspace/Lucene-Solr-5.x-Solaris/solr/build/solr-solrj/test/J1/temp/solr.client.solrj.embedded.LargeVolumeEmbeddedTest_616A35C6677EA7C2-001/tempDir-001/collection1/../../../../dist
   [junit4]   2> 10753 WARN  (coreLoadExecutor-54-thread-1) [    ] o.a.s.c.SolrConfig Couldn't add files from /export/home/jenkins/workspace/Lucene-Solr-5.x-Solaris/solr/build/solr-solrj/test/J1/temp/solr.client.solrj.embedded.LargeVolumeEmbeddedTest_616A35C6677EA7C2-001/tempDir-001/collection1/../../../../contrib/velocity/lib filtered by .*\.jar to classpath: /export/home/jenkins/workspace/Lucene-Solr-5.x-Solaris/solr/build/solr-solrj/test/J1/temp/solr.client.solrj.embedded.LargeVolumeEmbeddedTest_616A35C6677EA7C2-001/tempDir-001/collection1/../../../../contrib/velocity/lib
   [junit4]   2> 10754 WARN  (coreLoadExecutor-54-thread-1) [    ] o.a.s.c.SolrConfig Couldn't add files from /export/home/jenkins/workspace/Lucene-Solr-5.x-Solaris/solr/build/solr-solrj/test/J1/temp/solr.client.solrj.embedded.LargeVolumeEmbeddedTest_616A35C6677EA7C2-001/tempDir-001/collection1/../../../../dist filtered by solr-velocity-\d.*\.jar to classpath: /export/home/jenkins/workspace/Lucene-Solr-5.x-Solaris/solr/build/solr-solrj/test/J1/temp/solr.client.solrj.embedded.LargeVolumeEmbeddedTest_616A35C6677EA7C2-001/tempDir-001/collection1/../../../../dist
   [junit4]   2> 10772 INFO  (coreLoadExecutor-54-thread-1) [    ] o.a.s.u.SolrIndexConfig IndexWriter infoStream solr logging is enabled
   [junit4]   2> 10776 INFO  (coreLoadExecutor-54-thread-1) [    ] o.a.s.c.SolrConfig Using Lucene MatchVersion: 5.5.0
   [junit4]   2> 10814 INFO  (coreLoadExecutor-54-thread-1) [    ] o.a.s.c.SolrConfig Loaded SolrConfig: /export/home/jenkins/workspace/Lucene-Solr-5.x-Solaris/solr/build/solr-solrj/test/J1/temp/solr.client.solrj.embedded.LargeVolumeEmbeddedTest_616A35C6677EA7C2-001/tempDir-001/collection1/conf/solrconfig.xml
   [junit4]   2> 10826 INFO  (coreLoadExecutor-54-thread-1) [    ] o.a.s.s.IndexSchema [collection1] Schema name=example
   [junit4]   2> 10998 INFO  (coreLoadExecutor-54-thread-1) [    ] o.a.s.s.IndexSchema unique key field: id
   [junit4]   2> 11040 INFO  (coreLoadExecutor-54-thread-1) [    ] o.a.s.r.RestManager Registered ManagedResource impl org.apache.solr.rest.schema.analysis.ManagedWordSetResource for path /schema/analysis/stopwords/english
   [junit4]   2> 11041 INFO  (coreLoadExecutor-54-thread-1) [    ] o.a.s.r.RestManager Registered ManagedResource impl org.apache.solr.rest.schema.analysis.ManagedSynonymFilterFactory$SynonymManager for path /schema/analysis/synonyms/english
   [junit4]   2> 11042 INFO  (coreLoadExecutor-54-thread-1) [    ] o.a.s.r.RestManager Added observer of type org.apache.solr.rest.schema.analysis.ManagedStopFilterFactory to existing ManagedResource /schema/analysis/stopwords/english
   [junit4]   2> 11042 INFO  (coreLoadExecutor-54-thread-1) [    ] o.a.s.r.RestManager Added observer of type org.apache.solr.rest.schema.analysis.ManagedSynonymFilterFactory to existing ManagedResource /schema/analysis/synonyms/english
   [junit4]   2> 11053 INFO  (coreLoadExecutor-54-thread-1) [    ] o.a.s.s.FileExchangeRateProvider Reloading exchange rates from file currency.xml
   [junit4]   2> 11059 INFO  (coreLoadExecutor-54-thread-1) [    ] o.a.s.s.FileExchangeRateProvider Reloading exchange rates from file currency.xml
   [junit4]   2> 11077 INFO  (coreLoadExecutor-54-thread-1) [    ] o.a.s.c.ConfigSetProperties Did not find ConfigSet properties, assuming default properties: Can't find resource 'configsetprops.json' in classpath or '/export/home/jenkins/workspace/Lucene-Solr-5.x-Solaris/solr/build/solr-solrj/test/J1/temp/solr.client.solrj.embedded.LargeVolumeEmbeddedTest_616A35C6677EA7C2-001/tempDir-001/collection1'
   [junit4]   2> 11077 INFO  (coreLoadExecutor-54-thread-1) [    ] o.a.s.c.CoreContainer Creating SolrCore 'collection1' using configuration from instancedir /export/home/jenkins/workspace/Lucene-Solr-5.x-Solaris/solr/build/solr-solrj/test/J1/temp/solr.client.solrj.embedded.LargeVolumeEmbeddedTest_616A35C6677EA7C2-001/tempDir-001/collection1
   [junit4]   2> 11077 INFO  (coreLoadExecutor-54-thread-1) [    x:collection1] o.a.s.c.SolrCore org.apache.solr.core.MockDirectoryFactory
   [junit4]   2> 11102 INFO  (coreLoadExecutor-54-thread-1) [    x:collection1] o.a.s.c.SolrCore [[collection1] ] Opening new SolrCore at [/export/home/jenkins/workspace/Lucene-Solr-5.x-Solaris/solr/build/solr-solrj/test/J1/temp/solr.client.solrj.embedded.LargeVolumeEmbeddedTest_616A35C6677EA7C2-001/tempDir-001/collection1], dataDir=[/export/home/jenkins/workspace/Lucene-Solr-5.x-Solaris/solr/build/solr-solrj/test/J1/temp/solr.client.solrj.embedded.LargeVolumeEmbeddedTest_616A35C6677EA7C2-001/init-core-data-001/]
   [junit4]   2> 11107 INFO  (coreLoadExecutor-54-thread-1) [    x:collection1] o.a.s.c.JmxMonitoredMap No JMX servers found, not exposing Solr information with JMX.
   [junit4]   2> 11116 INFO  (coreLoadExecutor-54-thread-1) [    x:collection1] o.a.s.c.SolrCore [[collection1] ] Added SolrEventListener for newSearcher: [org.apache.solr.core.QuerySenderListener{queries=[]}]
   [junit4]   2> 11116 INFO  (coreLoadExecutor-54-thread-1) [    x:collection1] o.a.s.c.SolrCore [[collection1] ] Added SolrEventListener for firstSearcher: [org.apache.solr.core.QuerySenderListener{queries=[{q=static firstSearcher warming in solrconfig.xml}]}]
   [junit4]   2> 11148 INFO  (coreLoadExecutor-54-thread-1) [    x:collection1] o.a.s.c.CachingDirectoryFactory return new directory for /export/home/jenkins/workspace/Lucene-Solr-5.x-Solaris/solr/build/solr-solrj/test/J1/temp/solr.client.solrj.embedded.LargeVolumeEmbeddedTest_616A35C6677EA7C2-001/init-core-data-001
   [junit4]   2> 11148 INFO  (coreLoadExecutor-54-thread-1) [    x:collection1] o.a.s.c.SolrCore New index directory detected: old=null new=/export/home/jenkins/workspace/Lucene-Solr-5.x-Solaris/solr/build/solr-solrj/test/J1/temp/solr.client.solrj.embedded.LargeVolumeEmbeddedTest_616A35C6677EA7C2-001/init-core-data-001/index/
   [junit4]   2> 11148 WARN  (coreLoadExecutor-54-thread-1) [    x:collection1] o.a.s.c.SolrCore [collection1] Solr index directory '/export/home/jenkins/workspace/Lucene-Solr-5.x-Solaris/solr/build/solr-solrj/test/J1/temp/solr.client.solrj.embedded.LargeVolumeEmbeddedTest_616A35C6677EA7C2-001/init-core-data-001/index' doesn't exist. Creating new index...
   [junit4]   2> 11149 INFO  (coreLoadExecutor-54-thread-1) [    x:collection1] o.a.s.c.CachingDirectoryFactory return new directory for /export/home/jenkins/workspace/Lucene-Solr-5.x-Solaris/solr/build/solr-solrj/test/J1/temp/solr.client.solrj.embedded.LargeVolumeEmbeddedTest_616A35C6677EA7C2-001/init-core-data-001/index
   [junit4]   2> 11149 INFO  (coreLoadExecutor-54-thread-1) [    x:collection1] o.a.s.u.LoggingInfoStream [IFD][coreLoadExecutor-54-thread-1]: init: current segments file is "segments"; deletionPolicy=org.apache.solr.core.IndexDeletionPolicyWrapper@3bddc4a
   [junit4]   2> 11150 INFO  (coreLoadExecutor-54-thread-1) [    x:collection1] o.a.s.u.LoggingInfoStream [IFD][coreLoadExecutor-54-thread-1]: now checkpoint "" [0 segments ; isCommit = false]
   [junit4]   2> 11150 INFO  (coreLoadExecutor-54-thread-1) [    x:collection1] o.a.s.u.LoggingInfoStream [IFD][coreLoadExecutor-54-thread-1]: 0 msec to checkpoint
   [junit4]   2> 11150 INFO  (coreLoadExecutor-54-thread-1) [    x:collection1] o.a.s.u.LoggingInfoStream [IW][coreLoadExecutor-54-thread-1]: init: create=true
   [junit4]   2> 11151 INFO  (coreLoadExecutor-54-thread-1) [    x:collection1] o.a.s.u.LoggingInfoStream [IW][coreLoadExecutor-54-thread-1]: 
   [junit4]   2> dir=MockDirectoryWrapper(RAMDirectory@56de8beb lockFactory=org.apache.lucene.store.SingleInstanceLockFactory@43246482)
   [junit4]   2> index=
   [junit4]   2> version=5.5.0
   [junit4]   2> analyzer=org.apache.solr.update.SolrIndexConfig$DelayedSchemaAnalyzer
   [junit4]   2> ramBufferSizeMB=100.0
   [junit4]   2> maxBufferedDocs=-1
   [junit4]   2> maxBufferedDeleteTerms=-1
   [junit4]   2> mergedSegmentWarmer=null
   [junit4]   2> delPolicy=org.apache.solr.core.IndexDeletionPolicyWrapper
   [junit4]   2> commit=null
   [junit4]   2> openMode=CREATE
   [junit4]   2> similarity=org.apache.lucene.search.similarities.ClassicSimilarity
   [junit4]   2> mergeScheduler=ConcurrentMergeScheduler: maxThreadCount=-1, maxMergeCount=-1, ioThrottle=true
   [junit4]   2> default WRITE_LOCK_TIMEOUT=0
   [junit4]   2> writeLockTimeout=0
   [junit4]   2> codec=Lucene54
   [junit4]   2> infoStream=org.apache.solr.update.LoggingInfoStream
   [junit4]   2> mergePolicy=[TieredMergePolicy: maxMergeAtOnce=10, maxMergeAtOnceExplicit=30, maxMergedSegmentMB=5120.0, floorSegmentMB=2.0, forceMergeDeletesPctAllowed=10.0, segmentsPerTier=10.0, maxCFSSegmentSizeMB=8.796093022207999E12, noCFSRatio=0.1
   [junit4]   2> indexerThreadPool=org.apache.lucene.index.DocumentsWriterPerThreadPool@c250378
   [junit4]   2> readerPooling=false
   [junit4]   2> perThreadHardLimitMB=1945
   [junit4]   2> useCompoundFile=false
   [junit4]   2> commitOnClose=true
   [junit4]   2> writer=org.apache.solr.update.SolrIndexWriter@2e8650c4
   [junit4]   2> 
   [junit4]   2> 11151 INFO  (coreLoadExecutor-54-thread-1) [    x:collection1] o.a.s.u.LoggingInfoStream [IW][coreLoadExecutor-54-thread-1]: MMapDirectory.UNMAP_SUPPORTED=true
   [junit4]   2> 11151 INFO  (coreLoadExecutor-54-thread-1) [    x:collection1] o.a.s.u.LoggingInfoStream [IW][coreLoadExecutor-54-thread-1]: now flush at close
   [junit4]   2> 11151 INFO  (coreLoadExecutor-54-thread-1) [    x:collection1] o.a.s.u.LoggingInfoStream [IW][coreLoadExecutor-54-thread-1]:   start flush: applyAllDeletes=true
   [junit4]   2> 11151 INFO  (coreLoadExecutor-54-thread-1) [    x:collection1] o.a.s.u.LoggingInfoStream [IW][coreLoadExecutor-54-thread-1]:   index before flush 
   [junit4]   2> 11151 INFO  (coreLoadExecutor-54-thread-1) [    x:collection1] o.a.s.u.LoggingInfoStream [DW][coreLoadExecutor-54-thread-1]: startFullFlush
   [junit4]   2> 11151 INFO  (coreLoadExecutor-54-thread-1) [    x:collection1] o.a.s.u.LoggingInfoStream [DW][coreLoadExecutor-54-thread-1]: coreLoadExecutor-54-thread-1 finishFullFlush success=true
   [junit4]   2> 11151 INFO  (coreLoadExecutor-54-thread-1) [    x:collection1] o.a.s.u.LoggingInfoStream [IW][coreLoadExecutor-54-thread-1]: apply all deletes during flush
   [junit4]   2> 11152 INFO  (coreLoadExecutor-54-thread-1) [    x:collection1] o.a.s.u.LoggingInfoStream [IW][coreLoadExecutor-54-thread-1]: now apply all deletes for all segments maxDoc=0
   [junit4]   2> 11152 INFO  (coreLoadExecutor-54-thread-1) [    x:collection1] o.a.s.u.LoggingInfoStream [BD][coreLoadExecutor-54-thread-1]: prune sis=segments:  minGen=9223372036854775807 packetCount=0
   [junit4]   2> 11152 INFO  (coreLoadExecutor-54-thread-1) [    x:collection1] o.a.s.u.LoggingInfoStream [MS][coreLoadExecutor-54-thread-1]: initDynamicDefaults spins=false maxThreadCount=1 maxMergeCount=6
   [junit4]   2> 11160 INFO  (coreLoadExecutor-54-thread-1) [    x:collection1] o.a.s.u.LoggingInfoStream [MS][coreLoadExecutor-54-thread-1]: updateMergeThreads ioThrottle=true targetMBPerSec=10240.0 MB/sec
   [junit4]   2> 11160 INFO  (coreLoadExecutor-54-thread-1) [    x:collection1] o.a.s.u.LoggingInfoStream [MS][coreLoadExecutor-54-thread-1]: now merge
   [junit4]   2> 11160 INFO  (coreLoadExecutor-54-thread-1) [    x:collection1] o.a.s.u.LoggingInfoStream [MS][coreLoadExecutor-54-thread-1]:   index: 
   [junit4]   2> 11160 INFO  (coreLoadExecutor-54-thread-1) [    x:collection1] o.a.s.u.LoggingInfoStream [MS][coreLoadExecutor-54-thread-1]:   no more merges pending; now return
   [junit4]   2> 11160 INFO  (coreLoadExecutor-54-thread-1) [    x:collection1] o.a.s.u.LoggingInfoStream [IW][coreLoadExecutor-54-thread-1]: waitForMerges
   [junit4]   2> 11160 INFO  (coreLoadExecutor-54-thread-1) [    x:collection1] o.a.s.u.LoggingInfoStream [IW][coreLoadExecutor-54-thread-1]: waitForMerges done
   [junit4]   2> 11160 INFO  (coreLoadExecutor-54-thread-1) [    x:collection1] o.a.s.u.LoggingInfoStream [IW][coreLoadExecutor-54-thread-1]: commit: start
   [junit4]   2> 11160 INFO  (coreLoadExecutor-54-thread-1) [    x:collection1] o.a.s.u.LoggingInfoStream [IW][coreLoadExecutor-54-thread-1]: commit: enter lock
   [junit4]   2> 11160 INFO  (coreLoadExecutor-54-thread-1) [    x:collection1] o.a.s.u.LoggingInfoStream [IW][coreLoadExecutor-54-thread-1]: commit: now prepare
   [junit4]   2> 11160 INFO  (coreLoadExecutor-54-thread-1) [    x:collection1] o.a.s.u.LoggingInfoStream [IW][coreLoadExecutor-54-thread-1]: prepareCommit: flush
   [junit4]   2> 11160 INFO  (coreLoadExecutor-54-thread-1) [    x:collection1] o.a.s.u.LoggingInfoStream [IW][coreLoadExecutor-54-thread-1]:   index before flush 
   [junit4]   2> 11160 INFO  (coreLoadExecutor-54-thread-1) [    x:collection1] o.a.s.u.LoggingInfoStream [DW][coreLoadExecutor-54-thread-1]: startFullFlush
   [junit4]   2> 11160 INFO  (coreLoadExecutor-54-thread-1) [    x:collection1] o.a.s.u.LoggingInfoStream [IW][coreLoadExecutor-54-thread-1]: apply all deletes during flush
   [junit4]   2> 11160 INFO  (coreLoadExecutor-54-thread-1) [    x:collection1] o.a.s.u.LoggingInfoStream [IW][coreLoadExecutor-54-thread-1]: now apply all deletes for all segments maxDoc=0
   [junit4]   2> 11160 INFO  (coreLoadExecutor-54-thread-1) [    x:collection1] o.a.s.u.LoggingInfoStream [BD][coreLoadExecutor-54-thread-1]: prune sis=segments:  minGen=9223372036854775807 packetCount=0
   [junit4]   2> 11160 INFO  (coreLoadExecutor-54-thread-1) [    x:collection1] o.a.s.u.LoggingInfoStream [DW][coreLoadExecutor-54-thread-1]: coreLoadExecutor-54-thread-1 finishFullFlush success=true
   [junit4]   2> 11160 INFO  (coreLoadExecutor-54-thread-1) [    x:collection1] o.a.s.u.LoggingInfoStream [IW][coreLoadExecutor-54-thread-1]: startCommit(): start
   [junit4]   2> 11161 INFO  (coreLoadExecutor-54-thread-1) [    x:collection1] o.a.s.u.LoggingInfoStream [IW][coreLoadExecutor-54-thread-1]: startCommit index= changeCount=2
   [junit4]   2> 11162 INFO  (coreLoadExecutor-54-thread-1) [    x:collection1] o.a.s.u.LoggingInfoStream [IW][coreLoadExecutor-54-thread-1]: startCommit: wrote pending segments file "pending_segments_1"
   [junit4]   2> 11163 INFO  (coreLoadExecutor-54-thread-1) [    x:collection1] o.a.s.u.LoggingInfoStream [IW][coreLoadExecutor-54-thread-1]: done all syncs: []
   [junit4]   2> 11163 INFO  (coreLoadExecutor-54-thread-1) [    x:collection1] o.a.s.u.LoggingInfoStream [IW][coreLoadExecutor-54-thread-1]: commit: pendingCommit != null
   [junit4]   2> 11163 INFO  (coreLoadExecutor-54-thread-1) [    x:collection1] o.a.s.u.LoggingInfoStream [IW][coreLoadExecutor-54-thread-1]: commit: done writing segments file "segments_1"
   [junit4]   2> 11163 INFO  (coreLoadExecutor-54-thread-1) [    x:collection1] o.a.s.u.LoggingInfoStream [IFD][coreLoadExecutor-54-thread-1]: now checkpoint "" [0 segments ; isCommit = true]
   [junit4]   2> 11163 INFO  (coreLoadExecutor-54-thread-1) [    x:collection1] o.a.s.c.SolrDeletionPolicy SolrDeletionPolicy.onCommit: commits: num=1
   [junit4]   2> 	commit{dir=MockDirectoryWrapper(RAMDirectory@56de8beb lockFactory=org.apache.lucene.store.SingleInstanceLockFactory@43246482),segFN=segments_1,generation=1}
   [junit4]   2> 11163 INFO  (coreLoadExecutor-54-thread-1) [    x:collection1] o.a.s.c.SolrDeletionPolicy newest commit generation = 1
   [junit4]   2> 11163 INFO  (coreLoadExecutor-54-thread-1) [    x:collection1] o.a.s.u.LoggingInfoStream [IFD][coreLoadExecutor-54-thread-1]: 0 msec to checkpoint
   [junit4]   2> 11163 INFO  (coreLoadExecutor-54-thread-1) [    x:collection1] o.a.s.u.LoggingInfoStream [IW][coreLoadExecutor-54-thread-1]: commit: took 2.7 msec
   [junit4]   2> 11163 INFO  (coreLoadExecutor-54-thread-1) [    x:collection1] o.a.s.u.LoggingInfoStream [IW][coreLoadExecutor-54-thread-1]: commit: done
   [junit4]   2> 11163 INFO  (coreLoadExecutor-54-thread-1) [    x:collection1] o.a.s.u.LoggingInfoStream [IW][coreLoadExecutor-54-thread-1]: rollback
   [junit4]   2> 11164 INFO  (coreLoadExecutor-54-thread-1) [    x:collection1] o.a.s.u.LoggingInfoStream [IW][coreLoadExecutor-54-thread-1]: all running merges have aborted
   [junit4]   2> 11164 INFO  (coreLoadExecutor-54-thread-1) [    x:collection1] o.a.s.u.LoggingInfoStream [IW][coreLoadExecutor-54-thread-1]: rollback: done finish merges
   [junit4]   2> 11164 INFO  (coreLoadExecutor-54-thread-1) [    x:collection1] o.a.s.u.LoggingInfoStream [DW][coreLoadExecutor-54-thread-1]: abort
   [junit4]   2> 11164 INFO  (coreLoadExecutor-54-thread-1) [    x:collection1] o.a.s.u.LoggingInfoStream [DW][coreLoadExecutor-54-thread-1]: done abort success=true
   [junit4]   2> 11164 INFO  (coreLoadExecutor-54-thread-1) [    x:collection1] o.a.s.u.LoggingInfoStream [IW][coreLoadExecutor-54-thread-1]: rollback: infos=
   [junit4]   2> 11164 INFO  (coreLoadExecutor-54-thread-1) [    x:collection1] o.a.s.u.LoggingInfoStream [IFD][coreLoadExecutor-54-thread-1]: now checkpoint "" [0 segments ; isCommit = false]
   [junit4]   2> 11164 INFO  (coreLoadExecutor-54-thread-1) [    x:collection1] o.a.s.u.LoggingInfoStream [IFD][coreLoadExecutor-54-thread-1]: 0 msec to checkpoint
   [junit4]   2> 11170 INFO  (OldIndexDirectoryCleanupThreadForCore-collection1) [    x:collection1] o.a.s.c.SolrCore Looking for old index directories to cleanup for core collection1 in /export/home/jenkins/workspace/Lucene-Solr-5.x-Solaris/solr/build/solr-solrj/test/J1/temp/solr.client.solrj.embedded.LargeVolumeEmbeddedTest_616A35C6677EA7C2-001/init-core-data-001/
   [junit4]   2> 11174 INFO  (coreLoadExecutor-54-thread-1) [    x:collection1] o.a.s.c.PluginBag queryResponseWriter : 'velocity' created with startup=lazy 
   [junit4]   2> 11182 INFO  (coreLoadExecutor-54-thread-1) [    x:collection1] o.a.s.r.XSLTResponseWriter xsltCacheLifetimeSeconds=5
   [junit4]   2> 11293 INFO  (coreLoadExecutor-54-thread-1) [    x:collection1] o.a.s.c.SolrCore no updateRequestProcessorChain defined as default, creating implicit default
   [junit4]   2> 11298 INFO  (coreLoadExecutor-54-thread-1) [    x:collection1] o.a.s.h.l.XMLLoader xsltCacheLifetimeSeconds=60
   [junit4]   2> 11299 INFO  (coreLoadExecutor-54-thread-1) [    x:collection1] o.a.s.h.l.XMLLoader xsltCacheLifetimeSeconds=60
   [junit4]   2> 11300 INFO  (coreLoadExecutor-54-thread-1) [    x:collection1] o.a.s.h.l.XMLLoader xsltCacheLifetimeSeconds=60
   [junit4]   2> 11301 INFO  (coreLoadExecutor-54-thread-1) [    x:collection1] o.a.s.h.l.XMLLoader xsltCacheLifetimeSeconds=60
   [junit4]   2> 11314 INFO  (coreLoadExecutor-54-thread-1) [    x:collection1] o.a.s.c.PluginBag requestHandler : '/update/extract' created with startup=lazy 
   [junit4]   2> 11314 INFO  (coreLoadExecutor-54-thread-1) [    x:collection1] o.a.s.c.PluginBag requestHandler : '/analysis/field' created with startup=lazy 
   [junit4]   2> 11314 INFO  (coreLoadExecutor-54-thread-1) [    x:collection1] o.a.s.c.PluginBag requestHandler : '/analysis/document' created with startup=lazy 
   [junit4]   2> 11322 INFO  (coreLoadExecutor-54-thread-1) [    x:collection1] o.a.s.c.PluginBag requestHandler : '/spell' created with startup=lazy 
   [junit4]   2> 11322 INFO  (coreLoadExecutor-54-thread-1) [    x:collection1] o.a.s.c.PluginBag requestHandler : '/suggest' created with startup=lazy 
   [junit4]   2> 11322 INFO  (coreLoadExecutor-54-thread-1) [    x:collection1] o.a.s.c.PluginBag requestHandler : '/tvrh' created with startup=lazy 
   [junit4]   2> 11322 INFO  (coreLoadExecutor-54-thread-1) [    x:collection1] o.a.s.c.PluginBag requestHandler : '/terms' created with startup=lazy 
   [junit4]   2> 11322 INFO  (coreLoadExecutor-54-thread-1) [    x:collection1] o.a.s.c.PluginBag requestHandler : '/elevate' created with startup=lazy 
   [junit4]   2> 11322 INFO  (coreLoadExecutor-54-thread-1) [    x:collection1] o.a.s.c.RequestHandlers Registered paths: /admin/mbeans,/browse,/update/json/docs,/admin/luke,/export,/get,/admin/properties,/elevate,/update/json,/admin/threads,/query,/analysis/field,/analysis/document,/spell,/update/csv,/tvrh,/select,/admin/segments,/admin/system,/suggest,/replication,/config,/schema,/admin/plugins,/admin/logging,/admin/ping,/update,/admin/file,/debug/dump,/terms,/update/extract
   [junit4]   2> 11324 INFO  (coreLoadExecutor-54-thread-1) [    x:collection1] o.a.s.c.SolrCore Using default statsCache cache: org.apache.solr.search.stats.LocalStatsCache
   [junit4]   2> 11324 INFO  (coreLoadExecutor-54-thread-1) [    x:collection1] o.a.s.u.UpdateHandler Using UpdateLog implementation: org.apache.solr.update.UpdateLog
   [junit4]   2> 11325 INFO  (coreLoadExecutor-54-thread-1) [    x:collection1] o.a.s.u.UpdateLog Initializing UpdateLog: dataDir= defaultSyncLevel=FLUSH numRecordsToKeep=100 maxNumLogsToKeep=10 numVersionBuckets=65536
   [junit4]   2> 11326 INFO  (coreLoadExecutor-54-thread-1) [    x:collection1] o.a.s.u.CommitTracker Hard AutoCommit: if uncommited for 15000ms; 
   [junit4]   2> 11326 INFO  (coreLoadExecutor-54-thread-1) [    x:collection1] o.a.s.u.CommitTracker Soft AutoCommit: disabled
   [junit4]   2> 11328 INFO  (coreLoadExecutor-54-thread-1) [    x:collection1] o.a.s.u.LoggingInfoStream [IFD][coreLoadExecutor-54-thread-1]: init: current segments file is "segments_1"; deletionPolicy=org.apache.solr.core.IndexDeletionPolicyWrapper@3bddc4a
   [junit4]   2> 11328 INFO  (coreLoadExecutor-54-thread-1) [    x:collection1] o.a.s.u.LoggingInfoStream [IFD][coreLoadExecutor-54-thread-1]: init: load commit "segments_1"
   [junit4]   2> 11329 INFO  (coreLoadExecutor-54-thread-1) [    x:collection1] o.a.s.c.SolrDeletionPolicy SolrDeletionPolicy.onInit: commits: num=1
   [junit4]   2> 	commit{dir=MockDirectoryWrapper(RAMDirectory@56de8beb lockFactory=org.apache.lucene.store.SingleInstanceLockFactory@43246482),segFN=segments_1,generation=1}
   [junit4]   2> 11329 INFO  (coreLoadExecutor-54-thread-1) [    x:collection1] o.a.s.c.SolrDeletionPolicy newest commit generation = 1
   [junit4]   2> 11329 INFO  (coreLoadExecutor-54-thread-1) [    x:collection1] o.a.s.u.LoggingInfoStream [IFD][coreLoadExecutor-54-thread-1]: now checkpoint "" [0 segments ; isCommit = false]
   [junit4]   2> 11329 INFO  (coreLoadExecutor-54-thread-1) [    x:collection1] o.a.s.u.LoggingInfoStream [IFD][coreLoadExecutor-54-thread-1]: 0 msec to checkpoint
   [junit4]   2> 11329 INFO  (coreLoadExecutor-54-thread-1) [    x:collection1] o.a.s.u.LoggingInfoStream [IW][coreLoadExecutor-54-thread-1]: init: create=false
   [junit4]   2> 11329 INFO  (coreLoadExecutor-54-thread-1) [    x:collection1] o.a.s.u.LoggingInfoStream [IW][coreLoadExecutor-54-thread-1]: 
   [junit4]   2> dir=MockDirectoryWrapper(RAMDirectory@56de8beb lockFactory=org.apache.lucene.store.SingleInstanceLockFactory@43246482)
   [junit4]   2> index=
   [junit4]   2> version=5.5.0
   [junit4]   2> analyzer=org.apache.solr.update.SolrIndexConfig$DelayedSchemaAnalyzer
   [junit4]   2> ramBufferSizeMB=100.0
   [junit4]   2> maxBufferedDocs=-1
   [junit4]   2> maxBufferedDeleteTerms=-1
   [junit4]   2> mergedSegmentWarmer=null
   [junit4]   2> delPolicy=org.apache.solr.core.IndexDeletionPolicyWrapper
   [junit4]   2> commit=null
   [junit4]   2> openMode=APPEND
   [junit4]   2> similarity=org.apache.lucene.search.similarities.ClassicSimilarity
   [junit4]   2> mergeScheduler=ConcurrentMergeScheduler: maxThreadCount=-1, maxMergeCount=-1, ioThrottle=true
   [junit4]   2> default WRITE_LOCK_TIMEOUT=0
   [junit4]   2> writeLockTimeout=0
   [junit4]   2> codec=Lucene54
   [junit4]   2> infoStream=org.apache.solr.update.LoggingInfoStream
   [junit4]   2> mergePolicy=[TieredMergePolicy: maxMergeAtOnce=10, maxMergeAtOnceExplicit=30, maxMergedSegmentMB=5120.0, floorSegmentMB=2.0, forceMergeDeletesPctAllowed=10.0, segmentsPerTier=10.0, maxCFSSegmentSizeMB=8.796093022207999E12, noCFSRatio=0.1
   [junit4]   2> indexerThreadPool=org.apache.lucene.index.DocumentsWriterPerThreadPool@4e584bfd
   [junit4]   2> readerPooling=false
   [junit4]   2> perThreadHardLimitMB=1945
   [junit4]   2> useCompoundFile=false
   [junit4]   2> commitOnClose=true
   [junit4]   2> writer=org.apache.solr.update.SolrIndexWriter@12c53d6f
   [junit4]   2> 
   [junit4]   2> 11329 INFO  (coreLoadExecutor-54-thread-1) [    x:collection1] o.a.s.u.LoggingInfoStream [IW][coreLoadExecutor-54-thread-1]: MMapDirectory.UNMAP_SUPPORTED=true
   [junit4]   2> 11329 INFO  (coreLoadExecutor-54-thread-1) [    x:collection1] o.a.s.u.LoggingInfoStream [IW][coreLoadExecutor-54-thread-1]: flush at getReader
   [junit4]   2> 11329 INFO  (coreLoadExecutor-54-thread-1) [    x:collection1] o.a.s.u.LoggingInfoStream [DW][coreLoadExecutor-54-thread-1]: startFullFlush
   [junit4]   2> 11329 INFO  (coreLoadExecutor-54-thread-1) [    x:collection1] o.a.s.u.LoggingInfoStream [IW][coreLoadExecutor-54-thread-1]: apply all deletes during flush
   [junit4]   2> 11329 INFO  (coreLoadExecutor-54-thread-1) [    x:collection1] o.a.s.u.LoggingInfoStream [IW][coreLoadExecutor-54-thread-1]: now apply all deletes for all segments maxDoc=0
   [junit4]   2> 11329 INFO  (coreLoadExecutor-54-thread-1) [    x:collection1] o.a.s.u.LoggingInfoStream [BD][coreLoadExecutor-54-thread-1]: prune sis=segments_1:  minGen=9223372036854775807 packetCount=0
   [junit4]   2> 11329 INFO  (coreLoadExecutor-54-thread-1) [    x:collection1] o.a.s.u.LoggingInfoStream [IW][coreLoadExecutor-54-thread-1]: incRefDeleter for NRT reader version=2 segments=
   [junit4]   2> 11329 INFO  (coreLoadExecutor-54-thread-1) [    x:collection1] o.a.s.u.LoggingInfoStream [IW][coreLoadExecutor-54-thread-1]: return reader version=2 reader=StandardDirectoryReader(segments_1:2:nrt)
   [junit4]   2> 11329 INFO  (coreLoadExecutor-54-thread-1) [    x:collection1] o.a.s.u.LoggingInfoStream [DW][coreLoadExecutor-54-thread-1]: coreLoadExecutor-54-thread-1 finishFullFlush success=true
   [junit4]   2> 11329 INFO  (coreLoadExecutor-54-thread-1) [    x:collection1] o.a.s.u.LoggingInfoStream [IW][coreLoadExecutor-54-thread-1]: getReader took 0 msec
   [junit4]   2> 11330 INFO  (coreLoadExecutor-54-thread-1) [    x:collection1] o.a.s.s.SolrIndexSearcher Opening Searcher@19a9036e[collection1] main
   [junit4]   2> 11337 INFO  (coreLoadExecutor-54-thread-1) [    x:collection1] o.a.s.r.ManagedResourceStorage File-based storage initialized to use dir: /export/home/jenkins/workspace/Lucene-Solr-5.x-Solaris/solr/build/solr-solrj/test/J1/temp/solr.client.solrj.embedded.LargeVolumeEmbeddedTest_616A35C6677EA7C2-001/tempDir-001/collection1/conf
   [junit4]   2> 11337 INFO  (coreLoadExecutor-54-thread-1) [    x:collection1] o.a.s.r.RestManager Initializing RestManager with initArgs: {storageDir=/export/home/jenkins/workspace/Lucene-Solr-5.x-Solaris/solr/build/solr-solrj/test/J1/temp/solr.client.solrj.embedded.LargeVolumeEmbeddedTest_616A35C6677EA7C2-001/tempDir-001/collection1/conf}
   [junit4]   2> 11337 INFO  (coreLoadExecutor-54-thread-1) [    x:collection1] o.a.s.r.ManagedResourceStorage Reading _rest_managed.json using file:dir=/export/home/jenkins/workspace/Lucene-Solr-5.x-Solaris/solr/build/solr-solrj/test/J1/temp/solr.client.solrj.embedded.LargeVolumeEmbeddedTest_616A35C6677EA7C2-001/tempDir-001/collection1/conf
   [junit4]   2> 11338 INFO  (coreLoadExecutor-54-thread-1) [    x:collection1] o.a.s.r.ManagedResourceStorage Loaded LinkedHashMap at path _rest_managed.json using file:dir=/export/home/jenkins/workspace/Lucene-Solr-5.x-Solaris/solr/build/solr-solrj/test/J1/temp/solr.client.solrj.embedded.LargeVolumeEmbeddedTest_616A35C6677EA7C2-001/tempDir-001/collection1/conf
   [junit4]   2> 11338 INFO  (coreLoadExecutor-54-thread-1) [    x:collection1] o.a.s.r.ManagedResource Loaded initArgs {} for /rest/managed
   [junit4]   2> 11338 INFO  (coreLoadExecutor-54-thread-1) [    x:collection1] o.a.s.r.RestManager Initializing 2 registered ManagedResources
   [junit4]   2> 11339 INFO  (coreLoadExecutor-54-thread-1) [    x:collection1] o.a.s.r.ManagedResourceStorage Reading _schema_analysis_stopwords_english.json using file:dir=/export/home/jenkins/workspace/Lucene-Solr-5.x-Solaris/solr/build/solr-solrj/test/J1/temp/solr.client.solrj.embedded.LargeVolumeEmbeddedTest_616A35C6677EA7C2-001/tempDir-001/collection1/conf
   [junit4]   2> 11341 INFO  (coreLoadExecutor-54-thread-1) [    x:collection1] o.a.s.r.ManagedResourceStorage Loaded LinkedHashMap at path _schema_analysis_stopwords_english.json using file:dir=/export/home/jenkins/workspace/Lucene-Solr-5.x-Solaris/solr/build/solr-solrj/test/J1/temp/solr.client.solrj.embedded.LargeVolumeEmbeddedTest_616A35C6677EA7C2-001/tempDir-001/collection1/conf
   [junit4]   2> 11341 INFO  (coreLoadExecutor-54-thread-1) [    x:collection1] o.a.s.r.ManagedResource Loaded initArgs {ignoreCase=true} for /schema/analysis/stopwords/english
   [junit4]   2> 11341 INFO  (coreLoadExecutor-54-thread-1) [    x:collection1] o.a.s.r.s.a.ManagedWordSetResource Loaded 35 words for /schema/analysis/stopwords/english
   [junit4]   2> 11341 INFO  (coreLoadExecutor-54-thread-1) [    x:collection1] o.a.s.r.ManagedResource Notified 2 observers of /schema/analysis/stopwords/english
   [junit4]   2> 11341 INFO  (coreLoadExecutor-54-thread-1) [    x:collection1] o.a.s.r.ManagedResourceStorage Reading _schema_analysis_synonyms_english.json using file:dir=/export/home/jenkins/workspace/Lucene-Solr-5.x-Solaris/solr/build/solr-solrj/test/J1/temp/solr.client.solrj.embedded.LargeVolumeEmbeddedTest_616A35C6677EA7C2-001/tempDir-001/collection1/conf
   [junit4]   2> 11342 INFO  (coreLoadExecutor-54-thread-1) [    x:collection1] o.a.s.r.ManagedResourceStorage Loaded LinkedHashMap at path _schema_analysis_synonyms_english.json using file:dir=/export/home/jenkins/workspace/Lucene-Solr-5.x-Solaris/solr/build/solr-solrj/test/J1/temp/solr.client.solrj.embedded.LargeVolumeEmbeddedTest_616A35C6677EA7C2-001/tempDir-001/collection1/conf
   [junit4]   2> 11342 INFO  (coreLoadExecutor-54-thread-1) [    x:collection1] o.a.s.r.ManagedResource Loaded initArgs {ignoreCase=true,format=solr} for /schema/analysis/synonyms/english
   [junit4]   2> 11344 INFO  (coreLoadExecutor-54-thread-1) [    x:collection1] o.a.s.r.s.a.ManagedSynonymFilterFactory Loaded 3 synonym mappings for /schema/analysis/synonyms/english
   [junit4]   2> 11346 INFO  (coreLoadExecutor-54-thread-1) [    x:collection1] o.a.s.r.ManagedResource Notified 2 observers of /schema/analysis/synonyms/english
   [junit4]   2> 11346 INFO  (coreLoadExecutor-54-thread-1) [    x:collection1] o.a.s.h.c.SpellCheckComponent Initializing spell checkers
   [junit4]   2> 11387 INFO  (coreLoadExecutor-54-thread-1) [    x:collection1] o.a.s.s.DirectSolrSpellChecker init: {name=default,field=text,classname=solr.DirectSolrSpellChecker,distanceMeasure=internal,accuracy=0.5,maxEdits=2,minPrefix=1,maxInspections=5,minQueryLength=4,maxQueryFrequency=0.01}
   [junit4]   2> 11406 INFO  (coreLoadExecutor-54-thread-1) [    x:collection1] o.a.s.h.c.SpellCheckComponent No queryConverter defined, using default converter
   [junit4]   2> 11420 INFO  (coreLoadExecutor-54-thread-1) [    x:collection1] o.a.s.h.c.SuggestComponent Initializing SuggestComponent
   [junit4]   2> 11429 INFO  (coreLoadExecutor-54-thread-1) [    x:collection1] o.a.s.s.s.SolrSuggester init: {name=mySuggester,lookupImpl=FuzzyLookupFactory,dictionaryImpl=DocumentDictionaryFactory,field=cat,weightField=price,suggestAnalyzerFieldType=string,buildOnStartup=false}
   [junit4]   2> 11593 INFO  (coreLoadExecutor-54-thread-1) [    x:collection1] o.a.s.s.s.SolrSuggester Dictionary loaded with params: {name=mySuggester,lookupImpl=FuzzyLookupFactory,dictionaryImpl=DocumentDictionaryFactory,field=cat,weightField=price,suggestAnalyzerFieldType=string,buildOnStartup=false}
   [junit4]   2> 11628 INFO  (coreLoadExecutor-54-thread-1) [    x:collection1] o.a.s.h.c.QueryElevationComponent Loading QueryElevation from: /export/home/jenkins/workspace/Lucene-Solr-5.x-Solaris/solr/build/solr-solrj/test/J1/temp/solr.client.solrj.embedded.LargeVolumeEmbeddedTest_616A35C6677EA7C2-001/tempDir-001/collection1/conf/elevate.xml
   [junit4]   2> 11681 INFO  (coreLoadExecutor-54-thread-1) [    x:collection1] o.a.s.h.ReplicationHandler Commits will be reserved for  10000
   [junit4]   2> 11681 INFO  (searcherExecutor-55-thread-1-processing-x:collection1) [    x:collection1] o.a.s.c.QuerySenderListener QuerySenderListener sending requests to Searcher@19a9036e[collection1] main{ExitableDirectoryReader(UninvertingDirectoryReader())}
   [junit4]   2> 11682 INFO  (coreLoadExecutor-54-thread-1) [    x:collection1] o.a.s.u.UpdateLog Looking up max value of version field to seed version buckets
   [junit4]   2> 11682 INFO  (coreLoadExecutor-54-thread-1) [    x:collection1] o.a.s.u.VersionInfo Refreshing highest value of _version_ for 65536 version buckets from index
   [junit4]   2> 11682 INFO  (coreLoadExecutor-54-thread-1) [    x:collection1] o.a.s.u.VersionInfo No terms found for _version_, cannot seed version bucket highest value from index
   [junit4]   2> 11682 INFO  (coreLoadExecutor-54-thread-1) [    x:collection1] o.a.s.u.UpdateLog Could not find max version in index or recent updates, using new clock 1521515475220037632
   [junit4]   2> 11684 INFO  (coreLoadExecutor-54-thread-1) [    x:collection1] o.a.s.u.UpdateLog Took 1.0ms to seed version buckets with highest version 1521515475220037632
   [junit4]   2> 11684 INFO  (coreLoadExecutor-54-thread-1) [    x:collection1] o.a.s.c.CoreContainer registering core: collection1
   [junit4]   2> 11686 INFO  (SUITE-LargeVolumeEmbeddedTest-seed#[616A35C6677EA7C2]-worker) [    ] o.a.s.SolrTestCaseJ4 ####initCore end
   [junit4]   2> 11692 INFO  (TEST-LargeVolumeEmbeddedTest.testMultiThreaded-seed#[616A35C6677EA7C2]) [    ] o.a.s.SolrTestCaseJ4 ###Starting testMultiThreaded
   [junit4]   2> 11696 INFO  (TEST-LargeVolumeEmbeddedTest.testMultiThreaded-seed#[616A35C6677EA7C2]) [    ] o.a.s.u.LoggingInfoStream [DW][TEST-LargeVolumeEmbeddedTest.testMultiThreaded-seed#[616A35C6677EA7C2]]: anyChanges? numDocsInRam=0 deletes=true hasTickets:false pendingChangesInFullFlush: false
   [junit4]   2> 11696 INFO  (TEST-LargeVolumeEmbeddedTest.testMultiThreaded-seed#[616A35C6677EA7C2]) [    ] o.a.s.u.LoggingInfoStream [DW][TEST-LargeVolumeEmbeddedTest.testMultiThreaded-seed#[616A35C6677EA7C2]]: anyChanges? numDocsInRam=0 deletes=true hasTickets:false pendingChangesInFullFlush: false
   [junit4]   2> 11696 INFO  (TEST-LargeVolumeEmbeddedTest.testMultiThreaded-seed#[616A35C6677EA7C2]) [    ] o.a.s.u.LoggingInfoStream [IW][TEST-LargeVolumeEmbeddedTest.testMultiThreaded-seed#[616A35C6677EA7C2]]: nrtIsCurrent: infoVersion matches: true; DW changes: true; BD changes: false
   [junit4]   2> 11696 INFO  (TEST-LargeVolumeEmbeddedTest.testMultiThreaded-seed#[616A35C6677EA7C2]) [    ] o.a.s.u.LoggingInfoStream [IW][TEST-LargeVolumeEmbeddedTest.testMultiThreaded-seed#[616A35C6677EA7C2]]: flush at getReader
   [junit4]   2> 11696 INFO  (TEST-LargeVolumeEmbeddedTest.testMultiThreaded-seed#[616A35C6677EA7C2]) [    ] o.a.s.u.LoggingInfoStream [DW][TEST-LargeVolumeEmbeddedTest.testMultiThreaded-seed#[616A35C6677EA7C2]]: startFullFlush
   [junit4]   2> 11696 INFO  (TEST-LargeVolumeEmbeddedTest.testMultiThreaded-seed#[616A35C6677EA7C2]) [    ] o.a.s.u.LoggingInfoStream [DW][TEST-LargeVolumeEmbeddedTest.testMultiThreaded-seed#[616A35C6677EA7C2]]: anyChanges? numDocsInRam=0 deletes=true hasTickets:false pendingChangesInFullFlush: false
   [junit4]   2> 11696 INFO  (TEST-LargeVolumeEmbeddedTest.testMultiThreaded-seed#[616A35C6677EA7C2]) [    ] o.a.s.u.LoggingInfoStream [DW][TEST-LargeVolumeEmbeddedTest.testMultiThreaded-seed#[616A35C6677EA7C2]]: TEST-LargeVolumeEmbeddedTest.testMultiThreaded-seed#[616A35C6677EA7C2]: flush naked frozen global deletes
   [junit4]   2> 11697 INFO  (TEST-LargeVolumeEmbeddedTest.testMultiThreaded-seed#[616A35C6677EA7C2]) [    ] o.a.s.u.LoggingInfoStream [BD][TEST-LargeVolumeEmbeddedTest.testMultiThreaded-seed#[616A35C6677EA7C2]]: push deletes  1 deleted queries bytesUsed=100 segmentPrivate?=false delGen=2 packetCount=1 totBytesUsed=100
   [junit4]   2> 11697 INFO  (TEST-LargeVolumeEmbeddedTest.testMultiThreaded-seed#[616A35C6677EA7C2]) [    ] o.a.s.u.LoggingInfoStream [DW][TEST-LargeVolumeEmbeddedTest.testMultiThreaded-seed#[616A35C6677EA7C2]]: flush: push buffered updates:  1 deleted queries bytesUsed=100
   [junit4]   2> 11697 INFO  (TEST-LargeVolumeEmbeddedTest.testMultiThreaded-seed#[616A35C6677EA7C2]) [    ] o.a.s.u.LoggingInfoStream [IW][TEST-LargeVolumeEmbeddedTest.testMultiThreaded-seed#[616A35C6677EA7C2]]: apply all deletes during flush
   [junit4]   2> 11697 INFO  (TEST-LargeVolumeEmbeddedTest.testMultiThreaded-seed#[616A35C6677EA7C2]) [    ] o.a.s.u.LoggingInfoStream [IW][TEST-LargeVolumeEmbeddedTest.testMultiThreaded-seed#[616A35C6677EA7C2]]: now apply all deletes for all segments maxDoc=0
   [junit4]   2> 11697 INFO  (TEST-LargeVolumeEmbeddedTest.testMultiThreaded-seed#[616A35C6677EA7C2]) [    ] o.a.s.u.LoggingInfoStream [BD][TEST-LargeVolumeEmbeddedTest.testMultiThreaded-seed#[616A35C6677EA7C2]]: prune sis=segments_1:  minGen=9223372036854775807 packetCount=1
   [junit4]   2> 11697 INFO  (TEST-LargeVolumeEmbeddedTest.testMultiThreaded-seed#[616A35C6677EA7C2]) [    ] o.a.s.u.LoggingInfoStream [BD][TEST-LargeVolumeEmbeddedTest.testMultiThreaded-seed#[616A35C6677EA7C2]]: pruneDeletes: prune 1 packets; 0 packets remain
   [junit4]   2> 11697 INFO  (TEST-LargeVolumeEmbeddedTest.testMultiThreaded-seed#[616A35C6677EA7C2]) [    ] o.a.s.u.LoggingInfoStream [IW][TEST-LargeVolumeEmbeddedTest.testMultiThreaded-seed#[616A35C6677EA7C2]]: incRefDeleter for NRT reader version=2 segments=
   [junit4]   2> 11697 INFO  (TEST-LargeVolumeEmbeddedTest.testMultiThreaded-seed#[616A35C6677EA7C2]) [    ] o.a.s.u.LoggingInfoStream [IW][TEST-LargeVolumeEmbeddedTest.testMultiThreaded-seed#[616A35C6677EA7C2]]: return reader version=2 reader=StandardDirectoryReader(segments_1:2:nrt)
   [junit4]   2> 11697 INFO  (TEST-LargeVolumeEmbeddedTest.testMultiThreaded-seed#[616A35C6677EA7C2]) [    ] o.a.s.u.LoggingInfoStream [DW][TEST-LargeVolumeEmbeddedTest.testMultiThreaded-seed#[616A35C6677EA7C2]]: TEST-LargeVolumeEmbeddedTest.testMultiThreaded-seed#[616A35C6677EA7C2] finishFullFlush success=true
   [junit4]   2> 11697 INFO  (TEST-LargeVolumeEmbeddedTest.testMultiThreaded-seed#[616A35C6677EA7C2]) [    ] o.a.s.u.LoggingInfoStream [IW][TEST-LargeVolumeEmbeddedTest.testMultiThreaded-seed#[616A35C6677EA7C2]]: getReader took 1 msec
   [junit4]   2> 11697 INFO  (TEST-LargeVolumeEmbeddedTest.testMultiThreaded-seed#[616A35C6677EA7C2]) [    ] o.a.s.u.LoggingInfoStream [IW][TEST-LargeVolumeEmbeddedTest.testMultiThreaded-seed#[616A35C6677EA7C2]]: decRefDeleter for NRT reader version=2 segments=
   [junit4]   2> 11706 INFO  (TEST-LargeVolumeEmbeddedTest.testMultiThreaded-seed#[616A35C6677EA7C2]) [    ] o.a.s.u.p.LogUpdateProcessorFactory [collection1]  webapp=null path=/update params={}{deleteByQuery=*:* (-1521515475231571968)} 0 13
   [junit4]   2> 11709 INFO  (TEST-LargeVolumeEmbeddedTest.testMultiThreaded-seed#[616A35C6677EA7C2]) [    ] o.a.s.c.s.LargeVolumeTestBase Started thread: 0
   [junit4]   2> 11709 INFO  (TEST-LargeVolumeEmbeddedTest.testMultiThreaded-seed#[616A35C6677EA7C2]) [    ] o.a.s.c.s.LargeVolumeTestBase Started thread: 1
   [junit4]   2> 11716 INFO  (TEST-LargeVolumeEmbeddedTest.testMultiThreaded-seed#[616A35C6677EA7C2]) [    ] o.a.s.c.s.LargeVolumeTestBase Started thread: 2
   [junit4]   2> 11716 INFO  (TEST-LargeVolumeEmbeddedTest.testMultiThreaded-seed#[616A35C6677EA7C2]) [    ] o.a.s.c.s.LargeVolumeTestBase Started thread: 3
   [junit4]   2> 11717 INFO  (TEST-LargeVolumeEmbeddedTest.testMultiThreaded-seed#[616A35C6677EA7C2]) [    ] o.a.s.c.s.LargeVolumeTestBase Started thread: 4
   [junit4]   2> 11916 INFO  (DocThread-3) [    ] o.a.s.u.p.LogUpdateProcessorFactory [collection1]  webapp=null path=/update params={}{add=[T3:0 (1521515475273515009), T3:1 (1521515475325943808), T3:2 (1521515475328040961), T3:3 (1521515475332235264), T3:4 (1521515475333283840), T3:5 (1521515475333283841), T3:6 (1521515475333283842), T3:7 (1521515475334332416), T3:8 (1521515475334332417), T3:9 (1521515475334332419), ... (100 adds)]} 0 195
   [junit4]   2> 11917 INFO  (DocThread-3) [    ] o.a.s.u.DirectUpdateHandler2 start commit{,optimize=false,openSearcher=true,waitSearcher=true,expungeDeletes=false,softCommit=false,prepareCommit=false}
   [junit4]   2> 11921 INFO  (DocThread-3) [    ] o.a.s.u.LoggingInfoStream [IW][DocThread-3]: commit: start
   [junit4]   2> 11921 INFO  (DocThread-3) [    ] o.a.s.u.LoggingInfoStream [IW][DocThread-3]: commit: enter lock
   [junit4]   2> 11921 INFO  (DocThread-3) [    ] o.a.s.u.LoggingInfoStream [IW][DocThread-3]: commit: now prepare
   [junit4]   2> 11921 INFO  (DocThread-3) [    ] o.a.s.u.LoggingInfoStream [IW][DocThread-3]: prepareCommit: flush
   [junit4]   2> 11921 INFO  (DocThread-3) [    ] o.a.s.u.LoggingInfoStream [IW][DocThread-3]:   index before flush 
   [junit4]   2> 11921 INFO  (DocThread-3) [    ] o.a.s.u.LoggingInfoStream [DW][DocThread-3]: startFullFlush
   [junit4]   2> 11921 INFO  (DocThread-3) [    ] o.a.s.u.LoggingInfoStream [DW][DocThread-3]: anyChanges? numDocsInRam=405 deletes=true hasTickets:false pendingChangesInFullFlush: false
   [junit4]   2> 11922 INFO  (DocThread-3) [    ] o.a.s.u.LoggingInfoStream [DWFC][DocThread-3]: addFlushableState DocumentsWriterPerThread [pendingDeletes=gen=0 256 deleted terms (unique count=256) bytesUsed=59599, segment=_0, aborted=false, numDocsInRAM=6, deleteQueue=DWDQ: [ generation: 2 ]]
   [junit4]   2> 11922 INFO  (DocThread-3) [    ] o.a.s.u.LoggingInfoStream [DWFC][DocThread-3]: addFlushableState DocumentsWriterPerThread [pendingDeletes=gen=0 399 deleted terms (unique count=399) bytesUsed=92923, segment=_2, aborted=false, numDocsInRAM=16, deleteQueue=DWDQ: [ generation: 2 ]]
   [junit4]   2> 11922 INFO  (DocThread-3) [    ] o.a.s.u.LoggingInfoStream [DWFC][DocThread-3]: addFlushableState DocumentsWriterPerThread [pendingDeletes=gen=0 338 deleted terms (unique count=338) bytesUsed=78715, segment=_3, aborted=false, numDocsInRAM=146, deleteQueue=DWDQ: [ generation: 2 ]]
   [junit4]   2> 11922 INFO  (DocThread-3) [    ] o.a.s.u.LoggingInfoStream [DWFC][DocThread-3]: addFlushableState DocumentsWriterPerThread [pendingDeletes=gen=0 385 deleted terms (unique count=385) bytesUsed=89659, segment=_1, aborted=false, numDocsInRAM=110, deleteQueue=DWDQ: [ generation: 2 ]]
   [junit4]   2> 11922 INFO  (DocThread-3) [    ] o.a.s.u.LoggingInfoStream [DWFC][DocThread-3]: addFlushableState DocumentsWriterPerThread [pendingDeletes=gen=0 382 deleted terms (unique count=382) bytesUsed=88964, segment=_4, aborted=false, numDocsInRAM=127, deleteQueue=DWDQ: [ generation: 2 ]]
   [junit4]   2> 11933 INFO  (DocThread-2) [    ] o.a.s.u.LoggingInfoStream [DW][DocThread-2]: DocumentsWriter has queued dwpt; will hijack this thread to flush pending segment(s)
   [junit4]   2> 11934 INFO  (DocThread-1) [    ] o.a.s.u.LoggingInfoStream [DW][DocThread-1]: DocumentsWriter has queued dwpt; will hijack this thread to flush pending segment(s)
   [junit4]   2> 11934 INFO  (DocThread-4) [    ] o.a.s.u.LoggingInfoStream [DW][DocThread-4]: DocumentsWriter has queued dwpt; will hijack this thread to flush pending segment(s)
   [junit4]   2> 11935 INFO  (DocThread-3) [    ] o.a.s.u.LoggingInfoStream [DWPT][DocThread-3]: flush postings as segment _0 numDocs=6
   [junit4]   2> 11935 INFO  (DocThread-1) [    ] o.a.s.u.LoggingInfoStream [DWPT][DocThread-1]: flush postings as segment _3 numDocs=146
   [junit4]   2> 11935 INFO  (DocThread-0) [    ] o.a.s.u.LoggingInfoStream [DW][DocThread-0]: DocumentsWriter has queued dwpt; will hijack this thread to flush pending segment(s)
   [junit4]   2> 11935 INFO  (DocThread-0) [    ] o.a.s.u.LoggingInfoStream [DWPT][DocThread-0]: flush postings as segment _4 numDocs=127
   [junit4]   2> 11939 INFO  (DocThread-2) [    ] o.a.s.u.LoggingInfoStream [DWPT][DocThread-2]: flush postings as segment _2 numDocs=16
   [junit4]   2> 11940 INFO  (DocThread-4) [    ] o.a.s.u.LoggingInfoStream [DWPT][DocThread-4]: flush postings as segment _1 numDocs=110
   [junit4]   2> 11953 INFO  (DocThread-2) [    ] o.a.s.u.LoggingInfoStream [DWPT][DocThread-2]: new segment has 0 deleted docs
   [junit4]   2> 11953 INFO  (DocThread-2) [    ] o.a.s.u.LoggingInfoStream [DWPT][DocThread-2]: new segment has no vectors; norms; no docValues; prox; freqs
   [junit4]   2> 11953 INFO  (DocThread-2) [    ] o.a.s.u.LoggingInfoStream [DWPT][DocThread-2]: flushedFiles=[_2.nvd, _2.fdt, _2.nvm, _2_Lucene50_0.pos, _2.fnm, _2.fdx, _2_Lucene50_0.doc, _2_Lucene50_0.tim, _2_Lucene50_0.tip]
   [junit4]   2> 11954 INFO  (DocThread-2) [    ] o.a.s.u.LoggingInfoStream [DWPT][DocThread-2]: flushed codec=Lucene54
   [junit4]   2> 11954 INFO  (DocThread-3) [    ] o.a.s.u.LoggingInfoStream [DWPT][DocThread-3]: new segment has 0 deleted docs
   [junit4]   2> 11954 INFO  (DocThread-3) [    ] o.a.s.u.LoggingInfoStream [DWPT][DocThread-3]: new segment has no vectors; norms; no docValues; prox; freqs
   [junit4]   2> 11954 INFO  (DocThread-3) [    ] o.a.s.u.LoggingInfoStream [DWPT][DocThread-3]: flushedFiles=[_0_Lucene50_0.doc, _0_Lucene50_0.tim, _0_Lucene50_0.pos, _0.nvd, _0.fdx, _0_Lucene50_0.tip, _0.fdt, _0.nvm, _0.fnm]
   [junit4]   2> 11954 INFO  (DocThread-3) [    ] o.a.s.u.LoggingInfoStream [DWPT][DocThread-3]: flushed codec=Lucene54
   [junit4]   2> 11960 INFO  (DocThread-2) [    ] o.a.s.u.LoggingInfoStream [DWPT][DocThread-2]: flushed: segment=_2 ramUsed=0.185 MB newFlushedSize=0.002 MB docs/MB=8,481.909
   [junit4]   2> 11960 INFO  (DocThread-2) [    ] o.a.s.u.LoggingInfoStream [DWFC][DocThread-2]: waitIfStalled: numFlushesPending: 0 netBytes: 742513 flushBytes: 742513 fullFlush: true
   [junit4]   2> 11960 INFO  (DocThread-2) [    ] o.a.s.u.LoggingInfoStream [DW][DocThread-2]: continue indexing after helping out flushing DocumentsWriter is healthy
   [junit4]   2> 11961 INFO  (DocThread-2) [    ] o.a.s.u.LoggingInfoStream [TMP][DocThread-2]: findMerges: 0 segments
   [junit4]   2> 11961 INFO  (DocThread-2) [    ] o.a.s.u.LoggingInfoStream [MS][DocThread-2]: initDynamicDefaults spins=false maxThreadCount=1 maxMergeCount=6
   [junit4]   2> 11961 INFO  (DocThread-2) [    ] o.a.s.u.LoggingInfoStream [MS][DocThread-2]: now merge
   [junit4]   2> 11961 INFO  (DocThread-2) [    ] o.a.s.u.LoggingInfoStream [MS][DocThread-2]:   index: 
   [junit4]   2> 11961 INFO  (DocThread-2) [    ] o.a.s.u.LoggingInfoStream [MS][DocThread-2]:   no more merges pending; now return
   [junit4]   2> 11962 INFO  (DocThread-3) [    ] o.a.s.u.LoggingInfoStream [DWPT][DocThread-3]: flushed: segment=_0 ramUsed=0.186 MB newFlushedSize=0.002 MB docs/MB=3,888.415
   [junit4]   2> 11974 INFO  (DocThread-2) [    ] o.a.s.u.p.LogUpdateProcessorFactory [collection1]  webapp=null path=/update params={}{add=[T2:0 (1521515475273515010), T2:1 (1521515475333283843), T2:2 (1521515475336429568), T2:3 (1521515475336429570), T2:4 (1521515475336429572), T2:5 (1521515475337478144), T2:6 (1521515475337478147), T2:7 (1521515475337478148), T2:8 (1521515475338526720), T2:9 (1521515475338526722), ... (100 adds)]} 0 255
   [junit4]   2> 11986 INFO  (DocThread-4) [    ] o.a.s.u.LoggingInfoStream [DWPT][DocThread-4]: new segment has 0 deleted docs
   [junit4]   2> 11986 INFO  (DocThread-4) [    ] o.a.s.u.LoggingInfoStream [DWPT][DocThread-4]: new segment has no vectors; norms; no docValues; prox; freqs
   [junit4]   2> 11991 INFO  (DocThread-4) [    ] o.a.s.u.LoggingInfoStream [DWPT][DocThread-4]: flushedFiles=[_1_Lucene50_0.doc, _1_Lucene50_0.tim, _1.nvd, _1_Lucene50_0.pos, _1.fdx, _1.nvm, _1.fnm, _1.fdt, _1_Lucene50_0.tip]
   [junit4]   2> 11991 INFO  (DocThread-4) [    ] o.a.s.u.LoggingInfoStream [DWPT][DocThread-4]: flushed codec=Lucene54
   [junit4]   2> 11991 INFO  (DocThread-4) [    ] o.a.s.u.LoggingInfoStream [DWPT][DocThread-4]: flushed: segment=_1 ramUsed=0.191 MB newFlushedSize=0.004 MB docs/MB=24,853.126
   [junit4]   2> 11992 INFO  (DocThread-4) [    ] o.a.s.u.LoggingInfoStream [DWFC][DocThread-4]: waitIfStalled: numFlushesPending: 0 netBytes: 487781 flushBytes: 385791 fullFlush: true
   [junit4]   2> 11992 INFO  (DocThread-4) [    ] o.a.s.u.LoggingInfoStream [DW][DocThread-4]: continue indexing after helping out flushing DocumentsWriter is healthy
   [junit4]   2> 11994 INFO  (DocThread-4) [    ] o.a.s.u.LoggingInfoStream [DW][DocThread-4]: publishFlushedSegment seg-private updates=null
   [junit4]   2> 11994 INFO  (DocThread-4) [    ] o.a.s.u.LoggingInfoStream [IW][DocThread-4]: publishFlushedSegment
   [junit4]   2> 11994 INFO  (DocThread-4) [    ] o.a.s.u.LoggingInfoStream [BD][DocThread-4]: push deletes  405 deleted terms (unique count=405) bytesUsed=2112 segmentPrivate?=false delGen=4 packetCount=1 totBytesUsed=2112
   [junit4]   2> 11994 INFO  (DocThread-4) [    ] o.a.s.u.LoggingInfoStream [IW][DocThread-4]: publish sets newSegment delGen=5 seg=_0(5.5.0):C6
   [junit4]   2> 11995 INFO  (DocThread-4) [    ] o.a.s.u.LoggingInfoStream [IFD][DocThread-4]: now checkpoint "_0(5.5.0):C6" [1 segments ; isCommit = false]
   [junit4]   2> 11995 INFO  (DocThread-4) [    ] o.a.s.u.LoggingInfoStream [IFD][DocThread-4]: 0 msec to checkpoint
   [junit4]   2> 11995 INFO  (DocThread-4) [    ] o.a.s.u.LoggingInfoStream [DW][DocThread-4]: publishFlushedSegment seg-private updates=null
   [junit4]   2> 11995 INFO  (DocThread-4) [    ] o.a.s.u.LoggingInfoStream [IW][DocThread-4]: publishFlushedSegment
   [junit4]   2> 11995 INFO  (DocThread-4) [    ] o.a.s.u.LoggingInfoStream [IW][DocThread-4]: publish sets newSegment delGen=6 seg=_1(5.5.0):C110
   [junit4]   2> 11995 INFO  (DocThread-4) [    ] o.a.s.u.LoggingInfoStream [IFD][DocThread-4]: now checkpoint "_0(5.5.0):C6 _1(5.5.0):C110" [2 segments ; isCommit = false]
   [junit4]   2> 11995 INFO  (DocThread-4) [    ] o.a.s.u.LoggingInfoStream [IFD][DocThread-4]: 0 msec to checkpoint
   [junit4]   2> 11995 INFO  (DocThread-4) [    ] o.a.s.u.LoggingInfoStream [TMP][DocThread-4]: findMerges: 2 segments
   [junit4]   2> 11995 INFO  (DocThread-0) [    ] o.a.s.u.LoggingInfoStream [DWPT][DocThread-0]: new segment has 0 deleted docs
   [junit4]   2> 11999 INFO  (DocThread-0) [    ] o.a.s.u.LoggingInfoStream [DWPT][DocThread-0]: new segment has no vectors; norms; no docValues; prox; freqs
   [junit4]   2> 11999 INFO  (DocThread-0) [    ] o.a.s.u.LoggingInfoStream [DWPT][DocThread-0]: flushedFiles=[_4.fdt, _4.nvm, _4_Lucene50_0.pos, _4.fnm, _4_Lucene50_0.tip, _4.nvd, _4.fdx, _4_Lucene50_0.doc, _4_Lucene50_0.tim]
   [junit4]   2> 11999 INFO  (DocThread-0) [    ] o.a.s.u.LoggingInfoStream [DWPT][DocThread-0]: flushed codec=Lucene54
   [junit4]   2> 12004 INFO  (DocThread-4) [    ] o.a.s.u.LoggingInfoStream [TMP][DocThread-4]:   seg=_1(5.5.0):C110 size=0.004 MB [floored]
   [junit4]   2> 12004 INFO  (DocThread-4) [    ] o.a.s.u.LoggingInfoStream [TMP][DocThread-4]:   seg=_0(5.5.0):C6 size=0.002 MB [floored]
   [junit4]   2> 12004 INFO  (DocThread-4) [    ] o.a.s.u.LoggingInfoStream [TMP][DocThread-4]:   allowedSegmentCount=1 vs count=2 (eligible count=2) tooBigCount=0
   [junit4]   2> 12004 INFO  (DocThread-4) [    ] o.a.s.u.LoggingInfoStream [MS][DocThread-4]: now merge
   [junit4]   2> 12004 INFO  (DocThread-4) [    ] o.a.s.u.LoggingInfoStream [MS][DocThread-4]:   index: _0(5.5.0):C6 _1(5.5.0):C110
   [junit4]   2> 12004 INFO  (DocThread-4) [    ] o.a.s.u.LoggingInfoStream [MS][DocThread-4]:   no more merges pending; now return
   [junit4]   2> 12005 INFO  (DocThread-4) [    ] o.a.s.u.LoggingInfoStream [TMP][DocThread-4]: findMerges: 2 segments
   [junit4]   2> 12005 INFO  (DocThread-4) [    ] o.a.s.u.LoggingInfoStream [TMP][DocThread-4]:   seg=_1(5.5.0):C110 size=0.004 MB [floored]
   [junit4]   2> 12005 INFO  (DocThread-4) [    ] o.a.s.u.LoggingInfoStream [TMP][DocThread-4]:   seg=_0(5.5.0):C6 size=0.002 MB [floored]
   [junit4]   2> 12005 INFO  (DocThread-4) [    ] o.a.s.u.LoggingInfoStream [TMP][DocThread-4]:   allowedSegmentCount=1 vs count=2 (eligible count=2) tooBigCount=0
   [junit4]   2> 12005 INFO  (DocThread-4) [    ] o.a.s.u.LoggingInfoStream [MS][DocThread-4]: now merge
   [junit4]   2> 12005 INFO  (DocThread-4) [    ] o.a.s.u.LoggingInfoStream [MS][DocThread-4]:   index: _0(5.5.0):C6 _1(5.5.0):C110
   [junit4]   2> 12005 INFO  (DocThread-4) [    ] o.a.s.u.LoggingInfoStream [MS][DocThread-4]:   no more merges pending; now return
   [junit4]   2> 12005 INFO  (DocThread-4) [    ] o.a.s.u.p.LogUpdateProcessorFactory [collection1]  webapp=null path=/update params={}{add=[T4:0 (1521515475272466432), T4:1 (1521515475334332418), T4:2 (1521515475335380992), T4:3 (1521515475335380995), T4:4 (1521515475335380996), T4:5 (1521515475336429569), T4:6 (1521515475336429571), T4:7 (1521515475336429573), T4:8 (1521515475337478145), T4:9 (1521515475337478146), ... (100 adds)]} 0 283
   [junit4]   2> 12006 INFO  (DocThread-0) [    ] o.a.s.u.LoggingInfoStream [DWPT][DocThread-0]: flushed: segment=_4 ramUsed=0.191 MB newFlushedSize=0.005 MB docs/MB=25,878.187
   [junit4]   2> 12007 INFO  (DocThread-0) [    ] o.a.s.u.LoggingInfoStream [DWFC][DocThread-0]: waitIfStalled: numFlushesPending: 0 netBytes: 291739 flushBytes: 189155 fullFlush: true
   [junit4]   2> 12007 INFO  (DocThread-0) [    ] o.a.s.u.LoggingInfoStream [DW][DocThread-0]: continue indexing after helping out flushing DocumentsWriter is healthy
   [junit4]   2> 12007 INFO  (DocThread-0) [    ] o.a.s.u.LoggingInfoStream [TMP][DocThread-0]: findMerges: 2 segments
   [junit4]   2> 12015 INFO  (DocThread-1) [    ] o.a.s.u.LoggingInfoStream [DWPT][DocThread-1]: new segment has 0 deleted docs
   [junit4]   2> 12015 INFO  (DocThread-1) [    ] o.a.s.u.LoggingInfoStream [DWPT][DocThread-1]: new segment has no vectors; norms; no docValues; prox; freqs
   [junit4]   2> 12015 INFO  (DocThread-1) [    ] o.a.s.u.LoggingInfoStream [DWPT][DocThread-1]: flushedFiles=[_3.fdx, _3.nvd, _3_Lucene50_0.pos, _3_Lucene50_0.doc, _3_Lucene50_0.tim, _3.nvm, _3.fnm, _3.fdt, _3_Lucene50_0.tip]
   [junit4]   2> 12015 INFO  (DocThread-1) [    ] o.a.s.u.LoggingInfoStream [DWPT][DocThread-1]: flushed codec=Lucene54
   [junit4]   2> 12015 INFO  (DocThread-1) [    ] o.a.s.u.LoggingInfoStream [DWPT][DocThread-1]: flushed: segment=_3 ramUsed=0.193 MB newFlushedSize=0.005 MB docs/MB=28,852.638
   [junit4]   2> 12016 INFO  (DocThread-1) [    ] o.a.s.u.LoggingInfoStream [DWFC][DocThread-1]: waitIfStalled: numFlushesPending: 0 netBytes: 102817 flushBytes: 0 fullFlush: true
   [junit4]   2> 12016 INFO  (DocThread-1) [    ] o.a.s.u.LoggingInfoStream [DW][DocThread-1]: continue indexing after helping out flushing DocumentsWriter is healthy
   [junit4]   2> 12016 INFO  (DocThread-3) [    ] o.a.s.u.LoggingInfoStream [DW][DocThread-3]: publishFlushedSegment seg-private updates=null
   [junit4]   2> 12017 INFO  (DocThread-0) [    ] o.a.s.u.LoggingInfoStream [TMP][DocThread-0]:   seg=_1(5.5.0):C110 size=0.004 MB [floored]
   [junit4]   2> 12017 INFO  (DocThread-0) [    ] o.a.s.u.LoggingInfoStream [TMP][DocThread-0]:   seg=_0(5.5.0):C6 size=0.002 MB [floored]
   [junit4]   2> 12017 INFO  (DocThread-0) [    ] o.a.s.u.LoggingInfoStream [TMP][DocThread-0]:   allowedSegmentCount=1 vs count=2 (eligible count=2) tooBigCount=0
   [junit4]   2> 12017 INFO  (DocThread-0) [    ] o.a.s.u.LoggingInfoStream [MS][DocThread-0]: now merge
   [junit4]   2> 12017 INFO  (DocThread-0) [    ] o.a.s.u.LoggingInfoStream [MS][DocThread-0]:   index: _0(5.5.0):C6 _1(5.5.0):C110
   [junit4]   2> 12018 INFO  (DocThread-1) [    ] o.a.s.u.LoggingInfoStream [TMP][DocThread-1]: findMerges: 2 segments
   [junit4]   2> 12018 INFO  (DocThread-1) [    ] o.a.s.u.LoggingInfoStream [TMP][DocThread-1]:   seg=_1(5.5.0):C110 size=0.004 MB [floored]
   [junit4]   2> 12018 INFO  (DocThread-1) [    ] o.a.s.u.LoggingInfoStream [TMP][DocThread-1]:   seg=_0(5.5.0):C6 size=0.002 MB [floored]
   [junit4]   2> 12018 INFO  (DocThread-1) [    ] o.a.s.u.LoggingInfoStream [TMP][DocThread-1]:   allowedSegmentCount=1 vs count=2 (eligible count=2) tooBigCount=0
   [junit4]   2> 12018 INFO  (DocThread-3) [    ] o.a.s.u.LoggingInfoStream [IW][DocThread-3]: publishFlushedSegment
   [junit4]   2> 12018 INFO  (DocThread-3) [    ] o.a.s.u.LoggingInfoStream [IW][DocThread-3]: publish sets newSegment delGen=7 seg=_3(5.5.0):C146
   [junit4]   2> 12018 INFO  (DocThread-3) [    ] o.a.s.u.LoggingInfoStream [IFD][DocThread-3]: now checkpoint "_0(5.5.0):C6 _1(5.5.0):C110 _3(5.5.0):C146" [3 segments ; isCommit = false]
   [junit4]   2> 12019 INFO  (DocThread-3) [    ] o.a.s.u.LoggingInfoStream [IFD][DocThread-3]: 0 msec to checkpoint
   [junit4]   2> 12019 INFO  (DocThread-3) [    ] o.a.s.u.LoggingInfoStream [DW][DocThread-3]: publishFlushedSegment seg-private updates=null
   [junit4]   2> 12019 INFO  (DocThread-3) [    ] o.a.s.u.LoggingInfoStream [IW][DocThread-3]: publishFlushedSegment
   [junit4]   2> 12019 INFO  (DocThread-3) [    ] o.a.s.u.LoggingInfoStream [IW][DocThread-3]: publish sets newSegment delGen=8 seg=_4(5.5.0):C127
   [junit4]   2> 12019 INFO  (DocThread-3) [    ] o.a.s.u.LoggingInfoStream [IFD][DocThread-3]: now checkpoint "_0(5.5.0):C6 _1(5.5.0):C110 _3(5.5.0):C146 _4(5.5.0):C127" [4 segments ; isCommit = false]
   [junit4]   2> 12019 INFO  (DocThread-3) [    ] o.a.s.u.LoggingInfoStream [IFD][DocThread-3]: 0 msec to checkpoint
   [junit4]   2> 12019 INFO  (DocThread-3) [    ] o.a.s.u.LoggingInfoStream [DW][DocThread-3]: publishFlushedSegment seg-private updates=null
   [junit4]   2> 12019 INFO  (DocThread-3) [    ] o.a.s.u.LoggingInfoStream [IW][DocThread-3]: publishFlushedSegment
   [junit4]   2> 12019 INFO  (DocThread-3) [    ] o.a.s.u.LoggingInfoStream [IW][DocThread-3]: publish sets newSegment delGen=9 seg=_2(5.5.0):C16
   [junit4]   2> 12019 INFO  (DocThread-3) [    ] o.a.s.u.LoggingInfoStream [IFD][DocThread-3]: now checkpoint "_0(5.5.0):C6 _1(5.5.0):C110 _3(5.5.0):C146 _4(5.5.0):C127 _2(5.5.0):C16" [5 segments ; isCommit = false]
   [junit4]   2> 12019 INFO  (DocThread-3) [    ] o.a.s.u.LoggingInfoStream [IFD][DocThread-3]: 0 msec to checkpoint
   [junit4]   2> 12019 INFO  (DocThread-3) [    ] o.a.s.u.LoggingInfoStream [IW][DocThread-3]: apply all deletes during flush
   [junit4]   2> 12019 INFO  (DocThread-3) [    ] o.a.s.u.LoggingInfoStream [IW][DocThread-3]: now apply all deletes for all segments maxDoc=416
   [junit4]   2> 12019 INFO  (DocThread-3) [    ] o.a.s.u.LoggingInfoStream [BD][DocThread-3]: applyDeletes: open segment readers took 0 msec
   [junit4]   2> 12020 INFO  (DocThread-3) [    ] o.a.s.u.LoggingInfoStream [BD][DocThread-3]: applyDeletes: infos=[_0(5.5.0):C6, _1(5.5.0):C110, _3(5.5.0):C146, _4(5.5.0):C127, _2(5.5.0):C16] packetCount=1
   [junit4]   2> 12020 INFO  (DocThread-3) [    ] o.a.s.u.LoggingInfoStream [BD][DocThread-3]: applyDeletes took 1 msec for 5 segments, 0 newly deleted docs (query deletes), 0 visited terms, allDeleted=null
   [junit4]   2> 12020 INFO  (DocThread-3) [    ] o.a.s.u.LoggingInfoStream [BD][DocThread-3]: prune sis=segments_1: _0(5.5.0):C6 _1(5.5.0):C110 _3(5.5.0):C146 _4(5.5.0):C127 _2(5.5.0):C16 minGen=5 packetCount=1
   [junit4]   2> 12020 INFO  (DocThread-3) [    ] o.a.s.u.LoggingInfoStream [BD][DocThread-3]: pruneDeletes: prune 1 packets; 0 packets remain
   [junit4]   2> 12020 INFO  (DocThread-3) [    ] o.a.s.u.LoggingInfoStream [DW][DocThread-3]: DocThread-3 finishFullFlush success=true
   [junit4]   2> 12020 INFO  (DocThread-3) [    ] o.a.s.u.LoggingInfoStream [TMP][DocThread-3]: findMerges: 5 segments
   [junit4]   2> 12023 INFO  (DocThread-3) [    ] o.a.s.u.LoggingInfoStream [TMP][DocThread-3]:   seg=_3(5.5.0):C146 size=0.005 MB [floored]
   [junit4]   2> 12023 INFO  (DocThread-3) [    ] o.a.s.u.LoggingInfoStream [TMP][DocThread-3]:   seg=_4(5.5.0):C127 size=0.005 MB [floored]
   [junit4]   2> 12023 INFO  (DocThread-3) [    ] o.a.s.u.LoggingInfoStream [TMP][DocThread-3]:   seg=_1(5.5.0):C110 size=0.004 MB [floored]
   [junit4]   2> 12024 INFO  (DocThread-3) [    ] o.a.s.u.LoggingInfoStream [TMP][DocThread-3]:   seg=_2(5.5.0):C16 size=0.002 MB [floored]
   [junit4]   2> 12024 INFO  (DocThread-3) [    ] o.a.s.u.LoggingInfoStream [TMP][DocThread-3]:   seg=_0(5.5.0):C6 size=0.002 MB [floored]
   [junit4]   2> 12024 INFO  (DocThread-3) [    ] o.a.s.u.LoggingInfoStream [TMP][DocThread-3]:   allowedSegmentCount=1 vs count=5 (eligible count=5) tooBigCount=0
   [junit4]   2> 12024 INFO  (DocThread-0) [    ] o.a.s.u.LoggingInfoStream [MS][DocThread-0]:   no more merges pending; now return
   [junit4]   2> 12024 INFO  (DocThread-3) [    ] o.a.s.u.LoggingInfoStream [MS][DocThread-3]: now merge
   [junit4]   2> 12024 INFO  (DocThread-3) [    ] o.a.s.u.LoggingInfoStream [MS][DocThread-3]:   index: _0(5.5.0):C6 _1(5.5.0):C110 _3(5.5.0):C146 _4(5.5.0):C127 _2(5.5.0):C16
   [junit4]   2> 12024 INFO  (DocThread-3) [    ] o.a.s.u.LoggingInfoStream [MS][DocThread-3]:   no more merges pending; now return
   [junit4]   2> 12024 INFO  (DocThread-3) [    ] o.a.s.u.LoggingInfoStream [IW][DocThread-3]: startCommit(): start
   [junit4]   2> 12024 INFO  (DocThread-3) [    ] o.a.s.u.LoggingInfoStream [IW][DocThread-3]: startCommit index=_0(5.5.0):C6 _1(5.5.0):C110 _3(5.5.0):C146 _4(5.5.0):C127 _2(5.5.0):C16 changeCount=13
   [junit4]   2> 12025 INFO  (DocThread-3) [    ] o.a.s.u.LoggingInfoStream [IW][DocThread-3]: startCommit: wrote pending segments file "pending_segments_2"
   [junit4]   2> 12025 INFO  (DocThread-3) [    ] o.a.s.u.LoggingInfoStream [IW][DocThread-3]: done all syncs: [_3.si, _1.nvd, _0.nvd, _2_Lucene50_0.pos, _1.nvm, _1.fnm, _4_Lucene50_0.doc, _1_Lucene50_0.tim, _2.nvd, _4_Lucene50_0.pos, _2.nvm, _2.fnm, _1_Lucene50_0.tip, _2.si, _0_Lucene50_0.pos, _4_Lucene50_0.tip, _4_Lucene50_0.tim, _4.fdt, _3_Lucene50_0.tim, _3.fdt, _3_Lucene50_0.tip, _0.nvm, _0.fnm, _3.fdx, _0_Lucene50_0.doc, _1.si, _3_Lucene50_0.pos, _2.fdt, _2.fdx, _2_Lucene50_0.tim, _4.fdx, _2_Lucene50_0.tip, _1_Lucene50_0.pos, _3_Lucene50_0.doc, _1.fdx, _1.fdt, _0.si, _0_Lucene50_0.tim, _3.nvd, _4.nvm, _4.fnm, _0.fdx, _3.nvm, _3.fnm, _0_Lucene50_0.tip, _4.nvd, _2_Lucene50_0.doc, _0.fdt, _1_Lucene50_0.doc, _4.si]
   [junit4]   2> 12025 INFO  (DocThread-3) [    ] o.a.s.u.LoggingInfoStream [IW][DocThread-3]: commit: pendingCommit != null
   [junit4]   2> 12025 INFO  (DocThread-3) [    ] o.a.s.u.LoggingInfoStream [IW][DocThread-3]: commit: done writing segments file "segments_2"
   [junit4]   2> 12025 INFO  (DocThread-3) [    ] o.a.s.u.LoggingInfoStream [IFD][DocThread-3]: now checkpoint "_0(5.5.0):C6 _1(5.5.0):C110 _3(5.5.0):C146 _4(5.5.0):C127 _2(5.5.0):C16" [5 segments ; isCommit = true]
   [junit4]   2> 12025 INFO  (DocThread-3) [    ] o.a.s.c.SolrDeletionPolicy SolrDeletionPolicy.onCommit: commits: num=2
   [junit4]   2> 	commit{dir=MockDirectoryWrapper(RAMDirectory@56de8beb lockFactory=org.apache.lucene.store.SingleInstanceLockFactory@43246482),segFN=segments_1,generation=1}
   [junit4]   2> 	commit{dir=MockDirectoryWrapper(RAMDirectory@56de8beb lockFactory=org.apache.lucene.store.SingleInstanceLockFactory@43246482),segFN=segments_2,generation=2}
   [junit4]   2> 12027 INFO  (DocThread-3) [    ] o.a.s.c.SolrDeletionPolicy newest commit generation = 2
   [junit4]   2> 12027 INFO  (DocThread-3) [    ] o.a.s.u.LoggingInfoStream [IFD][DocThread-3]: deleteCommits: now decRef commit "segments_1"
   [junit4]   2> 12027 INFO  (DocThread-3) [    ] o.a.s.u.LoggingInfoStream [IFD][DocThread-3]: delete "segments_1"
   [junit4]   2> 12027 INFO  (DocThread-3) [    ] o.a.s.u.LoggingInfoStream [IFD][DocThread-3]: 2 msec to checkpoint
   [junit4]   2> 12027 INFO  (DocThread-3) [    ] o.a.s.u.LoggingInfoStream [IW][DocThread-3]: commit: took 106.1 msec
   [junit4]   2> 12027 INFO  (DocThread-3) [    ] o.a.s.u.LoggingInfoStream [IW][DocThread-3]: commit: done
   [junit4]   2> 12029 WARN  (DocThread-3) [    ] o.a.s.c.SolrCore [collection1] PERFORMANCE WARNING: Overlapping onDeckSearchers=2
   [junit4]   2> 12034 INFO  (DocThread-3) [    ] o.a.s.u.LoggingInfoStream [DW][DocThread-3]: anyChanges? numDocsInRam=11 deletes=true hasTickets:false pendingChangesInFullFlush: false
   [junit4]   2> 12034 INFO  (DocThread-3) [    ] o.a.s.u.LoggingInfoStream [IW][DocThread-3]: nrtIsCurrent: infoVersion matches: false; DW changes: true; BD changes: false
   [junit4]   2> 12034 INFO  (DocThread-3) [    ] o.a.s.u.LoggingInfoStream [IW][DocThread-3]: flush at getReader
   [junit4]   2> 12034 INFO  (DocThread-3) [    ] o.a.s.u.LoggingInfoStream [DW][DocThread-3]: startFullFlush
   [junit4]   2> 12034 INFO  (DocThread-3) [    ] o.a.s.u.LoggingInfoStream [DW][DocThread-3]: anyChanges? numDocsInRam=11 deletes=true hasTickets:false pendingChangesInFullFlush: false
   [junit4]   2> 12034 INFO  (DocThread-3) [    ] o.a.s.u.LoggingInfoStream [DWFC][DocThread-3]: addFlushableState DocumentsWriterPerThread [pendingDeletes=gen=0 10 deleted terms (unique count=10) bytesUsed=2330, segment=_5, aborted=false, numDocsInRAM=11, deleteQueue=DWDQ: [ generation: 3 ]]
   [junit4]   2> 12035 INFO  (DocThread-3) [    ] o.a.s.u.LoggingInfoStream [DWPT][DocThread-3]: flush postings as segment _5 numDocs=11
   [junit4]   2> 12036 INFO  (DocThread-1) [    ] o.a.s.u.LoggingInfoStream [MS][DocThread-1]: now merge
   [junit4]   2> 12036 INFO  (DocThread-1) [    ] o.a.s.u.LoggingInfoStream [MS][DocThread-1]:   index: _0(5.5.0):C6 _1(5.5.0):C110 _3(5.5.0):C146 _4(5.5.0):C127 _2(5.5.0):C16
   [junit4]   2> 12036 INFO  (DocThread-1) [    ] o.a.s.u.LoggingInfoStream [MS][DocThread-1]:   no more merges pending; now return
   [junit4]   2> 12037 INFO  (DocThread-3) [    ] o.a.s.u.LoggingInfoStream [DWPT][DocThread-3]: new segment has 0 deleted docs
   [junit4]   2> 12037 INFO  (DocThread-3) [    ] o.a.s.u.LoggingInfoStream [DWPT][DocThread-3]: new segment has no vectors; norms; no docValues; prox; freqs
   [junit4]   2> 12037 INFO  (DocThread-3) [    ] o.a.s.u.LoggingInfoStream [DWPT][DocThread-3]: flushedFiles=[_5.nvm, _5.fnm, _5_Lucene50_0.pos, _5.fdt, _5.nvd, _5_Lucene50_0.tip, _5_Lucene50_0.doc, _5_Lucene50_0.tim, _5.fdx]
   [junit4]   2> 12037 INFO  (DocThread-3) [    ] o.a.s.u.LoggingInfoStream [DWPT][DocThread-3]: flushed codec=Lucene54
   [junit4]   2> 12037 INFO  (DocThread-3) [    ] o.a.s.u.LoggingInfoStream [DWPT][DocThread-3]: flushed: segment=_5 ramUsed=0.098 MB newFlushedSize=0.002 MB docs/MB=6,432.982
   [junit4]   2> 12037 INFO  (DocThread-3) [    ] o.a.s.u.LoggingInfoStream [DW][DocThread-3]: publishFlushedSegment seg-private updates=null
   [junit4]   2> 12037 INFO  (DocThread-3) [    ] o.a.s.u.LoggingInfoStream [IW][DocThread-3]: publishFlushedSegment
   [junit4]   2> 12037 INFO  (DocThread-3) [    ] o.a.s.u.LoggingInfoStream [BD][DocThread-3]: push deletes  11 deleted terms (unique count=11) bytesUsed=1088 segmentPrivate?=false delGen=11 packetCount=1 totBytesUsed=1088
   [junit4]   2> 12037 INFO  (DocThread-3) [    ] o.a.s.u.LoggingInfoStream [IW][DocThread-3]: publish sets newSegment delGen=12 seg=_5(5.5.0):C11
   [junit4]   2> 12037 INFO  (DocThread-3) [    ] o.a.s.u.LoggingInfoStream [IFD][DocThread-3]: now checkpoint "_0(5.5.0):C6 _1(5.5.0):C110 _3(5.5.0):C146 _4(5.5.0):C127 _2(5.5.0):C16 _5(5.5.0):C11" [6 segments ; isCommit = false]
   [junit4]   2> 12038 INFO  (DocThread-3) [    ] o.a.s.u.LoggingInfoStream [IFD][DocThread-3]: 0 msec to checkpoint
   [junit4]   2> 12038 INFO  (DocThread-3) [    ] o.a.s.u.LoggingInfoStream [IW][DocThread-3]: apply all deletes during flush
   [junit4]   2> 12038 INFO  (DocThread-3) [    ] o.a.s.u.LoggingInfoStream [IW][DocThread-3]: now apply all deletes for all segments maxDoc=424
   [junit4]   2> 12038 INFO  (DocThread-3) [    ] o.a.s.u.LoggingInfoStream [BD][DocThread-3]: applyDeletes: open segment readers took 0 msec
   [junit4]   2> 12038 INFO  (DocThread-3) [    ] o.a.s.u.LoggingInfoStream [BD][DocThread-3]: applyDeletes: infos=[_0(5.5.0):C6, _1(5.5.0):C110, _3(5.5.0):C146, _4(5.5.0):C127, _2(5.5.0):C16, _5(5.5.0):C11] packetCount=1
   [junit4]   2> 12049 INFO  (DocThread-1) [    ] o.a.s.u.p.LogUpdateProcessorFactory [collection1]  webapp=null path=/update params={}{add=[T1:0 (1521515475273515008), T1:1 (1521515475355303936), T1:2 (1521515475357401088), T1:3 (1521515475358449664), T1:4 (1521515475358449665), T1:5 (1521515475358449666), T1:6 (1521515475359498240), T1:7 (1521515475359498242), T1:8 (1521515475359498244), T1:9 (1521515475360546816), ... (100 adds)]} 0 330
   [junit4]   2> 12087 INFO  (DocThread-0) [    ] o.a.s.u.p.LogUpdateProcessorFactory [collection1]  webapp=null path=/update params={}{add=[T0:0 (1521515475254640640), T0:1 (1521515475280855040), T0:2 (1521515475285049344), T0:3 (1521515475324895232), T0:4 (1521515475328040960), T0:5 (1521515475331186688), T0:6 (1521515475357401091), T0:7 (1521515475361595393), T0:8 (1521515475361595395), T0:9 (1521515475365789696), ... (100 adds)]} 0 377
   [junit4]   2> 12134 INFO  (DocThread-3) [    ] o.a.s.u.LoggingInfoStream [BD][DocThread-3]: applyTermDeletes took 16.5 msec for 6 segments and 1 packets; 11 del terms visited; 38 seg terms visited
   [junit4]   2> 12135 INFO  (DocThread-3) [    ] o.a.s.u.LoggingInfoStream [BD][DocThread-3]: applyDeletes: 0 new deleted documents
   [junit4]   2> 12135 INFO  (DocThread-3) [    ] o.a.s.u.Loggin

[...truncated too long message...]

6A35C6677EA7C2]-worker) [    x:collection1] o.a.s.u.LoggingInfoStream [IW][SUITE-LargeVolumeEmbeddedTest-seed#[616A35C6677EA7C2]-worker]: commit: done
   [junit4]   2> 12399 INFO  (SUITE-LargeVolumeEmbeddedTest-seed#[616A35C6677EA7C2]-worker) [    x:collection1] o.a.s.u.LoggingInfoStream [IW][SUITE-LargeVolumeEmbeddedTest-seed#[616A35C6677EA7C2]-worker]: rollback
   [junit4]   2> 12399 INFO  (SUITE-LargeVolumeEmbeddedTest-seed#[616A35C6677EA7C2]-worker) [    x:collection1] o.a.s.u.LoggingInfoStream [IW][SUITE-LargeVolumeEmbeddedTest-seed#[616A35C6677EA7C2]-worker]: all running merges have aborted
   [junit4]   2> 12399 INFO  (SUITE-LargeVolumeEmbeddedTest-seed#[616A35C6677EA7C2]-worker) [    x:collection1] o.a.s.u.LoggingInfoStream [IW][SUITE-LargeVolumeEmbeddedTest-seed#[616A35C6677EA7C2]-worker]: rollback: done finish merges
   [junit4]   2> 12399 INFO  (SUITE-LargeVolumeEmbeddedTest-seed#[616A35C6677EA7C2]-worker) [    x:collection1] o.a.s.u.LoggingInfoStream [DW][SUITE-LargeVolumeEmbeddedTest-seed#[616A35C6677EA7C2]-worker]: abort
   [junit4]   2> 12399 INFO  (SUITE-LargeVolumeEmbeddedTest-seed#[616A35C6677EA7C2]-worker) [    x:collection1] o.a.s.u.LoggingInfoStream [DW][SUITE-LargeVolumeEmbeddedTest-seed#[616A35C6677EA7C2]-worker]: done abort success=true
   [junit4]   2> 12399 INFO  (SUITE-LargeVolumeEmbeddedTest-seed#[616A35C6677EA7C2]-worker) [    x:collection1] o.a.s.u.LoggingInfoStream [IW][SUITE-LargeVolumeEmbeddedTest-seed#[616A35C6677EA7C2]-worker]: rollback: infos=_8(5.5.0):C500
   [junit4]   2> 12399 INFO  (SUITE-LargeVolumeEmbeddedTest-seed#[616A35C6677EA7C2]-worker) [    x:collection1] o.a.s.u.LoggingInfoStream [IFD][SUITE-LargeVolumeEmbeddedTest-seed#[616A35C6677EA7C2]-worker]: now checkpoint "_8(5.5.0):C500" [1 segments ; isCommit = false]
   [junit4]   2> 12399 INFO  (SUITE-LargeVolumeEmbeddedTest-seed#[616A35C6677EA7C2]-worker) [    x:collection1] o.a.s.u.LoggingInfoStream [IFD][SUITE-LargeVolumeEmbeddedTest-seed#[616A35C6677EA7C2]-worker]: 0 msec to checkpoint
   [junit4]   2> 12400 INFO  (SUITE-LargeVolumeEmbeddedTest-seed#[616A35C6677EA7C2]-worker) [    x:collection1] o.a.s.c.SolrCore [collection1] Closing main searcher on request.
   [junit4]   2> 12400 INFO  (SUITE-LargeVolumeEmbeddedTest-seed#[616A35C6677EA7C2]-worker) [    x:collection1] o.a.s.c.CachingDirectoryFactory Closing MockDirectoryFactory - 2 directories currently being tracked
   [junit4]   2> 12400 INFO  (SUITE-LargeVolumeEmbeddedTest-seed#[616A35C6677EA7C2]-worker) [    x:collection1] o.a.s.c.CachingDirectoryFactory looking to close /export/home/jenkins/workspace/Lucene-Solr-5.x-Solaris/solr/build/solr-solrj/test/J1/temp/solr.client.solrj.embedded.LargeVolumeEmbeddedTest_616A35C6677EA7C2-001/init-core-data-001 [CachedDir<<refCount=0;path=/export/home/jenkins/workspace/Lucene-Solr-5.x-Solaris/solr/build/solr-solrj/test/J1/temp/solr.client.solrj.embedded.LargeVolumeEmbeddedTest_616A35C6677EA7C2-001/init-core-data-001;done=false>>]
   [junit4]   2> 12400 INFO  (SUITE-LargeVolumeEmbeddedTest-seed#[616A35C6677EA7C2]-worker) [    x:collection1] o.a.s.c.CachingDirectoryFactory Closing directory: /export/home/jenkins/workspace/Lucene-Solr-5.x-Solaris/solr/build/solr-solrj/test/J1/temp/solr.client.solrj.embedded.LargeVolumeEmbeddedTest_616A35C6677EA7C2-001/init-core-data-001
   [junit4]   2> 12400 INFO  (SUITE-LargeVolumeEmbeddedTest-seed#[616A35C6677EA7C2]-worker) [    x:collection1] o.a.s.c.CachingDirectoryFactory looking to close /export/home/jenkins/workspace/Lucene-Solr-5.x-Solaris/solr/build/solr-solrj/test/J1/temp/solr.client.solrj.embedded.LargeVolumeEmbeddedTest_616A35C6677EA7C2-001/init-core-data-001/index [CachedDir<<refCount=0;path=/export/home/jenkins/workspace/Lucene-Solr-5.x-Solaris/solr/build/solr-solrj/test/J1/temp/solr.client.solrj.embedded.LargeVolumeEmbeddedTest_616A35C6677EA7C2-001/init-core-data-001/index;done=false>>]
   [junit4]   2> 12400 INFO  (SUITE-LargeVolumeEmbeddedTest-seed#[616A35C6677EA7C2]-worker) [    x:collection1] o.a.s.c.CachingDirectoryFactory Closing directory: /export/home/jenkins/workspace/Lucene-Solr-5.x-Solaris/solr/build/solr-solrj/test/J1/temp/solr.client.solrj.embedded.LargeVolumeEmbeddedTest_616A35C6677EA7C2-001/init-core-data-001/index
   [junit4]   2> 12401 INFO  (SUITE-LargeVolumeEmbeddedTest-seed#[616A35C6677EA7C2]-worker) [    x:collection1] o.a.s.SolrTestCaseJ4 ###deleteCore
   [junit4]   2> 12401 INFO  (SUITE-LargeVolumeEmbeddedTest-seed#[616A35C6677EA7C2]-worker) [    x:collection1] o.a.s.c.CoreContainer Shutting down CoreContainer instance=790010339
   [junit4]   2> ObjectTracker found 1 object(s) that were not released!!! [TransactionLog]
   [junit4]   2> org.apache.solr.common.util.ObjectReleaseTracker$ObjectTrackerException
   [junit4]   2> 	at org.apache.solr.common.util.ObjectReleaseTracker.track(ObjectReleaseTracker.java:34)
   [junit4]   2> 	at org.apache.solr.update.TransactionLog.<init>(TransactionLog.java:184)
   [junit4]   2> 	at org.apache.solr.update.TransactionLog.<init>(TransactionLog.java:142)
   [junit4]   2> 	at org.apache.solr.update.UpdateLog.ensureLog(UpdateLog.java:863)
   [junit4]   2> 	at org.apache.solr.update.UpdateLog.add(UpdateLog.java:424)
   [junit4]   2> 	at org.apache.solr.update.UpdateLog.add(UpdateLog.java:410)
   [junit4]   2> 	at org.apache.solr.update.DirectUpdateHandler2.doNormalUpdate(DirectUpdateHandler2.java:295)
   [junit4]   2> 	at org.apache.solr.update.DirectUpdateHandler2.addDoc0(DirectUpdateHandler2.java:207)
   [junit4]   2> 	at org.apache.solr.update.DirectUpdateHandler2.addDoc(DirectUpdateHandler2.java:169)
   [junit4]   2> 	at org.apache.solr.update.processor.RunUpdateProcessor.processAdd(RunUpdateProcessorFactory.java:69)
   [junit4]   2> 	at org.apache.solr.update.processor.UpdateRequestProcessor.processAdd(UpdateRequestProcessor.java:49)
   [junit4]   2> 	at org.apache.solr.update.processor.DistributedUpdateProcessor.doLocalAdd(DistributedUpdateProcessor.java:924)
   [junit4]   2> 	at org.apache.solr.update.processor.DistributedUpdateProcessor.versionAdd(DistributedUpdateProcessor.java:1079)
   [junit4]   2> 	at org.apache.solr.update.processor.DistributedUpdateProcessor.processAdd(DistributedUpdateProcessor.java:702)
   [junit4]   2> 	at org.apache.solr.update.processor.LogUpdateProcessorFactory$LogUpdateProcessor.processAdd(LogUpdateProcessorFactory.java:104)
   [junit4]   2> 	at org.apache.solr.handler.loader.XMLLoader.processUpdate(XMLLoader.java:251)
   [junit4]   2> 	at org.apache.solr.handler.loader.XMLLoader.load(XMLLoader.java:178)
   [junit4]   2> 	at org.apache.solr.handler.UpdateRequestHandler$1.load(UpdateRequestHandler.java:95)
   [junit4]   2> 	at org.apache.solr.handler.ContentStreamHandlerBase.handleRequestBody(ContentStreamHandlerBase.java:70)
   [junit4]   2> 	at org.apache.solr.handler.RequestHandlerBase.handleRequest(RequestHandlerBase.java:156)
   [junit4]   2> 	at org.apache.solr.core.SolrCore.execute(SolrCore.java:2070)
   [junit4]   2> 	at org.apache.solr.client.solrj.embedded.EmbeddedSolrServer.request(EmbeddedSolrServer.java:179)
   [junit4]   2> 	at org.apache.solr.client.solrj.SolrRequest.process(SolrRequest.java:150)
   [junit4]   2> 	at org.apache.solr.client.solrj.SolrClient.add(SolrClient.java:107)
   [junit4]   2> 	at org.apache.solr.client.solrj.SolrClient.add(SolrClient.java:72)
   [junit4]   2> 	at org.apache.solr.client.solrj.SolrClient.add(SolrClient.java:86)
   [junit4]   2> 	at org.apache.solr.client.solrj.LargeVolumeTestBase$DocThread.run(LargeVolumeTestBase.java:110)
   [junit4]   2> 
   [junit4]   2> NOTE: test params are: codec=Asserting(Lucene54): {}, docValues:{}, sim=DefaultSimilarity, locale=nl, timezone=Etc/Greenwich
   [junit4]   2> NOTE: SunOS 5.11 amd64/Oracle Corporation 1.8.0_66 (64-bit)/cpus=3,threads=1,free=16947408,total=64946176
   [junit4]   2> NOTE: All tests run in this JVM: [ClientUtilsTest, SolrExceptionTest, StreamExpressionParserTest, MergeIndexesEmbeddedTest, LargeVolumeEmbeddedTest]
   [junit4]   2> NOTE: reproduce with: ant test  -Dtestcase=LargeVolumeEmbeddedTest -Dtests.seed=616A35C6677EA7C2 -Dtests.slow=true -Dtests.locale=nl -Dtests.timezone=Etc/Greenwich -Dtests.asserts=true -Dtests.file.encoding=UTF-8
   [junit4] ERROR   0.00s J1 | LargeVolumeEmbeddedTest (suite) <<<
   [junit4]    > Throwable #1: java.lang.AssertionError: ObjectTracker found 1 object(s) that were not released!!! [TransactionLog]
   [junit4]    > 	at __randomizedtesting.SeedInfo.seed([616A35C6677EA7C2]:0)
   [junit4]    > 	at org.apache.solr.SolrTestCaseJ4.afterClass(SolrTestCaseJ4.java:228)
   [junit4]    > 	at java.lang.Thread.run(Thread.java:745)
   [junit4] Completed [5/69 (1!)] on J1 in 3.50s, 1 test, 1 failure <<< FAILURES!

[...truncated 203 lines...]
BUILD FAILED
/export/home/jenkins/workspace/Lucene-Solr-5.x-Solaris/build.xml:794: The following error occurred while executing this line:
/export/home/jenkins/workspace/Lucene-Solr-5.x-Solaris/build.xml:738: The following error occurred while executing this line:
/export/home/jenkins/workspace/Lucene-Solr-5.x-Solaris/build.xml:59: The following error occurred while executing this line:
/export/home/jenkins/workspace/Lucene-Solr-5.x-Solaris/solr/build.xml:246: The following error occurred while executing this line:
/export/home/jenkins/workspace/Lucene-Solr-5.x-Solaris/solr/common-build.xml:526: The following error occurred while executing this line:
/export/home/jenkins/workspace/Lucene-Solr-5.x-Solaris/lucene/common-build.xml:1456: The following error occurred while executing this line:
/export/home/jenkins/workspace/Lucene-Solr-5.x-Solaris/lucene/common-build.xml:1010: There were test failures: 69 suites, 476 tests, 1 suite-level error [seed: 616A35C6677EA7C2]

Total time: 76 minutes 36 seconds
Build step 'Invoke Ant' marked build as failure
Archiving artifacts
[WARNINGS] Skipping publisher since build result is FAILURE
Recording test results
Email was triggered for: Failure - Any
Sending email for trigger: Failure - Any



Mime
View raw message