lucene-dev mailing list archives

Site index · List index
Message view « Date » · « Thread »
Top « Date » · « Thread »
From Apache Jenkins Server <jenk...@builds.apache.org>
Subject [JENKINS] Lucene-Solr-NightlyTests-5.3 - Build # 14 - Still Failing
Date Sun, 17 Jan 2016 00:43:38 GMT
Build: https://builds.apache.org/job/Lucene-Solr-NightlyTests-5.3/14/

2 tests failed.
FAILED:  org.apache.solr.cloud.CollectionsAPIDistributedZkTest.test

Error Message:
Error from server at http://127.0.0.1:47477: Error CREATEing SolrCore 'halfcollection_shard1_replica1': Error reading cluster properties Caused by: KeeperErrorCode = Session expired for /clusterprops.json

Stack Trace:
org.apache.solr.client.solrj.impl.HttpSolrClient$RemoteSolrException: Error from server at http://127.0.0.1:47477: Error CREATEing SolrCore 'halfcollection_shard1_replica1': Error reading cluster properties Caused by: KeeperErrorCode = Session expired for /clusterprops.json
	at org.apache.solr.client.solrj.impl.HttpSolrClient.executeMethod(HttpSolrClient.java:560)
	at org.apache.solr.client.solrj.impl.HttpSolrClient.request(HttpSolrClient.java:234)
	at org.apache.solr.client.solrj.impl.HttpSolrClient.request(HttpSolrClient.java:226)
	at org.apache.solr.client.solrj.SolrClient.request(SolrClient.java:1220)
	at org.apache.solr.cloud.CollectionsAPIDistributedZkTest.makeRequest(CollectionsAPIDistributedZkTest.java:301)
	at org.apache.solr.cloud.CollectionsAPIDistributedZkTest.testErrorHandling(CollectionsAPIDistributedZkTest.java:418)
	at org.apache.solr.cloud.CollectionsAPIDistributedZkTest.test(CollectionsAPIDistributedZkTest.java:168)
	at sun.reflect.NativeMethodAccessorImpl.invoke0(Native Method)
	at sun.reflect.NativeMethodAccessorImpl.invoke(NativeMethodAccessorImpl.java:57)
	at sun.reflect.DelegatingMethodAccessorImpl.invoke(DelegatingMethodAccessorImpl.java:43)
	at java.lang.reflect.Method.invoke(Method.java:606)
	at com.carrotsearch.randomizedtesting.RandomizedRunner.invoke(RandomizedRunner.java:1627)
	at com.carrotsearch.randomizedtesting.RandomizedRunner$6.evaluate(RandomizedRunner.java:836)
	at com.carrotsearch.randomizedtesting.RandomizedRunner$7.evaluate(RandomizedRunner.java:872)
	at com.carrotsearch.randomizedtesting.RandomizedRunner$8.evaluate(RandomizedRunner.java:886)
	at org.apache.solr.BaseDistributedSearchTestCase$ShardsRepeatRule$ShardsFixedStatement.callStatement(BaseDistributedSearchTestCase.java:963)
	at org.apache.solr.BaseDistributedSearchTestCase$ShardsRepeatRule$ShardsStatement.evaluate(BaseDistributedSearchTestCase.java:938)
	at com.carrotsearch.randomizedtesting.rules.SystemPropertiesRestoreRule$1.evaluate(SystemPropertiesRestoreRule.java:57)
	at org.apache.lucene.util.TestRuleSetupTeardownChained$1.evaluate(TestRuleSetupTeardownChained.java:50)
	at org.apache.lucene.util.AbstractBeforeAfterRule$1.evaluate(AbstractBeforeAfterRule.java:46)
	at org.apache.lucene.util.TestRuleThreadAndTestName$1.evaluate(TestRuleThreadAndTestName.java:49)
	at org.apache.lucene.util.TestRuleIgnoreAfterMaxFailures$1.evaluate(TestRuleIgnoreAfterMaxFailures.java:65)
	at org.apache.lucene.util.TestRuleMarkFailure$1.evaluate(TestRuleMarkFailure.java:48)
	at com.carrotsearch.randomizedtesting.rules.StatementAdapter.evaluate(StatementAdapter.java:36)
	at com.carrotsearch.randomizedtesting.ThreadLeakControl$StatementRunner.run(ThreadLeakControl.java:365)
	at com.carrotsearch.randomizedtesting.ThreadLeakControl.forkTimeoutingTask(ThreadLeakControl.java:798)
	at com.carrotsearch.randomizedtesting.ThreadLeakControl$3.evaluate(ThreadLeakControl.java:458)
	at com.carrotsearch.randomizedtesting.RandomizedRunner.runSingleTest(RandomizedRunner.java:845)
	at com.carrotsearch.randomizedtesting.RandomizedRunner$3.evaluate(RandomizedRunner.java:747)
	at com.carrotsearch.randomizedtesting.RandomizedRunner$4.evaluate(RandomizedRunner.java:781)
	at com.carrotsearch.randomizedtesting.RandomizedRunner$5.evaluate(RandomizedRunner.java:792)
	at com.carrotsearch.randomizedtesting.rules.StatementAdapter.evaluate(StatementAdapter.java:36)
	at com.carrotsearch.randomizedtesting.rules.SystemPropertiesRestoreRule$1.evaluate(SystemPropertiesRestoreRule.java:57)
	at org.apache.lucene.util.AbstractBeforeAfterRule$1.evaluate(AbstractBeforeAfterRule.java:46)
	at com.carrotsearch.randomizedtesting.rules.StatementAdapter.evaluate(StatementAdapter.java:36)
	at org.apache.lucene.util.TestRuleStoreClassName$1.evaluate(TestRuleStoreClassName.java:42)
	at com.carrotsearch.randomizedtesting.rules.NoShadowingOrOverridesOnMethodsRule$1.evaluate(NoShadowingOrOverridesOnMethodsRule.java:39)
	at com.carrotsearch.randomizedtesting.rules.NoShadowingOrOverridesOnMethodsRule$1.evaluate(NoShadowingOrOverridesOnMethodsRule.java:39)
	at com.carrotsearch.randomizedtesting.rules.StatementAdapter.evaluate(StatementAdapter.java:36)
	at com.carrotsearch.randomizedtesting.rules.StatementAdapter.evaluate(StatementAdapter.java:36)
	at com.carrotsearch.randomizedtesting.rules.StatementAdapter.evaluate(StatementAdapter.java:36)
	at org.apache.lucene.util.TestRuleAssertionsRequired$1.evaluate(TestRuleAssertionsRequired.java:54)
	at org.apache.lucene.util.TestRuleMarkFailure$1.evaluate(TestRuleMarkFailure.java:48)
	at org.apache.lucene.util.TestRuleIgnoreAfterMaxFailures$1.evaluate(TestRuleIgnoreAfterMaxFailures.java:65)
	at org.apache.lucene.util.TestRuleIgnoreTestSuites$1.evaluate(TestRuleIgnoreTestSuites.java:55)
	at com.carrotsearch.randomizedtesting.rules.StatementAdapter.evaluate(StatementAdapter.java:36)
	at com.carrotsearch.randomizedtesting.ThreadLeakControl$StatementRunner.run(ThreadLeakControl.java:365)
	at java.lang.Thread.run(Thread.java:745)


FAILED:  org.apache.solr.cloud.hdfs.HdfsCollectionsAPIDistributedZkTest.test

Error Message:
Captured an uncaught exception in thread: Thread[id=72105, name=collection0, state=RUNNABLE, group=TGRP-HdfsCollectionsAPIDistributedZkTest]

Stack Trace:
com.carrotsearch.randomizedtesting.UncaughtExceptionError: Captured an uncaught exception in thread: Thread[id=72105, name=collection0, state=RUNNABLE, group=TGRP-HdfsCollectionsAPIDistributedZkTest]
Caused by: org.apache.solr.client.solrj.impl.HttpSolrClient$RemoteSolrException: Error from server at http://127.0.0.1:38524/g: Could not find collection : awholynewstresscollection_collection0_0
	at __randomizedtesting.SeedInfo.seed([E0C01C2B560B97F3]:0)
	at org.apache.solr.client.solrj.impl.HttpSolrClient.executeMethod(HttpSolrClient.java:560)
	at org.apache.solr.client.solrj.impl.HttpSolrClient.request(HttpSolrClient.java:234)
	at org.apache.solr.client.solrj.impl.HttpSolrClient.request(HttpSolrClient.java:226)
	at org.apache.solr.client.solrj.impl.LBHttpSolrClient.doRequest(LBHttpSolrClient.java:376)
	at org.apache.solr.client.solrj.impl.LBHttpSolrClient.request(LBHttpSolrClient.java:328)
	at org.apache.solr.client.solrj.impl.CloudSolrClient.sendRequest(CloudSolrClient.java:1098)
	at org.apache.solr.client.solrj.impl.CloudSolrClient.requestWithRetryOnStaleState(CloudSolrClient.java:869)
	at org.apache.solr.client.solrj.impl.CloudSolrClient.request(CloudSolrClient.java:805)
	at org.apache.solr.client.solrj.SolrClient.request(SolrClient.java:1220)
	at org.apache.solr.cloud.CollectionsAPIDistributedZkTest$1CollectionThread.run(CollectionsAPIDistributedZkTest.java:894)




Build Log:
[...truncated 11262 lines...]
   [junit4] Suite: org.apache.solr.cloud.CollectionsAPIDistributedZkTest
   [junit4]   2> Creating dataDir: /x1/jenkins/jenkins-slave/workspace/Lucene-Solr-NightlyTests-5.3/solr/build/solr-core/test/J1/temp/solr.cloud.CollectionsAPIDistributedZkTest_E0C01C2B560B97F3-001/init-core-data-001
   [junit4]   2> 2376775 INFO  (SUITE-CollectionsAPIDistributedZkTest-seed#[E0C01C2B560B97F3]-worker) [    ] o.a.s.SolrTestCaseJ4 Randomized ssl (false) and clientAuth (true)
   [junit4]   2> 2376775 INFO  (SUITE-CollectionsAPIDistributedZkTest-seed#[E0C01C2B560B97F3]-worker) [    ] o.a.s.BaseDistributedSearchTestCase Setting hostContext system property: /
   [junit4]   2> 2376780 INFO  (TEST-CollectionsAPIDistributedZkTest.test-seed#[E0C01C2B560B97F3]) [    ] o.a.s.c.ZkTestServer STARTING ZK TEST SERVER
   [junit4]   2> 2376780 INFO  (Thread-7280) [    ] o.a.s.c.ZkTestServer client port:0.0.0.0/0.0.0.0:0
   [junit4]   2> 2376780 INFO  (Thread-7280) [    ] o.a.s.c.ZkTestServer Starting server
   [junit4]   2> 2376880 INFO  (TEST-CollectionsAPIDistributedZkTest.test-seed#[E0C01C2B560B97F3]) [    ] o.a.s.c.ZkTestServer start zk server on port:42461
   [junit4]   2> 2376881 INFO  (TEST-CollectionsAPIDistributedZkTest.test-seed#[E0C01C2B560B97F3]) [    ] o.a.s.c.c.SolrZkClient Using default ZkCredentialsProvider
   [junit4]   2> 2376882 INFO  (TEST-CollectionsAPIDistributedZkTest.test-seed#[E0C01C2B560B97F3]) [    ] o.a.s.c.c.ConnectionManager Waiting for client to connect to ZooKeeper
   [junit4]   2> 2376884 INFO  (zkCallback-1702-thread-1) [    ] o.a.s.c.c.ConnectionManager Watcher org.apache.solr.common.cloud.ConnectionManager@d116f11 name:ZooKeeperConnection Watcher:127.0.0.1:42461 got event WatchedEvent state:SyncConnected type:None path:null path:null type:None
   [junit4]   2> 2376884 INFO  (TEST-CollectionsAPIDistributedZkTest.test-seed#[E0C01C2B560B97F3]) [    ] o.a.s.c.c.ConnectionManager Client is connected to ZooKeeper
   [junit4]   2> 2376885 INFO  (TEST-CollectionsAPIDistributedZkTest.test-seed#[E0C01C2B560B97F3]) [    ] o.a.s.c.c.SolrZkClient Using default ZkACLProvider
   [junit4]   2> 2376885 INFO  (TEST-CollectionsAPIDistributedZkTest.test-seed#[E0C01C2B560B97F3]) [    ] o.a.s.c.c.SolrZkClient makePath: /solr
   [junit4]   2> 2376888 INFO  (TEST-CollectionsAPIDistributedZkTest.test-seed#[E0C01C2B560B97F3]) [    ] o.a.s.c.c.SolrZkClient Using default ZkCredentialsProvider
   [junit4]   2> 2376888 INFO  (TEST-CollectionsAPIDistributedZkTest.test-seed#[E0C01C2B560B97F3]) [    ] o.a.s.c.c.ConnectionManager Waiting for client to connect to ZooKeeper
   [junit4]   2> 2376889 INFO  (zkCallback-1703-thread-1) [    ] o.a.s.c.c.ConnectionManager Watcher org.apache.solr.common.cloud.ConnectionManager@63790cb5 name:ZooKeeperConnection Watcher:127.0.0.1:42461/solr got event WatchedEvent state:SyncConnected type:None path:null path:null type:None
   [junit4]   2> 2376890 INFO  (TEST-CollectionsAPIDistributedZkTest.test-seed#[E0C01C2B560B97F3]) [    ] o.a.s.c.c.ConnectionManager Client is connected to ZooKeeper
   [junit4]   2> 2376890 INFO  (TEST-CollectionsAPIDistributedZkTest.test-seed#[E0C01C2B560B97F3]) [    ] o.a.s.c.c.SolrZkClient Using default ZkACLProvider
   [junit4]   2> 2376890 INFO  (TEST-CollectionsAPIDistributedZkTest.test-seed#[E0C01C2B560B97F3]) [    ] o.a.s.c.c.SolrZkClient makePath: /collections/collection1
   [junit4]   2> 2376892 INFO  (TEST-CollectionsAPIDistributedZkTest.test-seed#[E0C01C2B560B97F3]) [    ] o.a.s.c.c.SolrZkClient makePath: /collections/collection1/shards
   [junit4]   2> 2376894 INFO  (TEST-CollectionsAPIDistributedZkTest.test-seed#[E0C01C2B560B97F3]) [    ] o.a.s.c.c.SolrZkClient makePath: /collections/control_collection
   [junit4]   2> 2376895 INFO  (TEST-CollectionsAPIDistributedZkTest.test-seed#[E0C01C2B560B97F3]) [    ] o.a.s.c.c.SolrZkClient makePath: /collections/control_collection/shards
   [junit4]   2> 2376897 INFO  (TEST-CollectionsAPIDistributedZkTest.test-seed#[E0C01C2B560B97F3]) [    ] o.a.s.c.AbstractZkTestCase put /x1/jenkins/jenkins-slave/workspace/Lucene-Solr-NightlyTests-5.3/solr/core/src/test-files/solr/collection1/conf/solrconfig-tlog.xml to /configs/conf1/solrconfig.xml
   [junit4]   2> 2376897 INFO  (TEST-CollectionsAPIDistributedZkTest.test-seed#[E0C01C2B560B97F3]) [    ] o.a.s.c.c.SolrZkClient makePath: /configs/conf1/solrconfig.xml
   [junit4]   2> 2376900 INFO  (TEST-CollectionsAPIDistributedZkTest.test-seed#[E0C01C2B560B97F3]) [    ] o.a.s.c.AbstractZkTestCase put /x1/jenkins/jenkins-slave/workspace/Lucene-Solr-NightlyTests-5.3/solr/core/src/test-files/solr/collection1/conf/schema.xml to /configs/conf1/schema.xml
   [junit4]   2> 2376900 INFO  (TEST-CollectionsAPIDistributedZkTest.test-seed#[E0C01C2B560B97F3]) [    ] o.a.s.c.c.SolrZkClient makePath: /configs/conf1/schema.xml
   [junit4]   2> 2376902 INFO  (TEST-CollectionsAPIDistributedZkTest.test-seed#[E0C01C2B560B97F3]) [    ] o.a.s.c.AbstractZkTestCase put /x1/jenkins/jenkins-slave/workspace/Lucene-Solr-NightlyTests-5.3/solr/core/src/test-files/solr/collection1/conf/solrconfig.snippet.randomindexconfig.xml to /configs/conf1/solrconfig.snippet.randomindexconfig.xml
   [junit4]   2> 2376902 INFO  (TEST-CollectionsAPIDistributedZkTest.test-seed#[E0C01C2B560B97F3]) [    ] o.a.s.c.c.SolrZkClient makePath: /configs/conf1/solrconfig.snippet.randomindexconfig.xml
   [junit4]   2> 2376904 INFO  (TEST-CollectionsAPIDistributedZkTest.test-seed#[E0C01C2B560B97F3]) [    ] o.a.s.c.AbstractZkTestCase put /x1/jenkins/jenkins-slave/workspace/Lucene-Solr-NightlyTests-5.3/solr/core/src/test-files/solr/collection1/conf/stopwords.txt to /configs/conf1/stopwords.txt
   [junit4]   2> 2376904 INFO  (TEST-CollectionsAPIDistributedZkTest.test-seed#[E0C01C2B560B97F3]) [    ] o.a.s.c.c.SolrZkClient makePath: /configs/conf1/stopwords.txt
   [junit4]   2> 2376906 INFO  (TEST-CollectionsAPIDistributedZkTest.test-seed#[E0C01C2B560B97F3]) [    ] o.a.s.c.AbstractZkTestCase put /x1/jenkins/jenkins-slave/workspace/Lucene-Solr-NightlyTests-5.3/solr/core/src/test-files/solr/collection1/conf/protwords.txt to /configs/conf1/protwords.txt
   [junit4]   2> 2376906 INFO  (TEST-CollectionsAPIDistributedZkTest.test-seed#[E0C01C2B560B97F3]) [    ] o.a.s.c.c.SolrZkClient makePath: /configs/conf1/protwords.txt
   [junit4]   2> 2376908 INFO  (TEST-CollectionsAPIDistributedZkTest.test-seed#[E0C01C2B560B97F3]) [    ] o.a.s.c.AbstractZkTestCase put /x1/jenkins/jenkins-slave/workspace/Lucene-Solr-NightlyTests-5.3/solr/core/src/test-files/solr/collection1/conf/currency.xml to /configs/conf1/currency.xml
   [junit4]   2> 2376908 INFO  (TEST-CollectionsAPIDistributedZkTest.test-seed#[E0C01C2B560B97F3]) [    ] o.a.s.c.c.SolrZkClient makePath: /configs/conf1/currency.xml
   [junit4]   2> 2376910 INFO  (TEST-CollectionsAPIDistributedZkTest.test-seed#[E0C01C2B560B97F3]) [    ] o.a.s.c.AbstractZkTestCase put /x1/jenkins/jenkins-slave/workspace/Lucene-Solr-NightlyTests-5.3/solr/core/src/test-files/solr/collection1/conf/enumsConfig.xml to /configs/conf1/enumsConfig.xml
   [junit4]   2> 2376910 INFO  (TEST-CollectionsAPIDistributedZkTest.test-seed#[E0C01C2B560B97F3]) [    ] o.a.s.c.c.SolrZkClient makePath: /configs/conf1/enumsConfig.xml
   [junit4]   2> 2376912 INFO  (TEST-CollectionsAPIDistributedZkTest.test-seed#[E0C01C2B560B97F3]) [    ] o.a.s.c.AbstractZkTestCase put /x1/jenkins/jenkins-slave/workspace/Lucene-Solr-NightlyTests-5.3/solr/core/src/test-files/solr/collection1/conf/open-exchange-rates.json to /configs/conf1/open-exchange-rates.json
   [junit4]   2> 2376912 INFO  (TEST-CollectionsAPIDistributedZkTest.test-seed#[E0C01C2B560B97F3]) [    ] o.a.s.c.c.SolrZkClient makePath: /configs/conf1/open-exchange-rates.json
   [junit4]   2> 2376914 INFO  (TEST-CollectionsAPIDistributedZkTest.test-seed#[E0C01C2B560B97F3]) [    ] o.a.s.c.AbstractZkTestCase put /x1/jenkins/jenkins-slave/workspace/Lucene-Solr-NightlyTests-5.3/solr/core/src/test-files/solr/collection1/conf/mapping-ISOLatin1Accent.txt to /configs/conf1/mapping-ISOLatin1Accent.txt
   [junit4]   2> 2376914 INFO  (TEST-CollectionsAPIDistributedZkTest.test-seed#[E0C01C2B560B97F3]) [    ] o.a.s.c.c.SolrZkClient makePath: /configs/conf1/mapping-ISOLatin1Accent.txt
   [junit4]   2> 2376916 INFO  (TEST-CollectionsAPIDistributedZkTest.test-seed#[E0C01C2B560B97F3]) [    ] o.a.s.c.AbstractZkTestCase put /x1/jenkins/jenkins-slave/workspace/Lucene-Solr-NightlyTests-5.3/solr/core/src/test-files/solr/collection1/conf/old_synonyms.txt to /configs/conf1/old_synonyms.txt
   [junit4]   2> 2376916 INFO  (TEST-CollectionsAPIDistributedZkTest.test-seed#[E0C01C2B560B97F3]) [    ] o.a.s.c.c.SolrZkClient makePath: /configs/conf1/old_synonyms.txt
   [junit4]   2> 2376918 INFO  (TEST-CollectionsAPIDistributedZkTest.test-seed#[E0C01C2B560B97F3]) [    ] o.a.s.c.AbstractZkTestCase put /x1/jenkins/jenkins-slave/workspace/Lucene-Solr-NightlyTests-5.3/solr/core/src/test-files/solr/collection1/conf/synonyms.txt to /configs/conf1/synonyms.txt
   [junit4]   2> 2376918 INFO  (TEST-CollectionsAPIDistributedZkTest.test-seed#[E0C01C2B560B97F3]) [    ] o.a.s.c.c.SolrZkClient makePath: /configs/conf1/synonyms.txt
   [junit4]   2> 2377009 INFO  (TEST-CollectionsAPIDistributedZkTest.test-seed#[E0C01C2B560B97F3]) [    ] o.a.s.SolrTestCaseJ4 Writing core.properties file to /x1/jenkins/jenkins-slave/workspace/Lucene-Solr-NightlyTests-5.3/solr/build/solr-core/test/J1/temp/solr.cloud.CollectionsAPIDistributedZkTest_E0C01C2B560B97F3-001/control-001/cores/collection1
   [junit4]   2> 2377010 INFO  (TEST-CollectionsAPIDistributedZkTest.test-seed#[E0C01C2B560B97F3]) [    ] o.e.j.s.Server jetty-9.2.11.v20150529
   [junit4]   2> 2377012 INFO  (TEST-CollectionsAPIDistributedZkTest.test-seed#[E0C01C2B560B97F3]) [    ] o.e.j.s.h.ContextHandler Started o.e.j.s.ServletContextHandler@3696b47c{/,null,AVAILABLE}
   [junit4]   2> 2377013 INFO  (TEST-CollectionsAPIDistributedZkTest.test-seed#[E0C01C2B560B97F3]) [    ] o.e.j.s.ServerConnector Started ServerConnector@2f9a3464{HTTP/1.1}{127.0.0.1:39097}
   [junit4]   2> 2377013 INFO  (TEST-CollectionsAPIDistributedZkTest.test-seed#[E0C01C2B560B97F3]) [    ] o.e.j.s.Server Started @2380092ms
   [junit4]   2> 2377013 INFO  (TEST-CollectionsAPIDistributedZkTest.test-seed#[E0C01C2B560B97F3]) [    ] o.a.s.c.s.e.JettySolrRunner Jetty properties: {hostPort=39097, hostContext=/, solr.data.dir=/x1/jenkins/jenkins-slave/workspace/Lucene-Solr-NightlyTests-5.3/solr/build/solr-core/test/J1/temp/solr.cloud.CollectionsAPIDistributedZkTest_E0C01C2B560B97F3-001/tempDir-001/control/data, coreRootDirectory=/x1/jenkins/jenkins-slave/workspace/Lucene-Solr-NightlyTests-5.3/solr/build/solr-core/test/J1/temp/solr.cloud.CollectionsAPIDistributedZkTest_E0C01C2B560B97F3-001/control-001/cores}
   [junit4]   2> 2377014 INFO  (TEST-CollectionsAPIDistributedZkTest.test-seed#[E0C01C2B560B97F3]) [    ] o.a.s.s.SolrDispatchFilter SolrDispatchFilter.init(): sun.misc.Launcher$AppClassLoader@7b3cb2c6
   [junit4]   2> 2377014 INFO  (TEST-CollectionsAPIDistributedZkTest.test-seed#[E0C01C2B560B97F3]) [    ] o.a.s.c.SolrResourceLoader new SolrResourceLoader for directory: '/x1/jenkins/jenkins-slave/workspace/Lucene-Solr-NightlyTests-5.3/solr/build/solr-core/test/J1/temp/solr.cloud.CollectionsAPIDistributedZkTest_E0C01C2B560B97F3-001/control-001/'
   [junit4]   2> 2377032 INFO  (TEST-CollectionsAPIDistributedZkTest.test-seed#[E0C01C2B560B97F3]) [    ] o.a.s.c.c.SolrZkClient Using default ZkCredentialsProvider
   [junit4]   2> 2377032 INFO  (TEST-CollectionsAPIDistributedZkTest.test-seed#[E0C01C2B560B97F3]) [    ] o.a.s.c.c.ConnectionManager Waiting for client to connect to ZooKeeper
   [junit4]   2> 2377034 INFO  (zkCallback-1704-thread-1) [    ] o.a.s.c.c.ConnectionManager Watcher org.apache.solr.common.cloud.ConnectionManager@46419f69 name:ZooKeeperConnection Watcher:127.0.0.1:42461/solr got event WatchedEvent state:SyncConnected type:None path:null path:null type:None
   [junit4]   2> 2377034 INFO  (TEST-CollectionsAPIDistributedZkTest.test-seed#[E0C01C2B560B97F3]) [    ] o.a.s.c.c.ConnectionManager Client is connected to ZooKeeper
   [junit4]   2> 2377034 INFO  (TEST-CollectionsAPIDistributedZkTest.test-seed#[E0C01C2B560B97F3]) [    ] o.a.s.c.c.SolrZkClient Using default ZkACLProvider
   [junit4]   2> 2377035 INFO  (TEST-CollectionsAPIDistributedZkTest.test-seed#[E0C01C2B560B97F3]) [    ] o.a.s.s.SolrDispatchFilter Loading solr.xml from SolrHome (not found in ZooKeeper)
   [junit4]   2> 2377035 INFO  (TEST-CollectionsAPIDistributedZkTest.test-seed#[E0C01C2B560B97F3]) [    ] o.a.s.c.SolrXmlConfig Loading container configuration from /x1/jenkins/jenkins-slave/workspace/Lucene-Solr-NightlyTests-5.3/solr/build/solr-core/test/J1/temp/solr.cloud.CollectionsAPIDistributedZkTest_E0C01C2B560B97F3-001/control-001/solr.xml
   [junit4]   2> 2377049 INFO  (TEST-CollectionsAPIDistributedZkTest.test-seed#[E0C01C2B560B97F3]) [    ] o.a.s.c.CoresLocator Config-defined core root directory: /x1/jenkins/jenkins-slave/workspace/Lucene-Solr-NightlyTests-5.3/solr/build/solr-core/test/J1/temp/solr.cloud.CollectionsAPIDistributedZkTest_E0C01C2B560B97F3-001/control-001/cores
   [junit4]   2> 2377049 INFO  (TEST-CollectionsAPIDistributedZkTest.test-seed#[E0C01C2B560B97F3]) [    ] o.a.s.c.CoreContainer New CoreContainer 578851007
   [junit4]   2> 2377049 INFO  (TEST-CollectionsAPIDistributedZkTest.test-seed#[E0C01C2B560B97F3]) [    ] o.a.s.c.CoreContainer Loading cores into CoreContainer [instanceDir=/x1/jenkins/jenkins-slave/workspace/Lucene-Solr-NightlyTests-5.3/solr/build/solr-core/test/J1/temp/solr.cloud.CollectionsAPIDistributedZkTest_E0C01C2B560B97F3-001/control-001/]
   [junit4]   2> 2377050 INFO  (TEST-CollectionsAPIDistributedZkTest.test-seed#[E0C01C2B560B97F3]) [    ] o.a.s.c.CoreContainer loading shared library: /x1/jenkins/jenkins-slave/workspace/Lucene-Solr-NightlyTests-5.3/solr/build/solr-core/test/J1/temp/solr.cloud.CollectionsAPIDistributedZkTest_E0C01C2B560B97F3-001/control-001/lib
   [junit4]   2> 2377050 WARN  (TEST-CollectionsAPIDistributedZkTest.test-seed#[E0C01C2B560B97F3]) [    ] o.a.s.c.SolrResourceLoader Can't find (or read) directory to add to classloader: lib (resolved as: /x1/jenkins/jenkins-slave/workspace/Lucene-Solr-NightlyTests-5.3/solr/build/solr-core/test/J1/temp/solr.cloud.CollectionsAPIDistributedZkTest_E0C01C2B560B97F3-001/control-001/lib).
   [junit4]   2> 2377058 INFO  (TEST-CollectionsAPIDistributedZkTest.test-seed#[E0C01C2B560B97F3]) [    ] o.a.s.h.c.HttpShardHandlerFactory created with socketTimeout : 90000,urlScheme : ,connTimeout : 15000,maxConnectionsPerHost : 20,maxConnections : 10000,corePoolSize : 0,maximumPoolSize : 2147483647,maxThreadIdleTime : 5,sizeOfQueue : -1,fairnessPolicy : false,useRetries : false,
   [junit4]   2> 2377059 INFO  (TEST-CollectionsAPIDistributedZkTest.test-seed#[E0C01C2B560B97F3]) [    ] o.a.s.u.UpdateShardHandler Creating UpdateShardHandler HTTP client with params: socketTimeout=340000&connTimeout=45000&retry=true
   [junit4]   2> 2377060 INFO  (TEST-CollectionsAPIDistributedZkTest.test-seed#[E0C01C2B560B97F3]) [    ] o.a.s.l.LogWatcher SLF4J impl is org.slf4j.impl.Log4jLoggerFactory
   [junit4]   2> 2377060 INFO  (TEST-CollectionsAPIDistributedZkTest.test-seed#[E0C01C2B560B97F3]) [    ] o.a.s.l.LogWatcher Registering Log Listener [Log4j (org.slf4j.impl.Log4jLoggerFactory)]
   [junit4]   2> 2377060 INFO  (TEST-CollectionsAPIDistributedZkTest.test-seed#[E0C01C2B560B97F3]) [    ] o.a.s.c.ZkContainer Zookeeper client=127.0.0.1:42461/solr
   [junit4]   2> 2377060 INFO  (TEST-CollectionsAPIDistributedZkTest.test-seed#[E0C01C2B560B97F3]) [    ] o.a.s.c.ZkController zkHost includes chroot
   [junit4]   2> 2377061 INFO  (TEST-CollectionsAPIDistributedZkTest.test-seed#[E0C01C2B560B97F3]) [    ] o.a.s.c.c.SolrZkClient Using default ZkCredentialsProvider
   [junit4]   2> 2377061 INFO  (TEST-CollectionsAPIDistributedZkTest.test-seed#[E0C01C2B560B97F3]) [    ] o.a.s.c.c.ConnectionManager Waiting for client to connect to ZooKeeper
   [junit4]   2> 2377063 INFO  (zkCallback-1706-thread-1) [    ] o.a.s.c.c.ConnectionManager Watcher org.apache.solr.common.cloud.ConnectionManager@68fe52b name:ZooKeeperConnection Watcher:127.0.0.1:42461 got event WatchedEvent state:SyncConnected type:None path:null path:null type:None
   [junit4]   2> 2377063 INFO  (TEST-CollectionsAPIDistributedZkTest.test-seed#[E0C01C2B560B97F3]) [    ] o.a.s.c.c.ConnectionManager Client is connected to ZooKeeper
   [junit4]   2> 2377063 INFO  (TEST-CollectionsAPIDistributedZkTest.test-seed#[E0C01C2B560B97F3]) [    ] o.a.s.c.c.SolrZkClient Using default ZkACLProvider
   [junit4]   2> 2377065 INFO  (TEST-CollectionsAPIDistributedZkTest.test-seed#[E0C01C2B560B97F3]) [n:127.0.0.1:39097_    ] o.a.s.c.c.ConnectionManager Waiting for client to connect to ZooKeeper
   [junit4]   2> 2377066 INFO  (zkCallback-1707-thread-1-processing-n:127.0.0.1:39097_) [n:127.0.0.1:39097_    ] o.a.s.c.c.ConnectionManager Watcher org.apache.solr.common.cloud.ConnectionManager@48e148cb name:ZooKeeperConnection Watcher:127.0.0.1:42461/solr got event WatchedEvent state:SyncConnected type:None path:null path:null type:None
   [junit4]   2> 2377066 INFO  (TEST-CollectionsAPIDistributedZkTest.test-seed#[E0C01C2B560B97F3]) [n:127.0.0.1:39097_    ] o.a.s.c.c.ConnectionManager Client is connected to ZooKeeper
   [junit4]   2> 2377080 INFO  (TEST-CollectionsAPIDistributedZkTest.test-seed#[E0C01C2B560B97F3]) [n:127.0.0.1:39097_    ] o.a.s.c.c.SolrZkClient makePath: /overseer/queue
   [junit4]   2> 2377082 INFO  (TEST-CollectionsAPIDistributedZkTest.test-seed#[E0C01C2B560B97F3]) [n:127.0.0.1:39097_    ] o.a.s.c.c.SolrZkClient makePath: /overseer/collection-queue-work
   [junit4]   2> 2377084 INFO  (TEST-CollectionsAPIDistributedZkTest.test-seed#[E0C01C2B560B97F3]) [n:127.0.0.1:39097_    ] o.a.s.c.c.SolrZkClient makePath: /overseer/collection-map-running
   [junit4]   2> 2377086 INFO  (TEST-CollectionsAPIDistributedZkTest.test-seed#[E0C01C2B560B97F3]) [n:127.0.0.1:39097_    ] o.a.s.c.c.SolrZkClient makePath: /overseer/collection-map-completed
   [junit4]   2> 2377088 INFO  (TEST-CollectionsAPIDistributedZkTest.test-seed#[E0C01C2B560B97F3]) [n:127.0.0.1:39097_    ] o.a.s.c.c.SolrZkClient makePath: /overseer/collection-map-failure
   [junit4]   2> 2377090 INFO  (TEST-CollectionsAPIDistributedZkTest.test-seed#[E0C01C2B560B97F3]) [n:127.0.0.1:39097_    ] o.a.s.c.c.SolrZkClient makePath: /live_nodes
   [junit4]   2> 2377092 INFO  (TEST-CollectionsAPIDistributedZkTest.test-seed#[E0C01C2B560B97F3]) [n:127.0.0.1:39097_    ] o.a.s.c.c.SolrZkClient makePath: /aliases.json
   [junit4]   2> 2377093 INFO  (TEST-CollectionsAPIDistributedZkTest.test-seed#[E0C01C2B560B97F3]) [n:127.0.0.1:39097_    ] o.a.s.c.c.SolrZkClient makePath: /clusterstate.json
   [junit4]   2> 2377094 INFO  (TEST-CollectionsAPIDistributedZkTest.test-seed#[E0C01C2B560B97F3]) [n:127.0.0.1:39097_    ] o.a.s.c.c.SolrZkClient makePath: /security.json
   [junit4]   2> 2377095 INFO  (TEST-CollectionsAPIDistributedZkTest.test-seed#[E0C01C2B560B97F3]) [n:127.0.0.1:39097_    ] o.a.s.c.ZkController Register node as live in ZooKeeper:/live_nodes/127.0.0.1:39097_
   [junit4]   2> 2377096 INFO  (TEST-CollectionsAPIDistributedZkTest.test-seed#[E0C01C2B560B97F3]) [n:127.0.0.1:39097_    ] o.a.s.c.c.SolrZkClient makePath: /live_nodes/127.0.0.1:39097_
   [junit4]   2> 2377097 INFO  (TEST-CollectionsAPIDistributedZkTest.test-seed#[E0C01C2B560B97F3]) [n:127.0.0.1:39097_    ] o.a.s.c.c.SolrZkClient makePath: /overseer_elect
   [junit4]   2> 2377098 INFO  (TEST-CollectionsAPIDistributedZkTest.test-seed#[E0C01C2B560B97F3]) [n:127.0.0.1:39097_    ] o.a.s.c.c.SolrZkClient makePath: /overseer_elect/election
   [junit4]   2> 2377100 INFO  (TEST-CollectionsAPIDistributedZkTest.test-seed#[E0C01C2B560B97F3]) [n:127.0.0.1:39097_    ] o.a.s.c.Overseer Overseer (id=null) closing
   [junit4]   2> 2377100 INFO  (TEST-CollectionsAPIDistributedZkTest.test-seed#[E0C01C2B560B97F3]) [n:127.0.0.1:39097_    ] o.a.s.c.LeaderElector Joined leadership election with path: /overseer_elect/election/95222923427315716-127.0.0.1:39097_-n_0000000000
   [junit4]   2> 2377101 INFO  (TEST-CollectionsAPIDistributedZkTest.test-seed#[E0C01C2B560B97F3]) [n:127.0.0.1:39097_    ] o.a.s.c.OverseerElectionContext I am going to be the leader 127.0.0.1:39097_
   [junit4]   2> 2377101 INFO  (TEST-CollectionsAPIDistributedZkTest.test-seed#[E0C01C2B560B97F3]) [n:127.0.0.1:39097_    ] o.a.s.c.c.SolrZkClient makePath: /overseer_elect/leader
   [junit4]   2> 2377103 INFO  (TEST-CollectionsAPIDistributedZkTest.test-seed#[E0C01C2B560B97F3]) [n:127.0.0.1:39097_    ] o.a.s.c.Overseer Overseer (id=95222923427315716-127.0.0.1:39097_-n_0000000000) starting
   [junit4]   2> 2377104 INFO  (TEST-CollectionsAPIDistributedZkTest.test-seed#[E0C01C2B560B97F3]) [n:127.0.0.1:39097_    ] o.a.s.c.c.SolrZkClient makePath: /overseer/queue-work
   [junit4]   2> 2377110 INFO  (TEST-CollectionsAPIDistributedZkTest.test-seed#[E0C01C2B560B97F3]) [n:127.0.0.1:39097_    ] o.a.s.c.OverseerAutoReplicaFailoverThread Starting OverseerAutoReplicaFailoverThread autoReplicaFailoverWorkLoopDelay=10000 autoReplicaFailoverWaitAfterExpiration=10000 autoReplicaFailoverBadNodeExpiration=60000
   [junit4]   2> 2377111 INFO  (OverseerCollectionProcessor-95222923427315716-127.0.0.1:39097_-n_0000000000) [n:127.0.0.1:39097_    ] o.a.s.c.OverseerCollectionProcessor Process current queue of collection creations
   [junit4]   2> 2377111 INFO  (TEST-CollectionsAPIDistributedZkTest.test-seed#[E0C01C2B560B97F3]) [n:127.0.0.1:39097_    ] o.a.s.c.c.ZkStateReader Updating cluster state from ZooKeeper... 
   [junit4]   2> 2377111 INFO  (OverseerStateUpdate-95222923427315716-127.0.0.1:39097_-n_0000000000) [n:127.0.0.1:39097_    ] o.a.s.c.Overseer Starting to work on the main queue
   [junit4]   2> 2377129 INFO  (TEST-CollectionsAPIDistributedZkTest.test-seed#[E0C01C2B560B97F3]) [n:127.0.0.1:39097_    ] o.a.s.c.CoreContainer Security conf doesn't exist. Skipping setup for authorization module.
   [junit4]   2> 2377129 INFO  (TEST-CollectionsAPIDistributedZkTest.test-seed#[E0C01C2B560B97F3]) [n:127.0.0.1:39097_    ] o.a.s.c.CoreContainer No authentication plugin used.
   [junit4]   2> 2377131 INFO  (TEST-CollectionsAPIDistributedZkTest.test-seed#[E0C01C2B560B97F3]) [n:127.0.0.1:39097_    ] o.a.s.c.CoresLocator Looking for core definitions underneath /x1/jenkins/jenkins-slave/workspace/Lucene-Solr-NightlyTests-5.3/solr/build/solr-core/test/J1/temp/solr.cloud.CollectionsAPIDistributedZkTest_E0C01C2B560B97F3-001/control-001/cores
   [junit4]   2> 2377131 INFO  (TEST-CollectionsAPIDistributedZkTest.test-seed#[E0C01C2B560B97F3]) [n:127.0.0.1:39097_    ] o.a.s.c.SolrCore Created CoreDescriptor: {collection=control_collection, coreNodeName=, configSetProperties=configsetprops.json, transient=false, loadOnStartup=true, name=collection1, config=solrconfig.xml, shard=, instanceDir=/x1/jenkins/jenkins-slave/workspace/Lucene-Solr-NightlyTests-5.3/solr/build/solr-core/test/J1/temp/solr.cloud.CollectionsAPIDistributedZkTest_E0C01C2B560B97F3-001/control-001/cores/collection1, schema=schema.xml, absoluteInstDir=/x1/jenkins/jenkins-slave/workspace/Lucene-Solr-NightlyTests-5.3/solr/build/solr-core/test/J1/temp/solr.cloud.CollectionsAPIDistributedZkTest_E0C01C2B560B97F3-001/control-001/cores/collection1/, dataDir=data/}
   [junit4]   2> 2377132 INFO  (TEST-CollectionsAPIDistributedZkTest.test-seed#[E0C01C2B560B97F3]) [n:127.0.0.1:39097_    ] o.a.s.c.CoresLocator Found core collection1 in /x1/jenkins/jenkins-slave/workspace/Lucene-Solr-NightlyTests-5.3/solr/build/solr-core/test/J1/temp/solr.cloud.CollectionsAPIDistributedZkTest_E0C01C2B560B97F3-001/control-001/cores/collection1/
   [junit4]   2> 2377132 INFO  (TEST-CollectionsAPIDistributedZkTest.test-seed#[E0C01C2B560B97F3]) [n:127.0.0.1:39097_    ] o.a.s.c.CoresLocator Found 1 core definitions
   [junit4]   2> 2377132 INFO  (coreLoadExecutor-2817-thread-1-processing-n:127.0.0.1:39097_) [n:127.0.0.1:39097_ c:control_collection   x:collection1] o.a.s.c.ZkController publishing state=down
   [junit4]   2> 2377133 INFO  (coreLoadExecutor-2817-thread-1-processing-n:127.0.0.1:39097_) [n:127.0.0.1:39097_ c:control_collection   x:collection1] o.a.s.c.ZkController numShards not found on descriptor - reading it from system property
   [junit4]   2> 2377133 INFO  (TEST-CollectionsAPIDistributedZkTest.test-seed#[E0C01C2B560B97F3]) [n:127.0.0.1:39097_    ] o.a.s.s.SolrDispatchFilter user.dir=/x1/jenkins/jenkins-slave/workspace/Lucene-Solr-NightlyTests-5.3/solr/build/solr-core/test/J1
   [junit4]   2> 2377133 INFO  (TEST-CollectionsAPIDistributedZkTest.test-seed#[E0C01C2B560B97F3]) [n:127.0.0.1:39097_    ] o.a.s.s.SolrDispatchFilter SolrDispatchFilter.init() done
   [junit4]   2> 2377133 INFO  (zkCallback-1707-thread-1-processing-n:127.0.0.1:39097_) [n:127.0.0.1:39097_    ] o.a.s.c.DistributedQueue NodeChildrenChanged fired on path /overseer/queue state SyncConnected
   [junit4]   2> 2377133 INFO  (coreLoadExecutor-2817-thread-1-processing-n:127.0.0.1:39097_) [n:127.0.0.1:39097_ c:control_collection   x:collection1] o.a.s.c.ZkController look for our core node name
   [junit4]   2> 2377134 INFO  (OverseerStateUpdate-95222923427315716-127.0.0.1:39097_-n_0000000000) [n:127.0.0.1:39097_    ] o.a.s.c.Overseer processMessage: queueSize: 1, message = {
   [junit4]   2>   "base_url":"http://127.0.0.1:39097",
   [junit4]   2>   "collection":"control_collection",
   [junit4]   2>   "state":"down",
   [junit4]   2>   "shard":null,
   [junit4]   2>   "node_name":"127.0.0.1:39097_",
   [junit4]   2>   "roles":null,
   [junit4]   2>   "numShards":"1",
   [junit4]   2>   "operation":"state",
   [junit4]   2>   "core":"collection1"} current state version: 0
   [junit4]   2> 2377135 INFO  (OverseerStateUpdate-95222923427315716-127.0.0.1:39097_-n_0000000000) [n:127.0.0.1:39097_    ] o.a.s.c.o.ReplicaMutator Update state numShards=1 message={
   [junit4]   2>   "base_url":"http://127.0.0.1:39097",
   [junit4]   2>   "collection":"control_collection",
   [junit4]   2>   "state":"down",
   [junit4]   2>   "shard":null,
   [junit4]   2>   "node_name":"127.0.0.1:39097_",
   [junit4]   2>   "roles":null,
   [junit4]   2>   "numShards":"1",
   [junit4]   2>   "operation":"state",
   [junit4]   2>   "core":"collection1"}
   [junit4]   2> 2377135 INFO  (OverseerStateUpdate-95222923427315716-127.0.0.1:39097_-n_0000000000) [n:127.0.0.1:39097_    ] o.a.s.c.o.ClusterStateMutator building a new cName: control_collection
   [junit4]   2> 2377135 INFO  (OverseerStateUpdate-95222923427315716-127.0.0.1:39097_-n_0000000000) [n:127.0.0.1:39097_    ] o.a.s.c.o.ReplicaMutator Assigning new node to shard shard=shard1
   [junit4]   2> 2377136 INFO  (zkCallback-1707-thread-1-processing-n:127.0.0.1:39097_) [n:127.0.0.1:39097_    ] o.a.s.c.c.ZkStateReader A cluster state change: WatchedEvent state:SyncConnected type:NodeDataChanged path:/clusterstate.json, has occurred - updating... (live nodes size: 1)
   [junit4]   2> 2377137 INFO  (zkCallback-1707-thread-1-processing-n:127.0.0.1:39097_) [n:127.0.0.1:39097_    ] o.a.s.c.c.ZkStateReader Updated cluster state version to 1
   [junit4]   2> 2378134 INFO  (coreLoadExecutor-2817-thread-1-processing-n:127.0.0.1:39097_) [n:127.0.0.1:39097_ c:control_collection   x:collection1] o.a.s.c.ZkController waiting to find shard id in clusterstate for collection1
   [junit4]   2> 2378134 INFO  (coreLoadExecutor-2817-thread-1-processing-n:127.0.0.1:39097_) [n:127.0.0.1:39097_ c:control_collection   x:collection1] o.a.s.c.ZkController Check for collection zkNode:control_collection
   [junit4]   2> 2378135 INFO  (coreLoadExecutor-2817-thread-1-processing-n:127.0.0.1:39097_) [n:127.0.0.1:39097_ c:control_collection   x:collection1] o.a.s.c.ZkController Collection zkNode exists
   [junit4]   2> 2378135 INFO  (coreLoadExecutor-2817-thread-1-processing-n:127.0.0.1:39097_) [n:127.0.0.1:39097_ c:control_collection   x:collection1] o.a.s.c.c.ZkStateReader Load collection config from:/collections/control_collection
   [junit4]   2> 2378136 INFO  (coreLoadExecutor-2817-thread-1-processing-n:127.0.0.1:39097_) [n:127.0.0.1:39097_ c:control_collection   x:collection1] o.a.s.c.c.ZkStateReader path=/collections/control_collection configName=conf1 specified config exists in ZooKeeper
   [junit4]   2> 2378136 INFO  (coreLoadExecutor-2817-thread-1-processing-n:127.0.0.1:39097_) [n:127.0.0.1:39097_ c:control_collection   x:collection1] o.a.s.c.SolrResourceLoader new SolrResourceLoader for directory: '/x1/jenkins/jenkins-slave/workspace/Lucene-Solr-NightlyTests-5.3/solr/build/solr-core/test/J1/temp/solr.cloud.CollectionsAPIDistributedZkTest_E0C01C2B560B97F3-001/control-001/cores/collection1/'
   [junit4]   2> 2378152 INFO  (coreLoadExecutor-2817-thread-1-processing-n:127.0.0.1:39097_) [n:127.0.0.1:39097_ c:control_collection   x:collection1] o.a.s.c.Config loaded config solrconfig.xml with version 0 
   [junit4]   2> 2378158 INFO  (coreLoadExecutor-2817-thread-1-processing-n:127.0.0.1:39097_) [n:127.0.0.1:39097_ c:control_collection   x:collection1] o.a.s.c.SolrConfig current version of requestparams : -1
   [junit4]   2> 2378170 INFO  (coreLoadExecutor-2817-thread-1-processing-n:127.0.0.1:39097_) [n:127.0.0.1:39097_ c:control_collection   x:collection1] o.a.s.c.SolrConfig Using Lucene MatchVersion: 5.3.2
   [junit4]   2> 2378198 INFO  (coreLoadExecutor-2817-thread-1-processing-n:127.0.0.1:39097_) [n:127.0.0.1:39097_ c:control_collection   x:collection1] o.a.s.c.Config Loaded SolrConfig: solrconfig.xml
   [junit4]   2> 2378200 INFO  (coreLoadExecutor-2817-thread-1-processing-n:127.0.0.1:39097_) [n:127.0.0.1:39097_ c:control_collection   x:collection1] o.a.s.s.IndexSchema Reading Solr Schema from /configs/conf1/schema.xml
   [junit4]   2> 2378206 INFO  (coreLoadExecutor-2817-thread-1-processing-n:127.0.0.1:39097_) [n:127.0.0.1:39097_ c:control_collection   x:collection1] o.a.s.s.IndexSchema [collection1] Schema name=test
   [junit4]   2> 2378445 INFO  (coreLoadExecutor-2817-thread-1-processing-n:127.0.0.1:39097_) [n:127.0.0.1:39097_ c:control_collection   x:collection1] o.a.s.s.OpenExchangeRatesOrgProvider Initialized with rates=open-exchange-rates.json, refreshInterval=1440.
   [junit4]   2> 2378454 INFO  (coreLoadExecutor-2817-thread-1-processing-n:127.0.0.1:39097_) [n:127.0.0.1:39097_ c:control_collection   x:collection1] o.a.s.s.IndexSchema default search field in schema is text
   [junit4]   2> 2378455 INFO  (coreLoadExecutor-2817-thread-1-processing-n:127.0.0.1:39097_) [n:127.0.0.1:39097_ c:control_collection   x:collection1] o.a.s.s.IndexSchema unique key field: id
   [junit4]   2> 2378465 INFO  (coreLoadExecutor-2817-thread-1-processing-n:127.0.0.1:39097_) [n:127.0.0.1:39097_ c:control_collection   x:collection1] o.a.s.s.FileExchangeRateProvider Reloading exchange rates from file currency.xml
   [junit4]   2> 2378468 INFO  (coreLoadExecutor-2817-thread-1-processing-n:127.0.0.1:39097_) [n:127.0.0.1:39097_ c:control_collection   x:collection1] o.a.s.s.FileExchangeRateProvider Reloading exchange rates from file currency.xml
   [junit4]   2> 2378471 INFO  (coreLoadExecutor-2817-thread-1-processing-n:127.0.0.1:39097_) [n:127.0.0.1:39097_ c:control_collection   x:collection1] o.a.s.s.OpenExchangeRatesOrgProvider Reloading exchange rates from open-exchange-rates.json
   [junit4]   2> 2378472 WARN  (coreLoadExecutor-2817-thread-1-processing-n:127.0.0.1:39097_) [n:127.0.0.1:39097_ c:control_collection   x:collection1] o.a.s.s.OpenExchangeRatesOrgProvider Unknown key IMPORTANT NOTE
   [junit4]   2> 2378472 WARN  (coreLoadExecutor-2817-thread-1-processing-n:127.0.0.1:39097_) [n:127.0.0.1:39097_ c:control_collection   x:collection1] o.a.s.s.OpenExchangeRatesOrgProvider Expected key, got STRING
   [junit4]   2> 2378472 INFO  (coreLoadExecutor-2817-thread-1-processing-n:127.0.0.1:39097_) [n:127.0.0.1:39097_ c:control_collection   x:collection1] o.a.s.s.OpenExchangeRatesOrgProvider Reloading exchange rates from open-exchange-rates.json
   [junit4]   2> 2378473 WARN  (coreLoadExecutor-2817-thread-1-processing-n:127.0.0.1:39097_) [n:127.0.0.1:39097_ c:control_collection   x:collection1] o.a.s.s.OpenExchangeRatesOrgProvider Unknown key IMPORTANT NOTE
   [junit4]   2> 2378473 WARN  (coreLoadExecutor-2817-thread-1-processing-n:127.0.0.1:39097_) [n:127.0.0.1:39097_ c:control_collection   x:collection1] o.a.s.s.OpenExchangeRatesOrgProvider Expected key, got STRING
   [junit4]   2> 2378474 INFO  (coreLoadExecutor-2817-thread-1-processing-n:127.0.0.1:39097_) [n:127.0.0.1:39097_ c:control_collection   x:collection1] o.a.s.c.ConfigSetProperties Did not find ConfigSet properties, assuming default properties: Can't find resource 'configsetprops.json' in classpath or '/configs/conf1', cwd=/x1/jenkins/jenkins-slave/workspace/Lucene-Solr-NightlyTests-5.3/solr/build/solr-core/test/J1
   [junit4]   2> 2378474 INFO  (coreLoadExecutor-2817-thread-1-processing-n:127.0.0.1:39097_) [n:127.0.0.1:39097_ c:control_collection   x:collection1] o.a.s.c.CoreContainer Creating SolrCore 'collection1' using configuration from collection control_collection
   [junit4]   2> 2378474 INFO  (coreLoadExecutor-2817-thread-1-processing-n:127.0.0.1:39097_) [n:127.0.0.1:39097_ c:control_collection s:shard1 r:core_node1 x:collection1] o.a.s.c.SolrCore org.apache.solr.core.MockDirectoryFactory
   [junit4]   2> 2378474 INFO  (coreLoadExecutor-2817-thread-1-processing-n:127.0.0.1:39097_) [n:127.0.0.1:39097_ c:control_collection s:shard1 r:core_node1 x:collection1] o.a.s.c.SolrCore [[collection1] ] Opening new SolrCore at [/x1/jenkins/jenkins-slave/workspace/Lucene-Solr-NightlyTests-5.3/solr/build/solr-core/test/J1/temp/solr.cloud.CollectionsAPIDistributedZkTest_E0C01C2B560B97F3-001/control-001/cores/collection1/], dataDir=[null]
   [junit4]   2> 2378475 INFO  (coreLoadExecutor-2817-thread-1-processing-n:127.0.0.1:39097_) [n:127.0.0.1:39097_ c:control_collection s:shard1 r:core_node1 x:collection1] o.a.s.c.JmxMonitoredMap JMX monitoring is enabled. Adding Solr mbeans to JMX Server: com.sun.jmx.mbeanserver.JmxMBeanServer@7bf6ad64
   [junit4]   2> 2378475 INFO  (coreLoadExecutor-2817-thread-1-processing-n:127.0.0.1:39097_) [n:127.0.0.1:39097_ c:control_collection s:shard1 r:core_node1 x:collection1] o.a.s.c.CachingDirectoryFactory return new directory for /x1/jenkins/jenkins-slave/workspace/Lucene-Solr-NightlyTests-5.3/solr/build/solr-core/test/J1/temp/solr.cloud.CollectionsAPIDistributedZkTest_E0C01C2B560B97F3-001/control-001/cores/collection1/data
   [junit4]   2> 2378475 INFO  (coreLoadExecutor-2817-thread-1-processing-n:127.0.0.1:39097_) [n:127.0.0.1:39097_ c:control_collection s:shard1 r:core_node1 x:collection1] o.a.s.c.SolrCore New index directory detected: old=null new=/x1/jenkins/jenkins-slave/workspace/Lucene-Solr-NightlyTests-5.3/solr/build/solr-core/test/J1/temp/solr.cloud.CollectionsAPIDistributedZkTest_E0C01C2B560B97F3-001/control-001/cores/collection1/data/index/
   [junit4]   2> 2378475 WARN  (coreLoadExecutor-2817-thread-1-processing-n:127.0.0.1:39097_) [n:127.0.0.1:39097_ c:control_collection s:shard1 r:core_node1 x:collection1] o.a.s.c.SolrCore [collection1] Solr index directory '/x1/jenkins/jenkins-slave/workspace/Lucene-Solr-NightlyTests-5.3/solr/build/solr-core/test/J1/temp/solr.cloud.CollectionsAPIDistributedZkTest_E0C01C2B560B97F3-001/control-001/cores/collection1/data/index' doesn't exist. Creating new index...
   [junit4]   2> 2378476 INFO  (coreLoadExecutor-2817-thread-1-processing-n:127.0.0.1:39097_) [n:127.0.0.1:39097_ c:control_collection s:shard1 r:core_node1 x:collection1] o.a.s.c.CachingDirectoryFactory return new directory for /x1/jenkins/jenkins-slave/workspace/Lucene-Solr-NightlyTests-5.3/solr/build/solr-core/test/J1/temp/solr.cloud.CollectionsAPIDistributedZkTest_E0C01C2B560B97F3-001/control-001/cores/collection1/data/index
   [junit4]   2> 2378476 INFO  (coreLoadExecutor-2817-thread-1-processing-n:127.0.0.1:39097_) [n:127.0.0.1:39097_ c:control_collection s:shard1 r:core_node1 x:collection1] o.a.s.u.RandomMergePolicy RandomMergePolicy wrapping class org.apache.lucene.index.LogByteSizeMergePolicy: [LogByteSizeMergePolicy: minMergeSize=1677721, mergeFactor=36, maxMergeSize=2147483648, maxMergeSizeForForcedMerge=9223372036854775807, calibrateSizeByDeletes=false, maxMergeDocs=2147483647, maxCFSSegmentSizeMB=1.046875, noCFSRatio=0.6679703132246867]
   [junit4]   2> 2378477 INFO  (coreLoadExecutor-2817-thread-1-processing-n:127.0.0.1:39097_) [n:127.0.0.1:39097_ c:control_collection s:shard1 r:core_node1 x:collection1] o.a.s.c.SolrCore SolrDeletionPolicy.onCommit: commits: num=1
   [junit4]   2> 	commit{dir=MockDirectoryWrapper(NRTCachingDirectory(RAMDirectory@24bde722 lockFactory=org.apache.lucene.store.SingleInstanceLockFactory@2f917c06; maxCacheMB=0.212890625 maxMergeSizeMB=0.9638671875)),segFN=segments_1,generation=1}
   [junit4]   2> 2378477 INFO  (coreLoadExecutor-2817-thread-1-processing-n:127.0.0.1:39097_) [n:127.0.0.1:39097_ c:control_collection s:shard1 r:core_node1 x:collection1] o.a.s.c.SolrCore newest commit generation = 1
   [junit4]   2> 2378478 INFO  (OldIndexDirectoryCleanupThreadForCore-collection1) [n:127.0.0.1:39097_ c:control_collection s:shard1 r:core_node1 x:collection1] o.a.s.c.SolrCore Looking for old index directories to cleanup for core collection1 in /x1/jenkins/jenkins-slave/workspace/Lucene-Solr-NightlyTests-5.3/solr/build/solr-core/test/J1/temp/solr.cloud.CollectionsAPIDistributedZkTest_E0C01C2B560B97F3-001/control-001/cores/collection1/data/
   [junit4]   2> 2378478 WARN  (OldIndexDirectoryCleanupThreadForCore-collection1) [n:127.0.0.1:39097_ c:control_collection s:shard1 r:core_node1 x:collection1] o.a.s.c.DirectoryFactory /x1/jenkins/jenkins-slave/workspace/Lucene-Solr-NightlyTests-5.3/solr/build/solr-core/test/J1/temp/solr.cloud.CollectionsAPIDistributedZkTest_E0C01C2B560B97F3-001/control-001/cores/collection1/data/ does not point to a valid data directory; skipping clean-up of old index directories.
   [junit4]   2> 2378482 INFO  (coreLoadExecutor-2817-thread-1-processing-n:127.0.0.1:39097_) [n:127.0.0.1:39097_ c:control_collection s:shard1 r:core_node1 x:collection1] o.a.s.u.p.UpdateRequestProcessorChain creating updateRequestProcessorChain "nodistrib"
   [junit4]   2> 2378482 INFO  (coreLoadExecutor-2817-thread-1-processing-n:127.0.0.1:39097_) [n:127.0.0.1:39097_ c:control_collection s:shard1 r:core_node1 x:collection1] o.a.s.u.p.UpdateRequestProcessorChain creating updateRequestProcessorChain "dedupe"
   [junit4]   2> 2378482 INFO  (coreLoadExecutor-2817-thread-1-processing-n:127.0.0.1:39097_) [n:127.0.0.1:39097_ c:control_collection s:shard1 r:core_node1 x:collection1] o.a.s.u.p.UpdateRequestProcessorChain inserting DistributedUpdateProcessorFactory into updateRequestProcessorChain "dedupe"
   [junit4]   2> 2378482 INFO  (coreLoadExecutor-2817-thread-1-processing-n:127.0.0.1:39097_) [n:127.0.0.1:39097_ c:control_collection s:shard1 r:core_node1 x:collection1] o.a.s.u.p.UpdateRequestProcessorChain creating updateRequestProcessorChain "stored_sig"
   [junit4]   2> 2378482 INFO  (coreLoadExecutor-2817-thread-1-processing-n:127.0.0.1:39097_) [n:127.0.0.1:39097_ c:control_collection s:shard1 r:core_node1 x:collection1] o.a.s.u.p.UpdateRequestProcessorChain inserting DistributedUpdateProcessorFactory into updateRequestProcessorChain "stored_sig"
   [junit4]   2> 2378483 INFO  (coreLoadExecutor-2817-thread-1-processing-n:127.0.0.1:39097_) [n:127.0.0.1:39097_ c:control_collection s:shard1 r:core_node1 x:collection1] o.a.s.u.p.UpdateRequestProcessorChain creating updateRequestProcessorChain "distrib-dup-test-chain-explicit"
   [junit4]   2> 2378483 INFO  (coreLoadExecutor-2817-thread-1-processing-n:127.0.0.1:39097_) [n:127.0.0.1:39097_ c:control_collection s:shard1 r:core_node1 x:collection1] o.a.s.u.p.UpdateRequestProcessorChain creating updateRequestProcessorChain "distrib-dup-test-chain-implicit"
   [junit4]   2> 2378483 INFO  (coreLoadExecutor-2817-thread-1-processing-n:127.0.0.1:39097_) [n:127.0.0.1:39097_ c:control_collection s:shard1 r:core_node1 x:collection1] o.a.s.u.p.UpdateRequestProcessorChain inserting DistributedUpdateProcessorFactory into updateRequestProcessorChain "distrib-dup-test-chain-implicit"
   [junit4]   2> 2378483 INFO  (coreLoadExecutor-2817-thread-1-processing-n:127.0.0.1:39097_) [n:127.0.0.1:39097_ c:control_collection s:shard1 r:core_node1 x:collection1] o.a.s.c.SolrCore no updateRequestProcessorChain defined as default, creating implicit default
   [junit4]   2> 2378486 INFO  (coreLoadExecutor-2817-thread-1-processing-n:127.0.0.1:39097_) [n:127.0.0.1:39097_ c:control_collection s:shard1 r:core_node1 x:collection1] o.a.s.h.l.XMLLoader xsltCacheLifetimeSeconds=60
   [junit4]   2> 2378487 INFO  (coreLoadExecutor-2817-thread-1-processing-n:127.0.0.1:39097_) [n:127.0.0.1:39097_ c:control_collection s:shard1 r:core_node1 x:collection1] o.a.s.h.l.XMLLoader xsltCacheLifetimeSeconds=60
   [junit4]   2> 2378488 INFO  (coreLoadExecutor-2817-thread-1-processing-n:127.0.0.1:39097_) [n:127.0.0.1:39097_ c:control_collection s:shard1 r:core_node1 x:collection1] o.a.s.h.l.XMLLoader xsltCacheLifetimeSeconds=60
   [junit4]   2> 2378490 INFO  (coreLoadExecutor-2817-thread-1-processing-n:127.0.0.1:39097_) [n:127.0.0.1:39097_ c:control_collection s:shard1 r:core_node1 x:collection1] o.a.s.h.l.XMLLoader xsltCacheLifetimeSeconds=60
   [junit4]   2> 2378493 INFO  (coreLoadExecutor-2817-thread-1-processing-n:127.0.0.1:39097_) [n:127.0.0.1:39097_ c:control_collection s:shard1 r:core_node1 x:collection1] o.a.s.c.RequestHandlers Registered paths: /update/json,/admin/properties,/admin/plugins,/admin/logging,/admin/segments,standard,/update/csv,/admin/threads,/update,/admin/system,/admin/mbeans,/config,/admin/file,/get,/admin/luke,/update/json/docs,/admin/ping,/schema,/replication
   [junit4]   2> 2378495 INFO  (coreLoadExecutor-2817-thread-1-processing-n:127.0.0.1:39097_) [n:127.0.0.1:39097_ c:control_collection s:shard1 r:core_node1 x:collection1] o.a.s.c.SolrCore Using default statsCache cache: org.apache.solr.search.stats.LocalStatsCache
   [junit4]   2> 2378495 INFO  (coreLoadExecutor-2817-thread-1-processing-n:127.0.0.1:39097_) [n:127.0.0.1:39097_ c:control_collection s:shard1 r:core_node1 x:collection1] o.a.s.u.UpdateHandler Using UpdateLog implementation: org.apache.solr.update.UpdateLog
   [junit4]   2> 2378495 INFO  (coreLoadExecutor-2817-thread-1-processing-n:127.0.0.1:39097_) [n:127.0.0.1:39097_ c:control_collection s:shard1 r:core_node1 x:collection1] o.a.s.u.UpdateLog Initializing UpdateLog: dataDir= defaultSyncLevel=FLUSH numRecordsToKeep=100 maxNumLogsToKeep=10 numVersionBuckets=65536
   [junit4]   2> 2378496 INFO  (coreLoadExecutor-2817-thread-1-processing-n:127.0.0.1:39097_) [n:127.0.0.1:39097_ c:control_collection s:shard1 r:core_node1 x:collection1] o.a.s.c.SolrCore Hard AutoCommit: disabled
   [junit4]   2> 2378496 INFO  (coreLoadExecutor-2817-thread-1-processing-n:127.0.0.1:39097_) [n:127.0.0.1:39097_ c:control_collection s:shard1 r:core_node1 x:collection1] o.a.s.c.SolrCore Soft AutoCommit: disabled
   [junit4]   2> 2378497 INFO  (coreLoadExecutor-2817-thread-1-processing-n:127.0.0.1:39097_) [n:127.0.0.1:39097_ c:control_collection s:shard1 r:core_node1 x:collection1] o.a.s.u.RandomMergePolicy RandomMergePolicy wrapping class org.apache.lucene.index.TieredMergePolicy: [TieredMergePolicy: maxMergeAtOnce=42, maxMergeAtOnceExplicit=48, maxMergedSegmentMB=15.4521484375, floorSegmentMB=0.6943359375, forceMergeDeletesPctAllowed=24.769266714815988, segmentsPerTier=12.0, maxCFSSegmentSizeMB=8.796093022207999E12, noCFSRatio=0.0
   [junit4]   2> 2378497 INFO  (coreLoadExecutor-2817-thread-1-processing-n:127.0.0.1:39097_) [n:127.0.0.1:39097_ c:control_collection s:shard1 r:core_node1 x:collection1] o.a.s.c.SolrCore SolrDeletionPolicy.onInit: commits: num=1
   [junit4]   2> 	commit{dir=MockDirectoryWrapper(NRTCachingDirectory(RAMDirectory@24bde722 lockFactory=org.apache.lucene.store.SingleInstanceLockFactory@2f917c06; maxCacheMB=0.212890625 maxMergeSizeMB=0.9638671875)),segFN=segments_1,generation=1}
   [junit4]   2> 2378497 INFO  (coreLoadExecutor-2817-thread-1-processing-n:127.0.0.1:39097_) [n:127.0.0.1:39097_ c:control_collection s:shard1 r:core_node1 x:collection1] o.a.s.c.SolrCore newest commit generation = 1
   [junit4]   2> 2378498 INFO  (coreLoadExecutor-2817-thread-1-processing-n:127.0.0.1:39097_) [n:127.0.0.1:39097_ c:control_collection s:shard1 r:core_node1 x:collection1] o.a.s.s.SolrIndexSearcher Opening Searcher@169c605e[collection1] main
   [junit4]   2> 2378498 INFO  (coreLoadExecutor-2817-thread-1-processing-n:127.0.0.1:39097_) [n:127.0.0.1:39097_ c:control_collection s:shard1 r:core_node1 x:collection1] o.a.s.c.c.ZkStateReader Load collection config from:/collections/control_collection
   [junit4]   2> 2378499 INFO  (coreLoadExecutor-2817-thread-1-processing-n:127.0.0.1:39097_) [n:127.0.0.1:39097_ c:control_collection s:shard1 r:core_node1 x:collection1] o.a.s.c.c.ZkStateReader path=/collections/control_collection configName=conf1 specified config exists in ZooKeeper
   [junit4]   2> 2378499 INFO  (coreLoadExecutor-2817-thread-1-processing-n:127.0.0.1:39097_) [n:127.0.0.1:39097_ c:control_collection s:shard1 r:core_node1 x:collection1] o.a.s.r.ManagedResourceStorage Setting up ZooKeeper-based storage for the RestManager with znodeBase: /configs/conf1
   [junit4]   2> 2378499 INFO  (coreLoadExecutor-2817-thread-1-processing-n:127.0.0.1:39097_) [n:127.0.0.1:39097_ c:control_collection s:shard1 r:core_node1 x:collection1] o.a.s.r.ManagedResourceStorage Configured ZooKeeperStorageIO with znodeBase: /configs/conf1
   [junit4]   2> 2378500 INFO  (coreLoadExecutor-2817-thread-1-processing-n:127.0.0.1:39097_) [n:127.0.0.1:39097_ c:control_collection s:shard1 r:core_node1 x:collection1] o.a.s.r.RestManager Initializing RestManager with initArgs: {}
   [junit4]   2> 2378500 INFO  (coreLoadExecutor-2817-thread-1-processing-n:127.0.0.1:39097_) [n:127.0.0.1:39097_ c:control_collection s:shard1 r:core_node1 x:collection1] o.a.s.r.ManagedResourceStorage Reading _rest_managed.json using ZooKeeperStorageIO:path=/configs/conf1
   [junit4]   2> 2378500 INFO  (coreLoadExecutor-2817-thread-1-processing-n:127.0.0.1:39097_) [n:127.0.0.1:39097_ c:control_collection s:shard1 r:core_node1 x:collection1] o.a.s.r.ManagedResourceStorage No data found for znode /configs/conf1/_rest_managed.json
   [junit4]   2> 2378500 INFO  (coreLoadExecutor-2817-thread-1-processing-n:127.0.0.1:39097_) [n:127.0.0.1:39097_ c:control_collection s:shard1 r:core_node1 x:collection1] o.a.s.r.ManagedResourceStorage Loaded null at path _rest_managed.json using ZooKeeperStorageIO:path=/configs/conf1
   [junit4]   2> 2378501 INFO  (coreLoadExecutor-2817-thread-1-processing-n:127.0.0.1:39097_) [n:127.0.0.1:39097_ c:control_collection s:shard1 r:core_node1 x:collection1] o.a.s.r.RestManager Initializing 0 registered ManagedResources
   [junit4]   2> 2378501 INFO  (coreLoadExecutor-2817-thread-1-processing-n:127.0.0.1:39097_) [n:127.0.0.1:39097_ c:control_collection s:shard1 r:core_node1 x:collection1] o.a.s.h.ReplicationHandler Commits will be reserved for  10000
   [junit4]   2> 2378501 INFO  (searcherExecutor-2818-thread-1-processing-c:control_collection n:127.0.0.1:39097_ s:shard1 r:core_node1 x:collection1) [n:127.0.0.1:39097_ c:control_collection s:shard1 r:core_node1 x:collection1] o.a.s.c.SolrCore [collection1] Registered new searcher Searcher@169c605e[collection1] main{ExitableDirectoryReader(UninvertingDirectoryReader())}
   [junit4]   2> 2378502 INFO  (coreLoadExecutor-2817-thread-1-processing-n:127.0.0.1:39097_) [n:127.0.0.1:39097_ c:control_collection s:shard1 r:core_node1 x:collection1] o.a.s.u.UpdateLog Looking up max value of version field to seed version buckets
   [junit4]   2> 2378502 INFO  (coreLoadExecutor-2817-thread-1-processing-n:127.0.0.1:39097_) [n:127.0.0.1:39097_ c:control_collection s:shard1 r:core_node1 x:collection1] o.a.s.u.VersionInfo Refreshing highest value of _version_ for 65536 version buckets from index
   [junit4]   2> 2378502 INFO  (coreLoadExecutor-2817-thread-1-processing-n:127.0.0.1:39097_) [n:127.0.0.1:39097_ c:control_collection s:shard1 r:core_node1 x:collection1] o.a.s.u.VersionInfo No terms found for _version_, cannot seed version bucket highest value from index
   [junit4]   2> 2378502 INFO  (coreLoadExecutor-2817-thread-1-processing-n:127.0.0.1:39097_) [n:127.0.0.1:39097_ c:control_collection s:shard1 r:core_node1 x:collection1] o.a.s.u.UpdateLog Could not find max version in index or recent updates, using new clock 1523566776640602112
   [junit4]   2> 2378504 INFO  (coreLoadExecutor-2817-thread-1-processing-n:127.0.0.1:39097_) [n:127.0.0.1:39097_ c:control_collection s:shard1 r:core_node1 x:collection1] o.a.s.u.UpdateLog Took 2 ms to seed version buckets with highest version 1523566776640602112
   [junit4]   2> 2378504 INFO  (coreLoadExecutor-2817-thread-1-processing-n:127.0.0.1:39097_) [n:127.0.0.1:39097_ c:control_collection s:shard1 r:core_node1 x:collection1] o.a.s.c.ZkController watch zkdir /configs/conf1
   [junit4]   2> 2378505 INFO  (coreLoadExecutor-2817-thread-1-processing-n:127.0.0.1:39097_) [n:127.0.0.1:39097_ c:control_collection s:shard1 r:core_node1 x:collection1] o.a.s.c.CoreContainer registering core: collection1
   [junit4]   2> 2378505 INFO  (coreZkRegister-2811-thread-1-processing-c:control_collection n:127.0.0.1:39097_ s:shard1 r:core_node1 x:collection1) [n:127.0.0.1:39097_ c:control_collection s:shard1 r:core_node1 x:collection1] o.a.s.c.ZkController Register replica - core:collection1 address:http://127.0.0.1:39097 collection:control_collection shard:shard1
   [junit4]   2> 2378506 INFO  (coreZkRegister-2811-thread-1-processing-c:control_collection n:127.0.0.1:39097_ s:shard1 r:core_node1 x:collection1) [n:127.0.0.1:39097_ c:control_collection s:shard1 r:core_node1 x:collection1] o.a.s.c.c.SolrZkClient makePath: /collections/control_collection/leader_elect/shard1/election
   [junit4]   2> 2378510 INFO  (coreZkRegister-2811-thread-1-processing-c:control_collection n:127.0.0.1:39097_ s:shard1 r:core_node1 x:collection1) [n:127.0.0.1:39097_ c:control_collection s:shard1 r:core_node1 x:collection1] o.a.s.c.LeaderElector Joined leadership election with path: /collections/control_collection/leader_elect/shard1/election/95222923427315716-core_node1-n_0000000000
   [junit4]   2> 2378512 INFO  (coreZkRegister-2811-thread-1-processing-c:control_collection n:127.0.0.1:39097_ s:shard1 r:core_node1 x:collection1) [n:127.0.0.1:39097_ c:control_collection s:shard1 r:core_node1 x:collection1] o.a.s.c.ShardLeaderElectionContext Running the leader process for shard shard1
   [junit4]   2> 2378513 INFO  (zkCallback-1707-thread-1-processing-n:127.0.0.1:39097_) [n:127.0.0.1:39097_    ] o.a.s.c.DistributedQueue NodeChildrenChanged fired on path /overseer/queue state SyncConnected
   [junit4]   2> 2378513 INFO  (coreZkRegister-2811-thread-1-processing-c:control_collection n:127.0.0.1:39097_ s:shard1 r:core_node1 x:collection1) [n:127.0.0.1:39097_ c:control_collection s:shard1 r:core_node1 x:collection1] o.a.s.c.ShardLeaderElectionContext Enough replicas found to continue.
   [junit4]   2> 2378514 INFO  (coreZkRegister-2811-thread-1-processing-c:control_collection n:127.0.0.1:39097_ s:shard1 r:core_node1 x:collection1) [n:127.0.0.1:39097_ c:control_collection s:shard1 r:core_node1 x:collection1] o.a.s.c.ShardLeaderElectionContext I may be the new leader - try and sync
   [junit4]   2> 2378514 INFO  (OverseerStateUpdate-95222923427315716-127.0.0.1:39097_-n_0000000000) [n:127.0.0.1:39097_    ] o.a.s.c.Overseer processMessage: queueSize: 1, message = {
   [junit4]   2>   "operation":"leader",
   [junit4]   2>   "shard":"shard1",
   [junit4]   2>   "collection":"control_collection"} current state version: 1
   [junit4]   2> 2378514 INFO  (coreZkRegister-2811-thread-1-processing-c:control_collection n:127.0.0.1:39097_ s:shard1 r:core_node1 x:collection1) [n:127.0.0.1:39097_ c:control_collection s:shard1 r:core_node1 x:collection1] o.a.s.c.SyncStrategy Sync replicas to http://127.0.0.1:39097/collection1/
   [junit4]   2> 2378514 INFO  (coreZkRegister-2811-thread-1-processing-c:control_collection n:127.0.0.1:39097_ s:shard1 r:core_node1 x:collection1) [n:127.0.0.1:39097_ c:control_collection s:shard1 r:core_node1 x:collection1] o.a.s.c.SyncStrategy Sync Success - now sync replicas to me
   [junit4]   2> 2378514 INFO  (coreZkRegister-2811-thread-1-processing-c:control_collection n:127.0.0.1:39097_ s:shard1 r:core_node1 x:collection1) [n:127.0.0.1:39097_ c:control_collection s:shard1 r:core_node1 x:collection1] o.a.s.c.SyncStrategy http://127.0.0.1:39097/collection1/ has no replicas
   [junit4]   2> 2378514 INFO  (coreZkRegister-2811-thread-1-processing-c:control_collection n:127.0.0.1:39097_ s:shard1 r:core_node1 x:collection1) [n:127.0.0.1:39097_ c:control_collection s:shard1 r:core_node1 x:collection1] o.a.s.c.ShardLeaderElectionContext I am the new leader: http://127.0.0.1:39097/collection1/ shard1
   [junit4]   2> 2378515 INFO  (coreZkRegister-2811-thread-1-processing-c:control_collection n:127.0.0.1:39097_ s:shard1 r:core_node1 x:collection1) [n:127.0.0.1:39097_ c:control_collection s:shard1 r:core_node1 x:collection1] o.a.s.c.c.SolrZkClient makePath: /collections/control_collection/leaders/shard1
   [junit4]   2> 2378518 INFO  (zkCallback-1707-thread-1-processing-n:127.0.0.1:39097_) [n:127.0.0.1:39097_    ] o.a.s.c.DistributedQueue NodeChildrenChanged fired on path /overseer/queue state SyncConnected
   [junit4]   2> 2378519 INFO  (OverseerStateUpdate-95222923427315716-127.0.0.1:39097_-n_0000000000) [n:127.0.0.1:39097_    ] o.a.s.c.Overseer processMessage: queueSize: 1, message = {
   [junit4]   2>   "operation":"leader",
   [junit4]   2>   "shard":"shard1",
   [junit4]   2>   "collection":"control_collection",
   [junit4]   2>   "base_url":"http://127.0.0.1:39097",
   [junit4]   2>   "core":"collection1",
   [junit4]   2>   "state":"active"} current state version: 1
   [junit4]   2> 2378622 INFO  (zkCallback-1707-thread-1-processing-n:127.0.0.1:39097_) [n:127.0.0.1:39097_    ] o.a.s.c.c.ZkStateReader A cluster state change: WatchedEvent state:SyncConnected type:NodeDataChanged path:/clusterstate.json, has occurred - updating... (live nodes size: 1)
   [junit4]   2> 2378624 INFO  (zkCallback-1707-thread-1-processing-n:127.0.0.1:39097_) [n:127.0.0.1:39097_    ] o.a.s.c.c.ZkStateReader Updated cluster state version to 2
   [junit4]   2> 2378635 INFO  (TEST-CollectionsAPIDistributedZkTest.test-seed#[E0C01C2B560B97F3]) [    ] o.a.s.c.c.SolrZkClient Using default ZkCredentialsProvider
   [junit4]   2> 2378635 INFO  (TEST-CollectionsAPIDistributedZkTest.test-seed#[E0C01C2B560B97F3]) [    ] o.a.s.c.c.ConnectionManager Waiting for client to connect to ZooKeeper
   [junit4]   2> 2378637 INFO  (zkCallback-1709-thread-1) [    ] o.a.s.c.c.ConnectionManager Watcher org.apache.solr.common.cloud.ConnectionManager@1b497cc8 name:ZooKeeperConnection Watcher:127.0.0.1:42461/solr got event WatchedEvent state:SyncConnected type:None path:null path:null type:None
   [junit4]   2> 2378637 INFO  (TEST-CollectionsAPIDistributedZkTest.test-seed#[E0C01C2B560B97F3]) [    ] o.a.s.c.c.ConnectionManager Client is connected to ZooKeeper
   [junit4]   2> 2378637 INFO  (TEST-CollectionsAPIDistributedZkTest.test-seed#[E0C01C2B560B97F3]) [    ] o.a.s.c.c.SolrZkClient Using default ZkACLProvider
   [junit4]   2> 2378637 INFO  (TEST-CollectionsAPIDistributedZkTest.test-seed#[E0C01C2B560B97F3]) [    ] o.a.s.c.c.ZkStateReader Updating cluster state from ZooKeeper... 
   [junit4]   2> 2378640 INFO  (TEST-CollectionsAPIDistributedZkTest.test-seed#[E0C01C2B560B97F3]) [    ] o.a.s.c.ChaosMonkey monkey: init - expire sessions:false cause connection loss:false
   [junit4]   2> 2378640 INFO  (TEST-CollectionsAPIDistributedZkTest.test-seed#[E0C01C2B560B97F3]) [    ] o.a.s.c.AbstractFullDistribZkTestBase Creating collection1 with stateFormat=2
   [junit4]   2> 2378640 INFO  (TEST-CollectionsAPIDistributedZkTest.test-seed#[E0C01C2B560B97F3]) [    ] o.a.s.c.c.SolrZkClient Using default ZkCredentialsProvider
   [junit4]   2> 2378641 INFO  (TEST-CollectionsAPIDistributedZkTest.test-seed#[E0C01C2B560B97F3]) [    ] o.a.s.c.c.ConnectionManager Waiting for client to connect to ZooKeeper
   [junit4]   2> 2378642 INFO  (zkCallback-1710-thread-1) [    ] o.a.s.c.c.ConnectionManager Watcher org.apache.solr.common.cloud.ConnectionManager@2dccca43 name:ZooKeeperConnection Watcher:127.0.0.1:42461/solr got event WatchedEvent state:SyncConnected type:None path:null path:null type:None
   [junit4]   2> 2378642 INFO  (TEST-CollectionsAPIDistributedZkTest.test-seed#[E0C01C2B560B97F3]) [    ] o.a.s.c.c.ConnectionManager Client is connected to ZooKeeper
   [junit4]   2> 2378642 INFO  (TEST-CollectionsAPIDistributedZkTest.test-seed#[E0C01C2B560B97F3]) [    ] o.a.s.c.c.SolrZkClient Using default ZkACLProvider
   [junit4]   2> 2378644 INFO  (zkCallback-1707-thread-1-processing-n:127.0.0.1:39097_) [n:127.0.0.1:39097_    ] o.a.s.c.DistributedQueue NodeChildrenChanged fired on path /overseer/queue state SyncConnected
   [junit4]   2> 2378645 INFO  (OverseerStateUpdate-95222923427315716-127.0.0.1:39097_-n_0000000000) [n:127.0.0.1:39097_    ] o.a.s.c.Overseer processMessage: queueSize: 1, message = {
   [junit4]   2>   "operation":"create",
   [junit4]   2>   "name":"collection1",
   [junit4]   2>   "numShards":"2",
   [junit4]   2>   "stateFormat":"2"} current state version: 2
   [junit4]   2> 2378645 INFO  (OverseerStateUpdate-95222923427315716-127.0.0.1:39097_-n_0000000000) [n:127.0.0.1:39097_    ] o.a.s.c.o.ClusterStateMutator building a new cName: collection1
   [junit4]   2> 2378669 INFO  (coreZkRegister-2811-thread-1-processing-c:control_collection n:127.0.0.1:39097_ s:shard1 r:core_node1 x:collection1) [n:127.0.0.1:39097_ c:control_collection s:shard1 r:core_node1 x:collection1] o.a.s.c.ZkController We are http://127.0.0.1:39097/collection1/ and leader is http://127.0.0.1:39097/collection1/
   [junit4]   2> 2378669 INFO  (coreZkRegister-2811-thread-1-processing-c:control_collection n:127.0.0.1:39097_ s:shard1 r:core_node1 x:collection1) [n:127.0.0.1:39097_ c:control_collection s:shard1 r:core_node1 x:collection1] o.a.s.c.ZkController No LogReplay needed for core=collection1 baseURL=http://127.0.0.1:39097
   [junit4]   2> 2378669 INFO  (coreZkRegister-2811-thread-1-processing-c:control_collection n:127.0.0.1:39097_ s:shard1 r:core_node1 x:collection1) [n:127.0.0.1:39097_ c:control_collection s:shard1 r:core_node1 x:collection1] o.a.s.c.ZkController I am the leader, no recovery necessary
   [junit4]   2> 2378670 INFO  (coreZkRegister-2811-thread-1-processing-c:control_collection n:127.0.0.1:39097_ s:shard1 r:core_node1 x:collection1) [n:127.0.0.1:39097_ c:control_collection s:shard1 r:core_node1 x:collection1] o.a.s.c.ZkController publishing state=active
   [junit4]   2> 2378670 INFO  (coreZkRegister-2811-thread-1-processing-c:control_collection n:127.0.0.1:39097_ s:shard1 r:core_node1 x:collection1) [n:127.0.0.1:39097_ c:control_collection s:shard1 r:core_node1 x:collection1] o.a.s.c.ZkController numShards not found on descriptor - reading it from system property
   [junit4]   2> 2378671 INFO  (zkCallback-1707-thread-1-processing-n:127.0.0.1:39097_) [n:127.0.0.1:39097_    ] o.a.s.c.DistributedQueue NodeChildrenChanged fired on path /overseer/queue state SyncConnected
   [junit4]   2> 2378672 INFO  (OverseerStateUpdate-95222923427315716-127.0.0.1:39097_-n_0000000000) [n:127.0.0.1:39097_    ] o.a.s.c.Overseer processMessage: queueSize: 1, message = {
   [junit4]   2>   "base_url":"http://127.0.0.1:39097",
   [junit4]   2>   "collection":"control_collection",
   [junit4]   2>   "state":"active",
   [junit4]   2>   "shard":"shard1",
   [junit4]   2>   "node_name":"127.0.0.1:39097_",
   [junit4]   2>   "roles":null,
   [junit4]   2>   "core_node_name":"core_node1",
   [junit4]   2>   "numShards":"2",
   [junit4]   2>   "operation":"state",
   [junit4]   2>   "core":"collection1"} current state version: 2
   [junit4]   2> 2378672 INFO  (OverseerStateUpdate-95222923427315716-127.0.0.1:39097_-n_0000000000) [n:127.0.0.1:39097_    ] o.a.s.c.o.ReplicaMutator Update state numShards=2 message={
   [junit4]   2>   "base_url":"http://127.0.0.1:39097",
   [junit4]   2>   "collection":"control_collection",
   [junit4]   2>   "state":"active",
   [junit4]   2>   "shard":"shard1",
   [junit4]   2>   "node_name":"127.0.0.1:39097_",
   [junit4]   2>   "roles":null,
   [junit4]   2>   "core_node_name":"core_node1",
   [junit4]   2>   "numShards":"2",
   [junit4]   2>   "operation":"state",
   [junit4]   2>   "core":"collection1"}
   [junit4]   2> 2378673 INFO  (OverseerStateUpdate-95222923427315716-127.0.0.1:39097_-n_0000000000) [n:127.0.0.1:39097_    ] o.a.s.c.o.ZkStateWriter going to create_collection /collections/collection1/state.json
   [junit4]   2> 2378674 INFO  (zkCallback-1709-thread-1) [    ] o.a.s.c.c.ZkStateReader A cluster state change: WatchedEvent state:SyncConnected type:NodeDataChanged path:/clusterstate.json, has occurred - updating... (live nodes size: 1)
   [junit4]   2> 2378674 INFO  (zkCallback-1707-thread-1-processing-n:127.0.0.1:39097_) [n:127.0.0.1:39097_    ] o.a.s.c.c.ZkStateReader A cluster state change: WatchedEvent state:SyncConnected type:NodeDataChanged path:/clusterstate.json, has occurred - updating... (live nodes size: 1)
   [junit4]   2> 2378676 INFO  (zkCallback-1709-thread-1) [    ] o.a.s.c.c.ZkStateReader Updated cluster state version to 3
   [junit4]   2> 2378677 INFO  (zkCallback-1707-thread-1-processing-n:127.0.0.1:39097_) [n:127.0.0.1:39097_    ] o.a.s.c.c.ZkStateReader Updated cluster state version to 3
   [junit4]   2> 2378733 INFO  (TEST-CollectionsAPIDistributedZkTest.test-seed#[E0C01C2B560B97F3]) [    ] o.a.s.SolrTestCaseJ4 Writing core.properties file to /x1/jenkins/jenkins-slave/workspace/Lucene-Solr-NightlyTests-5.3/solr/build/solr-core/test/J1/temp/solr.cloud.CollectionsAPIDistributedZkTest_E0C01C2B560B97F3-001/shard-1-001/cores/collection1
   [junit4]   2> 2378733 INFO  (TEST-CollectionsAPIDistributedZkTest.test-seed#[E0C01C2B560B97F3]) [    ] o.a.s.c.AbstractFullDistribZkTestBase create jetty 1 in directory /x1/jenkins/jenkins-slave/workspace/Lucene-Solr-NightlyTests-5.3/solr/build/solr-core/test/J1/temp/solr.cloud.CollectionsAPIDistributedZkTest_E0C01C2B560B97F3-001/shard-1-001
   [junit4]   2> 2378734 INFO  (TEST-CollectionsAPIDistributedZkTest.test-seed#[E0C01C2B560B97F3]) [    ] o.e.j.s.Server jetty-9.2.11.v20150529
   [junit4]   2> 2378736 INFO  (TEST-CollectionsAPIDistributedZkTest.test-seed#[E0C01C2B560B97F3]) [    ] o.e.j.s.h.ContextHandler Started o.e.j.s.ServletContextHandler@284004a5{/,null,AVAILABLE}
   [junit4]   2> 2378737 INFO  (TEST-CollectionsAPIDistributedZkTest.test-seed#[E0C01C2B560B97F3]) [    ] o.e.j.s.ServerConnector Started ServerConnector@1c8b1f7a{HTTP/1.1}{127.0.0.1:47477}
   [junit4]   2> 2378737 INFO  (TEST-CollectionsAPIDistributedZkTest.test-seed#[E0C01C2B560B97F3]) [    ] o.e.j.s.Server Started @2381816ms
   [junit4]   2> 2378737 INFO  (TEST-CollectionsAPIDistributedZkTest.test-seed#[E0C01C2B560B97F3]) [    ] o.a.s.c.s.e.JettySolrRunner Jetty properties: {hostContext=/, hostPort=47477, coreRootDirectory=/x1/jenkins/jenkins-slave/workspace/Lucene-Solr-NightlyTests-5.3/solr/build/solr-core/test/J1/temp/solr.cloud.CollectionsAPIDistributedZkTest_E0C01C2B560B97F3-001/shard-1-001/cores, solr.data.dir=/x1/jenkins/jenkins-slave/workspace/Lucene-Solr-NightlyTests-5.3/solr/build/solr-core/test/J1/temp/solr.cloud.CollectionsAPIDistributedZkTest_E0C01C2B560B97F3-001/tempDir-001/jetty1, solrconfig=solrconfig.xml}
   [junit4]   2> 2378737 INFO  (TEST-CollectionsAPIDistributedZkTest.test-seed#[E0C01C2B560B97F3]) [    ] o.a.s.s.SolrDispatchFilter SolrDispatchFilter.init(): sun.misc.Launcher$AppClassLoader@7b3cb2c6
   [junit4]   2> 2378737 INFO  (TEST-CollectionsAPIDistributedZkTest.test-seed#[E0C01C2B560B97F3]) [    ] o.a.s.c.SolrResourceLoader new SolrResourceLoader for directory: '/x1/jenkins/jenkins-slave/workspace/Lucene-Solr-NightlyTests-5.3/solr/build/solr-core/test/J1/temp/solr.cloud.CollectionsAPIDistributedZkTest_E0C01C2B560B97F3-001/shard-1-001/'
   [junit4]   2> 2378755 INFO  (TEST-CollectionsAPIDistributedZkTest.test-seed#[E0C01C2B560B97F3]) [    ] o.a.s.c.c.SolrZkClient Using default ZkCredentialsProvider
   [junit4]   2> 2378756 INFO  (TEST-CollectionsAPIDistributedZkTest.test-seed#[E0C01C2B560B97F3]) [    ] o.a.s.c.c.ConnectionManager Waiting for client to connect to ZooKeeper
   [junit4]   2> 2378757 INFO  (zkCallback-1711-thread-1) [    ] o.a.s.c.c.ConnectionManager Watcher org.apache.solr.common.cloud.ConnectionManager@16a2c909 name:ZooKeeperConnection Watcher:127.0.0.1:42461/solr got event WatchedEvent state:SyncConnected type:None path:null path:null type:None
   [junit4]   2> 2378757 INFO  (TEST-CollectionsAPIDistributedZkTest.test-seed#[E0C01C2B560B97F3]) [    ] o.a.s.c.c.ConnectionManager Client is connected to ZooKeeper
   [junit4]   2> 2378758 INFO  (TEST-CollectionsAPIDistributedZkTest.test-seed#[E0C01C2B560B97F3]) [    ] o.a.s.c.c.SolrZkClient Using default ZkACLProvider
   [junit4]   2> 2378759 INFO  (TEST-CollectionsAPIDistributedZkTest.test-seed#[E0C01C2B560B97F3]) [    ] o.a.s.s.SolrDispatchFilter Loading solr.xml from SolrHome (not found in ZooKeeper)
   [junit4]   2> 2378759 INFO  (TEST-CollectionsAPIDistributedZkTest.test-seed#[E0C01C2B560B97F3]) [    ] o.a.s.c.SolrXmlConfig Loading container configuration from /x1/jenkins/jenkins-slave/workspace/Lucene-Solr-NightlyTests-5.3/solr/build/solr-core/test/J1/temp/solr.cloud.CollectionsAPIDistributedZkTest_E0C01C2B560B97F3-001/shard-1-001/solr.xml
   [junit4]   2> 2378774 INFO  (TEST-CollectionsAPIDistributedZkTest.test-seed#[E0C01C2B560B97F3]) [    ] o.a.s.c.CoresLocator Config-defined core root directory: /x1/jenkins/jenkins-slave/workspace/Lucene-Solr-NightlyTests-5.3/solr/build/solr-core/test/J1/temp/solr.cloud.CollectionsAPIDistributedZkTest_E0C01C2B560B97F3-001/shard-1-001/cores
   [junit4]   2> 2378774 INFO  (TEST-CollectionsAPIDistributedZkTest.test-seed#[E0C01C2B560B97F3]) [    ] o.a.s.c.CoreContainer New CoreContainer 1766376451
   [junit4]   2> 2378774 INFO  (TEST-CollectionsAPIDistributedZkTest.test-seed#[E0C01C2B560B97F3]) [    ] o.a.s.c.CoreContainer Loading cores into CoreContainer [instanceDir=/x1/jenkins/jenkins-slave/workspace/Lucene-Solr-NightlyTests-5.3/solr/build/solr-core/test/J1/temp/solr.cloud.CollectionsAPIDistributedZkTest_E0C01C2B560B97F3-001/shard-1-001/]
   [junit4]   2> 2378774 INFO  (TEST-CollectionsAPIDistributedZkTest.test-seed#[E0C01C2B560B97F3]) [    ] o.a.s.c.CoreContainer loading shared library: /x1/jenkins/jenkins-slave/workspace/Lucene-Solr-NightlyTests-5.3/solr/build/solr-core/test/J1/temp/solr.cloud.CollectionsAPIDistributedZkTest_E0C01C2B560B97F3-001/shard-1-001/lib
   [junit4]   2> 2378775 WARN  (TEST-CollectionsAPIDistributedZkTest.test-seed#[E0C01C2B560B97F3]) [    ] o.a.s.c.SolrResourceLoader Can't find (or read) directory to add to classloader: lib (resolved as: /x1/jenkins/jenkins-slave/workspace/Lucene-Solr-NightlyTests-5.3/solr/build/solr-core/test/J1/temp/solr.cloud.CollectionsAPIDistributedZkTest_E0C01C2B560B97F3-001/shard-1-001/lib).
   [junit4]   2> 2378779 INFO  (zkCallback-1709-thread-1) [    ] o.a.s.c.c.ZkStateReader A cluster state change: WatchedEvent state:SyncConnected type:NodeDataChanged path:/clusterstate.json, has occurred - updating... (live nodes size: 1)
   [junit4]   2> 2378779 INFO  (zkCallback-1707-thread-1-processing-n:127.0.0.1:39097_) [n:127.0.0.1:39097_    ] o.a.s.c.c.ZkStateReader A cluster state change: WatchedEvent state:SyncConnected type:NodeDataChanged path:/clusterstate.json, has occurred - updating... (live nodes size: 1)
   [junit4]   2> 2378781 INFO  (zkCallback-1709-thread-1) [    ] o.a.s.c.c.ZkStateReader Updated cluster state version to 4
   [junit4]   2> 2378782 INFO  (zkCallback-1707-thread-1-processing-n:127.0.0.1:39097_) [n:127.0.0.1:39097_    ] o.a.s.c.c.ZkStateReader Updated cluster state version to 4
   [junit4]   2> 2378783 INFO  (TEST-CollectionsAPIDistributedZkTest.test-seed#[E0C01C2B560B97F3]) [    ] o.a.s.h.c.HttpShardHandlerFactory created with socketTimeout : 90000,urlScheme : ,connTimeout : 15000,maxConnectionsPerHost : 20,maxConnections : 10000,corePoolSize : 0,maximumPoolSize : 2147483647,maxThreadIdleTime : 5,sizeOfQueue : -1,fairnessPolicy : false,useRetries : false,
   [junit4]   2> 2378784 INFO  (TEST-CollectionsAPIDistributedZkTest.test-seed#[E0C01C2B560B97F3]) [    ] o.a.s.u.UpdateShardHandler Creating UpdateShardHandler HTTP client with params: socketTimeout=340000&connTimeout=45000&retry=true
   [junit4]   2> 2378785 INFO  (TEST-CollectionsAPIDistributedZkTest.test-seed#[E0C01C2B560B97F3]) [    ] o.a.s.l.LogWatcher SLF4J impl is org.slf4j.impl.Log4jLoggerFactory
   [junit4]   2> 2378785 INFO  (TEST-CollectionsAPIDistributedZkTest.test-seed#[E0C01C2B560B97F3]) [    ] o.a.s.l.LogWatcher Registering Log Listener [Log4j (org.slf4j.impl.Log4jLoggerFactory)]
   [junit4]   2> 2378785 INFO  (TEST-CollectionsAPIDistributedZkTest.test-seed#[E0C01C2B560B97F3]) [    ] o.a.s.c.ZkContainer Zookeeper client=127.0.0.1:42461/solr
   [junit4]   2> 2378785 INFO  (TEST-CollectionsAPIDistributedZkTest.test-seed#[E0C01C2B560B97F3]) [    ] o.a.s.c.ZkController zkHost includes chroot
   [junit4]   2> 2378785 INFO  (TEST-CollectionsAPIDistributedZkTest.test-seed#[E0C01C2B560B97F3]) [    ] o.a.s.c.c.SolrZkClient Using default ZkCredentialsProvider
   [junit4]   2> 2378786 INFO  (TEST-CollectionsAPIDistributedZkTest.test-seed#[E0C01C2B560B97F3]) [    ] o.a.s.c.c.ConnectionManager Waiting for client to connect to ZooKeeper
   [junit4]   2> 2378787 INFO  (zkCallback-1713-thread-1) [    ] o.a.s.c.c.ConnectionManager Watcher org.apache.solr.common.cloud.ConnectionManager@2d6f0804 name:ZooKeeperConnection Watcher:127.0.0.1:42461 got event WatchedEvent state:SyncConnected type:None path:null path:null type:None
   [junit4]   2> 2378787 INFO  (TEST-CollectionsAPIDistributedZkTest.test-seed#[E0C01C2B560B97F3]) [    ] o.a.s.c.c.ConnectionManager Client is connected to ZooKeeper
   [junit4]   2> 2378788 INFO  (TEST-CollectionsAPIDistributedZkTest.test-seed#[E0C01C2B560B97F3]) [    ] o.a.s.c.c.SolrZkClient Using default ZkACLProvider
   [junit4]   2> 2378789 INFO  (TEST-CollectionsAPIDistributedZkTest.test-seed#[E0C01C2B560B97F3]) [n:127.0.0.1:47477_    ] o.a.s.c.c.ConnectionManager Waiting for client to connect to ZooKeeper
   [junit4]   2> 2378790 INFO  (zkCallback-1714-thread-1-processing-n:127.0.0.1:47477_) [n:127.0.0.1:47477_    ] o.a.s.c.c.ConnectionManager Watcher org.apache.solr.common.cloud.ConnectionManager@5e7da614 name:ZooKeeperConnection Watcher:127.0.0.1:42461/solr got event WatchedEvent state:SyncConnected type:None path:null path:null type:None
   [junit4]   2> 2378790 INFO  (TEST-CollectionsAPIDistributedZkTest.test-seed#[E0C01C2B560B97F3]) [n:127.0.0.1:47477_    ] o.a.s.c.c.ConnectionManager Client is connected to ZooKeeper
   [junit4]   2> 2378795 INFO  (TEST-CollectionsAPIDistributedZkTest.test-seed#[E0C01C2B560B97F3]) [n:127.0.0.1:47477_    ] o.a.s.c.c.ZkStateReader Updating cluster state from ZooKeeper... 
   [junit4]   2> 2379800 INFO  (TEST-CollectionsAPIDistributedZkTest.test-seed#[E0C01C2B560B97F3]) [n:127.0.0.1:47477_    ] o.a.s.c.ZkController Register node as live in ZooKeeper:/live_nodes/127.0.0.1:47477_
   [junit4]   2> 2379801 INFO  (TEST-CollectionsAPIDistributedZkTest.test-seed#[E0C01C2B560B97F3]) [n:127.0.0.1:47477_    ] o.a.s.c.c.SolrZkClient makePath: /live_nodes/127.0.0.1:47477_
   [junit4]   2> 2379804 INFO  (TEST-CollectionsAPIDistributedZkTest.test-seed#[E0C01C2B560B97F3]) [n:127.0.0.1:47477_    ] o.a.s.c.Overseer Overseer (id=null) closing
   [junit4]   2> 2379805 INFO  (TEST-CollectionsAPIDistributedZkTest.test-seed#[E0C01C2B560B97F3]) [n:127.0.0.1:47477_    ] o.a.s.c.LeaderElector Joined leadership election with path: /overseer_elect/election/95222923427315721-127.0.0.1:47477_-n_0000000001
   [junit4]   2> 2379805 INFO  (TEST-CollectionsAPIDistributedZkTest.test-seed#[E0C01C2B560B97F3]) [n:127.0.0.1:47477_    ] o.a.s.c.LeaderElector Watching path /overseer_elect/election/95222923427315716-127.0.0.1:39097_-n_0000000000 to know if I could be the leader
   [junit4]   2> 2379817 INFO  (TEST-CollectionsAPIDistributedZkTest.test-seed#[E0C01C2B560B97F3]) [n:127.0.0.1:47477_    ] o.a.s.c.CoreContainer Security conf doesn't exist. Skipping setup for authorization module.
   [junit4]   2> 2379817 INFO  (TEST-CollectionsAPIDistributedZkTest.test-seed#[E0C01C2B560B97F3]) [n:127.0.0.1:47477_    ] o.a.s.c.CoreContainer No authentication plugin used.
   [junit4]   2> 2379818 INFO  (TEST-CollectionsAPIDistributedZkTest.test-seed#[E0C01C2B560B97F3]) [n:127.0.0.1:47477_    ] o.a.s.c.CoresLocator Looking for core definitions underneath /x1/jenkins/jenkins-slave/workspace/Lucene-Solr-NightlyTests-5.3/solr/build/solr-core/test/J1/temp/solr.cloud.CollectionsAPIDistributedZkTest_E0C01C2B560B97F3-001/shard-1-001/cores
   [junit4]   2> 2379819 INFO  (TEST-CollectionsAPIDistributedZkTest.test-seed#[E0C01C2B560B97F3]) [n:127.0.0.1:47477_    ] o.a.s.c.SolrCore Created CoreDescriptor: {coreNodeName=, absoluteInstDir=/x1/jenkins/jenkins-slave/workspace/Lucene-Solr-NightlyTests-5.3/solr/build/solr-core/test/J1/temp/solr.cloud.CollectionsAPIDistributedZkTest_E0C01C2B560B97F3-001/shard-1-001/cores/collection1/, schema=schema.xml, transient=false, shard=, configSetProperties=configsetprops.json, instanceDir=/x1/jenkins/jenkins-slave/workspace/Lucene-Solr-NightlyTests-5.3/solr/build/solr-core/test/J1/temp/solr.cloud.CollectionsAPIDistributedZkTest_E0C01C2B560B97F3-001/shard-1-001/cores/collection1, config=solrconfig.xml, collection=collection1, name=collection1, dataDir=data/, loadOnStartup=true}
   [junit4]   2> 2379819 INFO  (TEST-CollectionsAPIDistributedZkTest.test-seed#[E0C01C2B560B97F3]) [n:127.0.0.1:47477_    ] o.a.s.c.CoresLocator Found core collection1 in /x1/jenkins/jenkins-slave/workspace/Lucene-Solr-NightlyTests-5.3/solr/build/solr-core/test/J1/temp/solr.cloud.CollectionsAPIDistributedZkTest_E0C01C2B560B97F3-001/shard-1-001/cores/collection1/
   [junit4]   2> 2379819 INFO  (TEST-CollectionsAPIDistributedZkTest.test-seed#[E0C01C2B560B97F3]) [n:127.0.0.1:47477_    ] o.a.s.c.CoresLocator Found 1 core definitions
   [junit4]   2> 2379820 INFO  (TEST-CollectionsAPIDistributedZkTest.test-seed#[E0C01C2B560B97F3]) [n:127.0.0.1:47477_    ] o.a.s.s.SolrDispatchFilter user.dir=/x1/jenkins/jenkins-slave/workspace/Lucene-Solr-NightlyTests-5.3/solr/build/solr-core/test/J1
   [junit4]   2> 2379820 INFO  (TEST-CollectionsAPIDistributedZkTest.test-seed#[E0C01C2B560B97F3]) [n:127.0.0.1:47477_    ] o.a.s.s.SolrDispatchFilter SolrDispatchFilter.init() done
   [junit4]   2> 2379821 INFO  (coreLoadExecutor-2828-thread-1-processing-n:127.0.0.1:47477_) [n:127.0.0.1:47477_ c:collection1   x:collection1] o.a.s.c.ZkController publishing state=down
   [junit4]   2> 2379821 INFO  (coreLoadExecutor-2828-thread-1-processing-n:127.0.0.1:47477_) [n:127.0.0.1:47477_ c:collection1   x:collection1] o.a.s.c.ZkController numShards not found on descriptor - reading it from system property
   [junit4]   2> 2379822 INFO  (zkCallback-1707-thread-1-processing-n:127.0.0.1:39097_) [n:127.0.0.1:39097_    ] o.a.s.c.DistributedQueue NodeChildrenChanged fired on path /overseer/queue state SyncConnected
   [junit4]   2> 2379823 INFO  (coreLoadExecutor-2828-thread-1-processing-n:127.0.0.1:47477_) [n:127.0.0.1:47477_ c:collection1   x:collection1] o.a.s.c.ZkController Registering watch for external collection collection1
   [junit4]   2> 2379823 INFO  (coreLoadExecutor-2828-thread-1-processing-n:127.0.0.1:47477_) [n:127.0.0.1:47477_ c:collection1   x:collection1] o.a.s.c.c.ZkStateReader addZkWatch collection1
   [junit4]   2> 2379823 INFO  (OverseerStateUpdate-95222923427315716-127.0.0.1:39097_-n_0000000000) [n:127.0.0.1:39097_    ] o.a.s.c.Overseer processMessage: queueSize: 1, message = {
   [junit4]   2>   "base_url":"http://127.0.0.1:47477",
   [junit4]   2>   "collection":"collection1",
   [junit4]   2>   "state":"down",
   [junit4]   2>   "shard":null,
   [junit4]   2>   "node_name":"127.0.0.1:47477_",
   [junit4]   2>   "roles":null,
   [junit4]   2>   "numShards":"2",
   [junit4]   2>   "operation":"state",
   [junit4]   2>   "core":"collection1"} current state version: 4
   [junit4]   2> 2379824 INFO  (coreLoadExecutor-2828-thread-1-processing-n:127.0.0.1:47477_) [n:127.0.0.1:47477_ c:collection1   x:collection1] o.a.s.c.c.ZkStateReader Updating collection state at /collections/collection1/state.json from ZooKeeper... 
   [junit4]   2> 2379824 INFO  (OverseerStateUpdate-95222923427315716-127.0.0.1:39097_-n_0000000000) [n:127.0.0.1:39097_    ] o.a.s.c.o.ReplicaMutator Update state numShards=2 message={
   [junit4]   2>   "base_url":"http://127.0.0.1:47477",
   [junit4]   2>   "collection":"collection1",
   [junit4]   2>   "state":"down",
   [junit4]   2>   "shard":null,
   [junit4]   2>   "node_name":"127.0.0.1:47477_",
   [junit4]   2>   "roles":null,
   [junit4]   2>   "numShards":"2",
   [junit4]   2>   "operation":"state",
   [junit4]   2>   "core":"collection1"}
   [junit4]   2> 2379824 INFO  (OverseerStateUpdate-95222923427315716-127.0.0.1:39097_-n_0000000000) [n:127.0.0.1:39097_    ] o.a.s.c.o.ReplicaMutator Collection already exists with numShards=2
   [junit4]   2> 2379824 INFO  (OverseerStateUpdate-95222923427315716-127.0.0.1:39097_-n_0000000000) [n:127.0.0.1:39097_    ] o.a.s.c.o.ReplicaMutator Assigning new node to shard shard=shard2
   [junit4]   2> 2379825 INFO  (coreLoadExecutor-2828-thread-1-processing-n:127.0.0.1:47477_) [n:127.0.0.1:47477_ c:collection1   x:collection1] o.a.s.c.c.ZkStateReader Updating data for collection1 to ver 0 
   [junit4]   2> 2379825 INFO  (coreLoadExecutor-2828-thread-1-processing-n:127.0.0.1:47477_) [n:127.0.0.1:47477_ c:collection1   x:collection1] o.a.s.c.ZkController look for our core node name
   [junit4]   2> 2379927 INFO  (OverseerStateUpdate-95222923427315716-127.0.0.1:39097_-n_0000000000) [n:127.0.0.1:39097_    ] o.a.s.c.o.ZkStateWriter going to update_collection /collections/collection1/state.json version: 0
   [junit4]   2> 2379927 INFO  (zkCallback-1714-thread-1-processing-n:127.0.0.1:47477_) [n:127.0.0.1:47477_    ] o.a.s.c.c.ZkStateReader A cluster state change: WatchedEvent state:SyncConnected type:NodeDataChanged path:/collections/collection1/state.json for collection collection1 has occurred - updating... (live nodes size: 2)
   [junit4]   2> 2379928 INFO  (zkCallback-1714-thread-1-processing-n:127.0.0.1:47477_) [n:127.0.0.1:47477_    ] o.a.s.c.c.ZkStateReader Updating data for collection1 to ver 1 
   [junit4]   2> 2380825 INFO  (coreLoadExecutor-2828-thread-1-processing-n:127.0.0.1:47477_) [n:127.0.0.1:47477_ c:collection1   x:collection1] o.a.s.c.ZkController waiting to find shard id in clusterstate for collection1
   [junit4]   2> 2380825 INFO  (coreLoadExecutor-2828-thread-1-processing-n:127.0.0.1:47477_) [n:127.0.0.1:47477_ c:collection1   x:collection1] o.a.s.c.ZkController Check for collection zkNode:collection1
   [junit4]   2> 2380826 INFO  (coreLoadExecutor-2828-thread-1-processing-n:127.0.0.1:47477_) [n:127.0.0.1:47477_ c:collection1   x:collection1] o.a.s.c.ZkController Collection zkNode exists
   [junit4]   2> 2380826 INFO  (coreLoadExecutor-2828-thread-1-processing-n:127.0.0.1:47477_) [n:127.0.0.1:47477_ c:collection1   x:collection1] o.a.s.c.c.ZkStateReader Load collection config from:/collections/collection1
   [junit4]   2> 2380827 INFO  (coreLoadExecutor-2828-thread-1-processing-n:127.0.0.1:47477_) [n:127.0.0.1:47477_ c:collection1   x:collection1] o.a.s.c.c.ZkStateReader path=/collections/collection1 configName=conf1 specified config exists in ZooKeeper
   [junit4]   2> 2380827 INFO  (coreLoadExecutor-2828-thread-1-processing-n:127.0.0.1:47477_) [n:127.0.0.1:47477_ c:collection1   x:collection1] o.a.s.c.SolrResourceLoader new SolrResourceLoader for directory: '/x1/jenkins/jenkins-slave/workspace/Lucene-Solr-NightlyTests-5.3/solr/build/solr-core/test/J1/temp/solr.cloud.CollectionsAPIDistributedZkTest_E0C01C2B560B97F3-001/shard-1-001/cores/collection1/'
   [junit4]   2> 2380844 INFO  (coreLoadExecutor-2828-thread-1-processing-n:127.0.0.1:47477_) [n:127.0.0.1:47477_ c:collection1   x:collection1] o.a.s.c.Config loaded config solrconfig.xml with version 0 
   [junit4]   2> 2380851 INFO  (coreLoadExecutor-2828-thread-1-processing-n:127.0.0.1:47477_) [n:127.0.0.1:47477_ c:collection1   x:collection1] o.a.s.c.SolrConfig current version of requestparams : -1
   [junit4]   2> 2380864 INFO  (coreLoadExecutor-2828-thread-1-processing-n:127.0.0.1:47477_) [n:127.0.0.1:47477_ c:collection1   x:collection1] o.a.s.c.SolrConfig Using Lucene MatchVersion: 5.3.2
   [junit4]   2> 2380907 INFO  (coreLoadExecutor-2828-thread-1-processing-n:127.0.0.1:47477_) [n:127.0.0.1:47477_ c:collection1   x:collection1] o.a.s.c.Config Loaded SolrConfig: solrconfig.xml
   [junit4]   2> 2380908 INFO  (coreLoadExecutor-2828-thread-1-processing-n:127.0.0.1:47477_) [n:127.0.0.1:47477_ c:collection1   x:collection1] o.a.s.s.IndexSchema Reading Solr Schema from /configs/conf1/schema.xml
   [junit4]   2> 2380915 INFO  (coreLoadExecutor-2828-thread-1-processing-n:127.0.0.1:47477_) [n:127.0.0.1:47477_ c:collection1   x:collection1] o.a.s.s.IndexSchema [collection1] Schema name=test
   [junit4]   2> 2381170 INFO  (coreLoadExecutor-2828-thread-1-processing-n:127.0.0.1:47477_) [n:127.0.0.1:47477_ c:collection1   x:collection1] o.a.s.s.OpenExchangeRatesOrgProvider Initialized with rates=open-exchange-rates.json, refreshInterval=1440.
   [junit4]   2> 2381178 INFO  (coreLoadExecutor-2828-thread-1-processing-n:127.0.0.1:47477_) [n:127.0.0.1:47477_ c:collection1   x:collection1] o.a.s.s.IndexSchema default search field in schema is text
   [junit4]   2> 2381180 INFO  (coreLoadExecutor-2828-thread-1-processing-n:127.0.0.1:47477_) [n:127.0.0.1:47477_ c:collection1   x:collection1] o.a.s.s.IndexSchema unique key field: id
   [junit4]   2> 2381191 INFO  (coreLoadExecutor-2828-thread-1-processing-n:127.0.0.1:47477_) [n:127.0.0.1:47477_ c:collection1   x:collection1] o.a.s.s.FileExchangeRateProvider Reloading exchange rates from file currency.xml
   [junit4]   2> 2381197 INFO  (coreLoadExecutor-2828-thread-1-processing-n:127.0.0.1:47477_) [n:127.0.0.1:47477_ c:collection1   x:collection1] o.a.s.s.FileExchangeRateProvider Reloading exchange rates from file currency.xml
   [junit4]   2> 2381204 INFO  (coreLoadExecutor-2828-thread-1-processing-n:127.0.0.

[...truncated too long message...]

BeanServerInterceptor.java:430)
   [junit4]   2> 	at com.sun.jmx.interceptor.DefaultMBeanServerInterceptor.unregisterMBean(DefaultMBeanServerInterceptor.java:415)
   [junit4]   2> 	at com.sun.jmx.mbeanserver.JmxMBeanServer.unregisterMBean(JmxMBeanServer.java:546)
   [junit4]   2> 	at org.apache.hadoop.metrics2.util.MBeans.unregister(MBeans.java:81)
   [junit4]   2> 	at org.apache.hadoop.metrics2.impl.MetricsSourceAdapter.stopMBeans(MetricsSourceAdapter.java:227)
   [junit4]   2> 	at org.apache.hadoop.metrics2.impl.MetricsSourceAdapter.stop(MetricsSourceAdapter.java:212)
   [junit4]   2> 	at org.apache.hadoop.metrics2.impl.MetricsSystemImpl.stopSources(MetricsSystemImpl.java:461)
   [junit4]   2> 	at org.apache.hadoop.metrics2.impl.MetricsSystemImpl.stop(MetricsSystemImpl.java:212)
   [junit4]   2> 	at org.apache.hadoop.metrics2.impl.MetricsSystemImpl.shutdown(MetricsSystemImpl.java:592)
   [junit4]   2> 	at org.apache.hadoop.metrics2.lib.DefaultMetricsSystem.shutdownInstance(DefaultMetricsSystem.java:72)
   [junit4]   2> 	at org.apache.hadoop.metrics2.lib.DefaultMetricsSystem.shutdown(DefaultMetricsSystem.java:68)
   [junit4]   2> 	at org.apache.hadoop.hdfs.server.namenode.metrics.NameNodeMetrics.shutdown(NameNodeMetrics.java:145)
   [junit4]   2> 	at org.apache.hadoop.hdfs.server.namenode.NameNode.stop(NameNode.java:822)
   [junit4]   2> 	at org.apache.hadoop.hdfs.MiniDFSCluster.shutdown(MiniDFSCluster.java:1720)
   [junit4]   2> 	at org.apache.hadoop.hdfs.MiniDFSCluster.shutdown(MiniDFSCluster.java:1699)
   [junit4]   2> 	at org.apache.solr.cloud.hdfs.HdfsTestUtil.teardownClass(HdfsTestUtil.java:197)
   [junit4]   2> 	at org.apache.solr.cloud.hdfs.HdfsCollectionsAPIDistributedZkTest.teardownClass(HdfsCollectionsAPIDistributedZkTest.java:50)
   [junit4]   2> 	at sun.reflect.NativeMethodAccessorImpl.invoke0(Native Method)
   [junit4]   2> 	at sun.reflect.NativeMethodAccessorImpl.invoke(NativeMethodAccessorImpl.java:57)
   [junit4]   2> 	at sun.reflect.DelegatingMethodAccessorImpl.invoke(DelegatingMethodAccessorImpl.java:43)
   [junit4]   2> 	at java.lang.reflect.Method.invoke(Method.java:606)
   [junit4]   2> 	at com.carrotsearch.randomizedtesting.RandomizedRunner.invoke(RandomizedRunner.java:1627)
   [junit4]   2> 	at com.carrotsearch.randomizedtesting.RandomizedRunner$5.evaluate(RandomizedRunner.java:799)
   [junit4]   2> 	at com.carrotsearch.randomizedtesting.rules.StatementAdapter.evaluate(StatementAdapter.java:36)
   [junit4]   2> 	at com.carrotsearch.randomizedtesting.rules.SystemPropertiesRestoreRule$1.evaluate(SystemPropertiesRestoreRule.java:57)
   [junit4]   2> 	at org.apache.lucene.util.AbstractBeforeAfterRule$1.evaluate(AbstractBeforeAfterRule.java:46)
   [junit4]   2> 	at com.carrotsearch.randomizedtesting.rules.StatementAdapter.evaluate(StatementAdapter.java:36)
   [junit4]   2> 	at org.apache.lucene.util.TestRuleStoreClassName$1.evaluate(TestRuleStoreClassName.java:42)
   [junit4]   2> 	at com.carrotsearch.randomizedtesting.rules.NoShadowingOrOverridesOnMethodsRule$1.evaluate(NoShadowingOrOverridesOnMethodsRule.java:39)
   [junit4]   2> 	at com.carrotsearch.randomizedtesting.rules.NoShadowingOrOverridesOnMethodsRule$1.evaluate(NoShadowingOrOverridesOnMethodsRule.java:39)
   [junit4]   2> 	at com.carrotsearch.randomizedtesting.rules.StatementAdapter.evaluate(StatementAdapter.java:36)
   [junit4]   2> 	at com.carrotsearch.randomizedtesting.rules.StatementAdapter.evaluate(StatementAdapter.java:36)
   [junit4]   2> 	at com.carrotsearch.randomizedtesting.rules.StatementAdapter.evaluate(StatementAdapter.java:36)
   [junit4]   2> 	at org.apache.lucene.util.TestRuleAssertionsRequired$1.evaluate(TestRuleAssertionsRequired.java:54)
   [junit4]   2> 	at org.apache.lucene.util.TestRuleMarkFailure$1.evaluate(TestRuleMarkFailure.java:48)
   [junit4]   2> 	at org.apache.lucene.util.TestRuleIgnoreAfterMaxFailures$1.evaluate(TestRuleIgnoreAfterMaxFailures.java:65)
   [junit4]   2> 	at org.apache.lucene.util.TestRuleIgnoreTestSuites$1.evaluate(TestRuleIgnoreTestSuites.java:55)
   [junit4]   2> 	at com.carrotsearch.randomizedtesting.rules.StatementAdapter.evaluate(StatementAdapter.java:36)
   [junit4]   2> 	at com.carrotsearch.randomizedtesting.ThreadLeakControl$StatementRunner.run(ThreadLeakControl.java:365)
   [junit4]   2> 	at java.lang.Thread.run(Thread.java:745)
   [junit4]   2> Caused by: java.lang.NullPointerException
   [junit4]   2> 	at org.apache.hadoop.hdfs.server.blockmanagement.BlocksMap.size(BlocksMap.java:198)
   [junit4]   2> 	at org.apache.hadoop.hdfs.server.blockmanagement.BlockManager.getTotalBlocks(BlockManager.java:3291)
   [junit4]   2> 	at org.apache.hadoop.hdfs.server.namenode.FSNamesystem.getBlocksTotal(FSNamesystem.java:6223)
   [junit4]   2> 	... 53 more
   [junit4]   2> 5881962 INFO  (SUITE-HdfsCollectionsAPIDistributedZkTest-seed#[E0C01C2B560B97F3]-worker) [n:127.0.0.1:54539_g c:addReplicaColl s:shard1 r:core_node7 x:propertyDotName] o.a.s.SolrTestCaseJ4 ###deleteCore
   [junit4]   2> Jan 17, 2016 12:20:07 AM com.carrotsearch.randomizedtesting.ThreadLeakControl checkThreadLeaks
   [junit4]   2> WARNING: Will linger awaiting termination of 3 leaked thread(s).
   [junit4]   2> NOTE: test params are: codec=Asserting(Lucene53): {timestamp=FSTOrd50, text=Lucene50(blocksize=128), multiDefault=FSTOrd50, a_t=FSTOrd50, intDefault=PostingsFormat(name=MockRandom), a_i1=FSTOrd50, range_facet_i_dv=FSTOrd50, other_tl1=PostingsFormat(name=MockRandom), id=PostingsFormat(name=Memory doPackFST= false), range_facet_l_dv=PostingsFormat(name=Memory doPackFST= false), _version_=PostingsFormat(name=MockRandom), range_facet_l=FSTOrd50}, docValues:{timestamp=DocValuesFormat(name=Asserting), range_facet_i_dv=DocValuesFormat(name=Asserting), range_facet_l_dv=DocValuesFormat(name=Lucene50)}, sim=RandomSimilarityProvider(queryNorm=true,coord=no): {}, locale=en_GB, timezone=Mexico/BajaSur
   [junit4]   2> NOTE: Linux 3.13.0-52-generic amd64/Oracle Corporation 1.7.0_80 (64-bit)/cpus=4,threads=2,free=212061776,total=519569408
   [junit4]   2> NOTE: All tests run in this JVM: [HardAutoCommitTest, QueryEqualityTest, TestObjectReleaseTracker, TestCloudInspectUtil, DistributedQueryComponentCustomSortTest, TestDocBasedVersionConstraints, RecoveryAfterSoftCommitTest, HdfsUnloadDistributedZkTest, ChangedSchemaMergeTest, RankQueryTest, SoftAutoCommitTest, TestTolerantSearch, SegmentsInfoRequestHandlerTest, TestRemoveLastDynamicCopyField, TestRebalanceLeaders, TestPerFieldSimilarity, PluginInfoTest, TestStressRecovery, TestSurroundQueryParser, OverseerTest, TestPseudoReturnFields, HLLUtilTest, DistributedExpandComponentTest, SimpleFacetsTest, TestManagedSynonymFilterFactory, TestTrieFacet, TestHdfsUpdateLog, TestRTimer, TestCursorMarkWithoutUniqueKey, TestManagedSchemaDynamicFieldResource, DirectUpdateHandlerTest, TestQuerySenderNoQuery, TestChildDocTransformer, TestMiniSolrCloudClusterBase, TestCryptoKeys, DistributedQueryElevationComponentTest, TestCollationField, TestConfigSetProperties, TestCollationFieldDocValues, TestPivotHelperCode, NumericFieldsTest, TestLRUStatsCache, TestPKIAuthenticationPlugin, DistributedFacetPivotWhiteBoxTest, TestExceedMaxTermLength, TestCustomSort, TestBinaryResponseWriter, TestTrie, TestSchemaSimilarityResource, SortByFunctionTest, LeaderElectionTest, MoreLikeThisHandlerTest, CleanupOldIndexTest, QueryResultKeyTest, CoreMergeIndexesAdminHandlerTest, ConnectionManagerTest, ResponseLogComponentTest, TestClassNameShortening, TestHighFrequencyDictionaryFactory, TestPartialUpdateDeduplication, TestSolrQueryParserResource, TestRawResponseWriter, HdfsSyncSliceTest, TestFieldCollectionResource, TestSimpleTrackingShardHandler, CollectionReloadTest, TestSha256AuthenticationProvider, AnalysisErrorHandlingTest, TestSchemaManager, ConcurrentDeleteAndCreateCollectionTest, TestSort, SolrXmlInZkTest, TestSolrConfigHandler, TestExclusionRuleCollectionAccess, RecoveryZkTest, TestReload, HdfsRecoveryZkTest, TestRecovery, RegexBoostProcessorTest, DistribJoinFromCollectionTest, TestSearcherReuse, TestCSVResponseWriter, BasicAuthIntegrationTest, SolrCloudExampleTest, OutputWriterTest, SynonymTokenizerTest, BasicZkTest, FullSolrCloudDistribCmdsTest, ZkSolrClientTest, TestZkChroot, TestRandomDVFaceting, TestDistributedSearch, DeleteInactiveReplicaTest, MigrateRouteKeyTest, MultiThreadedOCPTest, TestCloudPivotFacet, TestRandomRequestDistribution, TestShortCircuitedRequests, TestSolrCloudWithKerberosAlt, VMParamsZkACLAndCredentialsProvidersTest, HdfsBasicDistributedZk2Test, HdfsCollectionsAPIDistributedZkTest]
   [junit4] Completed [440/533] on J2 in 1012.40s, 1 test, 1 error <<< FAILURES!

[...truncated 330 lines...]
BUILD FAILED
/x1/jenkins/jenkins-slave/workspace/Lucene-Solr-NightlyTests-5.3/build.xml:733: The following error occurred while executing this line:
/x1/jenkins/jenkins-slave/workspace/Lucene-Solr-NightlyTests-5.3/build.xml:670: The following error occurred while executing this line:
/x1/jenkins/jenkins-slave/workspace/Lucene-Solr-NightlyTests-5.3/build.xml:59: The following error occurred while executing this line:
/x1/jenkins/jenkins-slave/workspace/Lucene-Solr-NightlyTests-5.3/solr/build.xml:230: The following error occurred while executing this line:
/x1/jenkins/jenkins-slave/workspace/Lucene-Solr-NightlyTests-5.3/solr/common-build.xml:524: The following error occurred while executing this line:
/x1/jenkins/jenkins-slave/workspace/Lucene-Solr-NightlyTests-5.3/lucene/common-build.xml:1449: The following error occurred while executing this line:
/x1/jenkins/jenkins-slave/workspace/Lucene-Solr-NightlyTests-5.3/lucene/common-build.xml:1003: There were test failures: 533 suites, 2104 tests, 2 errors, 26 ignored (14 assumptions)

Total time: 235 minutes 8 seconds
Build step 'Invoke Ant' marked build as failure
Archiving artifacts
No prior successful build to compare, so performing full copy of artifacts
Recording test results
Email was triggered for: Failure - Any
Sending email for trigger: Failure - Any



Mime
View raw message