lucene-dev mailing list archives

Site index · List index
Message view « Date » · « Thread »
Top « Date » · « Thread »
From Policeman Jenkins Server <jenk...@thetaphi.de>
Subject [JENKINS] Lucene-Solr-5.x-Linux (32bit/jdk1.7.0_80) - Build # 15133 - Failure!
Date Mon, 04 Jan 2016 05:17:53 GMT
Build: http://jenkins.thetaphi.de/job/Lucene-Solr-5.x-Linux/15133/
Java: 32bit/jdk1.7.0_80 -server -XX:+UseConcMarkSweepGC

2 tests failed.
FAILED:  org.apache.solr.cloud.RecoveryAfterSoftCommitTest.test

Error Message:
Didn't see all replicas for shard shard1 in collection1 come up within 30000 ms! ClusterState: {   "control_collection":{     "router":{"name":"compositeId"},     "autoCreated":"true",     "replicationFactor":"1",     "maxShardsPerNode":"1",     "shards":{"shard1":{         "range":"80000000-7fffffff",         "state":"active",         "replicas":{"core_node1":{             "base_url":"http://127.0.0.1:53871/pmsa/qv",             "state":"active",             "node_name":"127.0.0.1:53871_pmsa%2Fqv",             "core":"collection1",             "leader":"true"}}}},     "autoAddReplicas":"false"},   "collection1":{     "router":{"name":"compositeId"},     "autoCreated":"true",     "replicationFactor":"1",     "maxShardsPerNode":"1",     "shards":{"shard1":{         "range":"80000000-7fffffff",         "state":"active",         "replicas":{           "core_node1":{             "base_url":"http://127.0.0.1:50330/pmsa/qv",             "state":"active",             "node_name":"127.0.0.1:50330_pmsa%2Fqv",             "core":"collection1",             "leader":"true"},           "core_node2":{             "base_url":"http://127.0.0.1:47698/pmsa/qv",             "state":"recovering",             "node_name":"127.0.0.1:47698_pmsa%2Fqv",             "core":"collection1"}}}},     "autoAddReplicas":"false"}}

Stack Trace:
java.lang.AssertionError: Didn't see all replicas for shard shard1 in collection1 come up within 30000 ms! ClusterState: {
  "control_collection":{
    "router":{"name":"compositeId"},
    "autoCreated":"true",
    "replicationFactor":"1",
    "maxShardsPerNode":"1",
    "shards":{"shard1":{
        "range":"80000000-7fffffff",
        "state":"active",
        "replicas":{"core_node1":{
            "base_url":"http://127.0.0.1:53871/pmsa/qv",
            "state":"active",
            "node_name":"127.0.0.1:53871_pmsa%2Fqv",
            "core":"collection1",
            "leader":"true"}}}},
    "autoAddReplicas":"false"},
  "collection1":{
    "router":{"name":"compositeId"},
    "autoCreated":"true",
    "replicationFactor":"1",
    "maxShardsPerNode":"1",
    "shards":{"shard1":{
        "range":"80000000-7fffffff",
        "state":"active",
        "replicas":{
          "core_node1":{
            "base_url":"http://127.0.0.1:50330/pmsa/qv",
            "state":"active",
            "node_name":"127.0.0.1:50330_pmsa%2Fqv",
            "core":"collection1",
            "leader":"true"},
          "core_node2":{
            "base_url":"http://127.0.0.1:47698/pmsa/qv",
            "state":"recovering",
            "node_name":"127.0.0.1:47698_pmsa%2Fqv",
            "core":"collection1"}}}},
    "autoAddReplicas":"false"}}
	at __randomizedtesting.SeedInfo.seed([1441C83C27EF9305:9C15F7E68913FEFD]:0)
	at org.junit.Assert.fail(Assert.java:93)
	at org.apache.solr.cloud.AbstractFullDistribZkTestBase.ensureAllReplicasAreActive(AbstractFullDistribZkTestBase.java:1844)
	at org.apache.solr.cloud.RecoveryAfterSoftCommitTest.test(RecoveryAfterSoftCommitTest.java:115)
	at sun.reflect.NativeMethodAccessorImpl.invoke0(Native Method)
	at sun.reflect.NativeMethodAccessorImpl.invoke(NativeMethodAccessorImpl.java:57)
	at sun.reflect.DelegatingMethodAccessorImpl.invoke(DelegatingMethodAccessorImpl.java:43)
	at java.lang.reflect.Method.invoke(Method.java:606)
	at com.carrotsearch.randomizedtesting.RandomizedRunner.invoke(RandomizedRunner.java:1764)
	at com.carrotsearch.randomizedtesting.RandomizedRunner$8.evaluate(RandomizedRunner.java:871)
	at com.carrotsearch.randomizedtesting.RandomizedRunner$9.evaluate(RandomizedRunner.java:907)
	at com.carrotsearch.randomizedtesting.RandomizedRunner$10.evaluate(RandomizedRunner.java:921)
	at org.apache.solr.BaseDistributedSearchTestCase$ShardsRepeatRule$ShardsFixedStatement.callStatement(BaseDistributedSearchTestCase.java:965)
	at org.apache.solr.BaseDistributedSearchTestCase$ShardsRepeatRule$ShardsStatement.evaluate(BaseDistributedSearchTestCase.java:940)
	at com.carrotsearch.randomizedtesting.rules.SystemPropertiesRestoreRule$1.evaluate(SystemPropertiesRestoreRule.java:57)
	at org.apache.lucene.util.TestRuleSetupTeardownChained$1.evaluate(TestRuleSetupTeardownChained.java:50)
	at org.apache.lucene.util.AbstractBeforeAfterRule$1.evaluate(AbstractBeforeAfterRule.java:46)
	at org.apache.lucene.util.TestRuleThreadAndTestName$1.evaluate(TestRuleThreadAndTestName.java:49)
	at org.apache.lucene.util.TestRuleIgnoreAfterMaxFailures$1.evaluate(TestRuleIgnoreAfterMaxFailures.java:65)
	at org.apache.lucene.util.TestRuleMarkFailure$1.evaluate(TestRuleMarkFailure.java:48)
	at com.carrotsearch.randomizedtesting.rules.StatementAdapter.evaluate(StatementAdapter.java:36)
	at com.carrotsearch.randomizedtesting.ThreadLeakControl$StatementRunner.run(ThreadLeakControl.java:367)
	at com.carrotsearch.randomizedtesting.ThreadLeakControl.forkTimeoutingTask(ThreadLeakControl.java:809)
	at com.carrotsearch.randomizedtesting.ThreadLeakControl$3.evaluate(ThreadLeakControl.java:460)
	at com.carrotsearch.randomizedtesting.RandomizedRunner.runSingleTest(RandomizedRunner.java:880)
	at com.carrotsearch.randomizedtesting.RandomizedRunner$5.evaluate(RandomizedRunner.java:781)
	at com.carrotsearch.randomizedtesting.RandomizedRunner$6.evaluate(RandomizedRunner.java:816)
	at com.carrotsearch.randomizedtesting.RandomizedRunner$7.evaluate(RandomizedRunner.java:827)
	at com.carrotsearch.randomizedtesting.rules.StatementAdapter.evaluate(StatementAdapter.java:36)
	at com.carrotsearch.randomizedtesting.rules.SystemPropertiesRestoreRule$1.evaluate(SystemPropertiesRestoreRule.java:57)
	at org.apache.lucene.util.AbstractBeforeAfterRule$1.evaluate(AbstractBeforeAfterRule.java:46)
	at com.carrotsearch.randomizedtesting.rules.StatementAdapter.evaluate(StatementAdapter.java:36)
	at org.apache.lucene.util.TestRuleStoreClassName$1.evaluate(TestRuleStoreClassName.java:42)
	at com.carrotsearch.randomizedtesting.rules.NoShadowingOrOverridesOnMethodsRule$1.evaluate(NoShadowingOrOverridesOnMethodsRule.java:40)
	at com.carrotsearch.randomizedtesting.rules.NoShadowingOrOverridesOnMethodsRule$1.evaluate(NoShadowingOrOverridesOnMethodsRule.java:40)
	at com.carrotsearch.randomizedtesting.rules.StatementAdapter.evaluate(StatementAdapter.java:36)
	at com.carrotsearch.randomizedtesting.rules.StatementAdapter.evaluate(StatementAdapter.java:36)
	at com.carrotsearch.randomizedtesting.rules.StatementAdapter.evaluate(StatementAdapter.java:36)
	at org.apache.lucene.util.TestRuleAssertionsRequired$1.evaluate(TestRuleAssertionsRequired.java:54)
	at org.apache.lucene.util.TestRuleMarkFailure$1.evaluate(TestRuleMarkFailure.java:48)
	at org.apache.lucene.util.TestRuleIgnoreAfterMaxFailures$1.evaluate(TestRuleIgnoreAfterMaxFailures.java:65)
	at org.apache.lucene.util.TestRuleIgnoreTestSuites$1.evaluate(TestRuleIgnoreTestSuites.java:55)
	at com.carrotsearch.randomizedtesting.rules.StatementAdapter.evaluate(StatementAdapter.java:36)
	at com.carrotsearch.randomizedtesting.ThreadLeakControl$StatementRunner.run(ThreadLeakControl.java:367)
	at java.lang.Thread.run(Thread.java:745)


FAILED:  org.apache.solr.cloud.TestMiniSolrCloudCluster.testStopAllStartAll

Error Message:
expected:<2> but was:<1>

Stack Trace:
java.lang.AssertionError: expected:<2> but was:<1>
	at __randomizedtesting.SeedInfo.seed([1441C83C27EF9305:627FD74F66D83E2A]:0)
	at org.junit.Assert.fail(Assert.java:93)
	at org.junit.Assert.failNotEquals(Assert.java:647)
	at org.junit.Assert.assertEquals(Assert.java:128)
	at org.junit.Assert.assertEquals(Assert.java:472)
	at org.junit.Assert.assertEquals(Assert.java:456)
	at org.apache.solr.cloud.TestMiniSolrCloudCluster.testStopAllStartAll(TestMiniSolrCloudCluster.java:432)
	at sun.reflect.NativeMethodAccessorImpl.invoke0(Native Method)
	at sun.reflect.NativeMethodAccessorImpl.invoke(NativeMethodAccessorImpl.java:57)
	at sun.reflect.DelegatingMethodAccessorImpl.invoke(DelegatingMethodAccessorImpl.java:43)
	at java.lang.reflect.Method.invoke(Method.java:606)
	at com.carrotsearch.randomizedtesting.RandomizedRunner.invoke(RandomizedRunner.java:1764)
	at com.carrotsearch.randomizedtesting.RandomizedRunner$8.evaluate(RandomizedRunner.java:871)
	at com.carrotsearch.randomizedtesting.RandomizedRunner$9.evaluate(RandomizedRunner.java:907)
	at com.carrotsearch.randomizedtesting.RandomizedRunner$10.evaluate(RandomizedRunner.java:921)
	at com.carrotsearch.randomizedtesting.rules.SystemPropertiesRestoreRule$1.evaluate(SystemPropertiesRestoreRule.java:57)
	at org.apache.lucene.util.TestRuleSetupTeardownChained$1.evaluate(TestRuleSetupTeardownChained.java:50)
	at org.apache.lucene.util.AbstractBeforeAfterRule$1.evaluate(AbstractBeforeAfterRule.java:46)
	at org.apache.lucene.util.TestRuleThreadAndTestName$1.evaluate(TestRuleThreadAndTestName.java:49)
	at org.apache.lucene.util.TestRuleIgnoreAfterMaxFailures$1.evaluate(TestRuleIgnoreAfterMaxFailures.java:65)
	at org.apache.lucene.util.TestRuleMarkFailure$1.evaluate(TestRuleMarkFailure.java:48)
	at com.carrotsearch.randomizedtesting.rules.StatementAdapter.evaluate(StatementAdapter.java:36)
	at com.carrotsearch.randomizedtesting.ThreadLeakControl$StatementRunner.run(ThreadLeakControl.java:367)
	at com.carrotsearch.randomizedtesting.ThreadLeakControl.forkTimeoutingTask(ThreadLeakControl.java:809)
	at com.carrotsearch.randomizedtesting.ThreadLeakControl$3.evaluate(ThreadLeakControl.java:460)
	at com.carrotsearch.randomizedtesting.RandomizedRunner.runSingleTest(RandomizedRunner.java:880)
	at com.carrotsearch.randomizedtesting.RandomizedRunner$5.evaluate(RandomizedRunner.java:781)
	at com.carrotsearch.randomizedtesting.RandomizedRunner$6.evaluate(RandomizedRunner.java:816)
	at com.carrotsearch.randomizedtesting.RandomizedRunner$7.evaluate(RandomizedRunner.java:827)
	at com.carrotsearch.randomizedtesting.rules.StatementAdapter.evaluate(StatementAdapter.java:36)
	at com.carrotsearch.randomizedtesting.rules.SystemPropertiesRestoreRule$1.evaluate(SystemPropertiesRestoreRule.java:57)
	at org.apache.lucene.util.AbstractBeforeAfterRule$1.evaluate(AbstractBeforeAfterRule.java:46)
	at com.carrotsearch.randomizedtesting.rules.StatementAdapter.evaluate(StatementAdapter.java:36)
	at org.apache.lucene.util.TestRuleStoreClassName$1.evaluate(TestRuleStoreClassName.java:42)
	at com.carrotsearch.randomizedtesting.rules.NoShadowingOrOverridesOnMethodsRule$1.evaluate(NoShadowingOrOverridesOnMethodsRule.java:40)
	at com.carrotsearch.randomizedtesting.rules.NoShadowingOrOverridesOnMethodsRule$1.evaluate(NoShadowingOrOverridesOnMethodsRule.java:40)
	at com.carrotsearch.randomizedtesting.rules.StatementAdapter.evaluate(StatementAdapter.java:36)
	at com.carrotsearch.randomizedtesting.rules.StatementAdapter.evaluate(StatementAdapter.java:36)
	at com.carrotsearch.randomizedtesting.rules.StatementAdapter.evaluate(StatementAdapter.java:36)
	at org.apache.lucene.util.TestRuleAssertionsRequired$1.evaluate(TestRuleAssertionsRequired.java:54)
	at org.apache.lucene.util.TestRuleMarkFailure$1.evaluate(TestRuleMarkFailure.java:48)
	at org.apache.lucene.util.TestRuleIgnoreAfterMaxFailures$1.evaluate(TestRuleIgnoreAfterMaxFailures.java:65)
	at org.apache.lucene.util.TestRuleIgnoreTestSuites$1.evaluate(TestRuleIgnoreTestSuites.java:55)
	at com.carrotsearch.randomizedtesting.rules.StatementAdapter.evaluate(StatementAdapter.java:36)
	at com.carrotsearch.randomizedtesting.ThreadLeakControl$StatementRunner.run(ThreadLeakControl.java:367)
	at java.lang.Thread.run(Thread.java:745)




Build Log:
[...truncated 10470 lines...]
   [junit4] Suite: org.apache.solr.cloud.RecoveryAfterSoftCommitTest
   [junit4]   2> Creating dataDir: /home/jenkins/workspace/Lucene-Solr-5.x-Linux/solr/build/solr-core/test/J1/temp/solr.cloud.RecoveryAfterSoftCommitTest_1441C83C27EF9305-001/init-core-data-001
   [junit4]   2> 377310 INFO  (SUITE-RecoveryAfterSoftCommitTest-seed#[1441C83C27EF9305]-worker) [    ] o.a.s.BaseDistributedSearchTestCase Setting hostContext system property: /pmsa/qv
   [junit4]   2> 377313 INFO  (TEST-RecoveryAfterSoftCommitTest.test-seed#[1441C83C27EF9305]) [    ] o.a.s.c.ZkTestServer STARTING ZK TEST SERVER
   [junit4]   2> 377313 INFO  (Thread-1022) [    ] o.a.s.c.ZkTestServer client port:0.0.0.0/0.0.0.0:0
   [junit4]   2> 377313 INFO  (Thread-1022) [    ] o.a.s.c.ZkTestServer Starting server
   [junit4]   2> 377413 INFO  (TEST-RecoveryAfterSoftCommitTest.test-seed#[1441C83C27EF9305]) [    ] o.a.s.c.ZkTestServer start zk server on port:36479
   [junit4]   2> 377413 INFO  (TEST-RecoveryAfterSoftCommitTest.test-seed#[1441C83C27EF9305]) [    ] o.a.s.c.c.SolrZkClient Using default ZkCredentialsProvider
   [junit4]   2> 377414 INFO  (TEST-RecoveryAfterSoftCommitTest.test-seed#[1441C83C27EF9305]) [    ] o.a.s.c.c.ConnectionManager Waiting for client to connect to ZooKeeper
   [junit4]   2> 377416 INFO  (zkCallback-246-thread-1) [    ] o.a.s.c.c.ConnectionManager Watcher org.apache.solr.common.cloud.ConnectionManager@afdaa6 name:ZooKeeperConnection Watcher:127.0.0.1:36479 got event WatchedEvent state:SyncConnected type:None path:null path:null type:None
   [junit4]   2> 377416 INFO  (TEST-RecoveryAfterSoftCommitTest.test-seed#[1441C83C27EF9305]) [    ] o.a.s.c.c.ConnectionManager Client is connected to ZooKeeper
   [junit4]   2> 377416 INFO  (TEST-RecoveryAfterSoftCommitTest.test-seed#[1441C83C27EF9305]) [    ] o.a.s.c.c.SolrZkClient Using default ZkACLProvider
   [junit4]   2> 377416 INFO  (TEST-RecoveryAfterSoftCommitTest.test-seed#[1441C83C27EF9305]) [    ] o.a.s.c.c.SolrZkClient makePath: /solr
   [junit4]   2> 377417 INFO  (TEST-RecoveryAfterSoftCommitTest.test-seed#[1441C83C27EF9305]) [    ] o.a.s.c.c.SolrZkClient Using default ZkCredentialsProvider
   [junit4]   2> 377417 INFO  (TEST-RecoveryAfterSoftCommitTest.test-seed#[1441C83C27EF9305]) [    ] o.a.s.c.c.ConnectionManager Waiting for client to connect to ZooKeeper
   [junit4]   2> 377418 INFO  (zkCallback-247-thread-1) [    ] o.a.s.c.c.ConnectionManager Watcher org.apache.solr.common.cloud.ConnectionManager@1381304 name:ZooKeeperConnection Watcher:127.0.0.1:36479/solr got event WatchedEvent state:SyncConnected type:None path:null path:null type:None
   [junit4]   2> 377418 INFO  (TEST-RecoveryAfterSoftCommitTest.test-seed#[1441C83C27EF9305]) [    ] o.a.s.c.c.ConnectionManager Client is connected to ZooKeeper
   [junit4]   2> 377418 INFO  (TEST-RecoveryAfterSoftCommitTest.test-seed#[1441C83C27EF9305]) [    ] o.a.s.c.c.SolrZkClient Using default ZkACLProvider
   [junit4]   2> 377418 INFO  (TEST-RecoveryAfterSoftCommitTest.test-seed#[1441C83C27EF9305]) [    ] o.a.s.c.c.SolrZkClient makePath: /collections/collection1
   [junit4]   2> 377419 INFO  (TEST-RecoveryAfterSoftCommitTest.test-seed#[1441C83C27EF9305]) [    ] o.a.s.c.c.SolrZkClient makePath: /collections/collection1/shards
   [junit4]   2> 377419 INFO  (TEST-RecoveryAfterSoftCommitTest.test-seed#[1441C83C27EF9305]) [    ] o.a.s.c.c.SolrZkClient makePath: /collections/control_collection
   [junit4]   2> 377420 INFO  (TEST-RecoveryAfterSoftCommitTest.test-seed#[1441C83C27EF9305]) [    ] o.a.s.c.c.SolrZkClient makePath: /collections/control_collection/shards
   [junit4]   2> 377420 INFO  (TEST-RecoveryAfterSoftCommitTest.test-seed#[1441C83C27EF9305]) [    ] o.a.s.c.AbstractZkTestCase put /home/jenkins/workspace/Lucene-Solr-5.x-Linux/solr/core/src/test-files/solr/collection1/conf/solrconfig-tlog.xml to /configs/conf1/solrconfig.xml
   [junit4]   2> 377420 INFO  (TEST-RecoveryAfterSoftCommitTest.test-seed#[1441C83C27EF9305]) [    ] o.a.s.c.c.SolrZkClient makePath: /configs/conf1/solrconfig.xml
   [junit4]   2> 377421 INFO  (TEST-RecoveryAfterSoftCommitTest.test-seed#[1441C83C27EF9305]) [    ] o.a.s.c.AbstractZkTestCase put /home/jenkins/workspace/Lucene-Solr-5.x-Linux/solr/core/src/test-files/solr/collection1/conf/schema.xml to /configs/conf1/schema.xml
   [junit4]   2> 377421 INFO  (TEST-RecoveryAfterSoftCommitTest.test-seed#[1441C83C27EF9305]) [    ] o.a.s.c.c.SolrZkClient makePath: /configs/conf1/schema.xml
   [junit4]   2> 377422 INFO  (TEST-RecoveryAfterSoftCommitTest.test-seed#[1441C83C27EF9305]) [    ] o.a.s.c.AbstractZkTestCase put /home/jenkins/workspace/Lucene-Solr-5.x-Linux/solr/core/src/test-files/solr/collection1/conf/solrconfig.snippet.randomindexconfig.xml to /configs/conf1/solrconfig.snippet.randomindexconfig.xml
   [junit4]   2> 377422 INFO  (TEST-RecoveryAfterSoftCommitTest.test-seed#[1441C83C27EF9305]) [    ] o.a.s.c.c.SolrZkClient makePath: /configs/conf1/solrconfig.snippet.randomindexconfig.xml
   [junit4]   2> 377423 INFO  (TEST-RecoveryAfterSoftCommitTest.test-seed#[1441C83C27EF9305]) [    ] o.a.s.c.AbstractZkTestCase put /home/jenkins/workspace/Lucene-Solr-5.x-Linux/solr/core/src/test-files/solr/collection1/conf/stopwords.txt to /configs/conf1/stopwords.txt
   [junit4]   2> 377423 INFO  (TEST-RecoveryAfterSoftCommitTest.test-seed#[1441C83C27EF9305]) [    ] o.a.s.c.c.SolrZkClient makePath: /configs/conf1/stopwords.txt
   [junit4]   2> 377424 INFO  (TEST-RecoveryAfterSoftCommitTest.test-seed#[1441C83C27EF9305]) [    ] o.a.s.c.AbstractZkTestCase put /home/jenkins/workspace/Lucene-Solr-5.x-Linux/solr/core/src/test-files/solr/collection1/conf/protwords.txt to /configs/conf1/protwords.txt
   [junit4]   2> 377424 INFO  (TEST-RecoveryAfterSoftCommitTest.test-seed#[1441C83C27EF9305]) [    ] o.a.s.c.c.SolrZkClient makePath: /configs/conf1/protwords.txt
   [junit4]   2> 377424 INFO  (TEST-RecoveryAfterSoftCommitTest.test-seed#[1441C83C27EF9305]) [    ] o.a.s.c.AbstractZkTestCase put /home/jenkins/workspace/Lucene-Solr-5.x-Linux/solr/core/src/test-files/solr/collection1/conf/currency.xml to /configs/conf1/currency.xml
   [junit4]   2> 377424 INFO  (TEST-RecoveryAfterSoftCommitTest.test-seed#[1441C83C27EF9305]) [    ] o.a.s.c.c.SolrZkClient makePath: /configs/conf1/currency.xml
   [junit4]   2> 377425 INFO  (TEST-RecoveryAfterSoftCommitTest.test-seed#[1441C83C27EF9305]) [    ] o.a.s.c.AbstractZkTestCase put /home/jenkins/workspace/Lucene-Solr-5.x-Linux/solr/core/src/test-files/solr/collection1/conf/enumsConfig.xml to /configs/conf1/enumsConfig.xml
   [junit4]   2> 377425 INFO  (TEST-RecoveryAfterSoftCommitTest.test-seed#[1441C83C27EF9305]) [    ] o.a.s.c.c.SolrZkClient makePath: /configs/conf1/enumsConfig.xml
   [junit4]   2> 377425 INFO  (TEST-RecoveryAfterSoftCommitTest.test-seed#[1441C83C27EF9305]) [    ] o.a.s.c.AbstractZkTestCase put /home/jenkins/workspace/Lucene-Solr-5.x-Linux/solr/core/src/test-files/solr/collection1/conf/open-exchange-rates.json to /configs/conf1/open-exchange-rates.json
   [junit4]   2> 377426 INFO  (TEST-RecoveryAfterSoftCommitTest.test-seed#[1441C83C27EF9305]) [    ] o.a.s.c.c.SolrZkClient makePath: /configs/conf1/open-exchange-rates.json
   [junit4]   2> 377426 INFO  (TEST-RecoveryAfterSoftCommitTest.test-seed#[1441C83C27EF9305]) [    ] o.a.s.c.AbstractZkTestCase put /home/jenkins/workspace/Lucene-Solr-5.x-Linux/solr/core/src/test-files/solr/collection1/conf/mapping-ISOLatin1Accent.txt to /configs/conf1/mapping-ISOLatin1Accent.txt
   [junit4]   2> 377426 INFO  (TEST-RecoveryAfterSoftCommitTest.test-seed#[1441C83C27EF9305]) [    ] o.a.s.c.c.SolrZkClient makePath: /configs/conf1/mapping-ISOLatin1Accent.txt
   [junit4]   2> 377427 INFO  (TEST-RecoveryAfterSoftCommitTest.test-seed#[1441C83C27EF9305]) [    ] o.a.s.c.AbstractZkTestCase put /home/jenkins/workspace/Lucene-Solr-5.x-Linux/solr/core/src/test-files/solr/collection1/conf/old_synonyms.txt to /configs/conf1/old_synonyms.txt
   [junit4]   2> 377427 INFO  (TEST-RecoveryAfterSoftCommitTest.test-seed#[1441C83C27EF9305]) [    ] o.a.s.c.c.SolrZkClient makePath: /configs/conf1/old_synonyms.txt
   [junit4]   2> 377428 INFO  (TEST-RecoveryAfterSoftCommitTest.test-seed#[1441C83C27EF9305]) [    ] o.a.s.c.AbstractZkTestCase put /home/jenkins/workspace/Lucene-Solr-5.x-Linux/solr/core/src/test-files/solr/collection1/conf/synonyms.txt to /configs/conf1/synonyms.txt
   [junit4]   2> 377428 INFO  (TEST-RecoveryAfterSoftCommitTest.test-seed#[1441C83C27EF9305]) [    ] o.a.s.c.c.SolrZkClient makePath: /configs/conf1/synonyms.txt
   [junit4]   2> 377482 INFO  (TEST-RecoveryAfterSoftCommitTest.test-seed#[1441C83C27EF9305]) [    ] o.a.s.SolrTestCaseJ4 Writing core.properties file to /home/jenkins/workspace/Lucene-Solr-5.x-Linux/solr/build/solr-core/test/J1/temp/solr.cloud.RecoveryAfterSoftCommitTest_1441C83C27EF9305-001/control-001/cores/collection1
   [junit4]   2> 377484 INFO  (TEST-RecoveryAfterSoftCommitTest.test-seed#[1441C83C27EF9305]) [    ] o.e.j.s.Server jetty-9.2.13.v20150730
   [junit4]   2> 377485 INFO  (TEST-RecoveryAfterSoftCommitTest.test-seed#[1441C83C27EF9305]) [    ] o.e.j.s.h.ContextHandler Started o.e.j.s.ServletContextHandler@e758b4{/pmsa/qv,null,AVAILABLE}
   [junit4]   2> 377486 INFO  (TEST-RecoveryAfterSoftCommitTest.test-seed#[1441C83C27EF9305]) [    ] o.e.j.s.ServerConnector Started ServerConnector@135f851{HTTP/1.1}{127.0.0.1:35539}
   [junit4]   2> 377486 INFO  (TEST-RecoveryAfterSoftCommitTest.test-seed#[1441C83C27EF9305]) [    ] o.e.j.s.Server Started @378920ms
   [junit4]   2> 377486 INFO  (TEST-RecoveryAfterSoftCommitTest.test-seed#[1441C83C27EF9305]) [    ] o.a.s.c.s.e.JettySolrRunner Jetty properties: {hostContext=/pmsa/qv, coreRootDirectory=/home/jenkins/workspace/Lucene-Solr-5.x-Linux/solr/build/solr-core/test/J1/temp/solr.cloud.RecoveryAfterSoftCommitTest_1441C83C27EF9305-001/control-001/cores, hostPort=53871, solr.data.dir=/home/jenkins/workspace/Lucene-Solr-5.x-Linux/solr/build/solr-core/test/J1/temp/solr.cloud.RecoveryAfterSoftCommitTest_1441C83C27EF9305-001/tempDir-001/control/data}
   [junit4]   2> 377487 INFO  (TEST-RecoveryAfterSoftCommitTest.test-seed#[1441C83C27EF9305]) [    ] o.a.s.s.SolrDispatchFilter SolrDispatchFilter.init(): sun.misc.Launcher$AppClassLoader@327236
   [junit4]   2> 377487 INFO  (TEST-RecoveryAfterSoftCommitTest.test-seed#[1441C83C27EF9305]) [    ] o.a.s.c.SolrResourceLoader new SolrResourceLoader for directory: '/home/jenkins/workspace/Lucene-Solr-5.x-Linux/solr/build/solr-core/test/J1/temp/solr.cloud.RecoveryAfterSoftCommitTest_1441C83C27EF9305-001/control-001'
   [junit4]   2> 377487 INFO  (TEST-RecoveryAfterSoftCommitTest.test-seed#[1441C83C27EF9305]) [    ] o.a.s.c.SolrResourceLoader JNDI not configured for solr (NoInitialContextEx)
   [junit4]   2> 377488 INFO  (TEST-RecoveryAfterSoftCommitTest.test-seed#[1441C83C27EF9305]) [    ] o.a.s.c.SolrResourceLoader solr home defaulted to 'solr/' (could not find system property or JNDI)
   [junit4]   2> 377488 INFO  (TEST-RecoveryAfterSoftCommitTest.test-seed#[1441C83C27EF9305]) [    ] o.a.s.c.c.SolrZkClient Using default ZkCredentialsProvider
   [junit4]   2> 377488 INFO  (TEST-RecoveryAfterSoftCommitTest.test-seed#[1441C83C27EF9305]) [    ] o.a.s.c.c.ConnectionManager Waiting for client to connect to ZooKeeper
   [junit4]   2> 377489 INFO  (zkCallback-248-thread-1) [    ] o.a.s.c.c.ConnectionManager Watcher org.apache.solr.common.cloud.ConnectionManager@4d37d1 name:ZooKeeperConnection Watcher:127.0.0.1:36479/solr got event WatchedEvent state:SyncConnected type:None path:null path:null type:None
   [junit4]   2> 377489 INFO  (TEST-RecoveryAfterSoftCommitTest.test-seed#[1441C83C27EF9305]) [    ] o.a.s.c.c.ConnectionManager Client is connected to ZooKeeper
   [junit4]   2> 377489 INFO  (TEST-RecoveryAfterSoftCommitTest.test-seed#[1441C83C27EF9305]) [    ] o.a.s.c.c.SolrZkClient Using default ZkACLProvider
   [junit4]   2> 377489 INFO  (TEST-RecoveryAfterSoftCommitTest.test-seed#[1441C83C27EF9305]) [    ] o.a.s.s.SolrDispatchFilter Loading solr.xml from SolrHome (not found in ZooKeeper)
   [junit4]   2> 377490 INFO  (TEST-RecoveryAfterSoftCommitTest.test-seed#[1441C83C27EF9305]) [    ] o.a.s.c.SolrXmlConfig Loading container configuration from /home/jenkins/workspace/Lucene-Solr-5.x-Linux/solr/build/solr-core/test/J1/temp/solr.cloud.RecoveryAfterSoftCommitTest_1441C83C27EF9305-001/control-001/solr.xml
   [junit4]   2> 377509 INFO  (TEST-RecoveryAfterSoftCommitTest.test-seed#[1441C83C27EF9305]) [    ] o.a.s.c.CorePropertiesLocator Config-defined core root directory: /home/jenkins/workspace/Lucene-Solr-5.x-Linux/solr/build/solr-core/test/J1/temp/solr.cloud.RecoveryAfterSoftCommitTest_1441C83C27EF9305-001/control-001/cores
   [junit4]   2> 377509 INFO  (TEST-RecoveryAfterSoftCommitTest.test-seed#[1441C83C27EF9305]) [    ] o.a.s.c.CoreContainer New CoreContainer 25511211
   [junit4]   2> 377509 INFO  (TEST-RecoveryAfterSoftCommitTest.test-seed#[1441C83C27EF9305]) [    ] o.a.s.c.CoreContainer Loading cores into CoreContainer [instanceDir=/home/jenkins/workspace/Lucene-Solr-5.x-Linux/solr/build/solr-core/test/J1/temp/solr.cloud.RecoveryAfterSoftCommitTest_1441C83C27EF9305-001/control-001]
   [junit4]   2> 377509 WARN  (TEST-RecoveryAfterSoftCommitTest.test-seed#[1441C83C27EF9305]) [    ] o.a.s.c.CoreContainer Couldn't add files from /home/jenkins/workspace/Lucene-Solr-5.x-Linux/solr/build/solr-core/test/J1/temp/solr.cloud.RecoveryAfterSoftCommitTest_1441C83C27EF9305-001/control-001/lib to classpath: /home/jenkins/workspace/Lucene-Solr-5.x-Linux/solr/build/solr-core/test/J1/temp/solr.cloud.RecoveryAfterSoftCommitTest_1441C83C27EF9305-001/control-001/lib
   [junit4]   2> 377509 INFO  (TEST-RecoveryAfterSoftCommitTest.test-seed#[1441C83C27EF9305]) [    ] o.a.s.h.c.HttpShardHandlerFactory created with socketTimeout : 90000,urlScheme : ,connTimeout : 15000,maxConnectionsPerHost : 20,maxConnections : 10000,corePoolSize : 0,maximumPoolSize : 2147483647,maxThreadIdleTime : 5,sizeOfQueue : -1,fairnessPolicy : false,useRetries : false,
   [junit4]   2> 377510 INFO  (TEST-RecoveryAfterSoftCommitTest.test-seed#[1441C83C27EF9305]) [    ] o.a.s.u.UpdateShardHandler Creating UpdateShardHandler HTTP client with params: socketTimeout=340000&connTimeout=45000&retry=true
   [junit4]   2> 377510 INFO  (TEST-RecoveryAfterSoftCommitTest.test-seed#[1441C83C27EF9305]) [    ] o.a.s.l.LogWatcher SLF4J impl is org.slf4j.impl.Log4jLoggerFactory
   [junit4]   2> 377510 INFO  (TEST-RecoveryAfterSoftCommitTest.test-seed#[1441C83C27EF9305]) [    ] o.a.s.l.LogWatcher Registering Log Listener [Log4j (org.slf4j.impl.Log4jLoggerFactory)]
   [junit4]   2> 377511 INFO  (TEST-RecoveryAfterSoftCommitTest.test-seed#[1441C83C27EF9305]) [    ] o.a.s.c.ZkContainer Zookeeper client=127.0.0.1:36479/solr
   [junit4]   2> 377511 INFO  (TEST-RecoveryAfterSoftCommitTest.test-seed#[1441C83C27EF9305]) [    ] o.a.s.c.ZkController zkHost includes chroot
   [junit4]   2> 377511 INFO  (TEST-RecoveryAfterSoftCommitTest.test-seed#[1441C83C27EF9305]) [    ] o.a.s.c.c.SolrZkClient Using default ZkCredentialsProvider
   [junit4]   2> 377512 INFO  (TEST-RecoveryAfterSoftCommitTest.test-seed#[1441C83C27EF9305]) [    ] o.a.s.c.c.ConnectionManager Waiting for client to connect to ZooKeeper
   [junit4]   2> 377512 INFO  (zkCallback-250-thread-1) [    ] o.a.s.c.c.ConnectionManager Watcher org.apache.solr.common.cloud.ConnectionManager@1883dfb name:ZooKeeperConnection Watcher:127.0.0.1:36479 got event WatchedEvent state:SyncConnected type:None path:null path:null type:None
   [junit4]   2> 377513 INFO  (TEST-RecoveryAfterSoftCommitTest.test-seed#[1441C83C27EF9305]) [    ] o.a.s.c.c.ConnectionManager Client is connected to ZooKeeper
   [junit4]   2> 377513 INFO  (TEST-RecoveryAfterSoftCommitTest.test-seed#[1441C83C27EF9305]) [    ] o.a.s.c.c.SolrZkClient Using default ZkACLProvider
   [junit4]   2> 377514 INFO  (TEST-RecoveryAfterSoftCommitTest.test-seed#[1441C83C27EF9305]) [n:127.0.0.1:53871_pmsa%2Fqv    ] o.a.s.c.c.ConnectionManager Waiting for client to connect to ZooKeeper
   [junit4]   2> 377514 INFO  (zkCallback-251-thread-1-processing-n:127.0.0.1:53871_pmsa%2Fqv) [n:127.0.0.1:53871_pmsa%2Fqv    ] o.a.s.c.c.ConnectionManager Watcher org.apache.solr.common.cloud.ConnectionManager@593714 name:ZooKeeperConnection Watcher:127.0.0.1:36479/solr got event WatchedEvent state:SyncConnected type:None path:null path:null type:None
   [junit4]   2> 377514 INFO  (TEST-RecoveryAfterSoftCommitTest.test-seed#[1441C83C27EF9305]) [n:127.0.0.1:53871_pmsa%2Fqv    ] o.a.s.c.c.ConnectionManager Client is connected to ZooKeeper
   [junit4]   2> 377515 INFO  (TEST-RecoveryAfterSoftCommitTest.test-seed#[1441C83C27EF9305]) [n:127.0.0.1:53871_pmsa%2Fqv    ] o.a.s.c.c.SolrZkClient makePath: /overseer/queue
   [junit4]   2> 377516 INFO  (TEST-RecoveryAfterSoftCommitTest.test-seed#[1441C83C27EF9305]) [n:127.0.0.1:53871_pmsa%2Fqv    ] o.a.s.c.c.SolrZkClient makePath: /overseer/collection-queue-work
   [junit4]   2> 377517 INFO  (TEST-RecoveryAfterSoftCommitTest.test-seed#[1441C83C27EF9305]) [n:127.0.0.1:53871_pmsa%2Fqv    ] o.a.s.c.c.SolrZkClient makePath: /overseer/collection-map-running
   [junit4]   2> 377518 INFO  (TEST-RecoveryAfterSoftCommitTest.test-seed#[1441C83C27EF9305]) [n:127.0.0.1:53871_pmsa%2Fqv    ] o.a.s.c.c.SolrZkClient makePath: /overseer/collection-map-completed
   [junit4]   2> 377519 INFO  (TEST-RecoveryAfterSoftCommitTest.test-seed#[1441C83C27EF9305]) [n:127.0.0.1:53871_pmsa%2Fqv    ] o.a.s.c.c.SolrZkClient makePath: /overseer/collection-map-failure
   [junit4]   2> 377519 INFO  (TEST-RecoveryAfterSoftCommitTest.test-seed#[1441C83C27EF9305]) [n:127.0.0.1:53871_pmsa%2Fqv    ] o.a.s.c.c.SolrZkClient makePath: /live_nodes
   [junit4]   2> 377520 INFO  (TEST-RecoveryAfterSoftCommitTest.test-seed#[1441C83C27EF9305]) [n:127.0.0.1:53871_pmsa%2Fqv    ] o.a.s.c.c.SolrZkClient makePath: /aliases.json
   [junit4]   2> 377520 INFO  (TEST-RecoveryAfterSoftCommitTest.test-seed#[1441C83C27EF9305]) [n:127.0.0.1:53871_pmsa%2Fqv    ] o.a.s.c.c.SolrZkClient makePath: /clusterstate.json
   [junit4]   2> 377521 INFO  (TEST-RecoveryAfterSoftCommitTest.test-seed#[1441C83C27EF9305]) [n:127.0.0.1:53871_pmsa%2Fqv    ] o.a.s.c.c.SolrZkClient makePath: /security.json
   [junit4]   2> 377521 INFO  (TEST-RecoveryAfterSoftCommitTest.test-seed#[1441C83C27EF9305]) [n:127.0.0.1:53871_pmsa%2Fqv    ] o.a.s.c.ZkController Register node as live in ZooKeeper:/live_nodes/127.0.0.1:53871_pmsa%2Fqv
   [junit4]   2> 377521 INFO  (TEST-RecoveryAfterSoftCommitTest.test-seed#[1441C83C27EF9305]) [n:127.0.0.1:53871_pmsa%2Fqv    ] o.a.s.c.c.SolrZkClient makePath: /live_nodes/127.0.0.1:53871_pmsa%2Fqv
   [junit4]   2> 377521 INFO  (TEST-RecoveryAfterSoftCommitTest.test-seed#[1441C83C27EF9305]) [n:127.0.0.1:53871_pmsa%2Fqv    ] o.a.s.c.c.SolrZkClient makePath: /overseer_elect
   [junit4]   2> 377522 INFO  (TEST-RecoveryAfterSoftCommitTest.test-seed#[1441C83C27EF9305]) [n:127.0.0.1:53871_pmsa%2Fqv    ] o.a.s.c.c.SolrZkClient makePath: /overseer_elect/election
   [junit4]   2> 377522 INFO  (TEST-RecoveryAfterSoftCommitTest.test-seed#[1441C83C27EF9305]) [n:127.0.0.1:53871_pmsa%2Fqv    ] o.a.s.c.Overseer Overseer (id=null) closing
   [junit4]   2> 377522 INFO  (TEST-RecoveryAfterSoftCommitTest.test-seed#[1441C83C27EF9305]) [n:127.0.0.1:53871_pmsa%2Fqv    ] o.a.s.c.LeaderElector Joined leadership election with path: /overseer_elect/election/95150573225115652-127.0.0.1:53871_pmsa%2Fqv-n_0000000000
   [junit4]   2> 377523 INFO  (TEST-RecoveryAfterSoftCommitTest.test-seed#[1441C83C27EF9305]) [n:127.0.0.1:53871_pmsa%2Fqv    ] o.a.s.c.OverseerElectionContext I am going to be the leader 127.0.0.1:53871_pmsa%2Fqv
   [junit4]   2> 377523 INFO  (TEST-RecoveryAfterSoftCommitTest.test-seed#[1441C83C27EF9305]) [n:127.0.0.1:53871_pmsa%2Fqv    ] o.a.s.c.c.SolrZkClient makePath: /overseer_elect/leader
   [junit4]   2> 377523 INFO  (TEST-RecoveryAfterSoftCommitTest.test-seed#[1441C83C27EF9305]) [n:127.0.0.1:53871_pmsa%2Fqv    ] o.a.s.c.Overseer Overseer (id=95150573225115652-127.0.0.1:53871_pmsa%2Fqv-n_0000000000) starting
   [junit4]   2> 377524 INFO  (TEST-RecoveryAfterSoftCommitTest.test-seed#[1441C83C27EF9305]) [n:127.0.0.1:53871_pmsa%2Fqv    ] o.a.s.c.c.SolrZkClient makePath: /overseer/queue-work
   [junit4]   2> 377526 INFO  (TEST-RecoveryAfterSoftCommitTest.test-seed#[1441C83C27EF9305]) [n:127.0.0.1:53871_pmsa%2Fqv    ] o.a.s.c.OverseerAutoReplicaFailoverThread Starting OverseerAutoReplicaFailoverThread autoReplicaFailoverWorkLoopDelay=10000 autoReplicaFailoverWaitAfterExpiration=30000 autoReplicaFailoverBadNodeExpiration=60000
   [junit4]   2> 377526 INFO  (OverseerCollectionConfigSetProcessor-95150573225115652-127.0.0.1:53871_pmsa%2Fqv-n_0000000000) [n:127.0.0.1:53871_pmsa%2Fqv    ] o.a.s.c.OverseerTaskProcessor Process current queue of overseer operations
   [junit4]   2> 377526 INFO  (TEST-RecoveryAfterSoftCommitTest.test-seed#[1441C83C27EF9305]) [n:127.0.0.1:53871_pmsa%2Fqv    ] o.a.s.c.c.ZkStateReader Updating cluster state from ZooKeeper... 
   [junit4]   2> 377526 INFO  (OverseerStateUpdate-95150573225115652-127.0.0.1:53871_pmsa%2Fqv-n_0000000000) [n:127.0.0.1:53871_pmsa%2Fqv    ] o.a.s.c.Overseer Starting to work on the main queue
   [junit4]   2> 377542 INFO  (TEST-RecoveryAfterSoftCommitTest.test-seed#[1441C83C27EF9305]) [n:127.0.0.1:53871_pmsa%2Fqv    ] o.a.s.c.CoreContainer Security conf doesn't exist. Skipping setup for authorization module.
   [junit4]   2> 377542 INFO  (TEST-RecoveryAfterSoftCommitTest.test-seed#[1441C83C27EF9305]) [n:127.0.0.1:53871_pmsa%2Fqv    ] o.a.s.c.CoreContainer No authentication plugin used.
   [junit4]   2> 377543 INFO  (TEST-RecoveryAfterSoftCommitTest.test-seed#[1441C83C27EF9305]) [n:127.0.0.1:53871_pmsa%2Fqv    ] o.a.s.c.CorePropertiesLocator Looking for core definitions underneath /home/jenkins/workspace/Lucene-Solr-5.x-Linux/solr/build/solr-core/test/J1/temp/solr.cloud.RecoveryAfterSoftCommitTest_1441C83C27EF9305-001/control-001/cores
   [junit4]   2> 377543 INFO  (TEST-RecoveryAfterSoftCommitTest.test-seed#[1441C83C27EF9305]) [n:127.0.0.1:53871_pmsa%2Fqv    ] o.a.s.c.CoreDescriptor Created CoreDescriptor: {schema=schema.xml, transient=false, config=solrconfig.xml, name=collection1, coreNodeName=, shard=, loadOnStartup=true, dataDir=data/, collection=control_collection, configSetProperties=configsetprops.json}
   [junit4]   2> 377544 INFO  (TEST-RecoveryAfterSoftCommitTest.test-seed#[1441C83C27EF9305]) [n:127.0.0.1:53871_pmsa%2Fqv    ] o.a.s.c.CorePropertiesLocator Found core collection1 in /home/jenkins/workspace/Lucene-Solr-5.x-Linux/solr/build/solr-core/test/J1/temp/solr.cloud.RecoveryAfterSoftCommitTest_1441C83C27EF9305-001/control-001/cores/collection1
   [junit4]   2> 377544 INFO  (TEST-RecoveryAfterSoftCommitTest.test-seed#[1441C83C27EF9305]) [n:127.0.0.1:53871_pmsa%2Fqv    ] o.a.s.c.CorePropertiesLocator Found 1 core definitions
   [junit4]   2> 377544 INFO  (TEST-RecoveryAfterSoftCommitTest.test-seed#[1441C83C27EF9305]) [n:127.0.0.1:53871_pmsa%2Fqv    ] o.a.s.s.SolrDispatchFilter user.dir=/home/jenkins/workspace/Lucene-Solr-5.x-Linux/solr/build/solr-core/test/J1
   [junit4]   2> 377544 INFO  (TEST-RecoveryAfterSoftCommitTest.test-seed#[1441C83C27EF9305]) [n:127.0.0.1:53871_pmsa%2Fqv    ] o.a.s.s.SolrDispatchFilter SolrDispatchFilter.init() done
   [junit4]   2> 377544 INFO  (coreLoadExecutor-1039-thread-1-processing-n:127.0.0.1:53871_pmsa%2Fqv) [n:127.0.0.1:53871_pmsa%2Fqv c:control_collection   x:collection1] o.a.s.c.ZkController publishing state=down
   [junit4]   2> 377544 INFO  (coreLoadExecutor-1039-thread-1-processing-n:127.0.0.1:53871_pmsa%2Fqv) [n:127.0.0.1:53871_pmsa%2Fqv c:control_collection   x:collection1] o.a.s.c.ZkController numShards not found on descriptor - reading it from system property
   [junit4]   2> 377545 INFO  (OverseerStateUpdate-95150573225115652-127.0.0.1:53871_pmsa%2Fqv-n_0000000000) [n:127.0.0.1:53871_pmsa%2Fqv    ] o.a.s.c.Overseer processMessage: queueSize: 1, message = {
   [junit4]   2>   "base_url":"http://127.0.0.1:53871/pmsa/qv",
   [junit4]   2>   "roles":null,
   [junit4]   2>   "state":"down",
   [junit4]   2>   "operation":"state",
   [junit4]   2>   "shard":null,
   [junit4]   2>   "node_name":"127.0.0.1:53871_pmsa%2Fqv",
   [junit4]   2>   "collection":"control_collection",
   [junit4]   2>   "numShards":"1",
   [junit4]   2>   "core":"collection1"} current state version: 0
   [junit4]   2> 377545 INFO  (coreLoadExecutor-1039-thread-1-processing-n:127.0.0.1:53871_pmsa%2Fqv) [n:127.0.0.1:53871_pmsa%2Fqv c:control_collection   x:collection1] o.a.s.c.ZkController look for our core node name
   [junit4]   2> 377545 INFO  (OverseerStateUpdate-95150573225115652-127.0.0.1:53871_pmsa%2Fqv-n_0000000000) [n:127.0.0.1:53871_pmsa%2Fqv    ] o.a.s.c.o.ReplicaMutator Update state numShards=1 message={
   [junit4]   2>   "base_url":"http://127.0.0.1:53871/pmsa/qv",
   [junit4]   2>   "roles":null,
   [junit4]   2>   "state":"down",
   [junit4]   2>   "operation":"state",
   [junit4]   2>   "shard":null,
   [junit4]   2>   "node_name":"127.0.0.1:53871_pmsa%2Fqv",
   [junit4]   2>   "collection":"control_collection",
   [junit4]   2>   "numShards":"1",
   [junit4]   2>   "core":"collection1"}
   [junit4]   2> 377546 INFO  (OverseerStateUpdate-95150573225115652-127.0.0.1:53871_pmsa%2Fqv-n_0000000000) [n:127.0.0.1:53871_pmsa%2Fqv    ] o.a.s.c.o.ClusterStateMutator building a new cName: control_collection
   [junit4]   2> 377546 INFO  (OverseerStateUpdate-95150573225115652-127.0.0.1:53871_pmsa%2Fqv-n_0000000000) [n:127.0.0.1:53871_pmsa%2Fqv    ] o.a.s.c.o.ReplicaMutator Assigning new node to shard shard=shard1
   [junit4]   2> 377546 INFO  (zkCallback-251-thread-1-processing-n:127.0.0.1:53871_pmsa%2Fqv) [n:127.0.0.1:53871_pmsa%2Fqv    ] o.a.s.c.c.ZkStateReader A cluster state change: [WatchedEvent state:SyncConnected type:NodeDataChanged path:/clusterstate.json], has occurred - updating... (live nodes size: [1])
   [junit4]   2> 378545 INFO  (coreLoadExecutor-1039-thread-1-processing-n:127.0.0.1:53871_pmsa%2Fqv) [n:127.0.0.1:53871_pmsa%2Fqv c:control_collection   x:collection1] o.a.s.c.ZkController waiting to find shard id in clusterstate for collection1
   [junit4]   2> 378546 INFO  (coreLoadExecutor-1039-thread-1-processing-n:127.0.0.1:53871_pmsa%2Fqv) [n:127.0.0.1:53871_pmsa%2Fqv c:control_collection   x:collection1] o.a.s.c.ZkController Check for collection zkNode:control_collection
   [junit4]   2> 378546 INFO  (coreLoadExecutor-1039-thread-1-processing-n:127.0.0.1:53871_pmsa%2Fqv) [n:127.0.0.1:53871_pmsa%2Fqv c:control_collection   x:collection1] o.a.s.c.ZkController Collection zkNode exists
   [junit4]   2> 378546 INFO  (coreLoadExecutor-1039-thread-1-processing-n:127.0.0.1:53871_pmsa%2Fqv) [n:127.0.0.1:53871_pmsa%2Fqv c:control_collection   x:collection1] o.a.s.c.c.ZkStateReader Load collection config from: [/collections/control_collection]
   [junit4]   2> 378546 INFO  (coreLoadExecutor-1039-thread-1-processing-n:127.0.0.1:53871_pmsa%2Fqv) [n:127.0.0.1:53871_pmsa%2Fqv c:control_collection   x:collection1] o.a.s.c.c.ZkStateReader path=[/collections/control_collection] [configName]=[conf1] specified config exists in ZooKeeper
   [junit4]   2> 378546 INFO  (coreLoadExecutor-1039-thread-1-processing-n:127.0.0.1:53871_pmsa%2Fqv) [n:127.0.0.1:53871_pmsa%2Fqv c:control_collection   x:collection1] o.a.s.c.SolrResourceLoader new SolrResourceLoader for directory: '/home/jenkins/workspace/Lucene-Solr-5.x-Linux/solr/build/solr-core/test/J1/temp/solr.cloud.RecoveryAfterSoftCommitTest_1441C83C27EF9305-001/control-001/cores/collection1'
   [junit4]   2> 378546 INFO  (coreLoadExecutor-1039-thread-1-processing-n:127.0.0.1:53871_pmsa%2Fqv) [n:127.0.0.1:53871_pmsa%2Fqv c:control_collection   x:collection1] o.a.s.c.SolrResourceLoader JNDI not configured for solr (NoInitialContextEx)
   [junit4]   2> 378546 INFO  (coreLoadExecutor-1039-thread-1-processing-n:127.0.0.1:53871_pmsa%2Fqv) [n:127.0.0.1:53871_pmsa%2Fqv c:control_collection   x:collection1] o.a.s.c.SolrResourceLoader solr home defaulted to 'solr/' (could not find system property or JNDI)
   [junit4]   2> 378548 INFO  (coreLoadExecutor-1039-thread-1-processing-n:127.0.0.1:53871_pmsa%2Fqv) [n:127.0.0.1:53871_pmsa%2Fqv c:control_collection   x:collection1] o.a.s.c.Config loaded config solrconfig.xml with version 0 
   [junit4]   2> 378552 INFO  (coreLoadExecutor-1039-thread-1-processing-n:127.0.0.1:53871_pmsa%2Fqv) [n:127.0.0.1:53871_pmsa%2Fqv c:control_collection   x:collection1] o.a.s.c.SolrConfig current version of requestparams : -1
   [junit4]   2> 378573 INFO  (coreLoadExecutor-1039-thread-1-processing-n:127.0.0.1:53871_pmsa%2Fqv) [n:127.0.0.1:53871_pmsa%2Fqv c:control_collection   x:collection1] o.a.s.c.SolrConfig Using Lucene MatchVersion: 5.5.0
   [junit4]   2> 378594 INFO  (coreLoadExecutor-1039-thread-1-processing-n:127.0.0.1:53871_pmsa%2Fqv) [n:127.0.0.1:53871_pmsa%2Fqv c:control_collection   x:collection1] o.a.s.c.SolrConfig Loaded SolrConfig: solrconfig.xml
   [junit4]   2> 378599 INFO  (coreLoadExecutor-1039-thread-1-processing-n:127.0.0.1:53871_pmsa%2Fqv) [n:127.0.0.1:53871_pmsa%2Fqv c:control_collection   x:collection1] o.a.s.s.IndexSchema [collection1] Schema name=test
   [junit4]   2> 378821 INFO  (coreLoadExecutor-1039-thread-1-processing-n:127.0.0.1:53871_pmsa%2Fqv) [n:127.0.0.1:53871_pmsa%2Fqv c:control_collection   x:collection1] o.a.s.s.OpenExchangeRatesOrgProvider Initialized with rates=open-exchange-rates.json, refreshInterval=1440.
   [junit4]   2> 378826 INFO  (coreLoadExecutor-1039-thread-1-processing-n:127.0.0.1:53871_pmsa%2Fqv) [n:127.0.0.1:53871_pmsa%2Fqv c:control_collection   x:collection1] o.a.s.s.IndexSchema default search field in schema is text
   [junit4]   2> 378827 INFO  (coreLoadExecutor-1039-thread-1-processing-n:127.0.0.1:53871_pmsa%2Fqv) [n:127.0.0.1:53871_pmsa%2Fqv c:control_collection   x:collection1] o.a.s.s.IndexSchema unique key field: id
   [junit4]   2> 378832 INFO  (coreLoadExecutor-1039-thread-1-processing-n:127.0.0.1:53871_pmsa%2Fqv) [n:127.0.0.1:53871_pmsa%2Fqv c:control_collection   x:collection1] o.a.s.s.FileExchangeRateProvider Reloading exchange rates from file currency.xml
   [junit4]   2> 378834 INFO  (coreLoadExecutor-1039-thread-1-processing-n:127.0.0.1:53871_pmsa%2Fqv) [n:127.0.0.1:53871_pmsa%2Fqv c:control_collection   x:collection1] o.a.s.s.FileExchangeRateProvider Reloading exchange rates from file currency.xml
   [junit4]   2> 378836 INFO  (coreLoadExecutor-1039-thread-1-processing-n:127.0.0.1:53871_pmsa%2Fqv) [n:127.0.0.1:53871_pmsa%2Fqv c:control_collection   x:collection1] o.a.s.s.OpenExchangeRatesOrgProvider Reloading exchange rates from open-exchange-rates.json
   [junit4]   2> 378836 WARN  (coreLoadExecutor-1039-thread-1-processing-n:127.0.0.1:53871_pmsa%2Fqv) [n:127.0.0.1:53871_pmsa%2Fqv c:control_collection   x:collection1] o.a.s.s.OpenExchangeRatesOrgProvider Unknown key IMPORTANT NOTE
   [junit4]   2> 378836 WARN  (coreLoadExecutor-1039-thread-1-processing-n:127.0.0.1:53871_pmsa%2Fqv) [n:127.0.0.1:53871_pmsa%2Fqv c:control_collection   x:collection1] o.a.s.s.OpenExchangeRatesOrgProvider Expected key, got STRING
   [junit4]   2> 378836 INFO  (coreLoadExecutor-1039-thread-1-processing-n:127.0.0.1:53871_pmsa%2Fqv) [n:127.0.0.1:53871_pmsa%2Fqv c:control_collection   x:collection1] o.a.s.s.OpenExchangeRatesOrgProvider Reloading exchange rates from open-exchange-rates.json
   [junit4]   2> 378836 WARN  (coreLoadExecutor-1039-thread-1-processing-n:127.0.0.1:53871_pmsa%2Fqv) [n:127.0.0.1:53871_pmsa%2Fqv c:control_collection   x:collection1] o.a.s.s.OpenExchangeRatesOrgProvider Unknown key IMPORTANT NOTE
   [junit4]   2> 378836 WARN  (coreLoadExecutor-1039-thread-1-processing-n:127.0.0.1:53871_pmsa%2Fqv) [n:127.0.0.1:53871_pmsa%2Fqv c:control_collection   x:collection1] o.a.s.s.OpenExchangeRatesOrgProvider Expected key, got STRING
   [junit4]   2> 378837 INFO  (coreLoadExecutor-1039-thread-1-processing-n:127.0.0.1:53871_pmsa%2Fqv) [n:127.0.0.1:53871_pmsa%2Fqv c:control_collection   x:collection1] o.a.s.c.ConfigSetProperties Did not find ConfigSet properties, assuming default properties: Can't find resource 'configsetprops.json' in classpath or '/configs/conf1', cwd=/home/jenkins/workspace/Lucene-Solr-5.x-Linux/solr/build/solr-core/test/J1
   [junit4]   2> 378837 INFO  (coreLoadExecutor-1039-thread-1-processing-n:127.0.0.1:53871_pmsa%2Fqv) [n:127.0.0.1:53871_pmsa%2Fqv c:control_collection   x:collection1] o.a.s.c.CoreContainer Creating SolrCore 'collection1' using configuration from collection control_collection
   [junit4]   2> 378837 INFO  (coreLoadExecutor-1039-thread-1-processing-n:127.0.0.1:53871_pmsa%2Fqv) [n:127.0.0.1:53871_pmsa%2Fqv c:control_collection s:shard1 r:core_node1 x:collection1] o.a.s.c.SolrCore org.apache.solr.core.MockDirectoryFactory
   [junit4]   2> 378837 INFO  (coreLoadExecutor-1039-thread-1-processing-n:127.0.0.1:53871_pmsa%2Fqv) [n:127.0.0.1:53871_pmsa%2Fqv c:control_collection s:shard1 r:core_node1 x:collection1] o.a.s.c.SolrCore [[collection1] ] Opening new SolrCore at [/home/jenkins/workspace/Lucene-Solr-5.x-Linux/solr/build/solr-core/test/J1/temp/solr.cloud.RecoveryAfterSoftCommitTest_1441C83C27EF9305-001/control-001/cores/collection1], dataDir=[/home/jenkins/workspace/Lucene-Solr-5.x-Linux/solr/build/solr-core/test/J1/temp/solr.cloud.RecoveryAfterSoftCommitTest_1441C83C27EF9305-001/control-001/cores/collection1/data/]
   [junit4]   2> 378837 INFO  (coreLoadExecutor-1039-thread-1-processing-n:127.0.0.1:53871_pmsa%2Fqv) [n:127.0.0.1:53871_pmsa%2Fqv c:control_collection s:shard1 r:core_node1 x:collection1] o.a.s.c.JmxMonitoredMap JMX monitoring is enabled. Adding Solr mbeans to JMX Server: com.sun.jmx.mbeanserver.JmxMBeanServer@3388c4
   [junit4]   2> 378838 INFO  (coreLoadExecutor-1039-thread-1-processing-n:127.0.0.1:53871_pmsa%2Fqv) [n:127.0.0.1:53871_pmsa%2Fqv c:control_collection s:shard1 r:core_node1 x:collection1] o.a.s.c.CachingDirectoryFactory return new directory for /home/jenkins/workspace/Lucene-Solr-5.x-Linux/solr/build/solr-core/test/J1/temp/solr.cloud.RecoveryAfterSoftCommitTest_1441C83C27EF9305-001/control-001/cores/collection1/data
   [junit4]   2> 378838 INFO  (coreLoadExecutor-1039-thread-1-processing-n:127.0.0.1:53871_pmsa%2Fqv) [n:127.0.0.1:53871_pmsa%2Fqv c:control_collection s:shard1 r:core_node1 x:collection1] o.a.s.c.SolrCore New index directory detected: old=null new=/home/jenkins/workspace/Lucene-Solr-5.x-Linux/solr/build/solr-core/test/J1/temp/solr.cloud.RecoveryAfterSoftCommitTest_1441C83C27EF9305-001/control-001/cores/collection1/data/index/
   [junit4]   2> 378838 WARN  (coreLoadExecutor-1039-thread-1-processing-n:127.0.0.1:53871_pmsa%2Fqv) [n:127.0.0.1:53871_pmsa%2Fqv c:control_collection s:shard1 r:core_node1 x:collection1] o.a.s.c.SolrCore [collection1] Solr index directory '/home/jenkins/workspace/Lucene-Solr-5.x-Linux/solr/build/solr-core/test/J1/temp/solr.cloud.RecoveryAfterSoftCommitTest_1441C83C27EF9305-001/control-001/cores/collection1/data/index' doesn't exist. Creating new index...
   [junit4]   2> 378838 INFO  (coreLoadExecutor-1039-thread-1-processing-n:127.0.0.1:53871_pmsa%2Fqv) [n:127.0.0.1:53871_pmsa%2Fqv c:control_collection s:shard1 r:core_node1 x:collection1] o.a.s.c.CachingDirectoryFactory return new directory for /home/jenkins/workspace/Lucene-Solr-5.x-Linux/solr/build/solr-core/test/J1/temp/solr.cloud.RecoveryAfterSoftCommitTest_1441C83C27EF9305-001/control-001/cores/collection1/data/index
   [junit4]   2> 378838 INFO  (coreLoadExecutor-1039-thread-1-processing-n:127.0.0.1:53871_pmsa%2Fqv) [n:127.0.0.1:53871_pmsa%2Fqv c:control_collection s:shard1 r:core_node1 x:collection1] o.a.s.u.RandomMergePolicy RandomMergePolicy wrapping class org.apache.lucene.index.LogDocMergePolicy: [LogDocMergePolicy: minMergeSize=1000, mergeFactor=19, maxMergeSize=9223372036854775807, maxMergeSizeForForcedMerge=9223372036854775807, calibrateSizeByDeletes=true, maxMergeDocs=2147483647, maxCFSSegmentSizeMB=8.796093022207999E12, noCFSRatio=0.6185216744505297]
   [junit4]   2> 378839 INFO  (coreLoadExecutor-1039-thread-1-processing-n:127.0.0.1:53871_pmsa%2Fqv) [n:127.0.0.1:53871_pmsa%2Fqv c:control_collection s:shard1 r:core_node1 x:collection1] o.a.s.c.SolrDeletionPolicy SolrDeletionPolicy.onCommit: commits: num=1
   [junit4]   2> 	commit{dir=MockDirectoryWrapper(RAMDirectory@1af2d59 lockFactory=org.apache.lucene.store.SingleInstanceLockFactory@1ca392e),segFN=segments_1,generation=1}
   [junit4]   2> 378839 INFO  (coreLoadExecutor-1039-thread-1-processing-n:127.0.0.1:53871_pmsa%2Fqv) [n:127.0.0.1:53871_pmsa%2Fqv c:control_collection s:shard1 r:core_node1 x:collection1] o.a.s.c.SolrDeletionPolicy newest commit generation = 1
   [junit4]   2> 378839 INFO  (OldIndexDirectoryCleanupThreadForCore-collection1) [n:127.0.0.1:53871_pmsa%2Fqv c:control_collection s:shard1 r:core_node1 x:collection1] o.a.s.c.SolrCore Looking for old index directories to cleanup for core collection1 in /home/jenkins/workspace/Lucene-Solr-5.x-Linux/solr/build/solr-core/test/J1/temp/solr.cloud.RecoveryAfterSoftCommitTest_1441C83C27EF9305-001/control-001/cores/collection1/data/
   [junit4]   2> 378839 WARN  (OldIndexDirectoryCleanupThreadForCore-collection1) [n:127.0.0.1:53871_pmsa%2Fqv c:control_collection s:shard1 r:core_node1 x:collection1] o.a.s.c.DirectoryFactory /home/jenkins/workspace/Lucene-Solr-5.x-Linux/solr/build/solr-core/test/J1/temp/solr.cloud.RecoveryAfterSoftCommitTest_1441C83C27EF9305-001/control-001/cores/collection1/data/ does not point to a valid data directory; skipping clean-up of old index directories.
   [junit4]   2> 378842 INFO  (coreLoadExecutor-1039-thread-1-processing-n:127.0.0.1:53871_pmsa%2Fqv) [n:127.0.0.1:53871_pmsa%2Fqv c:control_collection s:shard1 r:core_node1 x:collection1] o.a.s.u.p.UpdateRequestProcessorChain creating updateRequestProcessorChain "nodistrib"
   [junit4]   2> 378842 INFO  (coreLoadExecutor-1039-thread-1-processing-n:127.0.0.1:53871_pmsa%2Fqv) [n:127.0.0.1:53871_pmsa%2Fqv c:control_collection s:shard1 r:core_node1 x:collection1] o.a.s.u.p.UpdateRequestProcessorChain creating updateRequestProcessorChain "dedupe"
   [junit4]   2> 378842 INFO  (coreLoadExecutor-1039-thread-1-processing-n:127.0.0.1:53871_pmsa%2Fqv) [n:127.0.0.1:53871_pmsa%2Fqv c:control_collection s:shard1 r:core_node1 x:collection1] o.a.s.u.p.UpdateRequestProcessorChain inserting DistributedUpdateProcessorFactory into updateRequestProcessorChain "dedupe"
   [junit4]   2> 378842 INFO  (coreLoadExecutor-1039-thread-1-processing-n:127.0.0.1:53871_pmsa%2Fqv) [n:127.0.0.1:53871_pmsa%2Fqv c:control_collection s:shard1 r:core_node1 x:collection1] o.a.s.u.p.UpdateRequestProcessorChain creating updateRequestProcessorChain "stored_sig"
   [junit4]   2> 378842 INFO  (coreLoadExecutor-1039-thread-1-processing-n:127.0.0.1:53871_pmsa%2Fqv) [n:127.0.0.1:53871_pmsa%2Fqv c:control_collection s:shard1 r:core_node1 x:collection1] o.a.s.u.p.UpdateRequestProcessorChain inserting DistributedUpdateProcessorFactory into updateRequestProcessorChain "stored_sig"
   [junit4]   2> 378842 INFO  (coreLoadExecutor-1039-thread-1-processing-n:127.0.0.1:53871_pmsa%2Fqv) [n:127.0.0.1:53871_pmsa%2Fqv c:control_collection s:shard1 r:core_node1 x:collection1] o.a.s.u.p.UpdateRequestProcessorChain creating updateRequestProcessorChain "distrib-dup-test-chain-explicit"
   [junit4]   2> 378842 INFO  (coreLoadExecutor-1039-thread-1-processing-n:127.0.0.1:53871_pmsa%2Fqv) [n:127.0.0.1:53871_pmsa%2Fqv c:control_collection s:shard1 r:core_node1 x:collection1] o.a.s.u.p.UpdateRequestProcessorChain creating updateRequestProcessorChain "distrib-dup-test-chain-implicit"
   [junit4]   2> 378843 INFO  (coreLoadExecutor-1039-thread-1-processing-n:127.0.0.1:53871_pmsa%2Fqv) [n:127.0.0.1:53871_pmsa%2Fqv c:control_collection s:shard1 r:core_node1 x:collection1] o.a.s.u.p.UpdateRequestProcessorChain inserting DistributedUpdateProcessorFactory into updateRequestProcessorChain "distrib-dup-test-chain-implicit"
   [junit4]   2> 378843 INFO  (coreLoadExecutor-1039-thread-1-processing-n:127.0.0.1:53871_pmsa%2Fqv) [n:127.0.0.1:53871_pmsa%2Fqv c:control_collection s:shard1 r:core_node1 x:collection1] o.a.s.c.SolrCore no updateRequestProcessorChain defined as default, creating implicit default
   [junit4]   2> 378843 WARN  (coreLoadExecutor-1039-thread-1-processing-n:127.0.0.1:53871_pmsa%2Fqv) [n:127.0.0.1:53871_pmsa%2Fqv c:control_collection s:shard1 r:core_node1 x:collection1] o.a.s.c.RequestHandlers INVALID paramSet a in requestHandler {type = requestHandler,name = /dump,class = DumpRequestHandler,args = {defaults={a=A,b=B}}}
   [junit4]   2> 378845 INFO  (coreLoadExecutor-1039-thread-1-processing-n:127.0.0.1:53871_pmsa%2Fqv) [n:127.0.0.1:53871_pmsa%2Fqv c:control_collection s:shard1 r:core_node1 x:collection1] o.a.s.h.l.XMLLoader xsltCacheLifetimeSeconds=60
   [junit4]   2> 378846 INFO  (coreLoadExecutor-1039-thread-1-processing-n:127.0.0.1:53871_pmsa%2Fqv) [n:127.0.0.1:53871_pmsa%2Fqv c:control_collection s:shard1 r:core_node1 x:collection1] o.a.s.h.l.XMLLoader xsltCacheLifetimeSeconds=60
   [junit4]   2> 378846 INFO  (coreLoadExecutor-1039-thread-1-processing-n:127.0.0.1:53871_pmsa%2Fqv) [n:127.0.0.1:53871_pmsa%2Fqv c:control_collection s:shard1 r:core_node1 x:collection1] o.a.s.h.l.XMLLoader xsltCacheLifetimeSeconds=60
   [junit4]   2> 378847 INFO  (coreLoadExecutor-1039-thread-1-processing-n:127.0.0.1:53871_pmsa%2Fqv) [n:127.0.0.1:53871_pmsa%2Fqv c:control_collection s:shard1 r:core_node1 x:collection1] o.a.s.h.l.XMLLoader xsltCacheLifetimeSeconds=60
   [junit4]   2> 378850 INFO  (coreLoadExecutor-1039-thread-1-processing-n:127.0.0.1:53871_pmsa%2Fqv) [n:127.0.0.1:53871_pmsa%2Fqv c:control_collection s:shard1 r:core_node1 x:collection1] o.a.s.c.RequestHandlers Registered paths: /admin/threads,/replication,/admin/ping,/admin/file,/admin/luke,/dump,/admin/properties,standard,/admin/plugins,/admin/logging,/get,/update/json/docs,/config,/update/json,/update/csv,/admin/segments,/admin/system,/update,/admin/mbeans,/schema
   [junit4]   2> 378851 INFO  (coreLoadExecutor-1039-thread-1-processing-n:127.0.0.1:53871_pmsa%2Fqv) [n:127.0.0.1:53871_pmsa%2Fqv c:control_collection s:shard1 r:core_node1 x:collection1] o.a.s.c.SolrCore Using default statsCache cache: org.apache.solr.search.stats.LocalStatsCache
   [junit4]   2> 378856 INFO  (coreLoadExecutor-1039-thread-1-processing-n:127.0.0.1:53871_pmsa%2Fqv) [n:127.0.0.1:53871_pmsa%2Fqv c:control_collection s:shard1 r:core_node1 x:collection1] o.a.s.u.UpdateHandler Using UpdateLog implementation: org.apache.solr.update.UpdateLog
   [junit4]   2> 378856 INFO  (coreLoadExecutor-1039-thread-1-processing-n:127.0.0.1:53871_pmsa%2Fqv) [n:127.0.0.1:53871_pmsa%2Fqv c:control_collection s:shard1 r:core_node1 x:collection1] o.a.s.u.UpdateLog Initializing UpdateLog: dataDir= defaultSyncLevel=FLUSH numRecordsToKeep=2 maxNumLogsToKeep=10 numVersionBuckets=65536
   [junit4]   2> 378857 INFO  (coreLoadExecutor-1039-thread-1-processing-n:127.0.0.1:53871_pmsa%2Fqv) [n:127.0.0.1:53871_pmsa%2Fqv c:control_collection s:shard1 r:core_node1 x:collection1] o.a.s.u.CommitTracker Hard AutoCommit: disabled
   [junit4]   2> 378857 INFO  (coreLoadExecutor-1039-thread-1-processing-n:127.0.0.1:53871_pmsa%2Fqv) [n:127.0.0.1:53871_pmsa%2Fqv c:control_collection s:shard1 r:core_node1 x:collection1] o.a.s.u.CommitTracker Soft AutoCommit: disabled
   [junit4]   2> 378857 INFO  (coreLoadExecutor-1039-thread-1-processing-n:127.0.0.1:53871_pmsa%2Fqv) [n:127.0.0.1:53871_pmsa%2Fqv c:control_collection s:shard1 r:core_node1 x:collection1] o.a.s.u.RandomMergePolicy RandomMergePolicy wrapping class org.apache.lucene.index.LogByteSizeMergePolicy: [LogByteSizeMergePolicy: minMergeSize=1677721, mergeFactor=50, maxMergeSize=2147483648, maxMergeSizeForForcedMerge=9223372036854775807, calibrateSizeByDeletes=false, maxMergeDocs=2147483647, maxCFSSegmentSizeMB=8.796093022207999E12, noCFSRatio=0.4987647354293663]
   [junit4]   2> 378858 INFO  (coreLoadExecutor-1039-thread-1-processing-n:127.0.0.1:53871_pmsa%2Fqv) [n:127.0.0.1:53871_pmsa%2Fqv c:control_collection s:shard1 r:core_node1 x:collection1] o.a.s.c.SolrDeletionPolicy SolrDeletionPolicy.onInit: commits: num=1
   [junit4]   2> 	commit{dir=MockDirectoryWrapper(RAMDirectory@1af2d59 lockFactory=org.apache.lucene.store.SingleInstanceLockFactory@1ca392e),segFN=segments_1,generation=1}
   [junit4]   2> 378858 INFO  (coreLoadExecutor-1039-thread-1-processing-n:127.0.0.1:53871_pmsa%2Fqv) [n:127.0.0.1:53871_pmsa%2Fqv c:control_collection s:shard1 r:core_node1 x:collection1] o.a.s.c.SolrDeletionPolicy newest commit generation = 1
   [junit4]   2> 378858 INFO  (coreLoadExecutor-1039-thread-1-processing-n:127.0.0.1:53871_pmsa%2Fqv) [n:127.0.0.1:53871_pmsa%2Fqv c:control_collection s:shard1 r:core_node1 x:collection1] o.a.s.s.SolrIndexSearcher Opening Searcher@10bf87[collection1] main
   [junit4]   2> 378858 INFO  (coreLoadExecutor-1039-thread-1-processing-n:127.0.0.1:53871_pmsa%2Fqv) [n:127.0.0.1:53871_pmsa%2Fqv c:control_collection s:shard1 r:core_node1 x:collection1] o.a.s.c.c.ZkStateReader Load collection config from: [/collections/control_collection]
   [junit4]   2> 378858 INFO  (coreLoadExecutor-1039-thread-1-processing-n:127.0.0.1:53871_pmsa%2Fqv) [n:127.0.0.1:53871_pmsa%2Fqv c:control_collection s:shard1 r:core_node1 x:collection1] o.a.s.c.c.ZkStateReader path=[/collections/control_collection] [configName]=[conf1] specified config exists in ZooKeeper
   [junit4]   2> 378858 INFO  (coreLoadExecutor-1039-thread-1-processing-n:127.0.0.1:53871_pmsa%2Fqv) [n:127.0.0.1:53871_pmsa%2Fqv c:control_collection s:shard1 r:core_node1 x:collection1] o.a.s.r.ManagedResourceStorage Setting up ZooKeeper-based storage for the RestManager with znodeBase: /configs/conf1
   [junit4]   2> 378858 INFO  (coreLoadExecutor-1039-thread-1-processing-n:127.0.0.1:53871_pmsa%2Fqv) [n:127.0.0.1:53871_pmsa%2Fqv c:control_collection s:shard1 r:core_node1 x:collection1] o.a.s.r.ManagedResourceStorage Configured ZooKeeperStorageIO with znodeBase: /configs/conf1
   [junit4]   2> 378859 INFO  (coreLoadExecutor-1039-thread-1-processing-n:127.0.0.1:53871_pmsa%2Fqv) [n:127.0.0.1:53871_pmsa%2Fqv c:control_collection s:shard1 r:core_node1 x:collection1] o.a.s.r.RestManager Initializing RestManager with initArgs: {}
   [junit4]   2> 378859 INFO  (coreLoadExecutor-1039-thread-1-processing-n:127.0.0.1:53871_pmsa%2Fqv) [n:127.0.0.1:53871_pmsa%2Fqv c:control_collection s:shard1 r:core_node1 x:collection1] o.a.s.r.ManagedResourceStorage Reading _rest_managed.json using ZooKeeperStorageIO:path=/configs/conf1
   [junit4]   2> 378859 INFO  (coreLoadExecutor-1039-thread-1-processing-n:127.0.0.1:53871_pmsa%2Fqv) [n:127.0.0.1:53871_pmsa%2Fqv c:control_collection s:shard1 r:core_node1 x:collection1] o.a.s.r.ManagedResourceStorage No data found for znode /configs/conf1/_rest_managed.json
   [junit4]   2> 378859 INFO  (coreLoadExecutor-1039-thread-1-processing-n:127.0.0.1:53871_pmsa%2Fqv) [n:127.0.0.1:53871_pmsa%2Fqv c:control_collection s:shard1 r:core_node1 x:collection1] o.a.s.r.ManagedResourceStorage Loaded null at path _rest_managed.json using ZooKeeperStorageIO:path=/configs/conf1
   [junit4]   2> 378859 INFO  (coreLoadExecutor-1039-thread-1-processing-n:127.0.0.1:53871_pmsa%2Fqv) [n:127.0.0.1:53871_pmsa%2Fqv c:control_collection s:shard1 r:core_node1 x:collection1] o.a.s.r.RestManager Initializing 0 registered ManagedResources
   [junit4]   2> 378859 INFO  (coreLoadExecutor-1039-thread-1-processing-n:127.0.0.1:53871_pmsa%2Fqv) [n:127.0.0.1:53871_pmsa%2Fqv c:control_collection s:shard1 r:core_node1 x:collection1] o.a.s.h.ReplicationHandler Commits will be reserved for  10000
   [junit4]   2> 378860 INFO  (searcherExecutor-1040-thread-1-processing-r:core_node1 s:shard1 n:127.0.0.1:53871_pmsa%2Fqv c:control_collection x:collection1) [n:127.0.0.1:53871_pmsa%2Fqv c:control_collection s:shard1 r:core_node1 x:collection1] o.a.s.c.SolrCore [collection1] Registered new searcher Searcher@10bf87[collection1] main{ExitableDirectoryReader(UninvertingDirectoryReader())}
   [junit4]   2> 378860 INFO  (coreLoadExecutor-1039-thread-1-processing-n:127.0.0.1:53871_pmsa%2Fqv) [n:127.0.0.1:53871_pmsa%2Fqv c:control_collection s:shard1 r:core_node1 x:collection1] o.a.s.u.UpdateLog Looking up max value of version field to seed version buckets
   [junit4]   2> 378860 INFO  (coreLoadExecutor-1039-thread-1-processing-n:127.0.0.1:53871_pmsa%2Fqv) [n:127.0.0.1:53871_pmsa%2Fqv c:control_collection s:shard1 r:core_node1 x:collection1] o.a.s.u.VersionInfo Refreshing highest value of _version_ for 65536 version buckets from index
   [junit4]   2> 378860 INFO  (coreLoadExecutor-1039-thread-1-processing-n:127.0.0.1:53871_pmsa%2Fqv) [n:127.0.0.1:53871_pmsa%2Fqv c:control_collection s:shard1 r:core_node1 x:collection1] o.a.s.u.VersionInfo No terms found for _version_, cannot seed version bucket highest value from index
   [junit4]   2> 378860 INFO  (coreLoadExecutor-1039-thread-1-processing-n:127.0.0.1:53871_pmsa%2Fqv) [n:127.0.0.1:53871_pmsa%2Fqv c:control_collection s:shard1 r:core_node1 x:collection1] o.a.s.u.UpdateLog Could not find max version in index or recent updates, using new clock 1522409173222948864
   [junit4]   2> 378862 INFO  (coreLoadExecutor-1039-thread-1-processing-n:127.0.0.1:53871_pmsa%2Fqv) [n:127.0.0.1:53871_pmsa%2Fqv c:control_collection s:shard1 r:core_node1 x:collection1] o.a.s.u.UpdateLog Took 1.0ms to seed version buckets with highest version 1522409173222948864
   [junit4]   2> 378862 INFO  (coreLoadExecutor-1039-thread-1-processing-n:127.0.0.1:53871_pmsa%2Fqv) [n:127.0.0.1:53871_pmsa%2Fqv c:control_collection s:shard1 r:core_node1 x:collection1] o.a.s.c.ZkController watch zkdir /configs/conf1
   [junit4]   2> 378862 INFO  (coreLoadExecutor-1039-thread-1-processing-n:127.0.0.1:53871_pmsa%2Fqv) [n:127.0.0.1:53871_pmsa%2Fqv c:control_collection s:shard1 r:core_node1 x:collection1] o.a.s.c.CoreContainer registering core: collection1
   [junit4]   2> 378862 INFO  (coreZkRegister-1033-thread-1-processing-r:core_node1 s:shard1 n:127.0.0.1:53871_pmsa%2Fqv c:control_collection x:collection1) [n:127.0.0.1:53871_pmsa%2Fqv c:control_collection s:shard1 r:core_node1 x:collection1] o.a.s.c.ZkController Register replica - core:collection1 address:http://127.0.0.1:53871/pmsa/qv collection:control_collection shard:shard1
   [junit4]   2> 378863 INFO  (coreZkRegister-1033-thread-1-processing-r:core_node1 s:shard1 n:127.0.0.1:53871_pmsa%2Fqv c:control_collection x:collection1) [n:127.0.0.1:53871_pmsa%2Fqv c:control_collection s:shard1 r:core_node1 x:collection1] o.a.s.c.c.SolrZkClient makePath: /collections/control_collection/leader_elect/shard1/election
   [junit4]   2> 378865 INFO  (coreZkRegister-1033-thread-1-processing-r:core_node1 s:shard1 n:127.0.0.1:53871_pmsa%2Fqv c:control_collection x:collection1) [n:127.0.0.1:53871_pmsa%2Fqv c:control_collection s:shard1 r:core_node1 x:collection1] o.a.s.c.LeaderElector Joined leadership election with path: /collections/control_collection/leader_elect/shard1/election/95150573225115652-core_node1-n_0000000000
   [junit4]   2> 378865 INFO  (coreZkRegister-1033-thread-1-processing-r:core_node1 s:shard1 n:127.0.0.1:53871_pmsa%2Fqv c:control_collection x:collection1) [n:127.0.0.1:53871_pmsa%2Fqv c:control_collection s:shard1 r:core_node1 x:collection1] o.a.s.c.ShardLeaderElectionContext Running the leader process for shard=shard1 and weAreReplacement=false and leaderVoteWait=10000
   [junit4]   2> 378866 INFO  (coreZkRegister-1033-thread-1-processing-r:core_node1 s:shard1 n:127.0.0.1:53871_pmsa%2Fqv c:control_collection x:collection1) [n:127.0.0.1:53871_pmsa%2Fqv c:control_collection s:shard1 r:core_node1 x:collection1] o.a.s.c.ShardLeaderElectionContext Enough replicas found to continue.
   [junit4]   2> 378866 INFO  (coreZkRegister-1033-thread-1-processing-r:core_node1 s:shard1 n:127.0.0.1:53871_pmsa%2Fqv c:control_collection x:collection1) [n:127.0.0.1:53871_pmsa%2Fqv c:control_collection s:shard1 r:core_node1 x:collection1] o.a.s.c.ShardLeaderElectionContext I may be the new leader - try and sync
   [junit4]   2> 378866 INFO  (coreZkRegister-1033-thread-1-processing-r:core_node1 s:shard1 n:127.0.0.1:53871_pmsa%2Fqv c:control_collection x:collection1) [n:127.0.0.1:53871_pmsa%2Fqv c:control_collection s:shard1 r:core_node1 x:collection1] o.a.s.c.SyncStrategy Sync replicas to http://127.0.0.1:53871/pmsa/qv/collection1/
   [junit4]   2> 378866 INFO  (coreZkRegister-1033-thread-1-processing-r:core_node1 s:shard1 n:127.0.0.1:53871_pmsa%2Fqv c:control_collection x:collection1) [n:127.0.0.1:53871_pmsa%2Fqv c:control_collection s:shard1 r:core_node1 x:collection1] o.a.s.c.SyncStrategy Sync Success - now sync replicas to me
   [junit4]   2> 378866 INFO  (coreZkRegister-1033-thread-1-processing-r:core_node1 s:shard1 n:127.0.0.1:53871_pmsa%2Fqv c:control_collection x:collection1) [n:127.0.0.1:53871_pmsa%2Fqv c:control_collection s:shard1 r:core_node1 x:collection1] o.a.s.c.SyncStrategy http://127.0.0.1:53871/pmsa/qv/collection1/ has no replicas
   [junit4]   2> 378866 INFO  (OverseerStateUpdate-95150573225115652-127.0.0.1:53871_pmsa%2Fqv-n_0000000000) [n:127.0.0.1:53871_pmsa%2Fqv    ] o.a.s.c.Overseer processMessage: queueSize: 1, message = {
   [junit4]   2>   "operation":"leader",
   [junit4]   2>   "shard":"shard1",
   [junit4]   2>   "collection":"control_collection"} current state version: 1
   [junit4]   2> 378867 INFO  (coreZkRegister-1033-thread-1-processing-r:core_node1 s:shard1 n:127.0.0.1:53871_pmsa%2Fqv c:control_collection x:collection1) [n:127.0.0.1:53871_pmsa%2Fqv c:control_collection s:shard1 r:core_node1 x:collection1] o.a.s.c.c.SolrZkClient makePath: /collections/control_collection/leaders/shard1
   [junit4]   2> 378869 INFO  (coreZkRegister-1033-thread-1-processing-r:core_node1 s:shard1 n:127.0.0.1:53871_pmsa%2Fqv c:control_collection x:collection1) [n:127.0.0.1:53871_pmsa%2Fqv c:control_collection s:shard1 r:core_node1 x:collection1] o.a.s.c.ShardLeaderElectionContextBase Creating leader registration node
   [junit4]   2> 378870 INFO  (coreZkRegister-1033-thread-1-processing-r:core_node1 s:shard1 n:127.0.0.1:53871_pmsa%2Fqv c:control_collection x:collection1) [n:127.0.0.1:53871_pmsa%2Fqv c:control_collection s:shard1 r:core_node1 x:collection1] o.a.s.c.ShardLeaderElectionContext I am the new leader: http://127.0.0.1:53871/pmsa/qv/collection1/ shard1
   [junit4]   2> 378870 INFO  (OverseerStateUpdate-95150573225115652-127.0.0.1:53871_pmsa%2Fqv-n_0000000000) [n:127.0.0.1:53871_pmsa%2Fqv    ] o.a.s.c.Overseer processMessage: queueSize: 1, message = {
   [junit4]   2>   "operation":"leader",
   [junit4]   2>   "shard":"shard1",
   [junit4]   2>   "collection":"control_collection",
   [junit4]   2>   "base_url":"http://127.0.0.1:53871/pmsa/qv",
   [junit4]   2>   "core":"collection1",
   [junit4]   2>   "state":"active"} current state version: 1
   [junit4]   2> 378972 INFO  (zkCallback-251-thread-1-processing-n:127.0.0.1:53871_pmsa%2Fqv) [n:127.0.0.1:53871_pmsa%2Fqv    ] o.a.s.c.c.ZkStateReader A cluster state change: [WatchedEvent state:SyncConnected type:NodeDataChanged path:/clusterstate.json], has occurred - updating... (live nodes size: [1])
   [junit4]   2> 379020 INFO  (coreZkRegister-1033-thread-1-processing-r:core_node1 s:shard1 n:127.0.0.1:53871_pmsa%2Fqv c:control_collection x:collection1) [n:127.0.0.1:53871_pmsa%2Fqv c:control_collection s:shard1 r:core_node1 x:collection1] o.a.s.c.ZkController We are http://127.0.0.1:53871/pmsa/qv/collection1/ and leader is http://127.0.0.1:53871/pmsa/qv/collection1/
   [junit4]   2> 379020 INFO  (coreZkRegister-1033-thread-1-processing-r:core_node1 s:shard1 n:127.0.0.1:53871_pmsa%2Fqv c:control_collection x:collection1) [n:127.0.0.1:53871_pmsa%2Fqv c:control_collection s:shard1 r:core_node1 x:collection1] o.a.s.c.ZkController No LogReplay needed for core=collection1 baseURL=http://127.0.0.1:53871/pmsa/qv
   [junit4]   2> 379020 INFO  (coreZkRegister-1033-thread-1-processing-r:core_node1 s:shard1 n:127.0.0.1:53871_pmsa%2Fqv c:control_collection x:collection1) [n:127.0.0.1:53871_pmsa%2Fqv c:control_collection s:shard1 r:core_node1 x:collection1] o.a.s.c.ZkController I am the leader, no recovery necessary
   [junit4]   2> 379020 INFO  (coreZkRegister-1033-thread-1-processing-r:core_node1 s:shard1 n:127.0.0.1:53871_pmsa%2Fqv c:control_collection x:collection1) [n:127.0.0.1:53871_pmsa%2Fqv c:control_collection s:shard1 r:core_node1 x:collection1] o.a.s.c.ZkController publishing state=active
   [junit4]   2> 379020 INFO  (coreZkRegister-1033-thread-1-processing-r:core_node1 s:shard1 n:127.0.0.1:53871_pmsa%2Fqv c:control_collection x:collection1) [n:127.0.0.1:53871_pmsa%2Fqv c:control_collection s:shard1 r:core_node1 x:collection1] o.a.s.c.ZkController numShards not found on descriptor - reading it from system property
   [junit4]   2> 379022 INFO  (OverseerStateUpdate-95150573225115652-127.0.0.1:53871_pmsa%2Fqv-n_0000000000) [n:127.0.0.1:53871_pmsa%2Fqv    ] o.a.s.c.Overseer processMessage: queueSize: 1, message = {
   [junit4]   2>   "core_node_name":"core_node1",
   [junit4]   2>   "base_url":"http://127.0.0.1:53871/pmsa/qv",
   [junit4]   2>   "roles":null,
   [junit4]   2>   "state":"active",
   [junit4]   2>   "operation":"state",
   [junit4]   2>   "shard":"shard1",
   [junit4]   2>   "node_name":"127.0.0.1:53871_pmsa%2Fqv",
   [junit4]   2>   "collection":"control_collection",
   [junit4]   2>   "numShards":"1",
   [junit4]   2>   "core":"collection1"} current state version: 2
   [junit4]   2> 379022 INFO  (OverseerStateUpdate-95150573225115652-127.0.0.1:53871_pmsa%2Fqv-n_0000000000) [n:127.0.0.1:53871_pmsa%2Fqv    ] o.a.s.c.o.ReplicaMutator Update state numShards=1 message={
   [junit4]   2>   "core_node_name":"core_node1",
   [junit4]   2>   "base_url":"http://127.0.0.1:53871/pmsa/qv",
   [junit4]   2>   "roles":null,
   [junit4]   2>   "state":"active",
   [junit4]   2>   "operation":"state",
   [junit4]   2>   "shard":"shard1",
   [junit4]   2>   "node_name":"127.0.0.1:53871_pmsa%2Fqv",
   [junit4]   2>   "collection":"control_collection",
   [junit4]   2>   "numShards":"1",
   [junit4]   2>   "core":"collection1"}
   [junit4]   2> 379046 INFO  (TEST-RecoveryAfterSoftCommitTest.test-seed#[1441C83C27EF9305]) [    ] o.a.s.c.c.SolrZkClient Using default ZkCredentialsProvider
   [junit4]   2> 379047 INFO  (TEST-RecoveryAfterSoftCommitTest.test-seed#[1441C83C27EF9305]) [    ] o.a.s.c.c.ConnectionManager Waiting for client to connect to ZooKeeper
   [junit4]   2> 379048 INFO  (zkCallback-253-thread-1) [    ] o.a.s.c.c.ConnectionManager Watcher org.apache.solr.common.cloud.ConnectionManager@1c6052c name:ZooKeeperConnection Watcher:127.0.0.1:36479/solr got event WatchedEvent state:SyncConnected type:None path:null path:null type:None
   [junit4]   2> 379048 INFO  (TEST-RecoveryAfterSoftCommitTest.test-seed#[1441C83C27EF9305]) [    ] o.a.s.c.c.ConnectionManager Client is connected to ZooKeeper
   [junit4]   2> 379048 INFO  (TEST-RecoveryAfterSoftCommitTest.test-seed#[1441C83C27EF9305]) [    ] o.a.s.c.c.SolrZkClient Using default ZkACLProvider
   [junit4]   2> 379048 INFO  (TEST-RecoveryAfterSoftCommitTest.test-seed#[1441C83C27EF9305]) [    ] o.a.s.c.c.ZkStateReader Updating cluster state from ZooKeeper... 
   [junit4]   2> 379050 INFO  (TEST-RecoveryAfterSoftCommitTest.test-seed#[1441C83C27EF9305]) [    ] o.a.s.c.ChaosMonkey monkey: init - expire sessions:false cause connection loss:false
   [junit4]   2> 379050 INFO  (TEST-RecoveryAfterSoftCommitTest.test-seed#[1441C83C27EF9305]) [    ] o.a.s.c.AbstractFullDistribZkTestBase Creating collection1 with stateFormat=2
   [junit4]   2> 379050 INFO  (TEST-RecoveryAfterSoftCommitTest.test-seed#[1441C83C27EF9305]) [    ] o.a.s.c.c.SolrZkClient Using default ZkCredentialsProvider
   [junit4]   2> 379050 INFO  (TEST-RecoveryAfterSoftCommitTest.test-seed#[1441C83C27EF9305]) [    ] o.a.s.c.c.ConnectionManager Waiting for client to connect to ZooKeeper
   [junit4]   2> 379051 INFO  (zkCallback-254-thread-1) [    ] o.a.s.c.c.ConnectionManager Watcher org.apache.solr.common.cloud.ConnectionManager@1f616a2 name:ZooKeeperConnection Watcher:127.0.0.1:36479/solr got event WatchedEvent state:SyncConnected type:None path:null path:null type:None
   [junit4]   2> 379051 INFO  (TEST-RecoveryAfterSoftCommitTest.test-seed#[1441C83C27EF9305]) [    ] o.a.s.c.c.ConnectionManager Client is connected to ZooKeeper
   [junit4]   2> 379051 INFO  (TEST-RecoveryAfterSoftCommitTest.test-seed#[1441C83C27EF9305]) [    ] o.a.s.c.c.SolrZkClient Using default ZkACLProvider
   [junit4]   2> 379053 INFO  (OverseerStateUpdate-95150573225115652-127.0.0.1:53871_pmsa%2Fqv-n_0000000000) [n:127.0.0.1:53871_pmsa%2Fqv    ] o.a.s.c.Overseer processMessage: queueSize: 1, message = {
   [junit4]   2>   "operation":"create",
   [junit4]   2>   "name":"collection1",
   [junit4]   2>   "numShards":"1",
   [junit4]   2>   "stateFormat":"2"} current state version: 2
   [junit4]   2> 379053 INFO  (OverseerStateUpdate-95150573225115652-127.0.0.1:53871_pmsa%2Fqv-n_0000000000) [n:127.0.0.1:53871_pmsa%2Fqv    ] o.a.s.c.o.ClusterStateMutator building a new cName: collection1
   [junit4]   2> 379053 INFO  (zkCallback-253-thread-1) [    ] o.a.s.c.c.ZkStateReader A cluster state change: [WatchedEvent state:SyncConnected type:NodeDataChanged path:/clusterstate.json], has occurred - updating... (live nodes size: [1])
   [junit4]   2> 379053 INFO  (zkCallback-251-thread-1-processing-n:127.0.0.1:53871_pmsa%2Fqv) [n:127.0.0.1:53871_pmsa%2Fqv    ] o.a.s.c.c.ZkStateReader A cluster state change: [WatchedEvent state:SyncConnected type:NodeDataChanged path:/clusterstate.json], has occurred - updating... (live nodes size: [1])
   [junit4]   2> 379122 INFO  (TEST-RecoveryAfterSoftCommitTest.test-seed#[1441C83C27EF9305]) [    ] o.a.s.SolrTestCaseJ4 Writing core.properties file to /home/jenkins/workspace/Lucene-Solr-5.x-Linux/solr/build/solr-core/test/J1/temp/solr.cloud.RecoveryAfterSoftCommitTest_1441C83C27EF9305-001/shard-1-001/cores/collection1
   [junit4]   2> 379123 INFO  (TEST-RecoveryAfterSoftCommitTest.test-seed#[1441C83C27EF9305]) [    ] o.a.s.c.AbstractFullDistribZkTestBase create jetty 1 in directory /home/jenkins/workspace/Lucene-Solr-5.x-Linux/solr/build/solr-core/test/J1/temp/solr.cloud.RecoveryAfterSoftCommitTest_1441C83C27EF9305-001/shard-1-001
   [junit4]   2> 379123 INFO  (TEST-RecoveryAfterSoftCommitTest.test-seed#[1441C83C27EF9305]) [    ] o.e.j.s.Server jetty-9.2.13.v20150730
   [junit4]   2> 379125 INFO  (TEST-RecoveryAfterSoftCommitTest.test-seed#[1441C83C27EF9305]) [    ] o.e.j.s.h.ContextHandler Started o.e.j.s.ServletContextHandler@5a69ca{/pmsa/qv,null,AVAILABLE}
   [junit4]   2> 379125 INFO  (TEST-RecoveryAfterSoftCommitTest.test-seed#[1441C83C27EF9305]) [    ] o.e.j.s.ServerConnector Started ServerConnector@74130c{HTTP/1.1}{127.0.0.1:47215}
   [junit4]   2> 379125 INFO  (TEST-RecoveryAfterSoftCommitTest.test-seed#[1441C83C27EF9305]) [    ] o.e.j.s.Server Started @380559ms
   [junit4]   2> 379125 INFO  (TEST-RecoveryAfterSoftCommitTest.test-seed#[1441C83C27EF9305]) [    ] o.a.s.c.s.e.JettySolrRunner Jetty properties: {solr.data.dir=/home/jenkins/workspace/Lucene-Solr-5.x-Linux/solr/build/solr-core/test/J1/temp/solr.cloud.RecoveryAfterSoftCommitTest_1441C83C27EF9305-001/tempDir-001/jetty1, hostContext=/pmsa/qv, hostPort=50330, coreRootDirectory=/home/jenkins/workspace/Lucene-Solr-5.x-Linux/solr/build/solr-core/test/J1/temp/solr.cloud.RecoveryAfterSoftCommitTest_1441C83C27EF9305-001/shard-1-001/cores, solrconfig=solrconfig.xml}
   [junit4]   2> 379125 INFO  (TEST-RecoveryAfterSoftCommitTest.test-seed#[1441C83C27EF9305]) [    ] o.a.s.s.SolrDispatchFilter SolrDispatchFilter.init(): sun.misc.Launcher$AppClassLoader@327236
   [junit4]   2> 379125 INFO  (TEST-RecoveryAfterSoftCommitTest.test-seed#[1441C83C27EF9305]) [    ] o.a.s.c.SolrResourceLoader new SolrResourceLoader for directory: '/home/jenkins/workspace/Lucene-Solr-5.x-Linux/solr/build/solr-core/test/J1/temp/solr.cloud.RecoveryAfterSoftCommitTest_1441C83C27EF9305-001/shard-1-001'
   [junit4]   2> 379125 INFO  (TEST-RecoveryAfterSoftCommitTest.test-seed#[1441C83C27EF9305]) [    ] o.a.s.c.SolrResourceLoader JNDI not configured for solr (NoInitialContextEx)
   [junit4]   2> 379126 INFO  (TEST-RecoveryAfterSoftCommitTest.test-seed#[1441C83C27EF9305]) [    ] o.a.s.c.SolrResourceLoader solr home defaulted to 'solr/' (could not find system property or JNDI)
   [junit4]   2> 379126 INFO  (TEST-RecoveryAfterSoftCommitTest.test-seed#[1441C83C27EF9305]) [    ] o.a.s.c.c.SolrZkClient Using default ZkCredentialsProvider
   [junit4]   2> 379132 INFO  (TEST-RecoveryAfterSoftCommitTest.test-seed#[1441C83C27EF9305]) [    ] o.a.s.c.c.ConnectionManager Waiting for client to connect to ZooKeeper
   [junit4]   2> 379133 INFO  (zkCallback-255-thread-1) [    ] o.a.s.c.c.ConnectionManager Watcher org.apache.solr.common.cloud.ConnectionManager@c72967 name:ZooKeeperConnection Watcher:127.0.0.1:36479/solr got event WatchedEvent state:SyncConnected type:None path:null path:null type:None
   [junit4]   2> 379133 INFO  (TEST-RecoveryAfterSoftCommitTest.test-seed#[1441C83C27EF9305]) [    ] o.a.s.c.c.ConnectionManager Client is connected to ZooKeeper
   [junit4]   2> 379134 INFO  (TEST-RecoveryAfterSoftCommitTest.test-seed#[1441C83C27EF9305]) [    ] o.a.s.c.c.SolrZkClient Using default ZkACLProvider
   [junit4]   2> 379137 INFO  (TEST-RecoveryAfterSoftCommitTest.test-seed#[1441C83C27EF9305]) [    ] o.a.s.s.SolrDispatchFilter Loading solr.xml from SolrHome (not found in ZooKeeper)
   [junit4]   2> 379137 INFO  (TEST-RecoveryAfterSoftCommitTest.test-seed#[1441C83C27EF9305]) [    ] o.a.s.c.SolrXmlConfig Loading container configuration from /home/jenkins/workspace/Lucene-Solr-5.x-Linux/solr/build/solr-core/test/J1/temp/solr.cloud.RecoveryAfterSoftCommitTest_1441C83C27EF9305-001/shard-1-001/solr.xml
   [junit4]   2> 379157 INFO  (TEST-RecoveryAfterSoftCommitTest.test-seed#[1441C83C27EF9305]) [    ] o.a.s.c.CorePropertiesLocator Config-defined core root directory: /home/jenkins/workspace/Lucene-Solr-5.x-Linux/solr/build/solr-core/test/J1/temp/solr.cloud.RecoveryAfterSoftCommitTest_1441C83C27EF9305-001/shard-1-001/cores
   [junit4]   2> 379157 INFO  (TEST-RecoveryAfterSoftCommitTest.test-seed#[1441C83C27EF9305]) [    ] o.a.s.c.CoreContainer New CoreContainer 26193864
   [junit4]   2> 379157 INFO  (TEST-RecoveryAfterSoftCommitTest.test-seed#[1441C83C27EF9305]) [    ] o.a.s.c.CoreContainer Loading cores into CoreContainer [instanceDir=/home/jenkins/workspace/Lucene-Solr-5.x-Linux/solr/build/solr-core/test/J1/temp/solr.cloud.RecoveryAfterSoftCommitTest_1441C83C27EF9305-001/shard-1-001]
   [junit4]   2> 379157 WARN  (TEST-RecoveryAfterSoftCommitTest.test-seed#[1441C83C27EF9305]) [    ] o.a.s.c.CoreContainer Couldn't add files from /home/jenkins/workspace/Lucene-Solr-5.x-Linux/solr/build/solr-core/test/J1/temp/solr.cloud.RecoveryAfterSoftCommitTest_1441C83C27EF9305-001/shard-1-001/lib to classpath: /home/jenkins/workspace/Lucene-Solr-5.x-Linux/solr/build/solr-core/test/J1/temp/solr.cloud.RecoveryAfterSoftCommitTest_1441C83C27EF9305-001/shard-1-001/lib
   [junit4]   2> 379157 INFO  (TEST-RecoveryAfterSoftCommitTest.test-seed#[1441C83C27EF9305]) [    ] o.a.s.h.c.HttpShardHandlerFactory created with socketTimeout : 90000,urlScheme : ,connTimeout : 15000,maxConnectionsPerHost : 20,maxConnections : 10000,corePoolSize : 0,maximumPoolSize : 2147483647,maxThreadIdleTime : 5,sizeOfQueue : -1,fairnessPolicy : false,useRetries : false,
   [junit4]   2> 379158 INFO  (TEST-RecoveryAfterSoftCommitTest.test-seed#[1441C83C27EF9305]) [    ] o.a.s.u.UpdateShardHandler Creating UpdateShardHandler HTTP client with params: socketTimeout=340000&connTimeout=45000&retry=true
   [junit4]   2> 379159 INFO  (TEST-RecoveryAfterSoftCommitTest.test-seed#[1441C83C27EF9305]) [    ] o.a.s.l.LogWatcher SLF4J impl is org.slf4j.impl.Log4jLoggerFactory
   [junit4]   2> 379159 INFO  (TEST-RecoveryAfterSoftCommitTest.test-seed#[1441C83C27EF9305]) [    ] o.a.s.l.LogWatcher Registering Log Listener [Log4j (org.slf4j.impl.Log4jLoggerFactory)]
   [junit4]   2> 379159 INFO  (TEST-RecoveryAfterSoftCommitTest.test-seed#[1441C83C27EF9305]) [    ] o.a.s.c.ZkContainer Zookeeper client=127.0.0.1:36479/solr
   [junit4]   2> 379159 INFO  (TEST-RecoveryAfterSoftCommitTest.test-seed#[1441C83C27EF9305]) [    ] o.a.s.c.ZkController zkHost includes chroot
   [junit4]   2> 379159 INFO  (TEST-RecoveryAfterSoftCommitTest.test-seed#[1441C83C27EF9305]) [    ] o.a.s.c.c.SolrZkClient Using default ZkCredentialsProvider
   [junit4]   2> 379160 INFO  (TEST-RecoveryAfterSoftCommitTest.test-seed#[1441C83C27EF9305]) [    ] o.a.s.c.c.ConnectionManager Waiting for client to connect to ZooKeeper
   [junit4]   2> 379161 INFO  (zkCallback-257-thread-1) [    ] o.a.s.c.c.ConnectionManager Watcher org.apache.solr.common.cloud.ConnectionManager@1598de name:ZooKeeperConnection Watcher:127.0.0.1:36479 got event WatchedEvent state:SyncConnected type:None path:null path:null type:None
   [junit4]   2> 379161 INFO  (TEST-RecoveryAfterSoftCommitTest.test-seed#[1441C83C27EF9305]) [    ] o.a.s.c.c.ConnectionManager Client is connected to ZooKeeper
   [junit4]   2> 379161 INFO  (TEST-RecoveryAfterSoftCommitTest.test-seed#[1441C83C27EF9305]) [    ] o.a.s.c.c.SolrZkClient Using default ZkACLProvider
   [junit4]   2> 379162 INFO  (OverseerStateUpdate-95150573225115652-127.0.0.1:53871_pmsa%2Fqv-n_0000000000) [n:127.0.0.1:53871_pmsa%2Fqv    ] o.a.s.c.o.ZkStateWriter going to create_collection /collections/collection1/state.json
   [junit4]   2> 379162 INFO  (TEST-RecoveryAfterSoftCommitTest.test-seed#[1441C83C27EF9305]) [n:127.0.0.1:50330_pmsa%2Fqv    ] o.a.s.c.c.ConnectionManager Waiting for client to connect to ZooKeeper
   [junit4]   2> 379163 INFO  (zkCallback-258-thread-1-processing-n:127.0.0.1:50330_pmsa%2Fqv) [n:127.0.0.1:50330_pmsa%2Fqv    ] o.a.s.c.c.ConnectionManager Watcher org.apache.solr.common.cloud.ConnectionManager@16221a8 name:ZooKeeperConnection Watcher:127.0.0.1:36479/solr got event WatchedEvent state:SyncConnected type:None path:null path:null type:None
   [junit4]   2> 379163 INFO  (TEST-RecoveryAfterSoftCommitTest.test-seed#[1441C83C27EF9305]) [n:127.0.0.1:50330_pmsa%2Fqv    ] o.a.s.c.c.ConnectionManager Client is connected to ZooKeeper
   [junit4]   2> 379165 INFO  (TEST-RecoveryAfterSoftCommitTest.test-seed#[1441C83C27EF9305]) [n:127.0.0.1:50330_pmsa%2Fqv    ] o.a.s.c.c.ZkStateReader Updating cluster state from ZooKeeper... 
   [junit4]   2> 380171 INFO  (TEST-RecoveryAfterSoftCommitTest.test-seed#[1441C83C27EF9305]) [n:127.0.0.1:50330_pmsa%2Fqv    ] o.a.s.c.ZkController Register node as live in ZooKeeper:/live_nodes/127.0.0.1:50330_pmsa%2Fqv
   [junit4]   2> 380171 INFO  (TEST-RecoveryAfterSoftCommitTest.test-seed#[1441C83C27EF9305]) [n:127.0.0.1:50330_pmsa%2Fqv    ] o.a.s.c.c.SolrZkClient makePath: /live_nodes/127.0.0.1:50330_pmsa%2Fqv
   [junit4]   2> 380172 INFO  (zkCallback-258-thread-1-processing-n:127.0.0.1:50330_pmsa%2Fqv) [n:127.0.0.1:50330_pmsa%2Fqv    ] o.a.s.c.c.ZkStateReader A live node change: [WatchedEvent state:SyncConnected type:NodeChildrenChanged path:/live_nodes], has occurred - updating... (live nodes size: [1])
   [junit4]   2> 380172 INFO  (zkCallback-253-thread-1) [    ] o.a.s.c.c.ZkStateReader A live node change: [WatchedEvent state:SyncConnected type:NodeChildrenChanged path:/live_nodes], has occurred - updating... (live nodes size: [1])
   [junit4]   2> 380172 INFO  (zkCallback-251-thread-1-processing-n:127.0.0.1:53871_pmsa%2Fqv) [n:127.0.0.1:53871_pmsa%2Fqv    ] o.a.s.c.c.ZkStateReader A live node change: [WatchedEvent state:SyncConnected type:NodeChildrenChanged path:/live_nodes], has occurred - updating... (live nodes size: [1])
   [junit4]   2> 380173 INFO  (TEST-RecoveryAfterSoftCommitTest.test-seed#[1441C83C27EF9305]) [n:127.0.0.1:50330_pmsa%2Fqv    ] o.a.s.c.Overseer Overseer (id=null) closing
   [junit4]   2> 380174 INFO  (TEST-RecoveryAfterSoftCommitTest.test-seed#[1441C83C27EF9305]) [n:127.0.0.1:50330_pmsa%2Fqv    ] o.a.s.c.LeaderElector Joined leadership election with path: /overseer_elect/election/95150573225115657-127.0.0.1:50330_pmsa%2Fqv-n_0000000001
   [junit4]   2> 380174 INFO  (TEST-RecoveryAfterSoftCommitTest.test-seed#[1441C83C27EF9305]) [n:127.0.0.1:50330_pmsa%2Fqv    ] o.a.s.c.LeaderElector Watching path /overseer_elect/election/95150573225115652-127.0.0.1:53871_pmsa%2Fqv-n_0000000000 to know if I could be the leader
   [junit4]   2> 380195 INFO  (TEST-RecoveryAfterSoftCommitTest.test-seed#[1441C83C27EF9305]) [n:127.0.0.1:50330_pmsa%2Fqv    ] o.a.s.c.CoreContainer Security conf doesn't exist. Skipping setup for authorization module.
   [junit4]   2> 380195 INFO  (TEST-RecoveryAfterSoftCommitTest.test-seed#[1441C83C27EF9305]) [n:127.0.0.1:50330_pmsa%2Fqv    ] o.a.s.c.CoreContainer No authentication plugin used.
   [junit4]   2> 380196 INFO  (TEST-RecoveryAfterSoftCommitTest.test-seed#[1441C83C27EF9305]) [n:127.0.0.1:50330_pmsa%2Fqv    ] o.a.s.c.CorePropertiesLocator Looking for core definitions underneath /home/jenkins/workspace/Lucene-Solr-5.x-Linux/solr/build/solr-core/test/J1/temp/solr.cloud.RecoveryAfterSoftCommitTest_1441C83C27EF9305-001/shard-1-001/cores
   [junit4]   2> 380197 INFO  (TEST-RecoveryAfterSoftCommitTest.test-seed#[1441C83C27EF9305]) [n:127.0.0.1:50330_pmsa%2Fqv    ] o.a.s.c.CoreDescriptor Created CoreDescriptor: {loadOnStartup=true, transient=false, name=collection1, coreNodeName=, dataDir=data/, schema=schema.xml, configSetProperties=configsetprops.json, shard=, config=solrconfig.xml, collection=collection1}
   [junit4]   2> 380197 INFO  (TEST-RecoveryAfterSoftCommitTest.test-seed#[1441C83C27EF9305]) [n:127.0.0.1:50330_pmsa%2Fqv    ] o.a.s.c.CorePropertiesLocator Found core collection1 in /home/jenkins/workspace/Lucene-Solr-5.x-Linux/solr/build/solr-core/test/J1/temp/solr.cloud.RecoveryAfterSoftCommitTest_1441C83C27EF9305-001/shard-1-001/cores/collection1
   [junit4]   2> 380197 INFO  (TEST-RecoveryAfterSoftCommitTest.test-seed#[1441C83C27EF9305]) [n:127.0.0.1:50330_pmsa%2Fqv    ] o.a.s.c.CorePropertiesLocator Found 1 core definitions
   [junit4]   2> 380197 INFO  (TEST-RecoveryAfterSoftCommitTest.test-seed#[1441C83C27EF9305]) [n:127.0.0.1:50330_pmsa%2Fqv    ] o.a.s.s.SolrDispatchFilter user.dir=/home/jenkins/workspace/Lucene-Solr-5.x-Linux/solr/build/solr-core/test/J1
   [junit4]   2> 380197 INFO  (TEST-RecoveryAfterSoftCommitTest.test-seed#[1441C83C27EF9305]) [n:127.0.0.1:50330_pmsa%2Fqv    ] o.a.s.s.SolrDispatchFilter SolrDispatchFilter.init() done
   [junit4]   2> 380197 INFO  (coreLoadExecutor-1050-thread-1-processing-n:127.0.0.1:50330_pmsa%2Fqv) [n:127.0.0.1:50330_pmsa%2Fqv c:collection1   x:collection1] o.a.s.c.ZkController publishing state=down
   [junit4]   2> 380198 INFO  (coreLoadExecutor-1050-thread-1-processing-n:127.0.0.1:50330_pmsa%2Fqv) [n:127.0.0.1:50330_pmsa%2Fqv c:collection1   x:collection1] o.a.s.c.ZkController numShards not found on descriptor - reading it from system property
   [junit4]   2> 380200 INFO  (coreLoadExecutor-1050-thread-1-processing-n:127.0.0.1:50330_pmsa%2Fqv) [n:127.0.0.1:50330_pmsa%2Fqv c:collection1   x:collection1] o.a.s.c.ZkController Registering watch for collection collection1
   [junit4]   2> 380201 INFO  (coreLoadExecutor-1050-thread-1-processing-n:127.0.0.1:50330_pmsa%2Fqv) [n:127.0.0.1:50330_pmsa%2Fqv c:collection1   x:collection1] o.a.s.c.c.ZkStateReader addZkWatch [collection1]
   [junit4]   2> 380201 INFO  (coreLoadExecutor-1050-thread-1-processing-n:127.0.0.1:50330_pmsa%2Fqv) [n:127.0.0.1:50330_pmsa%2Fqv c:collection1   x:collection1] o.a.s.c.c.ZkStateReader Add data for [collection1] ver [0]
   [junit4]   2> 380201 INFO  (coreLoadExecutor-1050-thread-1-processing-n:127.0.0.1:50330_pmsa%2Fqv) [n:127.0.0.1:50330_pmsa%2Fqv c:collection1   x:collection1] o.a.s.c.ZkController look for our core node name
   [junit4]   2> 380203 INFO  (OverseerStateUpdate-95150573225115652-127.0.0.1:53871_pmsa%2Fqv-n_0000000000) [n:127.0.0.1:53871_pmsa%2Fqv    ] o.a.s.c.Overseer processMessage: queueSize: 1, message = {
   [junit4]   2>   "base_url":"http://127.0.0.1:50330/pmsa/qv",
   [junit4]   2>   "roles":null,
   [junit4]   2>   "state":"down",
   [junit4]   2>   "operation":"state",
   [junit4]   2>   "shard":null,
   [junit4]   2>   "node_name":"127.0.0.1:50330_pmsa%2Fqv",
   [junit4]   2>   "collection":"collection1",
   [junit4]   2>   "numShards":"1",
   [junit4]   2>   "core":"collection1"} current state version: 3
   [junit4]   2> 380203 INFO  (OverseerStateUpdate-95150573225115652-127.0.0.1:53871_pmsa%2Fqv-n_0000000000) [n:127.0.0.1:53871_pmsa%2Fqv    ] o.a.s.c.o.ReplicaMutator Update state numShards=1 message={
   [junit4]   2>   "base_url":"http://127.0.0.1:50330/pmsa/qv",
   [junit4]   2>   "roles":null,
   [junit4]   2>   "state":"down",
   [junit4]   2>   "operation":"state",
   [junit4]   2>   "shard":null,
   [junit4]   2>   "node_name":"127.0.0.1:50330_pmsa%2Fqv",
   [junit4]   2>   "collection":"collection1",
   [junit4]   2>   "numShards":"1",
   [junit4]   2>   "core":"collection1"}
   [junit4]   2> 380203 INFO  (OverseerStateUpdate-95150573225115652-127.0.0.1:53871_pmsa%2Fqv-n_0000000000) [n:127.0.0.1:53871_pmsa%2Fqv    ] o.a.s.c.o.ReplicaMutator Collection already exists with numShards=1
   [junit4]   2> 380203 INFO  (OverseerStateUpdate-95150573225115652-127.0.0.1:53871_pmsa%2Fqv-n_0000000000) [n:127.0.0.1:53871_pmsa%2Fqv    ] o.a.s.c.o.ReplicaMutator Assigning new node to shard shard=shard1
   [junit4]   2> 380313 INFO  (OverseerStateUpdate-95150573225115652-127.0.0.1:53871_pmsa%2Fqv-n_0000000000) [n:127.0.0.1:53871_pmsa%2Fqv    ] o.a.s.c.o.ZkStateWriter going to update_collection /collections/collection1/state.json version: 0
   [junit4]   2> 380313 INFO  (zkCallback-258-thread-1-processing-n:127.0.0.1:50330_pmsa%2Fqv) [n:127.0.0.1:50330_pmsa%2Fqv    ] o.a.s.c.c.ZkStateReader A cluster state change: [WatchedEvent state:SyncConnected type:NodeDataChanged path:/collections/collection1/state.json] for collection [collection1] has occurred - updating... (li

[...truncated too long message...]

shard1_replica2] o.a.s.c.CachingDirectoryFactory Closing directory: data/index
   [junit4]   2> 2146574 INFO  (zkCallback-688-thread-3-processing-n:127.0.0.1:57639_solr) [n:127.0.0.1:57639_solr c:testcollection s:shard1 r:core_node2 x:testcollection_shard1_replica2] o.a.s.c.CachingDirectoryFactory looking to close data [CachedDir<<refCount=0;path=data;done=false>>]
   [junit4]   2> 2146574 INFO  (zkCallback-688-thread-3-processing-n:127.0.0.1:57639_solr) [n:127.0.0.1:57639_solr c:testcollection s:shard1 r:core_node2 x:testcollection_shard1_replica2] o.a.s.c.CachingDirectoryFactory Closing directory: data
   [junit4]   2> 2146574 INFO  (zkCallback-688-thread-3-processing-n:127.0.0.1:57639_solr) [n:127.0.0.1:57639_solr c:testcollection s:shard1 r:core_node2 x:testcollection_shard1_replica2] o.a.s.c.ShardLeaderElectionContextBase No version found for ephemeral leader parent node, won't remove previous leader registration.
   [junit4]   2> 2146574 INFO  (zkCallback-688-thread-3-processing-n:127.0.0.1:57639_solr) [n:127.0.0.1:57639_solr c:testcollection s:shard1 r:core_node2 x:testcollection_shard1_replica2] o.a.s.c.ElectionContext Canceling election /collections/testcollection/leader_elect/shard1/election/95150686785044499-core_node2-n_0000000001
   [junit4]   2> 2146574 WARN  (zkCallback-688-thread-3-processing-n:127.0.0.1:57639_solr) [n:127.0.0.1:57639_solr c:testcollection s:shard1 r:core_node2 x:testcollection_shard1_replica2] o.a.s.c.LeaderElector 
   [junit4]   2> org.apache.zookeeper.KeeperException$SessionExpiredException: KeeperErrorCode = Session expired for /collections/testcollection/leader_elect/shard1/election/95150686785044499-core_node2-n_0000000001
   [junit4]   2> 	at org.apache.zookeeper.KeeperException.create(KeeperException.java:127)
   [junit4]   2> 	at org.apache.zookeeper.KeeperException.create(KeeperException.java:51)
   [junit4]   2> 	at org.apache.zookeeper.ZooKeeper.delete(ZooKeeper.java:873)
   [junit4]   2> 	at org.apache.solr.common.cloud.SolrZkClient$2.execute(SolrZkClient.java:244)
   [junit4]   2> 	at org.apache.solr.common.cloud.SolrZkClient$2.execute(SolrZkClient.java:241)
   [junit4]   2> 	at org.apache.solr.common.cloud.ZkCmdExecutor.retryOperation(ZkCmdExecutor.java:61)
   [junit4]   2> 	at org.apache.solr.common.cloud.SolrZkClient.delete(SolrZkClient.java:241)
   [junit4]   2> 	at org.apache.solr.cloud.ElectionContext.cancelElection(ElectionContext.java:87)
   [junit4]   2> 	at org.apache.solr.cloud.ShardLeaderElectionContextBase.cancelElection(ElectionContext.java:167)
   [junit4]   2> 	at org.apache.solr.cloud.ShardLeaderElectionContext.cancelElection(ElectionContext.java:269)
   [junit4]   2> 	at org.apache.solr.cloud.ShardLeaderElectionContext.runLeaderProcess(ElectionContext.java:445)
   [junit4]   2> 	at org.apache.solr.cloud.LeaderElector.runIamLeaderProcess(LeaderElector.java:198)
   [junit4]   2> 	at org.apache.solr.cloud.LeaderElector.checkIfIamLeader(LeaderElector.java:158)
   [junit4]   2> 	at org.apache.solr.cloud.LeaderElector.access$200(LeaderElector.java:59)
   [junit4]   2> 	at org.apache.solr.cloud.LeaderElector$ElectionWatcher.process(LeaderElector.java:389)
   [junit4]   2> 	at org.apache.solr.common.cloud.SolrZkClient$3$1.run(SolrZkClient.java:264)
   [junit4]   2> 	at java.util.concurrent.Executors$RunnableAdapter.call(Executors.java:471)
   [junit4]   2> 	at java.util.concurrent.FutureTask.run(FutureTask.java:262)
   [junit4]   2> 	at org.apache.solr.common.util.ExecutorUtil$MDCAwareThreadPoolExecutor$1.run(ExecutorUtil.java:232)
   [junit4]   2> 	at java.util.concurrent.ThreadPoolExecutor.runWorker(ThreadPoolExecutor.java:1145)
   [junit4]   2> 	at java.util.concurrent.ThreadPoolExecutor$Worker.run(ThreadPoolExecutor.java:615)
   [junit4]   2> 	at java.lang.Thread.run(Thread.java:745)
   [junit4]   2> 2146575 INFO  (jetty-launcher-661-thread-3) [n:127.0.0.1:57639_solr c:testcollection s:shard1 r:core_node2 x:testcollection_shard1_replica2] o.e.j.s.h.ContextHandler Stopped o.e.j.s.ServletContextHandler@5244b5{/solr,null,UNAVAILABLE}
   [junit4]   2> 2146576 INFO  (TEST-TestMiniSolrCloudCluster.testCollectionCreateSearchDelete-seed#[1441C83C27EF9305]) [    ] o.a.s.c.ZkTestServer connecting to 127.0.0.1:48485 48485
   [junit4]   2> 2146612 INFO  (Thread-2592) [    ] o.a.s.c.ZkTestServer connecting to 127.0.0.1:48485 48485
   [junit4]   2> 2146612 WARN  (Thread-2592) [    ] o.a.s.c.ZkTestServer Watch limit violations: 
   [junit4]   2> Maximum concurrent create/delete watches above limit:
   [junit4]   2> 
   [junit4]   2> 	8	/solr/configs/solrCloudCollectionConfig
   [junit4]   2> 	8	/solr/aliases.json
   [junit4]   2> 	7	/solr/security.json
   [junit4]   2> 
   [junit4]   2> Maximum concurrent data watches above limit:
   [junit4]   2> 
   [junit4]   2> 	8	/solr/clusterstate.json
   [junit4]   2> 	8	/solr/collections/testcollection/state.json
   [junit4]   2> 	3	/solr/overseer_elect/election/95150686785044495-127.0.0.1:38860_solr-n_0000000000
   [junit4]   2> 	2	/solr/overseer_elect/election/95150686785044494-127.0.0.1:45938_solr-n_0000000003
   [junit4]   2> 
   [junit4]   2> Maximum concurrent children watches above limit:
   [junit4]   2> 
   [junit4]   2> 	8	/solr/collections
   [junit4]   2> 	6	/solr/live_nodes
   [junit4]   2> 	2	/solr/overseer/collection-queue-work
   [junit4]   2> 
   [junit4]   2> NOTE: leaving temporary files on disk at: /home/jenkins/workspace/Lucene-Solr-5.x-Linux/solr/build/solr-core/test/J1/temp/solr.cloud.TestMiniSolrCloudCluster_1441C83C27EF9305-001
   [junit4]   2> Jan 04, 2016 5:11:35 AM com.carrotsearch.randomizedtesting.ThreadLeakControl checkThreadLeaks
   [junit4]   2> WARNING: Will linger awaiting termination of 1 leaked thread(s).
   [junit4]   2> NOTE: test params are: codec=FastCompressingStoredFields(storedFieldsFormat=CompressingStoredFieldsFormat(compressionMode=FAST, chunkSize=3, maxDocsPerChunk=666, blockSize=900), termVectorsFormat=CompressingTermVectorsFormat(compressionMode=FAST, chunkSize=3, blockSize=900)), sim=RandomSimilarityProvider(queryNorm=false,coord=crazy): {}, locale=en_CA, timezone=Asia/Aden
   [junit4]   2> NOTE: Linux 3.19.0-42-generic i386/Oracle Corporation 1.7.0_80 (32-bit)/cpus=12,threads=1,free=102421776,total=298471424
   [junit4]   2> NOTE: All tests run in this JVM: [ConnectionManagerTest, TestSortingResponseWriter, TestWordDelimiterFilterFactory, CollectionsAPIAsyncDistributedZkTest, TestExactStatsCache, TestExpandComponent, TestFileDictionaryLookup, TermsComponentTest, TestConfigSetsAPIExclusivity, TestTestInjection, SoftAutoCommitTest, DocExpirationUpdateProcessorFactoryTest, TestSystemIdResolver, SortSpecParsingTest, HLLSerializationTest, BitVectorTest, TestConfigReload, NotRequiredUniqueKeyTest, MultiTermTest, DistributedIntervalFacetingTest, AnalysisErrorHandlingTest, SpellingQueryConverterTest, HdfsWriteToMultipleCollectionsTest, DistributedFacetPivotWhiteBoxTest, DistanceFunctionTest, TestBinaryResponseWriter, ConvertedLegacyTest, TestUseDocValuesAsStored2, SolrIndexConfigTest, OverseerRolesTest, UpdateRequestProcessorFactoryTest, TestFastLRUCache, TestExceedMaxTermLength, NumericFieldsTest, TestManagedSchemaFieldResource, TestSurroundQueryParser, ZkCLITest, TestOrdValues, TestFiltering, TestSolr4Spatial2, FileUtilsTest, TestReRankQParserPlugin, TermVectorComponentTest, CSVRequestHandlerTest, TestCodecSupport, TestRandomRequestDistribution, SimplePostToolTest, DistribCursorPagingTest, UniqFieldsUpdateProcessorFactoryTest, RecoveryAfterSoftCommitTest, TestSolrCloudWithKerberosAlt, TestCoreContainer, DistanceUnitsTest, TestSolrQueryParserResource, MinimalSchemaTest, DistributedTermsComponentTest, BlockJoinFacetDistribTest, TestRandomForceMergePolicy, TestDFRSimilarityFactory, HdfsSyncSliceTest, ConjunctionSolrSpellCheckerTest, SpatialFilterTest, ChaosMonkeyNothingIsSafeTest, DocValuesTest, TestLMJelinekMercerSimilarityFactory, TestQueryUtils, HdfsDirectoryFactoryTest, ZkSolrClientTest, SaslZkACLProviderTest, SortByFunctionTest, SpellPossibilityIteratorTest, SpatialRPTFieldTypeTest, TestNonDefinedSimilarityFactory, TestRestoreCore, CursorMarkTest, HighlighterTest, SolrPluginUtilsTest, TestRawResponseWriter, IndexBasedSpellCheckerTest, TestMaxScoreQueryParser, TestSimpleTrackingShardHandler, SuggestComponentContextFilterQueryTest, BlockCacheTest, TestInitParams, TestOverriddenPrefixQueryForCustomFieldType, TestQuerySenderListener, SolrXmlInZkTest, TestTrie, AddSchemaFieldsUpdateProcessorFactoryTest, SuggesterFSTTest, ClusterStateUpdateTest, TestDocumentBuilder, LeaderInitiatedRecoveryOnShardRestartTest, MultiThreadedOCPTest, TestCollectionAPI, TestMiniSolrCloudCluster]
   [junit4] Completed [469/562 (2!)] on J1 in 106.70s, 6 tests, 1 failure <<< FAILURES!

[...truncated 305 lines...]
BUILD FAILED
/home/jenkins/workspace/Lucene-Solr-5.x-Linux/build.xml:794: The following error occurred while executing this line:
/home/jenkins/workspace/Lucene-Solr-5.x-Linux/build.xml:738: The following error occurred while executing this line:
/home/jenkins/workspace/Lucene-Solr-5.x-Linux/build.xml:59: The following error occurred while executing this line:
/home/jenkins/workspace/Lucene-Solr-5.x-Linux/solr/build.xml:233: The following error occurred while executing this line:
/home/jenkins/workspace/Lucene-Solr-5.x-Linux/solr/common-build.xml:526: The following error occurred while executing this line:
/home/jenkins/workspace/Lucene-Solr-5.x-Linux/lucene/common-build.xml:1444: The following error occurred while executing this line:
/home/jenkins/workspace/Lucene-Solr-5.x-Linux/lucene/common-build.xml:1000: There were test failures: 562 suites (7 ignored), 2231 tests, 2 failures, 83 ignored (39 assumptions) [seed: 1441C83C27EF9305]

Total time: 66 minutes 55 seconds
Build step 'Invoke Ant' marked build as failure
Archiving artifacts
[WARNINGS] Skipping publisher since build result is FAILURE
Recording test results
Email was triggered for: Failure - Any
Sending email for trigger: Failure - Any



Mime
View raw message