lucene-dev mailing list archives

Site index · List index
Message view « Date » · « Thread »
Top « Date » · « Thread »
From Policeman Jenkins Server <jenk...@thetaphi.de>
Subject [JENKINS-EA] Lucene-Solr-5.x-Linux (64bit/jdk-9-ea+95) - Build # 15229 - Failure!
Date Tue, 12 Jan 2016 08:10:47 GMT
Build: http://jenkins.thetaphi.de/job/Lucene-Solr-5.x-Linux/15229/
Java: 64bit/jdk-9-ea+95 -XX:+UseCompressedOops -XX:+UseG1GC -XX:-CompactStrings

8 tests failed.
FAILED:  org.apache.solr.cloud.DistribDocExpirationUpdateProcessorTest.test

Error Message:
There are still nodes recoverying - waited for 30 seconds

Stack Trace:
java.lang.AssertionError: There are still nodes recoverying - waited for 30 seconds
	at __randomizedtesting.SeedInfo.seed([3579C61727BD2A5A:BD2DF9CD894147A2]:0)
	at org.junit.Assert.fail(Assert.java:93)
	at org.apache.solr.cloud.AbstractDistribZkTestBase.waitForRecoveriesToFinish(AbstractDistribZkTestBase.java:175)
	at org.apache.solr.cloud.AbstractFullDistribZkTestBase.waitForRecoveriesToFinish(AbstractFullDistribZkTestBase.java:837)
	at org.apache.solr.cloud.AbstractFullDistribZkTestBase.waitForThingsToLevelOut(AbstractFullDistribZkTestBase.java:1393)
	at org.apache.solr.cloud.DistribDocExpirationUpdateProcessorTest.test(DistribDocExpirationUpdateProcessorTest.java:73)
	at sun.reflect.NativeMethodAccessorImpl.invoke0(Native Method)
	at sun.reflect.NativeMethodAccessorImpl.invoke(NativeMethodAccessorImpl.java:62)
	at sun.reflect.DelegatingMethodAccessorImpl.invoke(DelegatingMethodAccessorImpl.java:43)
	at java.lang.reflect.Method.invoke(Method.java:520)
	at com.carrotsearch.randomizedtesting.RandomizedRunner.invoke(RandomizedRunner.java:1764)
	at com.carrotsearch.randomizedtesting.RandomizedRunner$8.evaluate(RandomizedRunner.java:871)
	at com.carrotsearch.randomizedtesting.RandomizedRunner$9.evaluate(RandomizedRunner.java:907)
	at com.carrotsearch.randomizedtesting.RandomizedRunner$10.evaluate(RandomizedRunner.java:921)
	at org.apache.solr.BaseDistributedSearchTestCase$ShardsRepeatRule$ShardsFixedStatement.callStatement(BaseDistributedSearchTestCase.java:965)
	at org.apache.solr.BaseDistributedSearchTestCase$ShardsRepeatRule$ShardsStatement.evaluate(BaseDistributedSearchTestCase.java:940)
	at com.carrotsearch.randomizedtesting.rules.SystemPropertiesRestoreRule$1.evaluate(SystemPropertiesRestoreRule.java:57)
	at org.apache.lucene.util.TestRuleSetupTeardownChained$1.evaluate(TestRuleSetupTeardownChained.java:50)
	at org.apache.lucene.util.AbstractBeforeAfterRule$1.evaluate(AbstractBeforeAfterRule.java:46)
	at org.apache.lucene.util.TestRuleThreadAndTestName$1.evaluate(TestRuleThreadAndTestName.java:49)
	at org.apache.lucene.util.TestRuleIgnoreAfterMaxFailures$1.evaluate(TestRuleIgnoreAfterMaxFailures.java:65)
	at org.apache.lucene.util.TestRuleMarkFailure$1.evaluate(TestRuleMarkFailure.java:48)
	at com.carrotsearch.randomizedtesting.rules.StatementAdapter.evaluate(StatementAdapter.java:36)
	at com.carrotsearch.randomizedtesting.ThreadLeakControl$StatementRunner.run(ThreadLeakControl.java:367)
	at com.carrotsearch.randomizedtesting.ThreadLeakControl.forkTimeoutingTask(ThreadLeakControl.java:809)
	at com.carrotsearch.randomizedtesting.ThreadLeakControl$3.evaluate(ThreadLeakControl.java:460)
	at com.carrotsearch.randomizedtesting.RandomizedRunner.runSingleTest(RandomizedRunner.java:880)
	at com.carrotsearch.randomizedtesting.RandomizedRunner$5.evaluate(RandomizedRunner.java:781)
	at com.carrotsearch.randomizedtesting.RandomizedRunner$6.evaluate(RandomizedRunner.java:816)
	at com.carrotsearch.randomizedtesting.RandomizedRunner$7.evaluate(RandomizedRunner.java:827)
	at com.carrotsearch.randomizedtesting.rules.StatementAdapter.evaluate(StatementAdapter.java:36)
	at com.carrotsearch.randomizedtesting.rules.SystemPropertiesRestoreRule$1.evaluate(SystemPropertiesRestoreRule.java:57)
	at org.apache.lucene.util.AbstractBeforeAfterRule$1.evaluate(AbstractBeforeAfterRule.java:46)
	at com.carrotsearch.randomizedtesting.rules.StatementAdapter.evaluate(StatementAdapter.java:36)
	at org.apache.lucene.util.TestRuleStoreClassName$1.evaluate(TestRuleStoreClassName.java:42)
	at com.carrotsearch.randomizedtesting.rules.NoShadowingOrOverridesOnMethodsRule$1.evaluate(NoShadowingOrOverridesOnMethodsRule.java:40)
	at com.carrotsearch.randomizedtesting.rules.NoShadowingOrOverridesOnMethodsRule$1.evaluate(NoShadowingOrOverridesOnMethodsRule.java:40)
	at com.carrotsearch.randomizedtesting.rules.StatementAdapter.evaluate(StatementAdapter.java:36)
	at com.carrotsearch.randomizedtesting.rules.StatementAdapter.evaluate(StatementAdapter.java:36)
	at com.carrotsearch.randomizedtesting.rules.StatementAdapter.evaluate(StatementAdapter.java:36)
	at org.apache.lucene.util.TestRuleAssertionsRequired$1.evaluate(TestRuleAssertionsRequired.java:54)
	at org.apache.lucene.util.TestRuleMarkFailure$1.evaluate(TestRuleMarkFailure.java:48)
	at org.apache.lucene.util.TestRuleIgnoreAfterMaxFailures$1.evaluate(TestRuleIgnoreAfterMaxFailures.java:65)
	at org.apache.lucene.util.TestRuleIgnoreTestSuites$1.evaluate(TestRuleIgnoreTestSuites.java:55)
	at com.carrotsearch.randomizedtesting.rules.StatementAdapter.evaluate(StatementAdapter.java:36)
	at com.carrotsearch.randomizedtesting.ThreadLeakControl$StatementRunner.run(ThreadLeakControl.java:367)
	at java.lang.Thread.run(Thread.java:747)


FAILED:  org.apache.solr.cloud.ForceLeaderTest.testReplicasInLIRNoLeader

Error Message:
Doc with id=1 not found in http://127.0.0.1:40307/epa/vb/forceleader_test_collection due to: Path not found: /id; rsp={doc=null}

Stack Trace:
java.lang.AssertionError: Doc with id=1 not found in http://127.0.0.1:40307/epa/vb/forceleader_test_collection due to: Path not found: /id; rsp={doc=null}
	at __randomizedtesting.SeedInfo.seed([3579C61727BD2A5A:D3EEF2D71E3FD33B]:0)
	at org.junit.Assert.fail(Assert.java:93)
	at org.junit.Assert.assertTrue(Assert.java:43)
	at org.apache.solr.cloud.HttpPartitionTest.assertDocExists(HttpPartitionTest.java:620)
	at org.apache.solr.cloud.HttpPartitionTest.assertDocsExistInAllReplicas(HttpPartitionTest.java:573)
	at org.apache.solr.cloud.ForceLeaderTest.testReplicasInLIRNoLeader(ForceLeaderTest.java:137)
	at sun.reflect.NativeMethodAccessorImpl.invoke0(Native Method)
	at sun.reflect.NativeMethodAccessorImpl.invoke(NativeMethodAccessorImpl.java:62)
	at sun.reflect.DelegatingMethodAccessorImpl.invoke(DelegatingMethodAccessorImpl.java:43)
	at java.lang.reflect.Method.invoke(Method.java:520)
	at com.carrotsearch.randomizedtesting.RandomizedRunner.invoke(RandomizedRunner.java:1764)
	at com.carrotsearch.randomizedtesting.RandomizedRunner$8.evaluate(RandomizedRunner.java:871)
	at com.carrotsearch.randomizedtesting.RandomizedRunner$9.evaluate(RandomizedRunner.java:907)
	at com.carrotsearch.randomizedtesting.RandomizedRunner$10.evaluate(RandomizedRunner.java:921)
	at org.apache.solr.BaseDistributedSearchTestCase$ShardsRepeatRule$ShardsFixedStatement.callStatement(BaseDistributedSearchTestCase.java:965)
	at org.apache.solr.BaseDistributedSearchTestCase$ShardsRepeatRule$ShardsStatement.evaluate(BaseDistributedSearchTestCase.java:940)
	at com.carrotsearch.randomizedtesting.rules.SystemPropertiesRestoreRule$1.evaluate(SystemPropertiesRestoreRule.java:57)
	at org.apache.lucene.util.TestRuleSetupTeardownChained$1.evaluate(TestRuleSetupTeardownChained.java:50)
	at org.apache.lucene.util.AbstractBeforeAfterRule$1.evaluate(AbstractBeforeAfterRule.java:46)
	at org.apache.lucene.util.TestRuleThreadAndTestName$1.evaluate(TestRuleThreadAndTestName.java:49)
	at org.apache.lucene.util.TestRuleIgnoreAfterMaxFailures$1.evaluate(TestRuleIgnoreAfterMaxFailures.java:65)
	at org.apache.lucene.util.TestRuleMarkFailure$1.evaluate(TestRuleMarkFailure.java:48)
	at com.carrotsearch.randomizedtesting.rules.StatementAdapter.evaluate(StatementAdapter.java:36)
	at com.carrotsearch.randomizedtesting.ThreadLeakControl$StatementRunner.run(ThreadLeakControl.java:367)
	at com.carrotsearch.randomizedtesting.ThreadLeakControl.forkTimeoutingTask(ThreadLeakControl.java:809)
	at com.carrotsearch.randomizedtesting.ThreadLeakControl$3.evaluate(ThreadLeakControl.java:460)
	at com.carrotsearch.randomizedtesting.RandomizedRunner.runSingleTest(RandomizedRunner.java:880)
	at com.carrotsearch.randomizedtesting.RandomizedRunner$5.evaluate(RandomizedRunner.java:781)
	at com.carrotsearch.randomizedtesting.RandomizedRunner$6.evaluate(RandomizedRunner.java:816)
	at com.carrotsearch.randomizedtesting.RandomizedRunner$7.evaluate(RandomizedRunner.java:827)
	at com.carrotsearch.randomizedtesting.rules.StatementAdapter.evaluate(StatementAdapter.java:36)
	at com.carrotsearch.randomizedtesting.rules.SystemPropertiesRestoreRule$1.evaluate(SystemPropertiesRestoreRule.java:57)
	at org.apache.lucene.util.AbstractBeforeAfterRule$1.evaluate(AbstractBeforeAfterRule.java:46)
	at com.carrotsearch.randomizedtesting.rules.StatementAdapter.evaluate(StatementAdapter.java:36)
	at org.apache.lucene.util.TestRuleStoreClassName$1.evaluate(TestRuleStoreClassName.java:42)
	at com.carrotsearch.randomizedtesting.rules.NoShadowingOrOverridesOnMethodsRule$1.evaluate(NoShadowingOrOverridesOnMethodsRule.java:40)
	at com.carrotsearch.randomizedtesting.rules.NoShadowingOrOverridesOnMethodsRule$1.evaluate(NoShadowingOrOverridesOnMethodsRule.java:40)
	at com.carrotsearch.randomizedtesting.rules.StatementAdapter.evaluate(StatementAdapter.java:36)
	at com.carrotsearch.randomizedtesting.rules.StatementAdapter.evaluate(StatementAdapter.java:36)
	at com.carrotsearch.randomizedtesting.rules.StatementAdapter.evaluate(StatementAdapter.java:36)
	at org.apache.lucene.util.TestRuleAssertionsRequired$1.evaluate(TestRuleAssertionsRequired.java:54)
	at org.apache.lucene.util.TestRuleMarkFailure$1.evaluate(TestRuleMarkFailure.java:48)
	at org.apache.lucene.util.TestRuleIgnoreAfterMaxFailures$1.evaluate(TestRuleIgnoreAfterMaxFailures.java:65)
	at org.apache.lucene.util.TestRuleIgnoreTestSuites$1.evaluate(TestRuleIgnoreTestSuites.java:55)
	at com.carrotsearch.randomizedtesting.rules.StatementAdapter.evaluate(StatementAdapter.java:36)
	at com.carrotsearch.randomizedtesting.ThreadLeakControl$StatementRunner.run(ThreadLeakControl.java:367)
	at java.lang.Thread.run(Thread.java:747)


FAILED:  org.apache.solr.cloud.FullSolrCloudDistribCmdsTest.test

Error Message:
Doc Counts do not add up expected:<2> but was:<1>

Stack Trace:
java.lang.AssertionError: Doc Counts do not add up expected:<2> but was:<1>
	at __randomizedtesting.SeedInfo.seed([3579C61727BD2A5A:BD2DF9CD894147A2]:0)
	at org.junit.Assert.fail(Assert.java:93)
	at org.junit.Assert.failNotEquals(Assert.java:647)
	at org.junit.Assert.assertEquals(Assert.java:128)
	at org.junit.Assert.assertEquals(Assert.java:472)
	at org.apache.solr.cloud.AbstractFullDistribZkTestBase.assertDocCounts(AbstractFullDistribZkTestBase.java:1368)
	at org.apache.solr.cloud.FullSolrCloudDistribCmdsTest.test(FullSolrCloudDistribCmdsTest.java:125)
	at sun.reflect.NativeMethodAccessorImpl.invoke0(Native Method)
	at sun.reflect.NativeMethodAccessorImpl.invoke(NativeMethodAccessorImpl.java:62)
	at sun.reflect.DelegatingMethodAccessorImpl.invoke(DelegatingMethodAccessorImpl.java:43)
	at java.lang.reflect.Method.invoke(Method.java:520)
	at com.carrotsearch.randomizedtesting.RandomizedRunner.invoke(RandomizedRunner.java:1764)
	at com.carrotsearch.randomizedtesting.RandomizedRunner$8.evaluate(RandomizedRunner.java:871)
	at com.carrotsearch.randomizedtesting.RandomizedRunner$9.evaluate(RandomizedRunner.java:907)
	at com.carrotsearch.randomizedtesting.RandomizedRunner$10.evaluate(RandomizedRunner.java:921)
	at org.apache.solr.BaseDistributedSearchTestCase$ShardsRepeatRule$ShardsFixedStatement.callStatement(BaseDistributedSearchTestCase.java:965)
	at org.apache.solr.BaseDistributedSearchTestCase$ShardsRepeatRule$ShardsStatement.evaluate(BaseDistributedSearchTestCase.java:940)
	at com.carrotsearch.randomizedtesting.rules.SystemPropertiesRestoreRule$1.evaluate(SystemPropertiesRestoreRule.java:57)
	at org.apache.lucene.util.TestRuleSetupTeardownChained$1.evaluate(TestRuleSetupTeardownChained.java:50)
	at org.apache.lucene.util.AbstractBeforeAfterRule$1.evaluate(AbstractBeforeAfterRule.java:46)
	at org.apache.lucene.util.TestRuleThreadAndTestName$1.evaluate(TestRuleThreadAndTestName.java:49)
	at org.apache.lucene.util.TestRuleIgnoreAfterMaxFailures$1.evaluate(TestRuleIgnoreAfterMaxFailures.java:65)
	at org.apache.lucene.util.TestRuleMarkFailure$1.evaluate(TestRuleMarkFailure.java:48)
	at com.carrotsearch.randomizedtesting.rules.StatementAdapter.evaluate(StatementAdapter.java:36)
	at com.carrotsearch.randomizedtesting.ThreadLeakControl$StatementRunner.run(ThreadLeakControl.java:367)
	at com.carrotsearch.randomizedtesting.ThreadLeakControl.forkTimeoutingTask(ThreadLeakControl.java:809)
	at com.carrotsearch.randomizedtesting.ThreadLeakControl$3.evaluate(ThreadLeakControl.java:460)
	at com.carrotsearch.randomizedtesting.RandomizedRunner.runSingleTest(RandomizedRunner.java:880)
	at com.carrotsearch.randomizedtesting.RandomizedRunner$5.evaluate(RandomizedRunner.java:781)
	at com.carrotsearch.randomizedtesting.RandomizedRunner$6.evaluate(RandomizedRunner.java:816)
	at com.carrotsearch.randomizedtesting.RandomizedRunner$7.evaluate(RandomizedRunner.java:827)
	at com.carrotsearch.randomizedtesting.rules.StatementAdapter.evaluate(StatementAdapter.java:36)
	at com.carrotsearch.randomizedtesting.rules.SystemPropertiesRestoreRule$1.evaluate(SystemPropertiesRestoreRule.java:57)
	at org.apache.lucene.util.AbstractBeforeAfterRule$1.evaluate(AbstractBeforeAfterRule.java:46)
	at com.carrotsearch.randomizedtesting.rules.StatementAdapter.evaluate(StatementAdapter.java:36)
	at org.apache.lucene.util.TestRuleStoreClassName$1.evaluate(TestRuleStoreClassName.java:42)
	at com.carrotsearch.randomizedtesting.rules.NoShadowingOrOverridesOnMethodsRule$1.evaluate(NoShadowingOrOverridesOnMethodsRule.java:40)
	at com.carrotsearch.randomizedtesting.rules.NoShadowingOrOverridesOnMethodsRule$1.evaluate(NoShadowingOrOverridesOnMethodsRule.java:40)
	at com.carrotsearch.randomizedtesting.rules.StatementAdapter.evaluate(StatementAdapter.java:36)
	at com.carrotsearch.randomizedtesting.rules.StatementAdapter.evaluate(StatementAdapter.java:36)
	at com.carrotsearch.randomizedtesting.rules.StatementAdapter.evaluate(StatementAdapter.java:36)
	at org.apache.lucene.util.TestRuleAssertionsRequired$1.evaluate(TestRuleAssertionsRequired.java:54)
	at org.apache.lucene.util.TestRuleMarkFailure$1.evaluate(TestRuleMarkFailure.java:48)
	at org.apache.lucene.util.TestRuleIgnoreAfterMaxFailures$1.evaluate(TestRuleIgnoreAfterMaxFailures.java:65)
	at org.apache.lucene.util.TestRuleIgnoreTestSuites$1.evaluate(TestRuleIgnoreTestSuites.java:55)
	at com.carrotsearch.randomizedtesting.rules.StatementAdapter.evaluate(StatementAdapter.java:36)
	at com.carrotsearch.randomizedtesting.ThreadLeakControl$StatementRunner.run(ThreadLeakControl.java:367)
	at java.lang.Thread.run(Thread.java:747)


FAILED:  org.apache.solr.cloud.LeaderFailoverAfterPartitionTest.test

Error Message:
Doc with id=4 not found in http://127.0.0.1:57925/hw_/bz/c8n_1x3_lf due to: Path not found: /id; rsp={doc=null}

Stack Trace:
java.lang.AssertionError: Doc with id=4 not found in http://127.0.0.1:57925/hw_/bz/c8n_1x3_lf due to: Path not found: /id; rsp={doc=null}
	at __randomizedtesting.SeedInfo.seed([3579C61727BD2A5A:BD2DF9CD894147A2]:0)
	at org.junit.Assert.fail(Assert.java:93)
	at org.junit.Assert.assertTrue(Assert.java:43)
	at org.apache.solr.cloud.HttpPartitionTest.assertDocExists(HttpPartitionTest.java:620)
	at org.apache.solr.cloud.HttpPartitionTest.assertDocsExistInAllReplicas(HttpPartitionTest.java:575)
	at org.apache.solr.cloud.LeaderFailoverAfterPartitionTest.testRf3WithLeaderFailover(LeaderFailoverAfterPartitionTest.java:103)
	at org.apache.solr.cloud.LeaderFailoverAfterPartitionTest.test(LeaderFailoverAfterPartitionTest.java:56)
	at sun.reflect.NativeMethodAccessorImpl.invoke0(Native Method)
	at sun.reflect.NativeMethodAccessorImpl.invoke(NativeMethodAccessorImpl.java:62)
	at sun.reflect.DelegatingMethodAccessorImpl.invoke(DelegatingMethodAccessorImpl.java:43)
	at java.lang.reflect.Method.invoke(Method.java:520)
	at com.carrotsearch.randomizedtesting.RandomizedRunner.invoke(RandomizedRunner.java:1764)
	at com.carrotsearch.randomizedtesting.RandomizedRunner$8.evaluate(RandomizedRunner.java:871)
	at com.carrotsearch.randomizedtesting.RandomizedRunner$9.evaluate(RandomizedRunner.java:907)
	at com.carrotsearch.randomizedtesting.RandomizedRunner$10.evaluate(RandomizedRunner.java:921)
	at org.apache.solr.BaseDistributedSearchTestCase$ShardsRepeatRule$ShardsFixedStatement.callStatement(BaseDistributedSearchTestCase.java:965)
	at org.apache.solr.BaseDistributedSearchTestCase$ShardsRepeatRule$ShardsStatement.evaluate(BaseDistributedSearchTestCase.java:940)
	at com.carrotsearch.randomizedtesting.rules.SystemPropertiesRestoreRule$1.evaluate(SystemPropertiesRestoreRule.java:57)
	at org.apache.lucene.util.TestRuleSetupTeardownChained$1.evaluate(TestRuleSetupTeardownChained.java:50)
	at org.apache.lucene.util.AbstractBeforeAfterRule$1.evaluate(AbstractBeforeAfterRule.java:46)
	at org.apache.lucene.util.TestRuleThreadAndTestName$1.evaluate(TestRuleThreadAndTestName.java:49)
	at org.apache.lucene.util.TestRuleIgnoreAfterMaxFailures$1.evaluate(TestRuleIgnoreAfterMaxFailures.java:65)
	at org.apache.lucene.util.TestRuleMarkFailure$1.evaluate(TestRuleMarkFailure.java:48)
	at com.carrotsearch.randomizedtesting.rules.StatementAdapter.evaluate(StatementAdapter.java:36)
	at com.carrotsearch.randomizedtesting.ThreadLeakControl$StatementRunner.run(ThreadLeakControl.java:367)
	at com.carrotsearch.randomizedtesting.ThreadLeakControl.forkTimeoutingTask(ThreadLeakControl.java:809)
	at com.carrotsearch.randomizedtesting.ThreadLeakControl$3.evaluate(ThreadLeakControl.java:460)
	at com.carrotsearch.randomizedtesting.RandomizedRunner.runSingleTest(RandomizedRunner.java:880)
	at com.carrotsearch.randomizedtesting.RandomizedRunner$5.evaluate(RandomizedRunner.java:781)
	at com.carrotsearch.randomizedtesting.RandomizedRunner$6.evaluate(RandomizedRunner.java:816)
	at com.carrotsearch.randomizedtesting.RandomizedRunner$7.evaluate(RandomizedRunner.java:827)
	at com.carrotsearch.randomizedtesting.rules.StatementAdapter.evaluate(StatementAdapter.java:36)
	at com.carrotsearch.randomizedtesting.rules.SystemPropertiesRestoreRule$1.evaluate(SystemPropertiesRestoreRule.java:57)
	at org.apache.lucene.util.AbstractBeforeAfterRule$1.evaluate(AbstractBeforeAfterRule.java:46)
	at com.carrotsearch.randomizedtesting.rules.StatementAdapter.evaluate(StatementAdapter.java:36)
	at org.apache.lucene.util.TestRuleStoreClassName$1.evaluate(TestRuleStoreClassName.java:42)
	at com.carrotsearch.randomizedtesting.rules.NoShadowingOrOverridesOnMethodsRule$1.evaluate(NoShadowingOrOverridesOnMethodsRule.java:40)
	at com.carrotsearch.randomizedtesting.rules.NoShadowingOrOverridesOnMethodsRule$1.evaluate(NoShadowingOrOverridesOnMethodsRule.java:40)
	at com.carrotsearch.randomizedtesting.rules.StatementAdapter.evaluate(StatementAdapter.java:36)
	at com.carrotsearch.randomizedtesting.rules.StatementAdapter.evaluate(StatementAdapter.java:36)
	at com.carrotsearch.randomizedtesting.rules.StatementAdapter.evaluate(StatementAdapter.java:36)
	at org.apache.lucene.util.TestRuleAssertionsRequired$1.evaluate(TestRuleAssertionsRequired.java:54)
	at org.apache.lucene.util.TestRuleMarkFailure$1.evaluate(TestRuleMarkFailure.java:48)
	at org.apache.lucene.util.TestRuleIgnoreAfterMaxFailures$1.evaluate(TestRuleIgnoreAfterMaxFailures.java:65)
	at org.apache.lucene.util.TestRuleIgnoreTestSuites$1.evaluate(TestRuleIgnoreTestSuites.java:55)
	at com.carrotsearch.randomizedtesting.rules.StatementAdapter.evaluate(StatementAdapter.java:36)
	at com.carrotsearch.randomizedtesting.ThreadLeakControl$StatementRunner.run(ThreadLeakControl.java:367)
	at java.lang.Thread.run(Thread.java:747)


FAILED:  org.apache.solr.cloud.SyncSliceTest.test

Error Message:


Stack Trace:
java.lang.AssertionError
	at __randomizedtesting.SeedInfo.seed([3579C61727BD2A5A:BD2DF9CD894147A2]:0)
	at org.junit.Assert.fail(Assert.java:92)
	at org.junit.Assert.assertTrue(Assert.java:43)
	at org.junit.Assert.assertNotNull(Assert.java:526)
	at org.junit.Assert.assertNotNull(Assert.java:537)
	at org.apache.solr.cloud.SyncSliceTest.test(SyncSliceTest.java:101)
	at sun.reflect.NativeMethodAccessorImpl.invoke0(Native Method)
	at sun.reflect.NativeMethodAccessorImpl.invoke(NativeMethodAccessorImpl.java:62)
	at sun.reflect.DelegatingMethodAccessorImpl.invoke(DelegatingMethodAccessorImpl.java:43)
	at java.lang.reflect.Method.invoke(Method.java:520)
	at com.carrotsearch.randomizedtesting.RandomizedRunner.invoke(RandomizedRunner.java:1764)
	at com.carrotsearch.randomizedtesting.RandomizedRunner$8.evaluate(RandomizedRunner.java:871)
	at com.carrotsearch.randomizedtesting.RandomizedRunner$9.evaluate(RandomizedRunner.java:907)
	at com.carrotsearch.randomizedtesting.RandomizedRunner$10.evaluate(RandomizedRunner.java:921)
	at org.apache.solr.BaseDistributedSearchTestCase$ShardsRepeatRule$ShardsFixedStatement.callStatement(BaseDistributedSearchTestCase.java:965)
	at org.apache.solr.BaseDistributedSearchTestCase$ShardsRepeatRule$ShardsStatement.evaluate(BaseDistributedSearchTestCase.java:940)
	at com.carrotsearch.randomizedtesting.rules.SystemPropertiesRestoreRule$1.evaluate(SystemPropertiesRestoreRule.java:57)
	at org.apache.lucene.util.TestRuleSetupTeardownChained$1.evaluate(TestRuleSetupTeardownChained.java:50)
	at org.apache.lucene.util.AbstractBeforeAfterRule$1.evaluate(AbstractBeforeAfterRule.java:46)
	at org.apache.lucene.util.TestRuleThreadAndTestName$1.evaluate(TestRuleThreadAndTestName.java:49)
	at org.apache.lucene.util.TestRuleIgnoreAfterMaxFailures$1.evaluate(TestRuleIgnoreAfterMaxFailures.java:65)
	at org.apache.lucene.util.TestRuleMarkFailure$1.evaluate(TestRuleMarkFailure.java:48)
	at com.carrotsearch.randomizedtesting.rules.StatementAdapter.evaluate(StatementAdapter.java:36)
	at com.carrotsearch.randomizedtesting.ThreadLeakControl$StatementRunner.run(ThreadLeakControl.java:367)
	at com.carrotsearch.randomizedtesting.ThreadLeakControl.forkTimeoutingTask(ThreadLeakControl.java:809)
	at com.carrotsearch.randomizedtesting.ThreadLeakControl$3.evaluate(ThreadLeakControl.java:460)
	at com.carrotsearch.randomizedtesting.RandomizedRunner.runSingleTest(RandomizedRunner.java:880)
	at com.carrotsearch.randomizedtesting.RandomizedRunner$5.evaluate(RandomizedRunner.java:781)
	at com.carrotsearch.randomizedtesting.RandomizedRunner$6.evaluate(RandomizedRunner.java:816)
	at com.carrotsearch.randomizedtesting.RandomizedRunner$7.evaluate(RandomizedRunner.java:827)
	at com.carrotsearch.randomizedtesting.rules.StatementAdapter.evaluate(StatementAdapter.java:36)
	at com.carrotsearch.randomizedtesting.rules.SystemPropertiesRestoreRule$1.evaluate(SystemPropertiesRestoreRule.java:57)
	at org.apache.lucene.util.AbstractBeforeAfterRule$1.evaluate(AbstractBeforeAfterRule.java:46)
	at com.carrotsearch.randomizedtesting.rules.StatementAdapter.evaluate(StatementAdapter.java:36)
	at org.apache.lucene.util.TestRuleStoreClassName$1.evaluate(TestRuleStoreClassName.java:42)
	at com.carrotsearch.randomizedtesting.rules.NoShadowingOrOverridesOnMethodsRule$1.evaluate(NoShadowingOrOverridesOnMethodsRule.java:40)
	at com.carrotsearch.randomizedtesting.rules.NoShadowingOrOverridesOnMethodsRule$1.evaluate(NoShadowingOrOverridesOnMethodsRule.java:40)
	at com.carrotsearch.randomizedtesting.rules.StatementAdapter.evaluate(StatementAdapter.java:36)
	at com.carrotsearch.randomizedtesting.rules.StatementAdapter.evaluate(StatementAdapter.java:36)
	at com.carrotsearch.randomizedtesting.rules.StatementAdapter.evaluate(StatementAdapter.java:36)
	at org.apache.lucene.util.TestRuleAssertionsRequired$1.evaluate(TestRuleAssertionsRequired.java:54)
	at org.apache.lucene.util.TestRuleMarkFailure$1.evaluate(TestRuleMarkFailure.java:48)
	at org.apache.lucene.util.TestRuleIgnoreAfterMaxFailures$1.evaluate(TestRuleIgnoreAfterMaxFailures.java:65)
	at org.apache.lucene.util.TestRuleIgnoreTestSuites$1.evaluate(TestRuleIgnoreTestSuites.java:55)
	at com.carrotsearch.randomizedtesting.rules.StatementAdapter.evaluate(StatementAdapter.java:36)
	at com.carrotsearch.randomizedtesting.ThreadLeakControl$StatementRunner.run(ThreadLeakControl.java:367)
	at java.lang.Thread.run(Thread.java:747)


FAILED:  org.apache.solr.cloud.TestAuthenticationFramework.testBasics

Error Message:
expected:<1> but was:<0>

Stack Trace:
java.lang.AssertionError: expected:<1> but was:<0>
	at __randomizedtesting.SeedInfo.seed([3579C61727BD2A5A:8A1683B1F53742A]:0)
	at org.junit.Assert.fail(Assert.java:93)
	at org.junit.Assert.failNotEquals(Assert.java:647)
	at org.junit.Assert.assertEquals(Assert.java:128)
	at org.junit.Assert.assertEquals(Assert.java:472)
	at org.junit.Assert.assertEquals(Assert.java:456)
	at org.apache.solr.cloud.TestMiniSolrCloudCluster.testCollectionCreateSearchDelete(TestMiniSolrCloudCluster.java:175)
	at org.apache.solr.cloud.TestAuthenticationFramework.testBasics(TestAuthenticationFramework.java:93)
	at sun.reflect.NativeMethodAccessorImpl.invoke0(Native Method)
	at sun.reflect.NativeMethodAccessorImpl.invoke(NativeMethodAccessorImpl.java:62)
	at sun.reflect.DelegatingMethodAccessorImpl.invoke(DelegatingMethodAccessorImpl.java:43)
	at java.lang.reflect.Method.invoke(Method.java:520)
	at com.carrotsearch.randomizedtesting.RandomizedRunner.invoke(RandomizedRunner.java:1764)
	at com.carrotsearch.randomizedtesting.RandomizedRunner$8.evaluate(RandomizedRunner.java:871)
	at com.carrotsearch.randomizedtesting.RandomizedRunner$9.evaluate(RandomizedRunner.java:907)
	at com.carrotsearch.randomizedtesting.RandomizedRunner$10.evaluate(RandomizedRunner.java:921)
	at com.carrotsearch.randomizedtesting.rules.SystemPropertiesRestoreRule$1.evaluate(SystemPropertiesRestoreRule.java:57)
	at org.apache.lucene.util.TestRuleSetupTeardownChained$1.evaluate(TestRuleSetupTeardownChained.java:50)
	at org.apache.lucene.util.AbstractBeforeAfterRule$1.evaluate(AbstractBeforeAfterRule.java:46)
	at org.apache.lucene.util.TestRuleThreadAndTestName$1.evaluate(TestRuleThreadAndTestName.java:49)
	at org.apache.lucene.util.TestRuleIgnoreAfterMaxFailures$1.evaluate(TestRuleIgnoreAfterMaxFailures.java:65)
	at org.apache.lucene.util.TestRuleMarkFailure$1.evaluate(TestRuleMarkFailure.java:48)
	at com.carrotsearch.randomizedtesting.rules.StatementAdapter.evaluate(StatementAdapter.java:36)
	at com.carrotsearch.randomizedtesting.ThreadLeakControl$StatementRunner.run(ThreadLeakControl.java:367)
	at com.carrotsearch.randomizedtesting.ThreadLeakControl.forkTimeoutingTask(ThreadLeakControl.java:809)
	at com.carrotsearch.randomizedtesting.ThreadLeakControl$3.evaluate(ThreadLeakControl.java:460)
	at com.carrotsearch.randomizedtesting.RandomizedRunner.runSingleTest(RandomizedRunner.java:880)
	at com.carrotsearch.randomizedtesting.RandomizedRunner$5.evaluate(RandomizedRunner.java:781)
	at com.carrotsearch.randomizedtesting.RandomizedRunner$6.evaluate(RandomizedRunner.java:816)
	at com.carrotsearch.randomizedtesting.RandomizedRunner$7.evaluate(RandomizedRunner.java:827)
	at com.carrotsearch.randomizedtesting.rules.StatementAdapter.evaluate(StatementAdapter.java:36)
	at com.carrotsearch.randomizedtesting.rules.SystemPropertiesRestoreRule$1.evaluate(SystemPropertiesRestoreRule.java:57)
	at org.apache.lucene.util.AbstractBeforeAfterRule$1.evaluate(AbstractBeforeAfterRule.java:46)
	at com.carrotsearch.randomizedtesting.rules.StatementAdapter.evaluate(StatementAdapter.java:36)
	at org.apache.lucene.util.TestRuleStoreClassName$1.evaluate(TestRuleStoreClassName.java:42)
	at com.carrotsearch.randomizedtesting.rules.NoShadowingOrOverridesOnMethodsRule$1.evaluate(NoShadowingOrOverridesOnMethodsRule.java:40)
	at com.carrotsearch.randomizedtesting.rules.NoShadowingOrOverridesOnMethodsRule$1.evaluate(NoShadowingOrOverridesOnMethodsRule.java:40)
	at com.carrotsearch.randomizedtesting.rules.StatementAdapter.evaluate(StatementAdapter.java:36)
	at com.carrotsearch.randomizedtesting.rules.StatementAdapter.evaluate(StatementAdapter.java:36)
	at com.carrotsearch.randomizedtesting.rules.StatementAdapter.evaluate(StatementAdapter.java:36)
	at org.apache.lucene.util.TestRuleAssertionsRequired$1.evaluate(TestRuleAssertionsRequired.java:54)
	at org.apache.lucene.util.TestRuleMarkFailure$1.evaluate(TestRuleMarkFailure.java:48)
	at org.apache.lucene.util.TestRuleIgnoreAfterMaxFailures$1.evaluate(TestRuleIgnoreAfterMaxFailures.java:65)
	at org.apache.lucene.util.TestRuleIgnoreTestSuites$1.evaluate(TestRuleIgnoreTestSuites.java:55)
	at com.carrotsearch.randomizedtesting.rules.StatementAdapter.evaluate(StatementAdapter.java:36)
	at com.carrotsearch.randomizedtesting.ThreadLeakControl$StatementRunner.run(ThreadLeakControl.java:367)
	at java.lang.Thread.run(Thread.java:747)


FAILED:  org.apache.solr.cloud.TestAuthenticationFramework.testStopAllStartAll

Error Message:
expected:<8> but was:<5>

Stack Trace:
java.lang.AssertionError: expected:<8> but was:<5>
	at __randomizedtesting.SeedInfo.seed([3579C61727BD2A5A:4347D964668A8775]:0)
	at org.junit.Assert.fail(Assert.java:93)
	at org.junit.Assert.failNotEquals(Assert.java:647)
	at org.junit.Assert.assertEquals(Assert.java:128)
	at org.junit.Assert.assertEquals(Assert.java:472)
	at org.junit.Assert.assertEquals(Assert.java:456)
	at org.apache.solr.cloud.TestMiniSolrCloudCluster.testStopAllStartAll(TestMiniSolrCloudCluster.java:448)
	at sun.reflect.NativeMethodAccessorImpl.invoke0(Native Method)
	at sun.reflect.NativeMethodAccessorImpl.invoke(NativeMethodAccessorImpl.java:62)
	at sun.reflect.DelegatingMethodAccessorImpl.invoke(DelegatingMethodAccessorImpl.java:43)
	at java.lang.reflect.Method.invoke(Method.java:520)
	at com.carrotsearch.randomizedtesting.RandomizedRunner.invoke(RandomizedRunner.java:1764)
	at com.carrotsearch.randomizedtesting.RandomizedRunner$8.evaluate(RandomizedRunner.java:871)
	at com.carrotsearch.randomizedtesting.RandomizedRunner$9.evaluate(RandomizedRunner.java:907)
	at com.carrotsearch.randomizedtesting.RandomizedRunner$10.evaluate(RandomizedRunner.java:921)
	at com.carrotsearch.randomizedtesting.rules.SystemPropertiesRestoreRule$1.evaluate(SystemPropertiesRestoreRule.java:57)
	at org.apache.lucene.util.TestRuleSetupTeardownChained$1.evaluate(TestRuleSetupTeardownChained.java:50)
	at org.apache.lucene.util.AbstractBeforeAfterRule$1.evaluate(AbstractBeforeAfterRule.java:46)
	at org.apache.lucene.util.TestRuleThreadAndTestName$1.evaluate(TestRuleThreadAndTestName.java:49)
	at org.apache.lucene.util.TestRuleIgnoreAfterMaxFailures$1.evaluate(TestRuleIgnoreAfterMaxFailures.java:65)
	at org.apache.lucene.util.TestRuleMarkFailure$1.evaluate(TestRuleMarkFailure.java:48)
	at com.carrotsearch.randomizedtesting.rules.StatementAdapter.evaluate(StatementAdapter.java:36)
	at com.carrotsearch.randomizedtesting.ThreadLeakControl$StatementRunner.run(ThreadLeakControl.java:367)
	at com.carrotsearch.randomizedtesting.ThreadLeakControl.forkTimeoutingTask(ThreadLeakControl.java:809)
	at com.carrotsearch.randomizedtesting.ThreadLeakControl$3.evaluate(ThreadLeakControl.java:460)
	at com.carrotsearch.randomizedtesting.RandomizedRunner.runSingleTest(RandomizedRunner.java:880)
	at com.carrotsearch.randomizedtesting.RandomizedRunner$5.evaluate(RandomizedRunner.java:781)
	at com.carrotsearch.randomizedtesting.RandomizedRunner$6.evaluate(RandomizedRunner.java:816)
	at com.carrotsearch.randomizedtesting.RandomizedRunner$7.evaluate(RandomizedRunner.java:827)
	at com.carrotsearch.randomizedtesting.rules.StatementAdapter.evaluate(StatementAdapter.java:36)
	at com.carrotsearch.randomizedtesting.rules.SystemPropertiesRestoreRule$1.evaluate(SystemPropertiesRestoreRule.java:57)
	at org.apache.lucene.util.AbstractBeforeAfterRule$1.evaluate(AbstractBeforeAfterRule.java:46)
	at com.carrotsearch.randomizedtesting.rules.StatementAdapter.evaluate(StatementAdapter.java:36)
	at org.apache.lucene.util.TestRuleStoreClassName$1.evaluate(TestRuleStoreClassName.java:42)
	at com.carrotsearch.randomizedtesting.rules.NoShadowingOrOverridesOnMethodsRule$1.evaluate(NoShadowingOrOverridesOnMethodsRule.java:40)
	at com.carrotsearch.randomizedtesting.rules.NoShadowingOrOverridesOnMethodsRule$1.evaluate(NoShadowingOrOverridesOnMethodsRule.java:40)
	at com.carrotsearch.randomizedtesting.rules.StatementAdapter.evaluate(StatementAdapter.java:36)
	at com.carrotsearch.randomizedtesting.rules.StatementAdapter.evaluate(StatementAdapter.java:36)
	at com.carrotsearch.randomizedtesting.rules.StatementAdapter.evaluate(StatementAdapter.java:36)
	at org.apache.lucene.util.TestRuleAssertionsRequired$1.evaluate(TestRuleAssertionsRequired.java:54)
	at org.apache.lucene.util.TestRuleMarkFailure$1.evaluate(TestRuleMarkFailure.java:48)
	at org.apache.lucene.util.TestRuleIgnoreAfterMaxFailures$1.evaluate(TestRuleIgnoreAfterMaxFailures.java:65)
	at org.apache.lucene.util.TestRuleIgnoreTestSuites$1.evaluate(TestRuleIgnoreTestSuites.java:55)
	at com.carrotsearch.randomizedtesting.rules.StatementAdapter.evaluate(StatementAdapter.java:36)
	at com.carrotsearch.randomizedtesting.ThreadLeakControl$StatementRunner.run(ThreadLeakControl.java:367)
	at java.lang.Thread.run(Thread.java:747)


FAILED:  org.apache.solr.cloud.TestMiniSolrCloudClusterBase.testBasics

Error Message:
expected:<1> but was:<0>

Stack Trace:
java.lang.AssertionError: expected:<1> but was:<0>
	at __randomizedtesting.SeedInfo.seed([3579C61727BD2A5A:8A1683B1F53742A]:0)
	at org.junit.Assert.fail(Assert.java:93)
	at org.junit.Assert.failNotEquals(Assert.java:647)
	at org.junit.Assert.assertEquals(Assert.java:128)
	at org.junit.Assert.assertEquals(Assert.java:472)
	at org.junit.Assert.assertEquals(Assert.java:456)
	at org.apache.solr.cloud.TestMiniSolrCloudClusterBase.testCollectionCreateSearchDelete(TestMiniSolrCloudClusterBase.java:149)
	at org.apache.solr.cloud.TestMiniSolrCloudClusterBase.testBasics(TestMiniSolrCloudClusterBase.java:78)
	at sun.reflect.NativeMethodAccessorImpl.invoke0(Native Method)
	at sun.reflect.NativeMethodAccessorImpl.invoke(NativeMethodAccessorImpl.java:62)
	at sun.reflect.DelegatingMethodAccessorImpl.invoke(DelegatingMethodAccessorImpl.java:43)
	at java.lang.reflect.Method.invoke(Method.java:520)
	at com.carrotsearch.randomizedtesting.RandomizedRunner.invoke(RandomizedRunner.java:1764)
	at com.carrotsearch.randomizedtesting.RandomizedRunner$8.evaluate(RandomizedRunner.java:871)
	at com.carrotsearch.randomizedtesting.RandomizedRunner$9.evaluate(RandomizedRunner.java:907)
	at com.carrotsearch.randomizedtesting.RandomizedRunner$10.evaluate(RandomizedRunner.java:921)
	at com.carrotsearch.randomizedtesting.rules.SystemPropertiesRestoreRule$1.evaluate(SystemPropertiesRestoreRule.java:57)
	at org.apache.lucene.util.TestRuleSetupTeardownChained$1.evaluate(TestRuleSetupTeardownChained.java:50)
	at org.apache.lucene.util.AbstractBeforeAfterRule$1.evaluate(AbstractBeforeAfterRule.java:46)
	at org.apache.lucene.util.TestRuleThreadAndTestName$1.evaluate(TestRuleThreadAndTestName.java:49)
	at org.apache.lucene.util.TestRuleIgnoreAfterMaxFailures$1.evaluate(TestRuleIgnoreAfterMaxFailures.java:65)
	at org.apache.lucene.util.TestRuleMarkFailure$1.evaluate(TestRuleMarkFailure.java:48)
	at com.carrotsearch.randomizedtesting.rules.StatementAdapter.evaluate(StatementAdapter.java:36)
	at com.carrotsearch.randomizedtesting.ThreadLeakControl$StatementRunner.run(ThreadLeakControl.java:367)
	at com.carrotsearch.randomizedtesting.ThreadLeakControl.forkTimeoutingTask(ThreadLeakControl.java:809)
	at com.carrotsearch.randomizedtesting.ThreadLeakControl$3.evaluate(ThreadLeakControl.java:460)
	at com.carrotsearch.randomizedtesting.RandomizedRunner.runSingleTest(RandomizedRunner.java:880)
	at com.carrotsearch.randomizedtesting.RandomizedRunner$5.evaluate(RandomizedRunner.java:781)
	at com.carrotsearch.randomizedtesting.RandomizedRunner$6.evaluate(RandomizedRunner.java:816)
	at com.carrotsearch.randomizedtesting.RandomizedRunner$7.evaluate(RandomizedRunner.java:827)
	at com.carrotsearch.randomizedtesting.rules.StatementAdapter.evaluate(StatementAdapter.java:36)
	at com.carrotsearch.randomizedtesting.rules.SystemPropertiesRestoreRule$1.evaluate(SystemPropertiesRestoreRule.java:57)
	at org.apache.lucene.util.AbstractBeforeAfterRule$1.evaluate(AbstractBeforeAfterRule.java:46)
	at com.carrotsearch.randomizedtesting.rules.StatementAdapter.evaluate(StatementAdapter.java:36)
	at org.apache.lucene.util.TestRuleStoreClassName$1.evaluate(TestRuleStoreClassName.java:42)
	at com.carrotsearch.randomizedtesting.rules.NoShadowingOrOverridesOnMethodsRule$1.evaluate(NoShadowingOrOverridesOnMethodsRule.java:40)
	at com.carrotsearch.randomizedtesting.rules.NoShadowingOrOverridesOnMethodsRule$1.evaluate(NoShadowingOrOverridesOnMethodsRule.java:40)
	at com.carrotsearch.randomizedtesting.rules.StatementAdapter.evaluate(StatementAdapter.java:36)
	at com.carrotsearch.randomizedtesting.rules.StatementAdapter.evaluate(StatementAdapter.java:36)
	at com.carrotsearch.randomizedtesting.rules.StatementAdapter.evaluate(StatementAdapter.java:36)
	at org.apache.lucene.util.TestRuleAssertionsRequired$1.evaluate(TestRuleAssertionsRequired.java:54)
	at org.apache.lucene.util.TestRuleMarkFailure$1.evaluate(TestRuleMarkFailure.java:48)
	at org.apache.lucene.util.TestRuleIgnoreAfterMaxFailures$1.evaluate(TestRuleIgnoreAfterMaxFailures.java:65)
	at org.apache.lucene.util.TestRuleIgnoreTestSuites$1.evaluate(TestRuleIgnoreTestSuites.java:55)
	at com.carrotsearch.randomizedtesting.rules.StatementAdapter.evaluate(StatementAdapter.java:36)
	at com.carrotsearch.randomizedtesting.ThreadLeakControl$StatementRunner.run(ThreadLeakControl.java:367)
	at java.lang.Thread.run(Thread.java:747)




Build Log:
[...truncated 10195 lines...]
   [junit4] Suite: org.apache.solr.cloud.FullSolrCloudDistribCmdsTest
   [junit4]   2> Creating dataDir: /home/jenkins/workspace/Lucene-Solr-5.x-Linux/solr/build/solr-core/test/J2/temp/solr.cloud.FullSolrCloudDistribCmdsTest_3579C61727BD2A5A-001/init-core-data-001
   [junit4]   2> 172617 INFO  (SUITE-FullSolrCloudDistribCmdsTest-seed#[3579C61727BD2A5A]-worker) [    ] o.a.s.BaseDistributedSearchTestCase Setting hostContext system property: /
   [junit4]   2> 172619 INFO  (TEST-FullSolrCloudDistribCmdsTest.test-seed#[3579C61727BD2A5A]) [    ] o.a.s.c.ZkTestServer STARTING ZK TEST SERVER
   [junit4]   2> 172619 INFO  (Thread-726) [    ] o.a.s.c.ZkTestServer client port:0.0.0.0/0.0.0.0:0
   [junit4]   2> 172619 INFO  (Thread-726) [    ] o.a.s.c.ZkTestServer Starting server
   [junit4]   2> 172719 INFO  (TEST-FullSolrCloudDistribCmdsTest.test-seed#[3579C61727BD2A5A]) [    ] o.a.s.c.ZkTestServer start zk server on port:35712
   [junit4]   2> 172719 INFO  (TEST-FullSolrCloudDistribCmdsTest.test-seed#[3579C61727BD2A5A]) [    ] o.a.s.c.c.SolrZkClient Using default ZkCredentialsProvider
   [junit4]   2> 172720 INFO  (TEST-FullSolrCloudDistribCmdsTest.test-seed#[3579C61727BD2A5A]) [    ] o.a.s.c.c.ConnectionManager Waiting for client to connect to ZooKeeper
   [junit4]   2> 172722 INFO  (zkCallback-171-thread-1) [    ] o.a.s.c.c.ConnectionManager Watcher org.apache.solr.common.cloud.ConnectionManager@5aa27bf0 name:ZooKeeperConnection Watcher:127.0.0.1:35712 got event WatchedEvent state:SyncConnected type:None path:null path:null type:None
   [junit4]   2> 172722 INFO  (TEST-FullSolrCloudDistribCmdsTest.test-seed#[3579C61727BD2A5A]) [    ] o.a.s.c.c.ConnectionManager Client is connected to ZooKeeper
   [junit4]   2> 172723 INFO  (TEST-FullSolrCloudDistribCmdsTest.test-seed#[3579C61727BD2A5A]) [    ] o.a.s.c.c.SolrZkClient Using default ZkACLProvider
   [junit4]   2> 172723 INFO  (TEST-FullSolrCloudDistribCmdsTest.test-seed#[3579C61727BD2A5A]) [    ] o.a.s.c.c.SolrZkClient makePath: /solr
   [junit4]   2> 172724 INFO  (TEST-FullSolrCloudDistribCmdsTest.test-seed#[3579C61727BD2A5A]) [    ] o.a.s.c.c.SolrZkClient Using default ZkCredentialsProvider
   [junit4]   2> 172725 INFO  (TEST-FullSolrCloudDistribCmdsTest.test-seed#[3579C61727BD2A5A]) [    ] o.a.s.c.c.ConnectionManager Waiting for client to connect to ZooKeeper
   [junit4]   2> 172726 INFO  (zkCallback-172-thread-1) [    ] o.a.s.c.c.ConnectionManager Watcher org.apache.solr.common.cloud.ConnectionManager@23eada13 name:ZooKeeperConnection Watcher:127.0.0.1:35712/solr got event WatchedEvent state:SyncConnected type:None path:null path:null type:None
   [junit4]   2> 172726 INFO  (TEST-FullSolrCloudDistribCmdsTest.test-seed#[3579C61727BD2A5A]) [    ] o.a.s.c.c.ConnectionManager Client is connected to ZooKeeper
   [junit4]   2> 172726 INFO  (TEST-FullSolrCloudDistribCmdsTest.test-seed#[3579C61727BD2A5A]) [    ] o.a.s.c.c.SolrZkClient Using default ZkACLProvider
   [junit4]   2> 172726 INFO  (TEST-FullSolrCloudDistribCmdsTest.test-seed#[3579C61727BD2A5A]) [    ] o.a.s.c.c.SolrZkClient makePath: /collections/collection1
   [junit4]   2> 172727 INFO  (TEST-FullSolrCloudDistribCmdsTest.test-seed#[3579C61727BD2A5A]) [    ] o.a.s.c.c.SolrZkClient makePath: /collections/collection1/shards
   [junit4]   2> 172727 INFO  (TEST-FullSolrCloudDistribCmdsTest.test-seed#[3579C61727BD2A5A]) [    ] o.a.s.c.c.SolrZkClient makePath: /collections/control_collection
   [junit4]   2> 172728 INFO  (TEST-FullSolrCloudDistribCmdsTest.test-seed#[3579C61727BD2A5A]) [    ] o.a.s.c.c.SolrZkClient makePath: /collections/control_collection/shards
   [junit4]   2> 172728 INFO  (TEST-FullSolrCloudDistribCmdsTest.test-seed#[3579C61727BD2A5A]) [    ] o.a.s.c.AbstractZkTestCase put /home/jenkins/workspace/Lucene-Solr-5.x-Linux/solr/core/src/test-files/solr/collection1/conf/solrconfig-tlog.xml to /configs/conf1/solrconfig.xml
   [junit4]   2> 172728 INFO  (TEST-FullSolrCloudDistribCmdsTest.test-seed#[3579C61727BD2A5A]) [    ] o.a.s.c.c.SolrZkClient makePath: /configs/conf1/solrconfig.xml
   [junit4]   2> 172729 INFO  (TEST-FullSolrCloudDistribCmdsTest.test-seed#[3579C61727BD2A5A]) [    ] o.a.s.c.AbstractZkTestCase put /home/jenkins/workspace/Lucene-Solr-5.x-Linux/solr/core/src/test-files/solr/collection1/conf/schema15.xml to /configs/conf1/schema.xml
   [junit4]   2> 172730 INFO  (TEST-FullSolrCloudDistribCmdsTest.test-seed#[3579C61727BD2A5A]) [    ] o.a.s.c.c.SolrZkClient makePath: /configs/conf1/schema.xml
   [junit4]   2> 172730 INFO  (TEST-FullSolrCloudDistribCmdsTest.test-seed#[3579C61727BD2A5A]) [    ] o.a.s.c.AbstractZkTestCase put /home/jenkins/workspace/Lucene-Solr-5.x-Linux/solr/core/src/test-files/solr/collection1/conf/solrconfig.snippet.randomindexconfig.xml to /configs/conf1/solrconfig.snippet.randomindexconfig.xml
   [junit4]   2> 172731 INFO  (TEST-FullSolrCloudDistribCmdsTest.test-seed#[3579C61727BD2A5A]) [    ] o.a.s.c.c.SolrZkClient makePath: /configs/conf1/solrconfig.snippet.randomindexconfig.xml
   [junit4]   2> 172734 INFO  (TEST-FullSolrCloudDistribCmdsTest.test-seed#[3579C61727BD2A5A]) [    ] o.a.s.c.AbstractZkTestCase put /home/jenkins/workspace/Lucene-Solr-5.x-Linux/solr/core/src/test-files/solr/collection1/conf/stopwords.txt to /configs/conf1/stopwords.txt
   [junit4]   2> 172734 INFO  (TEST-FullSolrCloudDistribCmdsTest.test-seed#[3579C61727BD2A5A]) [    ] o.a.s.c.c.SolrZkClient makePath: /configs/conf1/stopwords.txt
   [junit4]   2> 172735 INFO  (TEST-FullSolrCloudDistribCmdsTest.test-seed#[3579C61727BD2A5A]) [    ] o.a.s.c.AbstractZkTestCase put /home/jenkins/workspace/Lucene-Solr-5.x-Linux/solr/core/src/test-files/solr/collection1/conf/protwords.txt to /configs/conf1/protwords.txt
   [junit4]   2> 172735 INFO  (TEST-FullSolrCloudDistribCmdsTest.test-seed#[3579C61727BD2A5A]) [    ] o.a.s.c.c.SolrZkClient makePath: /configs/conf1/protwords.txt
   [junit4]   2> 172737 INFO  (TEST-FullSolrCloudDistribCmdsTest.test-seed#[3579C61727BD2A5A]) [    ] o.a.s.c.AbstractZkTestCase put /home/jenkins/workspace/Lucene-Solr-5.x-Linux/solr/core/src/test-files/solr/collection1/conf/currency.xml to /configs/conf1/currency.xml
   [junit4]   2> 172737 INFO  (TEST-FullSolrCloudDistribCmdsTest.test-seed#[3579C61727BD2A5A]) [    ] o.a.s.c.c.SolrZkClient makePath: /configs/conf1/currency.xml
   [junit4]   2> 172738 INFO  (TEST-FullSolrCloudDistribCmdsTest.test-seed#[3579C61727BD2A5A]) [    ] o.a.s.c.AbstractZkTestCase put /home/jenkins/workspace/Lucene-Solr-5.x-Linux/solr/core/src/test-files/solr/collection1/conf/enumsConfig.xml to /configs/conf1/enumsConfig.xml
   [junit4]   2> 172739 INFO  (TEST-FullSolrCloudDistribCmdsTest.test-seed#[3579C61727BD2A5A]) [    ] o.a.s.c.c.SolrZkClient makePath: /configs/conf1/enumsConfig.xml
   [junit4]   2> 172739 INFO  (TEST-FullSolrCloudDistribCmdsTest.test-seed#[3579C61727BD2A5A]) [    ] o.a.s.c.AbstractZkTestCase put /home/jenkins/workspace/Lucene-Solr-5.x-Linux/solr/core/src/test-files/solr/collection1/conf/open-exchange-rates.json to /configs/conf1/open-exchange-rates.json
   [junit4]   2> 172740 INFO  (TEST-FullSolrCloudDistribCmdsTest.test-seed#[3579C61727BD2A5A]) [    ] o.a.s.c.c.SolrZkClient makePath: /configs/conf1/open-exchange-rates.json
   [junit4]   2> 172740 INFO  (TEST-FullSolrCloudDistribCmdsTest.test-seed#[3579C61727BD2A5A]) [    ] o.a.s.c.AbstractZkTestCase put /home/jenkins/workspace/Lucene-Solr-5.x-Linux/solr/core/src/test-files/solr/collection1/conf/mapping-ISOLatin1Accent.txt to /configs/conf1/mapping-ISOLatin1Accent.txt
   [junit4]   2> 172740 INFO  (TEST-FullSolrCloudDistribCmdsTest.test-seed#[3579C61727BD2A5A]) [    ] o.a.s.c.c.SolrZkClient makePath: /configs/conf1/mapping-ISOLatin1Accent.txt
   [junit4]   2> 172741 INFO  (TEST-FullSolrCloudDistribCmdsTest.test-seed#[3579C61727BD2A5A]) [    ] o.a.s.c.AbstractZkTestCase put /home/jenkins/workspace/Lucene-Solr-5.x-Linux/solr/core/src/test-files/solr/collection1/conf/old_synonyms.txt to /configs/conf1/old_synonyms.txt
   [junit4]   2> 172741 INFO  (TEST-FullSolrCloudDistribCmdsTest.test-seed#[3579C61727BD2A5A]) [    ] o.a.s.c.c.SolrZkClient makePath: /configs/conf1/old_synonyms.txt
   [junit4]   2> 172742 INFO  (TEST-FullSolrCloudDistribCmdsTest.test-seed#[3579C61727BD2A5A]) [    ] o.a.s.c.AbstractZkTestCase put /home/jenkins/workspace/Lucene-Solr-5.x-Linux/solr/core/src/test-files/solr/collection1/conf/synonyms.txt to /configs/conf1/synonyms.txt
   [junit4]   2> 172742 INFO  (TEST-FullSolrCloudDistribCmdsTest.test-seed#[3579C61727BD2A5A]) [    ] o.a.s.c.c.SolrZkClient makePath: /configs/conf1/synonyms.txt
   [junit4]   2> 172796 INFO  (TEST-FullSolrCloudDistribCmdsTest.test-seed#[3579C61727BD2A5A]) [    ] o.a.s.SolrTestCaseJ4 Writing core.properties file to /home/jenkins/workspace/Lucene-Solr-5.x-Linux/solr/build/solr-core/test/J2/temp/solr.cloud.FullSolrCloudDistribCmdsTest_3579C61727BD2A5A-001/control-001/cores/collection1
   [junit4]   2> 172800 INFO  (TEST-FullSolrCloudDistribCmdsTest.test-seed#[3579C61727BD2A5A]) [    ] o.e.j.s.Server jetty-9.2.13.v20150730
   [junit4]   2> 172801 INFO  (TEST-FullSolrCloudDistribCmdsTest.test-seed#[3579C61727BD2A5A]) [    ] o.e.j.s.h.ContextHandler Started o.e.j.s.ServletContextHandler@3419007f{/,null,AVAILABLE}
   [junit4]   2> 172806 INFO  (TEST-FullSolrCloudDistribCmdsTest.test-seed#[3579C61727BD2A5A]) [    ] o.e.j.s.ServerConnector Started ServerConnector@cf654dd{HTTP/1.1}{127.0.0.1:43728}
   [junit4]   2> 172806 INFO  (TEST-FullSolrCloudDistribCmdsTest.test-seed#[3579C61727BD2A5A]) [    ] o.e.j.s.Server Started @174964ms
   [junit4]   2> 172806 INFO  (TEST-FullSolrCloudDistribCmdsTest.test-seed#[3579C61727BD2A5A]) [    ] o.a.s.c.s.e.JettySolrRunner Jetty properties: {solr.data.dir=/home/jenkins/workspace/Lucene-Solr-5.x-Linux/solr/build/solr-core/test/J2/temp/solr.cloud.FullSolrCloudDistribCmdsTest_3579C61727BD2A5A-001/tempDir-001/control/data, hostContext=/, hostPort=43728, coreRootDirectory=/home/jenkins/workspace/Lucene-Solr-5.x-Linux/solr/build/solr-core/test/J2/temp/solr.cloud.FullSolrCloudDistribCmdsTest_3579C61727BD2A5A-001/control-001/cores}
   [junit4]   2> 172806 INFO  (TEST-FullSolrCloudDistribCmdsTest.test-seed#[3579C61727BD2A5A]) [    ] o.a.s.s.SolrDispatchFilter SolrDispatchFilter.init(): sun.misc.Launcher$AppClassLoader@694f9431
   [junit4]   2> 172806 INFO  (TEST-FullSolrCloudDistribCmdsTest.test-seed#[3579C61727BD2A5A]) [    ] o.a.s.c.SolrResourceLoader new SolrResourceLoader for directory: '/home/jenkins/workspace/Lucene-Solr-5.x-Linux/solr/build/solr-core/test/J2/temp/solr.cloud.FullSolrCloudDistribCmdsTest_3579C61727BD2A5A-001/control-001'
   [junit4]   2> 172807 INFO  (TEST-FullSolrCloudDistribCmdsTest.test-seed#[3579C61727BD2A5A]) [    ] o.a.s.c.SolrResourceLoader JNDI not configured for solr (NoInitialContextEx)
   [junit4]   2> 172807 INFO  (TEST-FullSolrCloudDistribCmdsTest.test-seed#[3579C61727BD2A5A]) [    ] o.a.s.c.SolrResourceLoader solr home defaulted to 'solr/' (could not find system property or JNDI)
   [junit4]   2> 172807 INFO  (TEST-FullSolrCloudDistribCmdsTest.test-seed#[3579C61727BD2A5A]) [    ] o.a.s.c.c.SolrZkClient Using default ZkCredentialsProvider
   [junit4]   2> 172807 INFO  (TEST-FullSolrCloudDistribCmdsTest.test-seed#[3579C61727BD2A5A]) [    ] o.a.s.c.c.ConnectionManager Waiting for client to connect to ZooKeeper
   [junit4]   2> 172814 INFO  (zkCallback-173-thread-1) [    ] o.a.s.c.c.ConnectionManager Watcher org.apache.solr.common.cloud.ConnectionManager@1b086fb5 name:ZooKeeperConnection Watcher:127.0.0.1:35712/solr got event WatchedEvent state:SyncConnected type:None path:null path:null type:None
   [junit4]   2> 172815 INFO  (TEST-FullSolrCloudDistribCmdsTest.test-seed#[3579C61727BD2A5A]) [    ] o.a.s.c.c.ConnectionManager Client is connected to ZooKeeper
   [junit4]   2> 172815 INFO  (TEST-FullSolrCloudDistribCmdsTest.test-seed#[3579C61727BD2A5A]) [    ] o.a.s.c.c.SolrZkClient Using default ZkACLProvider
   [junit4]   2> 172816 INFO  (TEST-FullSolrCloudDistribCmdsTest.test-seed#[3579C61727BD2A5A]) [    ] o.a.s.s.SolrDispatchFilter Loading solr.xml from SolrHome (not found in ZooKeeper)
   [junit4]   2> 172816 INFO  (TEST-FullSolrCloudDistribCmdsTest.test-seed#[3579C61727BD2A5A]) [    ] o.a.s.c.SolrXmlConfig Loading container configuration from /home/jenkins/workspace/Lucene-Solr-5.x-Linux/solr/build/solr-core/test/J2/temp/solr.cloud.FullSolrCloudDistribCmdsTest_3579C61727BD2A5A-001/control-001/solr.xml
   [junit4]   2> 172820 INFO  (TEST-FullSolrCloudDistribCmdsTest.test-seed#[3579C61727BD2A5A]) [    ] o.a.s.c.CorePropertiesLocator Config-defined core root directory: /home/jenkins/workspace/Lucene-Solr-5.x-Linux/solr/build/solr-core/test/J2/temp/solr.cloud.FullSolrCloudDistribCmdsTest_3579C61727BD2A5A-001/control-001/cores
   [junit4]   2> 172820 INFO  (TEST-FullSolrCloudDistribCmdsTest.test-seed#[3579C61727BD2A5A]) [    ] o.a.s.c.CoreContainer New CoreContainer 1185805838
   [junit4]   2> 172820 INFO  (TEST-FullSolrCloudDistribCmdsTest.test-seed#[3579C61727BD2A5A]) [    ] o.a.s.c.CoreContainer Loading cores into CoreContainer [instanceDir=/home/jenkins/workspace/Lucene-Solr-5.x-Linux/solr/build/solr-core/test/J2/temp/solr.cloud.FullSolrCloudDistribCmdsTest_3579C61727BD2A5A-001/control-001]
   [junit4]   2> 172820 WARN  (TEST-FullSolrCloudDistribCmdsTest.test-seed#[3579C61727BD2A5A]) [    ] o.a.s.c.CoreContainer Couldn't add files from /home/jenkins/workspace/Lucene-Solr-5.x-Linux/solr/build/solr-core/test/J2/temp/solr.cloud.FullSolrCloudDistribCmdsTest_3579C61727BD2A5A-001/control-001/lib to classpath: /home/jenkins/workspace/Lucene-Solr-5.x-Linux/solr/build/solr-core/test/J2/temp/solr.cloud.FullSolrCloudDistribCmdsTest_3579C61727BD2A5A-001/control-001/lib
   [junit4]   2> 172821 INFO  (TEST-FullSolrCloudDistribCmdsTest.test-seed#[3579C61727BD2A5A]) [    ] o.a.s.h.c.HttpShardHandlerFactory created with socketTimeout : 90000,urlScheme : ,connTimeout : 15000,maxConnectionsPerHost : 20,maxConnections : 10000,corePoolSize : 0,maximumPoolSize : 2147483647,maxThreadIdleTime : 5,sizeOfQueue : -1,fairnessPolicy : false,useRetries : false,
   [junit4]   2> 172822 INFO  (TEST-FullSolrCloudDistribCmdsTest.test-seed#[3579C61727BD2A5A]) [    ] o.a.s.u.UpdateShardHandler Creating UpdateShardHandler HTTP client with params: socketTimeout=340000&connTimeout=45000&retry=true
   [junit4]   2> 172822 INFO  (TEST-FullSolrCloudDistribCmdsTest.test-seed#[3579C61727BD2A5A]) [    ] o.a.s.l.LogWatcher SLF4J impl is org.slf4j.impl.Log4jLoggerFactory
   [junit4]   2> 172822 INFO  (TEST-FullSolrCloudDistribCmdsTest.test-seed#[3579C61727BD2A5A]) [    ] o.a.s.l.LogWatcher Registering Log Listener [Log4j (org.slf4j.impl.Log4jLoggerFactory)]
   [junit4]   2> 172822 INFO  (TEST-FullSolrCloudDistribCmdsTest.test-seed#[3579C61727BD2A5A]) [    ] o.a.s.c.ZkContainer Zookeeper client=127.0.0.1:35712/solr
   [junit4]   2> 172822 INFO  (TEST-FullSolrCloudDistribCmdsTest.test-seed#[3579C61727BD2A5A]) [    ] o.a.s.c.ZkController zkHost includes chroot
   [junit4]   2> 172822 INFO  (TEST-FullSolrCloudDistribCmdsTest.test-seed#[3579C61727BD2A5A]) [    ] o.a.s.c.c.SolrZkClient Using default ZkCredentialsProvider
   [junit4]   2> 172823 INFO  (TEST-FullSolrCloudDistribCmdsTest.test-seed#[3579C61727BD2A5A]) [    ] o.a.s.c.c.ConnectionManager Waiting for client to connect to ZooKeeper
   [junit4]   2> 172824 INFO  (zkCallback-175-thread-1) [    ] o.a.s.c.c.ConnectionManager Watcher org.apache.solr.common.cloud.ConnectionManager@37048772 name:ZooKeeperConnection Watcher:127.0.0.1:35712 got event WatchedEvent state:SyncConnected type:None path:null path:null type:None
   [junit4]   2> 172825 INFO  (TEST-FullSolrCloudDistribCmdsTest.test-seed#[3579C61727BD2A5A]) [    ] o.a.s.c.c.ConnectionManager Client is connected to ZooKeeper
   [junit4]   2> 172825 INFO  (TEST-FullSolrCloudDistribCmdsTest.test-seed#[3579C61727BD2A5A]) [    ] o.a.s.c.c.SolrZkClient Using default ZkACLProvider
   [junit4]   2> 172826 INFO  (TEST-FullSolrCloudDistribCmdsTest.test-seed#[3579C61727BD2A5A]) [    ] o.a.s.c.c.ConnectionManager Waiting for client to connect to ZooKeeper
   [junit4]   2> 172827 INFO  (zkCallback-176-thread-1) [    ] o.a.s.c.c.ConnectionManager Watcher org.apache.solr.common.cloud.ConnectionManager@5c813905 name:ZooKeeperConnection Watcher:127.0.0.1:35712/solr got event WatchedEvent state:SyncConnected type:None path:null path:null type:None
   [junit4]   2> 172827 INFO  (TEST-FullSolrCloudDistribCmdsTest.test-seed#[3579C61727BD2A5A]) [    ] o.a.s.c.c.ConnectionManager Client is connected to ZooKeeper
   [junit4]   2> 172828 INFO  (TEST-FullSolrCloudDistribCmdsTest.test-seed#[3579C61727BD2A5A]) [    ] o.a.s.c.c.SolrZkClient makePath: /overseer/queue
   [junit4]   2> 172829 INFO  (TEST-FullSolrCloudDistribCmdsTest.test-seed#[3579C61727BD2A5A]) [    ] o.a.s.c.c.SolrZkClient makePath: /overseer/collection-queue-work
   [junit4]   2> 172830 INFO  (TEST-FullSolrCloudDistribCmdsTest.test-seed#[3579C61727BD2A5A]) [    ] o.a.s.c.c.SolrZkClient makePath: /overseer/collection-map-running
   [junit4]   2> 172831 INFO  (TEST-FullSolrCloudDistribCmdsTest.test-seed#[3579C61727BD2A5A]) [    ] o.a.s.c.c.SolrZkClient makePath: /overseer/collection-map-completed
   [junit4]   2> 172832 INFO  (TEST-FullSolrCloudDistribCmdsTest.test-seed#[3579C61727BD2A5A]) [    ] o.a.s.c.c.SolrZkClient makePath: /overseer/collection-map-failure
   [junit4]   2> 172835 INFO  (TEST-FullSolrCloudDistribCmdsTest.test-seed#[3579C61727BD2A5A]) [    ] o.a.s.c.c.SolrZkClient makePath: /live_nodes
   [junit4]   2> 172836 INFO  (TEST-FullSolrCloudDistribCmdsTest.test-seed#[3579C61727BD2A5A]) [    ] o.a.s.c.c.SolrZkClient makePath: /aliases.json
   [junit4]   2> 172837 INFO  (TEST-FullSolrCloudDistribCmdsTest.test-seed#[3579C61727BD2A5A]) [    ] o.a.s.c.c.SolrZkClient makePath: /clusterstate.json
   [junit4]   2> 172838 INFO  (TEST-FullSolrCloudDistribCmdsTest.test-seed#[3579C61727BD2A5A]) [    ] o.a.s.c.c.SolrZkClient makePath: /security.json
   [junit4]   2> 172839 INFO  (TEST-FullSolrCloudDistribCmdsTest.test-seed#[3579C61727BD2A5A]) [    ] o.a.s.c.ZkController Register node as live in ZooKeeper:/live_nodes/127.0.0.1:43728_
   [junit4]   2> 172840 INFO  (TEST-FullSolrCloudDistribCmdsTest.test-seed#[3579C61727BD2A5A]) [    ] o.a.s.c.c.SolrZkClient makePath: /live_nodes/127.0.0.1:43728_
   [junit4]   2> 172840 INFO  (TEST-FullSolrCloudDistribCmdsTest.test-seed#[3579C61727BD2A5A]) [    ] o.a.s.c.c.SolrZkClient makePath: /overseer_elect
   [junit4]   2> 172841 INFO  (TEST-FullSolrCloudDistribCmdsTest.test-seed#[3579C61727BD2A5A]) [    ] o.a.s.c.c.SolrZkClient makePath: /overseer_elect/election
   [junit4]   2> 172842 INFO  (TEST-FullSolrCloudDistribCmdsTest.test-seed#[3579C61727BD2A5A]) [    ] o.a.s.c.Overseer Overseer (id=null) closing
   [junit4]   2> 172842 INFO  (TEST-FullSolrCloudDistribCmdsTest.test-seed#[3579C61727BD2A5A]) [    ] o.a.s.c.LeaderElector Joined leadership election with path: /overseer_elect/election/95196584334721028-127.0.0.1:43728_-n_0000000000
   [junit4]   2> 172842 INFO  (TEST-FullSolrCloudDistribCmdsTest.test-seed#[3579C61727BD2A5A]) [    ] o.a.s.c.OverseerElectionContext I am going to be the leader 127.0.0.1:43728_
   [junit4]   2> 172842 INFO  (TEST-FullSolrCloudDistribCmdsTest.test-seed#[3579C61727BD2A5A]) [    ] o.a.s.c.c.SolrZkClient makePath: /overseer_elect/leader
   [junit4]   2> 172844 INFO  (TEST-FullSolrCloudDistribCmdsTest.test-seed#[3579C61727BD2A5A]) [    ] o.a.s.c.Overseer Overseer (id=95196584334721028-127.0.0.1:43728_-n_0000000000) starting
   [junit4]   2> 172845 INFO  (TEST-FullSolrCloudDistribCmdsTest.test-seed#[3579C61727BD2A5A]) [    ] o.a.s.c.c.SolrZkClient makePath: /overseer/queue-work
   [junit4]   2> 172848 INFO  (TEST-FullSolrCloudDistribCmdsTest.test-seed#[3579C61727BD2A5A]) [    ] o.a.s.c.OverseerAutoReplicaFailoverThread Starting OverseerAutoReplicaFailoverThread autoReplicaFailoverWorkLoopDelay=10000 autoReplicaFailoverWaitAfterExpiration=30000 autoReplicaFailoverBadNodeExpiration=60000
   [junit4]   2> 172849 INFO  (OverseerCollectionConfigSetProcessor-95196584334721028-127.0.0.1:43728_-n_0000000000) [    ] o.a.s.c.OverseerTaskProcessor Process current queue of overseer operations
   [junit4]   2> 172849 INFO  (OverseerStateUpdate-95196584334721028-127.0.0.1:43728_-n_0000000000) [    ] o.a.s.c.Overseer Starting to work on the main queue
   [junit4]   2> 172850 INFO  (OverseerStateUpdate-95196584334721028-127.0.0.1:43728_-n_0000000000) [    ] o.a.s.c.c.ZkStateReader Updating cluster state from ZooKeeper... 
   [junit4]   2> 172856 INFO  (TEST-FullSolrCloudDistribCmdsTest.test-seed#[3579C61727BD2A5A]) [    ] o.a.s.c.c.ZkStateReader Updating cluster state from ZooKeeper... 
   [junit4]   2> 172870 INFO  (TEST-FullSolrCloudDistribCmdsTest.test-seed#[3579C61727BD2A5A]) [    ] o.a.s.c.CoreContainer Security conf doesn't exist. Skipping setup for authorization module.
   [junit4]   2> 172870 INFO  (TEST-FullSolrCloudDistribCmdsTest.test-seed#[3579C61727BD2A5A]) [    ] o.a.s.c.CoreContainer No authentication plugin used.
   [junit4]   2> 172870 INFO  (TEST-FullSolrCloudDistribCmdsTest.test-seed#[3579C61727BD2A5A]) [    ] o.a.s.c.CorePropertiesLocator Looking for core definitions underneath /home/jenkins/workspace/Lucene-Solr-5.x-Linux/solr/build/solr-core/test/J2/temp/solr.cloud.FullSolrCloudDistribCmdsTest_3579C61727BD2A5A-001/control-001/cores
   [junit4]   2> 172871 INFO  (TEST-FullSolrCloudDistribCmdsTest.test-seed#[3579C61727BD2A5A]) [    ] o.a.s.c.CoreDescriptor Created CoreDescriptor: {name=collection1, config=solrconfig.xml, transient=false, schema=schema.xml, loadOnStartup=true, configSetProperties=configsetprops.json, collection=control_collection, coreNodeName=, dataDir=data/, shard=}
   [junit4]   2> 172871 INFO  (TEST-FullSolrCloudDistribCmdsTest.test-seed#[3579C61727BD2A5A]) [    ] o.a.s.c.CorePropertiesLocator Found core collection1 in /home/jenkins/workspace/Lucene-Solr-5.x-Linux/solr/build/solr-core/test/J2/temp/solr.cloud.FullSolrCloudDistribCmdsTest_3579C61727BD2A5A-001/control-001/cores/collection1
   [junit4]   2> 172871 INFO  (TEST-FullSolrCloudDistribCmdsTest.test-seed#[3579C61727BD2A5A]) [    ] o.a.s.c.CorePropertiesLocator Found 1 core definitions
   [junit4]   2> 172872 INFO  (coreLoadExecutor-1145-thread-1) [    ] o.a.s.c.ZkController publishing state=down
   [junit4]   2> 172872 INFO  (coreLoadExecutor-1145-thread-1) [    ] o.a.s.c.ZkController numShards not found on descriptor - reading it from system property
   [junit4]   2> 172873 INFO  (coreLoadExecutor-1145-thread-1) [    ] o.a.s.c.ZkController look for our core node name
   [junit4]   2> 172876 INFO  (TEST-FullSolrCloudDistribCmdsTest.test-seed#[3579C61727BD2A5A]) [    ] o.a.s.s.SolrDispatchFilter user.dir=/home/jenkins/workspace/Lucene-Solr-5.x-Linux/solr/build/solr-core/test/J2
   [junit4]   2> 172876 INFO  (TEST-FullSolrCloudDistribCmdsTest.test-seed#[3579C61727BD2A5A]) [    ] o.a.s.s.SolrDispatchFilter SolrDispatchFilter.init() done
   [junit4]   2> 172877 INFO  (OverseerStateUpdate-95196584334721028-127.0.0.1:43728_-n_0000000000) [    ] o.a.s.c.Overseer processMessage: queueSize: 1, message = {
   [junit4]   2>   "core":"collection1",
   [junit4]   2>   "roles":null,
   [junit4]   2>   "base_url":"http://127.0.0.1:43728",
   [junit4]   2>   "node_name":"127.0.0.1:43728_",
   [junit4]   2>   "numShards":"1",
   [junit4]   2>   "state":"down",
   [junit4]   2>   "shard":null,
   [junit4]   2>   "collection":"control_collection",
   [junit4]   2>   "operation":"state"} current state version: 0
   [junit4]   2> 172877 INFO  (OverseerStateUpdate-95196584334721028-127.0.0.1:43728_-n_0000000000) [    ] o.a.s.c.o.ReplicaMutator Update state numShards=1 message={
   [junit4]   2>   "core":"collection1",
   [junit4]   2>   "roles":null,
   [junit4]   2>   "base_url":"http://127.0.0.1:43728",
   [junit4]   2>   "node_name":"127.0.0.1:43728_",
   [junit4]   2>   "numShards":"1",
   [junit4]   2>   "state":"down",
   [junit4]   2>   "shard":null,
   [junit4]   2>   "collection":"control_collection",
   [junit4]   2>   "operation":"state"}
   [junit4]   2> 172877 INFO  (OverseerStateUpdate-95196584334721028-127.0.0.1:43728_-n_0000000000) [    ] o.a.s.c.o.ClusterStateMutator building a new cName: control_collection
   [junit4]   2> 172878 INFO  (OverseerStateUpdate-95196584334721028-127.0.0.1:43728_-n_0000000000) [    ] o.a.s.c.o.ReplicaMutator Assigning new node to shard shard=shard1
   [junit4]   2> 172878 INFO  (zkCallback-176-thread-1) [    ] o.a.s.c.c.ZkStateReader A cluster state change: [WatchedEvent state:SyncConnected type:NodeDataChanged path:/clusterstate.json], has occurred - updating... (live nodes size: [1])
   [junit4]   2> 172879 INFO  (zkCallback-176-thread-2) [    ] o.a.s.c.c.ZkStateReader A cluster state change: [WatchedEvent state:SyncConnected type:NodeDataChanged path:/clusterstate.json], has occurred - updating... (live nodes size: [1])
   [junit4]   2> 173873 INFO  (coreLoadExecutor-1145-thread-1) [    ] o.a.s.c.ZkController waiting to find shard id in clusterstate for collection1
   [junit4]   2> 173873 INFO  (coreLoadExecutor-1145-thread-1) [    ] o.a.s.c.ZkController Check for collection zkNode:control_collection
   [junit4]   2> 173874 INFO  (coreLoadExecutor-1145-thread-1) [    ] o.a.s.c.ZkController Collection zkNode exists
   [junit4]   2> 173874 INFO  (coreLoadExecutor-1145-thread-1) [    ] o.a.s.c.c.ZkStateReader Load collection config from: [/collections/control_collection]
   [junit4]   2> 173874 INFO  (coreLoadExecutor-1145-thread-1) [    ] o.a.s.c.c.ZkStateReader path=[/collections/control_collection] [configName]=[conf1] specified config exists in ZooKeeper
   [junit4]   2> 173874 INFO  (coreLoadExecutor-1145-thread-1) [    ] o.a.s.c.SolrResourceLoader new SolrResourceLoader for directory: '/home/jenkins/workspace/Lucene-Solr-5.x-Linux/solr/build/solr-core/test/J2/temp/solr.cloud.FullSolrCloudDistribCmdsTest_3579C61727BD2A5A-001/control-001/cores/collection1'
   [junit4]   2> 173874 INFO  (coreLoadExecutor-1145-thread-1) [    ] o.a.s.c.SolrResourceLoader JNDI not configured for solr (NoInitialContextEx)
   [junit4]   2> 173874 INFO  (coreLoadExecutor-1145-thread-1) [    ] o.a.s.c.SolrResourceLoader solr home defaulted to 'solr/' (could not find system property or JNDI)
   [junit4]   2> 173875 INFO  (coreLoadExecutor-1145-thread-1) [    ] o.a.s.c.Config loaded config solrconfig.xml with version 0 
   [junit4]   2> 173879 INFO  (coreLoadExecutor-1145-thread-1) [    ] o.a.s.c.SolrConfig current version of requestparams : -1
   [junit4]   2> 173881 INFO  (coreLoadExecutor-1145-thread-1) [    ] o.a.s.c.SolrConfig Using Lucene MatchVersion: 5.5.0
   [junit4]   2> 173886 INFO  (coreLoadExecutor-1145-thread-1) [    ] o.a.s.c.SolrConfig Loaded SolrConfig: solrconfig.xml
   [junit4]   2> 173889 INFO  (coreLoadExecutor-1145-thread-1) [    ] o.a.s.s.IndexSchema [collection1] Schema name=test
   [junit4]   2> 173942 INFO  (coreLoadExecutor-1145-thread-1) [    ] o.a.s.s.IndexSchema default search field in schema is text
   [junit4]   2> 173943 INFO  (coreLoadExecutor-1145-thread-1) [    ] o.a.s.s.IndexSchema unique key field: id
   [junit4]   2> 173944 INFO  (coreLoadExecutor-1145-thread-1) [    ] o.a.s.s.FileExchangeRateProvider Reloading exchange rates from file currency.xml
   [junit4]   2> 173946 INFO  (coreLoadExecutor-1145-thread-1) [    ] o.a.s.s.FileExchangeRateProvider Reloading exchange rates from file currency.xml
   [junit4]   2> 173953 INFO  (coreLoadExecutor-1145-thread-1) [    ] o.a.s.c.ConfigSetProperties Did not find ConfigSet properties, assuming default properties: Can't find resource 'configsetprops.json' in classpath or '/configs/conf1', cwd=/home/jenkins/workspace/Lucene-Solr-5.x-Linux/solr/build/solr-core/test/J2
   [junit4]   2> 173953 INFO  (coreLoadExecutor-1145-thread-1) [    ] o.a.s.c.CoreContainer Creating SolrCore 'collection1' using configuration from collection control_collection
   [junit4]   2> 173953 INFO  (coreLoadExecutor-1145-thread-1) [    ] o.a.s.c.SolrCore org.apache.solr.core.MockDirectoryFactory
   [junit4]   2> 173953 INFO  (coreLoadExecutor-1145-thread-1) [    ] o.a.s.c.SolrCore [[collection1] ] Opening new SolrCore at [/home/jenkins/workspace/Lucene-Solr-5.x-Linux/solr/build/solr-core/test/J2/temp/solr.cloud.FullSolrCloudDistribCmdsTest_3579C61727BD2A5A-001/control-001/cores/collection1], dataDir=[/home/jenkins/workspace/Lucene-Solr-5.x-Linux/solr/build/solr-core/test/J2/temp/solr.cloud.FullSolrCloudDistribCmdsTest_3579C61727BD2A5A-001/control-001/cores/collection1/data/]
   [junit4]   2> 173953 INFO  (coreLoadExecutor-1145-thread-1) [    ] o.a.s.c.JmxMonitoredMap JMX monitoring is enabled. Adding Solr mbeans to JMX Server: com.sun.jmx.mbeanserver.JmxMBeanServer@32216d34
   [junit4]   2> 173954 INFO  (coreLoadExecutor-1145-thread-1) [    ] o.a.s.c.CachingDirectoryFactory return new directory for /home/jenkins/workspace/Lucene-Solr-5.x-Linux/solr/build/solr-core/test/J2/temp/solr.cloud.FullSolrCloudDistribCmdsTest_3579C61727BD2A5A-001/control-001/cores/collection1/data
   [junit4]   2> 173954 INFO  (coreLoadExecutor-1145-thread-1) [    ] o.a.s.c.SolrCore New index directory detected: old=null new=/home/jenkins/workspace/Lucene-Solr-5.x-Linux/solr/build/solr-core/test/J2/temp/solr.cloud.FullSolrCloudDistribCmdsTest_3579C61727BD2A5A-001/control-001/cores/collection1/data/index/
   [junit4]   2> 173954 WARN  (coreLoadExecutor-1145-thread-1) [    ] o.a.s.c.SolrCore [collection1] Solr index directory '/home/jenkins/workspace/Lucene-Solr-5.x-Linux/solr/build/solr-core/test/J2/temp/solr.cloud.FullSolrCloudDistribCmdsTest_3579C61727BD2A5A-001/control-001/cores/collection1/data/index' doesn't exist. Creating new index...
   [junit4]   2> 173954 INFO  (coreLoadExecutor-1145-thread-1) [    ] o.a.s.c.CachingDirectoryFactory return new directory for /home/jenkins/workspace/Lucene-Solr-5.x-Linux/solr/build/solr-core/test/J2/temp/solr.cloud.FullSolrCloudDistribCmdsTest_3579C61727BD2A5A-001/control-001/cores/collection1/data/index
   [junit4]   2> 173955 INFO  (coreLoadExecutor-1145-thread-1) [    ] o.a.s.u.RandomMergePolicy RandomMergePolicy wrapping class org.apache.lucene.index.AlcoholicMergePolicy: [AlcoholicMergePolicy: minMergeSize=0, mergeFactor=10, maxMergeSize=1045943740, maxMergeSizeForForcedMerge=9223372036854775807, calibrateSizeByDeletes=true, maxMergeDocs=2147483647, maxCFSSegmentSizeMB=8.796093022207999E12, noCFSRatio=0.1]
   [junit4]   2> 173955 INFO  (coreLoadExecutor-1145-thread-1) [    ] o.a.s.c.SolrDeletionPolicy SolrDeletionPolicy.onCommit: commits: num=1
   [junit4]   2> 	commit{dir=MockDirectoryWrapper(RAMDirectory@7638f58b lockFactory=org.apache.lucene.store.SingleInstanceLockFactory@6e9736c8),segFN=segments_1,generation=1}
   [junit4]   2> 173956 INFO  (coreLoadExecutor-1145-thread-1) [    ] o.a.s.c.SolrDeletionPolicy newest commit generation = 1
   [junit4]   2> 173956 INFO  (OldIndexDirectoryCleanupThreadForCore-collection1) [    ] o.a.s.c.SolrCore Looking for old index directories to cleanup for core collection1 in /home/jenkins/workspace/Lucene-Solr-5.x-Linux/solr/build/solr-core/test/J2/temp/solr.cloud.FullSolrCloudDistribCmdsTest_3579C61727BD2A5A-001/control-001/cores/collection1/data/
   [junit4]   2> 173956 WARN  (OldIndexDirectoryCleanupThreadForCore-collection1) [    ] o.a.s.c.DirectoryFactory /home/jenkins/workspace/Lucene-Solr-5.x-Linux/solr/build/solr-core/test/J2/temp/solr.cloud.FullSolrCloudDistribCmdsTest_3579C61727BD2A5A-001/control-001/cores/collection1/data/ does not point to a valid data directory; skipping clean-up of old index directories.
   [junit4]   2> 173959 INFO  (coreLoadExecutor-1145-thread-1) [    ] o.a.s.u.p.UpdateRequestProcessorChain creating updateRequestProcessorChain "nodistrib"
   [junit4]   2> 173959 INFO  (coreLoadExecutor-1145-thread-1) [    ] o.a.s.u.p.UpdateRequestProcessorChain creating updateRequestProcessorChain "dedupe"
   [junit4]   2> 173959 INFO  (coreLoadExecutor-1145-thread-1) [    ] o.a.s.u.p.UpdateRequestProcessorChain inserting DistributedUpdateProcessorFactory into updateRequestProcessorChain "dedupe"
   [junit4]   2> 173959 INFO  (coreLoadExecutor-1145-thread-1) [    ] o.a.s.u.p.UpdateRequestProcessorChain creating updateRequestProcessorChain "stored_sig"
   [junit4]   2> 173959 INFO  (coreLoadExecutor-1145-thread-1) [    ] o.a.s.u.p.UpdateRequestProcessorChain inserting DistributedUpdateProcessorFactory into updateRequestProcessorChain "stored_sig"
   [junit4]   2> 173960 INFO  (coreLoadExecutor-1145-thread-1) [    ] o.a.s.u.p.UpdateRequestProcessorChain creating updateRequestProcessorChain "distrib-dup-test-chain-explicit"
   [junit4]   2> 173960 INFO  (coreLoadExecutor-1145-thread-1) [    ] o.a.s.u.p.UpdateRequestProcessorChain creating updateRequestProcessorChain "distrib-dup-test-chain-implicit"
   [junit4]   2> 173960 INFO  (coreLoadExecutor-1145-thread-1) [    ] o.a.s.u.p.UpdateRequestProcessorChain inserting DistributedUpdateProcessorFactory into updateRequestProcessorChain "distrib-dup-test-chain-implicit"
   [junit4]   2> 173960 INFO  (coreLoadExecutor-1145-thread-1) [    ] o.a.s.c.SolrCore no updateRequestProcessorChain defined as default, creating implicit default
   [junit4]   2> 173960 WARN  (coreLoadExecutor-1145-thread-1) [    ] o.a.s.c.RequestHandlers INVALID paramSet a in requestHandler {type = requestHandler,name = /dump,class = DumpRequestHandler,args = {defaults={a=A,b=B}}}
   [junit4]   2> 173962 INFO  (coreLoadExecutor-1145-thread-1) [    ] o.a.s.h.l.XMLLoader xsltCacheLifetimeSeconds=60
   [junit4]   2> 173963 INFO  (coreLoadExecutor-1145-thread-1) [    ] o.a.s.h.l.XMLLoader xsltCacheLifetimeSeconds=60
   [junit4]   2> 173964 INFO  (coreLoadExecutor-1145-thread-1) [    ] o.a.s.h.l.XMLLoader xsltCacheLifetimeSeconds=60
   [junit4]   2> 173965 INFO  (coreLoadExecutor-1145-thread-1) [    ] o.a.s.h.l.XMLLoader xsltCacheLifetimeSeconds=60
   [junit4]   2> 173968 INFO  (coreLoadExecutor-1145-thread-1) [    ] o.a.s.c.RequestHandlers Registered paths: /admin/mbeans,standard,/dump,/update/csv,/update/json/docs,/admin/luke,/admin/segments,/get,/admin/system,/replication,/admin/properties,/config,/schema,/admin/plugins,/admin/logging,/update/json,/admin/threads,/admin/ping,/update,/admin/file
   [junit4]   2> 173968 INFO  (coreLoadExecutor-1145-thread-1) [    ] o.a.s.c.SolrCore Using default statsCache cache: org.apache.solr.search.stats.LocalStatsCache
   [junit4]   2> 173969 INFO  (coreLoadExecutor-1145-thread-1) [    ] o.a.s.u.UpdateHandler Using UpdateLog implementation: org.apache.solr.update.UpdateLog
   [junit4]   2> 173969 INFO  (coreLoadExecutor-1145-thread-1) [    ] o.a.s.u.UpdateLog Initializing UpdateLog: dataDir= defaultSyncLevel=FLUSH numRecordsToKeep=100 maxNumLogsToKeep=10 numVersionBuckets=65536
   [junit4]   2> 173969 INFO  (coreLoadExecutor-1145-thread-1) [    ] o.a.s.u.CommitTracker Hard AutoCommit: disabled
   [junit4]   2> 173969 INFO  (coreLoadExecutor-1145-thread-1) [    ] o.a.s.u.CommitTracker Soft AutoCommit: disabled
   [junit4]   2> 173970 INFO  (coreLoadExecutor-1145-thread-1) [    ] o.a.s.u.RandomMergePolicy RandomMergePolicy wrapping class org.apache.lucene.index.MockRandomMergePolicy: org.apache.lucene.index.MockRandomMergePolicy@6770522b
   [junit4]   2> 173970 INFO  (coreLoadExecutor-1145-thread-1) [    ] o.a.s.c.SolrDeletionPolicy SolrDeletionPolicy.onInit: commits: num=1
   [junit4]   2> 	commit{dir=MockDirectoryWrapper(RAMDirectory@7638f58b lockFactory=org.apache.lucene.store.SingleInstanceLockFactory@6e9736c8),segFN=segments_1,generation=1}
   [junit4]   2> 173970 INFO  (coreLoadExecutor-1145-thread-1) [    ] o.a.s.c.SolrDeletionPolicy newest commit generation = 1
   [junit4]   2> 173970 INFO  (coreLoadExecutor-1145-thread-1) [    ] o.a.s.s.SolrIndexSearcher Opening Searcher@2812a413[collection1] main
   [junit4]   2> 173970 INFO  (coreLoadExecutor-1145-thread-1) [    ] o.a.s.c.c.ZkStateReader Load collection config from: [/collections/control_collection]
   [junit4]   2> 173970 INFO  (coreLoadExecutor-1145-thread-1) [    ] o.a.s.c.c.ZkStateReader path=[/collections/control_collection] [configName]=[conf1] specified config exists in ZooKeeper
   [junit4]   2> 173970 INFO  (coreLoadExecutor-1145-thread-1) [    ] o.a.s.r.ManagedResourceStorage Setting up ZooKeeper-based storage for the RestManager with znodeBase: /configs/conf1
   [junit4]   2> 173971 INFO  (coreLoadExecutor-1145-thread-1) [    ] o.a.s.r.ManagedResourceStorage Configured ZooKeeperStorageIO with znodeBase: /configs/conf1
   [junit4]   2> 173971 INFO  (coreLoadExecutor-1145-thread-1) [    ] o.a.s.r.RestManager Initializing RestManager with initArgs: {}
   [junit4]   2> 173971 INFO  (coreLoadExecutor-1145-thread-1) [    ] o.a.s.r.ManagedResourceStorage Reading _rest_managed.json using ZooKeeperStorageIO:path=/configs/conf1
   [junit4]   2> 173971 INFO  (coreLoadExecutor-1145-thread-1) [    ] o.a.s.r.ManagedResourceStorage No data found for znode /configs/conf1/_rest_managed.json
   [junit4]   2> 173971 INFO  (coreLoadExecutor-1145-thread-1) [    ] o.a.s.r.ManagedResourceStorage Loaded null at path _rest_managed.json using ZooKeeperStorageIO:path=/configs/conf1
   [junit4]   2> 173971 INFO  (coreLoadExecutor-1145-thread-1) [    ] o.a.s.r.RestManager Initializing 0 registered ManagedResources
   [junit4]   2> 173971 INFO  (coreLoadExecutor-1145-thread-1) [    ] o.a.s.h.ReplicationHandler Commits will be reserved for  10000
   [junit4]   2> 173972 INFO  (searcherExecutor-1146-thread-1) [    ] o.a.s.c.SolrCore [collection1] Registered new searcher Searcher@2812a413[collection1] main{ExitableDirectoryReader(UninvertingDirectoryReader())}
   [junit4]   2> 173972 INFO  (coreLoadExecutor-1145-thread-1) [    ] o.a.s.u.UpdateLog Looking up max value of version field to seed version buckets
   [junit4]   2> 173972 INFO  (coreLoadExecutor-1145-thread-1) [    ] o.a.s.u.VersionInfo Refreshing highest value of _version_ for 65536 version buckets from index
   [junit4]   2> 173972 INFO  (coreLoadExecutor-1145-thread-1) [    ] o.a.s.u.VersionInfo No terms found for _version_, cannot seed version bucket highest value from index
   [junit4]   2> 173972 INFO  (coreLoadExecutor-1145-thread-1) [    ] o.a.s.u.UpdateLog Could not find max version in index or recent updates, using new clock 1523145350771113984
   [junit4]   2> 173973 INFO  (coreLoadExecutor-1145-thread-1) [    ] o.a.s.u.UpdateLog Took 1.0ms to seed version buckets with highest version 1523145350771113984
   [junit4]   2> 173974 INFO  (coreLoadExecutor-1145-thread-1) [    ] o.a.s.c.ZkController watch zkdir /configs/conf1
   [junit4]   2> 173974 INFO  (coreLoadExecutor-1145-thread-1) [    ] o.a.s.c.CoreContainer registering core: collection1
   [junit4]   2> 173974 INFO  (coreZkRegister-1139-thread-1) [    ] o.a.s.c.ZkController Register replica - core:collection1 address:http://127.0.0.1:43728 collection:control_collection shard:shard1
   [junit4]   2> 173975 INFO  (coreZkRegister-1139-thread-1) [    ] o.a.s.c.c.SolrZkClient makePath: /collections/control_collection/leader_elect/shard1/election
   [junit4]   2> 173976 INFO  (coreZkRegister-1139-thread-1) [    ] o.a.s.c.LeaderElector Joined leadership election with path: /collections/control_collection/leader_elect/shard1/election/95196584334721028-core_node1-n_0000000000
   [junit4]   2> 173976 INFO  (coreZkRegister-1139-thread-1) [    ] o.a.s.c.ShardLeaderElectionContext Running the leader process for shard=shard1 and weAreReplacement=false and leaderVoteWait=10000
   [junit4]   2> 173977 INFO  (coreZkRegister-1139-thread-1) [    ] o.a.s.c.ShardLeaderElectionContext Enough replicas found to continue.
   [junit4]   2> 173977 INFO  (coreZkRegister-1139-thread-1) [    ] o.a.s.c.ShardLeaderElectionContext I may be the new leader - try and sync
   [junit4]   2> 173977 INFO  (coreZkRegister-1139-thread-1) [    ] o.a.s.c.SyncStrategy Sync replicas to http://127.0.0.1:43728/collection1/
   [junit4]   2> 173977 INFO  (coreZkRegister-1139-thread-1) [    ] o.a.s.c.SyncStrategy Sync Success - now sync replicas to me
   [junit4]   2> 173977 INFO  (coreZkRegister-1139-thread-1) [    ] o.a.s.c.SyncStrategy http://127.0.0.1:43728/collection1/ has no replicas
   [junit4]   2> 173977 INFO  (OverseerStateUpdate-95196584334721028-127.0.0.1:43728_-n_0000000000) [    ] o.a.s.c.Overseer processMessage: queueSize: 1, message = {
   [junit4]   2>   "operation":"leader",
   [junit4]   2>   "shard":"shard1",
   [junit4]   2>   "collection":"control_collection"} current state version: 1
   [junit4]   2> 173978 INFO  (coreZkRegister-1139-thread-1) [    ] o.a.s.c.c.SolrZkClient makePath: /collections/control_collection/leaders/shard1
   [junit4]   2> 173979 INFO  (coreZkRegister-1139-thread-1) [    ] o.a.s.c.ShardLeaderElectionContextBase Creating leader registration node
   [junit4]   2> 173980 INFO  (coreZkRegister-1139-thread-1) [    ] o.a.s.c.ShardLeaderElectionContext I am the new leader: http://127.0.0.1:43728/collection1/ shard1
   [junit4]   2> 173981 INFO  (OverseerStateUpdate-95196584334721028-127.0.0.1:43728_-n_0000000000) [    ] o.a.s.c.Overseer processMessage: queueSize: 1, message = {
   [junit4]   2>   "operation":"leader",
   [junit4]   2>   "shard":"shard1",
   [junit4]   2>   "collection":"control_collection",
   [junit4]   2>   "base_url":"http://127.0.0.1:43728",
   [junit4]   2>   "core":"collection1",
   [junit4]   2>   "state":"active"} current state version: 1
   [junit4]   2> 174082 INFO  (zkCallback-176-thread-2) [    ] o.a.s.c.c.ZkStateReader A cluster state change: [WatchedEvent state:SyncConnected type:NodeDataChanged path:/clusterstate.json], has occurred - updating... (live nodes size: [1])
   [junit4]   2> 174082 INFO  (zkCallback-176-thread-1) [    ] o.a.s.c.c.ZkStateReader A cluster state change: [WatchedEvent state:SyncConnected type:NodeDataChanged path:/clusterstate.json], has occurred - updating... (live nodes size: [1])
   [junit4]   2> 174131 INFO  (coreZkRegister-1139-thread-1) [    ] o.a.s.c.ZkController We are http://127.0.0.1:43728/collection1/ and leader is http://127.0.0.1:43728/collection1/
   [junit4]   2> 174131 INFO  (coreZkRegister-1139-thread-1) [    ] o.a.s.c.ZkController No LogReplay needed for core=collection1 baseURL=http://127.0.0.1:43728
   [junit4]   2> 174131 INFO  (coreZkRegister-1139-thread-1) [    ] o.a.s.c.ZkController I am the leader, no recovery necessary
   [junit4]   2> 174131 INFO  (coreZkRegister-1139-thread-1) [    ] o.a.s.c.ZkController publishing state=active
   [junit4]   2> 174131 INFO  (coreZkRegister-1139-thread-1) [    ] o.a.s.c.ZkController numShards not found on descriptor - reading it from system property
   [junit4]   2> 174135 INFO  (OverseerStateUpdate-95196584334721028-127.0.0.1:43728_-n_0000000000) [    ] o.a.s.c.Overseer processMessage: queueSize: 1, message = {
   [junit4]   2>   "core":"collection1",
   [junit4]   2>   "core_node_name":"core_node1",
   [junit4]   2>   "roles":null,
   [junit4]   2>   "base_url":"http://127.0.0.1:43728",
   [junit4]   2>   "node_name":"127.0.0.1:43728_",
   [junit4]   2>   "numShards":"1",
   [junit4]   2>   "state":"active",
   [junit4]   2>   "shard":"shard1",
   [junit4]   2>   "collection":"control_collection",
   [junit4]   2>   "operation":"state"} current state version: 2
   [junit4]   2> 174136 INFO  (OverseerStateUpdate-95196584334721028-127.0.0.1:43728_-n_0000000000) [    ] o.a.s.c.o.ReplicaMutator Update state numShards=1 message={
   [junit4]   2>   "core":"collection1",
   [junit4]   2>   "core_node_name":"core_node1",
   [junit4]   2>   "roles":null,
   [junit4]   2>   "base_url":"http://127.0.0.1:43728",
   [junit4]   2>   "node_name":"127.0.0.1:43728_",
   [junit4]   2>   "numShards":"1",
   [junit4]   2>   "state":"active",
   [junit4]   2>   "shard":"shard1",
   [junit4]   2>   "collection":"control_collection",
   [junit4]   2>   "operation":"state"}
   [junit4]   2> 174238 INFO  (zkCallback-176-thread-2) [    ] o.a.s.c.c.ZkStateReader A cluster state change: [WatchedEvent state:SyncConnected type:NodeDataChanged path:/clusterstate.json], has occurred - updating... (live nodes size: [1])
   [junit4]   2> 174238 INFO  (zkCallback-176-thread-1) [    ] o.a.s.c.c.ZkStateReader A cluster state change: [WatchedEvent state:SyncConnected type:NodeDataChanged path:/clusterstate.json], has occurred - updating... (live nodes size: [1])
   [junit4]   2> 174377 INFO  (TEST-FullSolrCloudDistribCmdsTest.test-seed#[3579C61727BD2A5A]) [    ] o.a.s.c.c.SolrZkClient Using default ZkCredentialsProvider
   [junit4]   2> 174377 INFO  (TEST-FullSolrCloudDistribCmdsTest.test-seed#[3579C61727BD2A5A]) [    ] o.a.s.c.c.ConnectionManager Waiting for client to connect to ZooKeeper
   [junit4]   2> 174378 INFO  (zkCallback-178-thread-1) [    ] o.a.s.c.c.ConnectionManager Watcher org.apache.solr.common.cloud.ConnectionManager@295f98c1 name:ZooKeeperConnection Watcher:127.0.0.1:35712/solr got event WatchedEvent state:SyncConnected type:None path:null path:null type:None
   [junit4]   2> 174378 INFO  (TEST-FullSolrCloudDistribCmdsTest.test-seed#[3579C61727BD2A5A]) [    ] o.a.s.c.c.ConnectionManager Client is connected to ZooKeeper
   [junit4]   2> 174378 INFO  (TEST-FullSolrCloudDistribCmdsTest.test-seed#[3579C61727BD2A5A]) [    ] o.a.s.c.c.SolrZkClient Using default ZkACLProvider
   [junit4]   2> 174379 INFO  (TEST-FullSolrCloudDistribCmdsTest.test-seed#[3579C61727BD2A5A]) [    ] o.a.s.c.c.ZkStateReader Updating cluster state from ZooKeeper... 
   [junit4]   2> 174380 INFO  (TEST-FullSolrCloudDistribCmdsTest.test-seed#[3579C61727BD2A5A]) [    ] o.a.s.c.ChaosMonkey monkey: init - expire sessions:false cause connection loss:false
   [junit4]   2> 174380 INFO  (TEST-FullSolrCloudDistribCmdsTest.test-seed#[3579C61727BD2A5A]) [    ] o.a.s.c.AbstractFullDistribZkTestBase Creating collection1 with stateFormat=2
   [junit4]   2> 174380 INFO  (TEST-FullSolrCloudDistribCmdsTest.test-seed#[3579C61727BD2A5A]) [    ] o.a.s.c.c.SolrZkClient Using default ZkCredentialsProvider
   [junit4]   2> 174380 INFO  (TEST-FullSolrCloudDistribCmdsTest.test-seed#[3579C61727BD2A5A]) [    ] o.a.s.c.c.ConnectionManager Waiting for client to connect to ZooKeeper
   [junit4]   2> 174381 INFO  (zkCallback-179-thread-1) [    ] o.a.s.c.c.ConnectionManager Watcher org.apache.solr.common.cloud.ConnectionManager@70c315d8 name:ZooKeeperConnection Watcher:127.0.0.1:35712/solr got event WatchedEvent state:SyncConnected type:None path:null path:null type:None
   [junit4]   2> 174381 INFO  (TEST-FullSolrCloudDistribCmdsTest.test-seed#[3579C61727BD2A5A]) [    ] o.a.s.c.c.ConnectionManager Client is connected to ZooKeeper
   [junit4]   2> 174381 INFO  (TEST-FullSolrCloudDistribCmdsTest.test-seed#[3579C61727BD2A5A]) [    ] o.a.s.c.c.SolrZkClient Using default ZkACLProvider
   [junit4]   2> 174382 INFO  (OverseerStateUpdate-95196584334721028-127.0.0.1:43728_-n_0000000000) [    ] o.a.s.c.Overseer processMessage: queueSize: 1, message = {
   [junit4]   2>   "operation":"create",
   [junit4]   2>   "name":"collection1",
   [junit4]   2>   "numShards":"3",
   [junit4]   2>   "stateFormat":"2"} current state version: 3
   [junit4]   2> 174383 INFO  (OverseerStateUpdate-95196584334721028-127.0.0.1:43728_-n_0000000000) [    ] o.a.s.c.o.ClusterStateMutator building a new cName: collection1
   [junit4]   2> 174433 INFO  (TEST-FullSolrCloudDistribCmdsTest.test-seed#[3579C61727BD2A5A]) [    ] o.a.s.SolrTestCaseJ4 Writing core.properties file to /home/jenkins/workspace/Lucene-Solr-5.x-Linux/solr/build/solr-core/test/J2/temp/solr.cloud.FullSolrCloudDistribCmdsTest_3579C61727BD2A5A-001/shard-1-001/cores/collection1
   [junit4]   2> 174433 INFO  (TEST-FullSolrCloudDistribCmdsTest.test-seed#[3579C61727BD2A5A]) [    ] o.a.s.c.AbstractFullDistribZkTestBase create jetty 1 in directory /home/jenkins/workspace/Lucene-Solr-5.x-Linux/solr/build/solr-core/test/J2/temp/solr.cloud.FullSolrCloudDistribCmdsTest_3579C61727BD2A5A-001/shard-1-001
   [junit4]   2> 174434 INFO  (TEST-FullSolrCloudDistribCmdsTest.test-seed#[3579C61727BD2A5A]) [    ] o.e.j.s.Server jetty-9.2.13.v20150730
   [junit4]   2> 174436 INFO  (TEST-FullSolrCloudDistribCmdsTest.test-seed#[3579C61727BD2A5A]) [    ] o.e.j.s.h.ContextHandler Started o.e.j.s.ServletContextHandler@2bc0f114{/,null,AVAILABLE}
   [junit4]   2> 174436 INFO  (TEST-FullSolrCloudDistribCmdsTest.test-seed#[3579C61727BD2A5A]) [    ] o.e.j.s.ServerConnector Started ServerConnector@77901a6d{HTTP/1.1}{127.0.0.1:42189}
   [junit4]   2> 174436 INFO  (TEST-FullSolrCloudDistribCmdsTest.test-seed#[3579C61727BD2A5A]) [    ] o.e.j.s.Server Started @176594ms
   [junit4]   2> 174436 INFO  (TEST-FullSolrCloudDistribCmdsTest.test-seed#[3579C61727BD2A5A]) [    ] o.a.s.c.s.e.JettySolrRunner Jetty properties: {solr.data.dir=/home/jenkins/workspace/Lucene-Solr-5.x-Linux/solr/build/solr-core/test/J2/temp/solr.cloud.FullSolrCloudDistribCmdsTest_3579C61727BD2A5A-001/tempDir-001/jetty1, solrconfig=solrconfig.xml, hostContext=/, hostPort=42189, coreRootDirectory=/home/jenkins/workspace/Lucene-Solr-5.x-Linux/solr/build/solr-core/test/J2/../../../../../../../../../home/jenkins/workspace/Lucene-Solr-5.x-Linux/solr/build/solr-core/test/J2/temp/solr.cloud.FullSolrCloudDistribCmdsTest_3579C61727BD2A5A-001/shard-1-001/cores}
   [junit4]   2> 174436 INFO  (TEST-FullSolrCloudDistribCmdsTest.test-seed#[3579C61727BD2A5A]) [    ] o.a.s.s.SolrDispatchFilter SolrDispatchFilter.init(): sun.misc.Launcher$AppClassLoader@694f9431
   [junit4]   2> 174436 INFO  (TEST-FullSolrCloudDistribCmdsTest.test-seed#[3579C61727BD2A5A]) [    ] o.a.s.c.SolrResourceLoader new SolrResourceLoader for directory: '/home/jenkins/workspace/Lucene-Solr-5.x-Linux/solr/build/solr-core/test/J2/temp/solr.cloud.FullSolrCloudDistribCmdsTest_3579C61727BD2A5A-001/shard-1-001'
   [junit4]   2> 174436 INFO  (TEST-FullSolrCloudDistribCmdsTest.test-seed#[3579C61727BD2A5A]) [    ] o.a.s.c.SolrResourceLoader JNDI not configured for solr (NoInitialContextEx)
   [junit4]   2> 174436 INFO  (TEST-FullSolrCloudDistribCmdsTest.test-seed#[3579C61727BD2A5A]) [    ] o.a.s.c.SolrResourceLoader solr home defaulted to 'solr/' (could not find system property or JNDI)
   [junit4]   2> 174437 INFO  (TEST-FullSolrCloudDistribCmdsTest.test-seed#[3579C61727BD2A5A]) [    ] o.a.s.c.c.SolrZkClient Using default ZkCredentialsProvider
   [junit4]   2> 174437 INFO  (TEST-FullSolrCloudDistribCmdsTest.test-seed#[3579C61727BD2A5A]) [    ] o.a.s.c.c.ConnectionManager Waiting for client to connect to ZooKeeper
   [junit4]   2> 174438 INFO  (zkCallback-180-thread-1) [    ] o.a.s.c.c.ConnectionManager Watcher org.apache.solr.common.cloud.ConnectionManager@6d4f9e1d name:ZooKeeperConnection Watcher:127.0.0.1:35712/solr got event WatchedEvent state:SyncConnected type:None path:null path:null type:None
   [junit4]   2> 174438 INFO  (TEST-FullSolrCloudDistribCmdsTest.test-seed#[3579C61727BD2A5A]) [    ] o.a.s.c.c.ConnectionManager Client is connected to ZooKeeper
   [junit4]   2> 174438 INFO  (TEST-FullSolrCloudDistribCmdsTest.test-seed#[3579C61727BD2A5A]) [    ] o.a.s.c.c.SolrZkClient Using default ZkACLProvider
   [junit4]   2> 174438 INFO  (TEST-FullSolrCloudDistribCmdsTest.test-seed#[3579C61727BD2A5A]) [    ] o.a.s.s.SolrDispatchFilter Loading solr.xml from SolrHome (not found in ZooKeeper)
   [junit4]   2> 174438 INFO  (TEST-FullSolrCloudDistribCmdsTest.test-seed#[3579C61727BD2A5A]) [    ] o.a.s.c.SolrXmlConfig Loading container configuration from /home/jenkins/workspace/Lucene-Solr-5.x-Linux/solr/build/solr-core/test/J2/temp/solr.cloud.FullSolrCloudDistribCmdsTest_3579C61727BD2A5A-001/shard-1-001/solr.xml
   [junit4]   2> 174442 INFO  (TEST-FullSolrCloudDistribCmdsTest.test-seed#[3579C61727BD2A5A]) [    ] o.a.s.c.CorePropertiesLocator Config-defined core root directory: /home/jenkins/workspace/Lucene-Solr-5.x-Linux/solr/build/solr-core/test/J2/../../../../../../../../../home/jenkins/workspace/Lucene-Solr-5.x-Linux/solr/build/solr-core/test/J2/temp/solr.cloud.FullSolrCloudDistribCmdsTest_3579C61727BD2A5A-001/shard-1-001/cores
   [junit4]   2> 174442 INFO  (TEST-FullSolrCloudDistribCmdsTest.test-seed#[3579C61727BD2A5A]) [    ] o.a.s.c.CoreContainer New CoreContainer 843492145
   [junit4]   2> 174442 INFO  (TEST-FullSolrCloudDistribCmdsTest.test-seed#[3579C61727BD2A5A]) [    ] o.a.s.c.CoreContainer Loading cores i

[...truncated too long message...]

er.KeeperException.create(KeeperException.java:51)
   [junit4]   2> 	at org.apache.zookeeper.ZooKeeper.delete(ZooKeeper.java:873)
   [junit4]   2> 	at org.apache.solr.common.cloud.SolrZkClient$2.execute(SolrZkClient.java:244)
   [junit4]   2> 	at org.apache.solr.common.cloud.SolrZkClient$2.execute(SolrZkClient.java:241)
   [junit4]   2> 	at org.apache.solr.common.cloud.ZkCmdExecutor.retryOperation(ZkCmdExecutor.java:61)
   [junit4]   2> 	at org.apache.solr.common.cloud.SolrZkClient.delete(SolrZkClient.java:241)
   [junit4]   2> 	at org.apache.solr.cloud.ElectionContext.cancelElection(ElectionContext.java:87)
   [junit4]   2> 	at org.apache.solr.cloud.ShardLeaderElectionContextBase.cancelElection(ElectionContext.java:167)
   [junit4]   2> 	at org.apache.solr.cloud.ShardLeaderElectionContext.cancelElection(ElectionContext.java:269)
   [junit4]   2> 	at org.apache.solr.cloud.ShardLeaderElectionContext.runLeaderProcess(ElectionContext.java:445)
   [junit4]   2> 	at org.apache.solr.cloud.LeaderElector.runIamLeaderProcess(LeaderElector.java:198)
   [junit4]   2> 	at org.apache.solr.cloud.LeaderElector.checkIfIamLeader(LeaderElector.java:158)
   [junit4]   2> 	at org.apache.solr.cloud.LeaderElector.access$200(LeaderElector.java:59)
   [junit4]   2> 	at org.apache.solr.cloud.LeaderElector$ElectionWatcher.process(LeaderElector.java:389)
   [junit4]   2> 	at org.apache.solr.common.cloud.SolrZkClient$3$1.run(SolrZkClient.java:264)
   [junit4]   2> 	at java.util.concurrent.Executors$RunnableAdapter.call(Executors.java:514)
   [junit4]   2> 	at java.util.concurrent.FutureTask.run(FutureTask.java:266)
   [junit4]   2> 	at org.apache.solr.common.util.ExecutorUtil$MDCAwareThreadPoolExecutor$1.run(ExecutorUtil.java:232)
   [junit4]   2> 	at java.util.concurrent.ThreadPoolExecutor.runWorker(ThreadPoolExecutor.java:1158)
   [junit4]   2> 	at java.util.concurrent.ThreadPoolExecutor$Worker.run(ThreadPoolExecutor.java:632)
   [junit4]   2> 	at java.lang.Thread.run(Thread.java:747)
   [junit4]   2> 1465295 INFO  (jetty-launcher-1070-thread-5) [    ] o.e.j.s.h.ContextHandler Stopped o.e.j.s.ServletContextHandler@21443c75{/solr,null,UNAVAILABLE}
   [junit4]   2> 1465296 INFO  (TEST-TestMiniSolrCloudClusterBase.testBasics-seed#[3579C61727BD2A5A]) [    ] o.a.s.c.ZkTestServer connecting to 127.0.0.1:41334 41334
   [junit4]   2> 1465318 INFO  (Thread-3491) [    ] o.a.s.c.ZkTestServer connecting to 127.0.0.1:41334 41334
   [junit4]   2> 1465321 WARN  (Thread-3491) [    ] o.a.s.c.ZkTestServer Watch limit violations: 
   [junit4]   2> Maximum concurrent create/delete watches above limit:
   [junit4]   2> 
   [junit4]   2> 	8	/solr/aliases.json
   [junit4]   2> 	6	/solr/security.json
   [junit4]   2> 	4	/solr/configs/solrCloudCollectionConfig
   [junit4]   2> 
   [junit4]   2> Maximum concurrent data watches above limit:
   [junit4]   2> 
   [junit4]   2> 	8	/solr/clusterstate.json
   [junit4]   2> 	4	/solr/collections/testSolrCloudCollection/state.json
   [junit4]   2> 	2	/solr/overseer_elect/election/95196667730591758-127.0.0.1:58523_solr-n_0000000002
   [junit4]   2> 	2	/solr/overseer_elect/election/95196667730591759-127.0.0.1:40836_solr-n_0000000001
   [junit4]   2> 
   [junit4]   2> Maximum concurrent children watches above limit:
   [junit4]   2> 
   [junit4]   2> 	8	/solr/collections
   [junit4]   2> 	7	/solr/live_nodes
   [junit4]   2> 	2	/solr/overseer/collection-queue-work
   [junit4]   2> 
   [junit4]   2> NOTE: reproduce with: ant test  -Dtestcase=TestMiniSolrCloudClusterBase -Dtests.method=testBasics -Dtests.seed=3579C61727BD2A5A -Dtests.multiplier=3 -Dtests.slow=true -Dtests.locale=sr_RS_#Cyrl -Dtests.timezone=Indian/Comoro -Dtests.asserts=true -Dtests.file.encoding=ISO-8859-1
   [junit4] FAILURE 20.2s J2 | TestMiniSolrCloudClusterBase.testBasics <<<
   [junit4]    > Throwable #1: java.lang.AssertionError: expected:<1> but was:<0>
   [junit4]    > 	at __randomizedtesting.SeedInfo.seed([3579C61727BD2A5A:8A1683B1F53742A]:0)
   [junit4]    > 	at org.apache.solr.cloud.TestMiniSolrCloudClusterBase.testCollectionCreateSearchDelete(TestMiniSolrCloudClusterBase.java:149)
   [junit4]    > 	at org.apache.solr.cloud.TestMiniSolrCloudClusterBase.testBasics(TestMiniSolrCloudClusterBase.java:78)
   [junit4]    > 	at java.lang.Thread.run(Thread.java:747)
   [junit4]   2> NOTE: leaving temporary files on disk at: /home/jenkins/workspace/Lucene-Solr-5.x-Linux/solr/build/solr-core/test/J2/temp/solr.cloud.TestMiniSolrCloudClusterBase_3579C61727BD2A5A-001
   [junit4]   2> Jan 12, 2016 8:04:52 AM com.carrotsearch.randomizedtesting.ThreadLeakControl checkThreadLeaks
   [junit4]   2> WARNING: Will linger awaiting termination of 1 leaked thread(s).
   [junit4]   2> NOTE: test params are: codec=Asserting(Lucene54): {range_facet_l_dv=PostingsFormat(name=LuceneFixedGap), _version_=Lucene50(blocksize=128), multiDefault=PostingsFormat(name=Memory doPackFST= false), intDefault=Lucene50(blocksize=128), id=PostingsFormat(name=LuceneFixedGap), range_facet_i_dv=PostingsFormat(name=Memory doPackFST= false), range_facet_l=PostingsFormat(name=Memory doPackFST= false), timestamp=PostingsFormat(name=Memory doPackFST= false)}, docValues:{range_facet_l_dv=DocValuesFormat(name=Lucene54), range_facet_i_dv=DocValuesFormat(name=Memory), timestamp=DocValuesFormat(name=Memory)}, sim=DefaultSimilarity, locale=sr_RS_#Cyrl, timezone=Indian/Comoro
   [junit4]   2> NOTE: Linux 3.19.0-42-generic amd64/Oracle Corporation 9-ea (64-bit)/cpus=12,threads=1,free=280773384,total=536870912
   [junit4]   2> NOTE: All tests run in this JVM: [DirectUpdateHandlerOptimizeTest, TestLeaderInitiatedRecoveryThread, SuggesterWFSTTest, TestZkChroot, TestReRankQParserPlugin, TestFieldTypeCollectionResource, TestSchemaNameResource, JavabinLoaderTest, TestCoreDiscovery, TestExtendedDismaxParser, DocExpirationUpdateProcessorFactoryTest, SolrTestCaseJ4Test, AnalysisErrorHandlingTest, DirectSolrConnectionTest, TestShardHandlerFactory, TestRandomForceMergePolicy, BadComponentTest, CoreAdminCreateDiscoverTest, TestSuggestSpellingConverter, SolrCoreCheckLockOnStartupTest, TestExpandComponent, HdfsCollectionsAPIDistributedZkTest, TestReload, TestFastWriter, CloudMLTQParserTest, ShowFileRequestHandlerTest, DateRangeFieldTest, PrimitiveFieldTypeTest, TestStressReorder, ConjunctionSolrSpellCheckerTest, DistanceUnitsTest, TestIndexingPerformance, TestPostingsSolrHighlighter, BlockCacheTest, ConcurrentDeleteAndCreateCollectionTest, HdfsBasicDistributedZkTest, TestReversedWildcardFilterFactory, RemoteQueryErrorTest, CoreAdminHandlerTest, TestTestInjection, TestTolerantSearch, TestConfigSetImmutable, DocValuesMultiTest, TestElisionMultitermQuery, DebugComponentTest, BinaryUpdateRequestHandlerTest, CurrencyFieldXmlFileTest, TestMacros, AutoCommitTest, TestJmxMonitoredMap, ActionThrottleTest, TestSolrXml, TestDefaultStatsCache, TestSolrDeletionPolicy1, HdfsRecoveryZkTest, FullSolrCloudDistribCmdsTest, NoCacheHeaderTest, TestUseDocValuesAsStored2, TestPerFieldSimilarity, HighlighterConfigTest, TestConfigSetsAPIZkFailure, TestMaxScoreQueryParser, TestOrdValues, TestFuzzyAnalyzedSuggestions, TestDownShardTolerantSearch, ZkStateWriterTest, TestRestoreCore, DirectUpdateHandlerTest, TestRestManager, TestSolrJ, TestNonDefinedSimilarityFactory, HdfsDirectoryFactoryTest, SearchHandlerTest, OverriddenZkACLAndCredentialsProvidersTest, TestFileDictionaryLookup, AsyncCallRequestStatusResponseTest, HardAutoCommitTest, TestXIncludeConfig, FieldMutatingUpdateProcessorTest, DateMathParserTest, TestFieldSortValues, TestSearchPerf, TestPHPSerializedResponseWriter, FieldAnalysisRequestHandlerTest, TestSweetSpotSimilarityFactory, TestSortingResponseWriter, OverseerTest, BitVectorTest, OverseerStatusTest, LeaderFailoverAfterPartitionTest, SyncSliceTest, TestReplicationHandler, TermVectorComponentDistributedTest, TestStressVersions, TestRangeQuery, TestCoreContainer, SimpleFacetsTest, TestGroupingSearch, BadIndexSchemaTest, TestSort, TestLazyCores, TestBadConfig, TestIndexSearcher, HighlighterTest, DistributedQueryElevationComponentTest, SignatureUpdateProcessorFactoryTest, SpellCheckCollatorTest, TestTrie, PolyFieldTest, SortByFunctionTest, XsltUpdateRequestHandlerTest, LukeRequestHandlerTest, XmlUpdateRequestHandlerTest, TestValueSourceCache, TestSolrQueryParser, IndexSchemaRuntimeFieldTest, SolrPluginUtilsTest, JSONWriterTest, UniqFieldsUpdateProcessorFactoryTest, TestLFUCache, AsyncMigrateRouteKeyTest, DeleteInactiveReplicaTest, DistribDocExpirationUpdateProcessorTest, ForceLeaderTest, SharedFSAutoReplicaFailoverTest, SharedFSAutoReplicaFailoverUtilsTest, SolrXmlInZkTest, TestAuthenticationFramework, TestMiniSolrCloudClusterBase]
   [junit4] Completed [442/563 (7!)] on J2 in 20.70s, 1 test, 1 failure <<< FAILURES!

[...truncated 404 lines...]
BUILD FAILED
/home/jenkins/workspace/Lucene-Solr-5.x-Linux/build.xml:794: The following error occurred while executing this line:
/home/jenkins/workspace/Lucene-Solr-5.x-Linux/build.xml:738: The following error occurred while executing this line:
/home/jenkins/workspace/Lucene-Solr-5.x-Linux/build.xml:59: The following error occurred while executing this line:
/home/jenkins/workspace/Lucene-Solr-5.x-Linux/solr/build.xml:233: The following error occurred while executing this line:
/home/jenkins/workspace/Lucene-Solr-5.x-Linux/solr/common-build.xml:526: The following error occurred while executing this line:
/home/jenkins/workspace/Lucene-Solr-5.x-Linux/lucene/common-build.xml:1444: The following error occurred while executing this line:
/home/jenkins/workspace/Lucene-Solr-5.x-Linux/lucene/common-build.xml:1000: There were test failures: 563 suites (7 ignored), 2236 tests, 8 failures, 84 ignored (39 assumptions) [seed: 3579C61727BD2A5A]

Total time: 53 minutes 39 seconds
Build step 'Invoke Ant' marked build as failure
Archiving artifacts
[WARNINGS] Skipping publisher since build result is FAILURE
Recording test results
Email was triggered for: Failure - Any
Sending email for trigger: Failure - Any



Mime
View raw message