lucene-dev mailing list archives

Site index · List index
Message view « Date » · « Thread »
Top « Date » · « Thread »
From Policeman Jenkins Server <jenk...@thetaphi.de>
Subject [JENKINS-EA] Lucene-Solr-trunk-Linux (32bit/jdk-9-ea+95) - Build # 15511 - Failure!
Date Mon, 11 Jan 2016 02:39:13 GMT
Build: http://jenkins.thetaphi.de/job/Lucene-Solr-trunk-Linux/15511/
Java: 32bit/jdk-9-ea+95 -client -XX:+UseParallelGC -XX:-CompactStrings

1 tests failed.
FAILED:  org.apache.solr.handler.TestReplicationHandler.doTestIndexAndConfigAliasReplication

Error Message:
Index: 0, Size: 0

Stack Trace:
java.lang.IndexOutOfBoundsException: Index: 0, Size: 0
	at __randomizedtesting.SeedInfo.seed([398BDAFA08197A52:CEF834A2CEF1D5B4]:0)
	at java.util.ArrayList.rangeCheck(ArrayList.java:659)
	at java.util.ArrayList.get(ArrayList.java:432)
	at org.apache.solr.handler.TestReplicationHandler.doTestIndexAndConfigAliasReplication(TestReplicationHandler.java:1241)
	at sun.reflect.NativeMethodAccessorImpl.invoke0(Native Method)
	at sun.reflect.NativeMethodAccessorImpl.invoke(NativeMethodAccessorImpl.java:62)
	at sun.reflect.DelegatingMethodAccessorImpl.invoke(DelegatingMethodAccessorImpl.java:43)
	at java.lang.reflect.Method.invoke(Method.java:520)
	at com.carrotsearch.randomizedtesting.RandomizedRunner.invoke(RandomizedRunner.java:1764)
	at com.carrotsearch.randomizedtesting.RandomizedRunner$8.evaluate(RandomizedRunner.java:871)
	at com.carrotsearch.randomizedtesting.RandomizedRunner$9.evaluate(RandomizedRunner.java:907)
	at com.carrotsearch.randomizedtesting.RandomizedRunner$10.evaluate(RandomizedRunner.java:921)
	at com.carrotsearch.randomizedtesting.rules.SystemPropertiesRestoreRule$1.evaluate(SystemPropertiesRestoreRule.java:57)
	at org.apache.lucene.util.TestRuleSetupTeardownChained$1.evaluate(TestRuleSetupTeardownChained.java:50)
	at org.apache.lucene.util.AbstractBeforeAfterRule$1.evaluate(AbstractBeforeAfterRule.java:46)
	at org.apache.lucene.util.TestRuleThreadAndTestName$1.evaluate(TestRuleThreadAndTestName.java:49)
	at org.apache.lucene.util.TestRuleIgnoreAfterMaxFailures$1.evaluate(TestRuleIgnoreAfterMaxFailures.java:65)
	at org.apache.lucene.util.TestRuleMarkFailure$1.evaluate(TestRuleMarkFailure.java:48)
	at com.carrotsearch.randomizedtesting.rules.StatementAdapter.evaluate(StatementAdapter.java:36)
	at com.carrotsearch.randomizedtesting.ThreadLeakControl$StatementRunner.run(ThreadLeakControl.java:367)
	at com.carrotsearch.randomizedtesting.ThreadLeakControl.forkTimeoutingTask(ThreadLeakControl.java:809)
	at com.carrotsearch.randomizedtesting.ThreadLeakControl$3.evaluate(ThreadLeakControl.java:460)
	at com.carrotsearch.randomizedtesting.RandomizedRunner.runSingleTest(RandomizedRunner.java:880)
	at com.carrotsearch.randomizedtesting.RandomizedRunner$5.evaluate(RandomizedRunner.java:781)
	at com.carrotsearch.randomizedtesting.RandomizedRunner$6.evaluate(RandomizedRunner.java:816)
	at com.carrotsearch.randomizedtesting.RandomizedRunner$7.evaluate(RandomizedRunner.java:827)
	at com.carrotsearch.randomizedtesting.rules.StatementAdapter.evaluate(StatementAdapter.java:36)
	at com.carrotsearch.randomizedtesting.rules.SystemPropertiesRestoreRule$1.evaluate(SystemPropertiesRestoreRule.java:57)
	at org.apache.lucene.util.AbstractBeforeAfterRule$1.evaluate(AbstractBeforeAfterRule.java:46)
	at com.carrotsearch.randomizedtesting.rules.StatementAdapter.evaluate(StatementAdapter.java:36)
	at org.apache.lucene.util.TestRuleStoreClassName$1.evaluate(TestRuleStoreClassName.java:42)
	at com.carrotsearch.randomizedtesting.rules.NoShadowingOrOverridesOnMethodsRule$1.evaluate(NoShadowingOrOverridesOnMethodsRule.java:40)
	at com.carrotsearch.randomizedtesting.rules.NoShadowingOrOverridesOnMethodsRule$1.evaluate(NoShadowingOrOverridesOnMethodsRule.java:40)
	at com.carrotsearch.randomizedtesting.rules.StatementAdapter.evaluate(StatementAdapter.java:36)
	at com.carrotsearch.randomizedtesting.rules.StatementAdapter.evaluate(StatementAdapter.java:36)
	at com.carrotsearch.randomizedtesting.rules.StatementAdapter.evaluate(StatementAdapter.java:36)
	at org.apache.lucene.util.TestRuleAssertionsRequired$1.evaluate(TestRuleAssertionsRequired.java:54)
	at org.apache.lucene.util.TestRuleMarkFailure$1.evaluate(TestRuleMarkFailure.java:48)
	at org.apache.lucene.util.TestRuleIgnoreAfterMaxFailures$1.evaluate(TestRuleIgnoreAfterMaxFailures.java:65)
	at org.apache.lucene.util.TestRuleIgnoreTestSuites$1.evaluate(TestRuleIgnoreTestSuites.java:55)
	at com.carrotsearch.randomizedtesting.rules.StatementAdapter.evaluate(StatementAdapter.java:36)
	at com.carrotsearch.randomizedtesting.ThreadLeakControl$StatementRunner.run(ThreadLeakControl.java:367)
	at java.lang.Thread.run(Thread.java:747)




Build Log:
[...truncated 10522 lines...]
   [junit4] Suite: org.apache.solr.handler.TestReplicationHandler
   [junit4]   2> Creating dataDir: /home/jenkins/workspace/Lucene-Solr-trunk-Linux/solr/build/solr-core/test/J1/temp/solr.handler.TestReplicationHandler_398BDAFA08197A52-001/init-core-data-001
   [junit4]   2> 1019434 INFO  (TEST-TestReplicationHandler.doTestDetails-seed#[398BDAFA08197A52]) [    ] o.a.s.SolrTestCaseJ4 ###Starting doTestDetails
   [junit4]   2> 1019434 INFO  (TEST-TestReplicationHandler.doTestDetails-seed#[398BDAFA08197A52]) [    ] o.a.s.SolrTestCaseJ4 Writing core.properties file to /home/jenkins/workspace/Lucene-Solr-trunk-Linux/solr/build/solr-core/test/J1/temp/solr.handler.TestReplicationHandler_398BDAFA08197A52-001/solr-instance-001/collection1
   [junit4]   2> 1019438 INFO  (TEST-TestReplicationHandler.doTestDetails-seed#[398BDAFA08197A52]) [    ] o.e.j.s.Server jetty-9.2.13.v20150730
   [junit4]   2> 1019440 INFO  (TEST-TestReplicationHandler.doTestDetails-seed#[398BDAFA08197A52]) [    ] o.e.j.s.h.ContextHandler Started o.e.j.s.ServletContextHandler@127bcc1{/solr,null,AVAILABLE}
   [junit4]   2> 1019448 INFO  (TEST-TestReplicationHandler.doTestDetails-seed#[398BDAFA08197A52]) [    ] o.e.j.s.ServerConnector Started ServerConnector@195c1c0{HTTP/1.1}{127.0.0.1:54252}
   [junit4]   2> 1019448 INFO  (TEST-TestReplicationHandler.doTestDetails-seed#[398BDAFA08197A52]) [    ] o.e.j.s.Server Started @1020604ms
   [junit4]   2> 1019448 INFO  (TEST-TestReplicationHandler.doTestDetails-seed#[398BDAFA08197A52]) [    ] o.a.s.c.s.e.JettySolrRunner Jetty properties: {solr.data.dir=/home/jenkins/workspace/Lucene-Solr-trunk-Linux/solr/build/solr-core/test/J1/temp/solr.handler.TestReplicationHandler_398BDAFA08197A52-001/solr-instance-001/collection1/data, hostContext=/solr, hostPort=54252}
   [junit4]   2> 1019449 INFO  (TEST-TestReplicationHandler.doTestDetails-seed#[398BDAFA08197A52]) [    ] o.a.s.s.SolrDispatchFilter SolrDispatchFilter.init(): sun.misc.Launcher$AppClassLoader@1eb6432
   [junit4]   2> 1019449 INFO  (TEST-TestReplicationHandler.doTestDetails-seed#[398BDAFA08197A52]) [    ] o.a.s.c.SolrResourceLoader new SolrResourceLoader for directory: '/home/jenkins/workspace/Lucene-Solr-trunk-Linux/solr/build/solr-core/test/J1/temp/solr.handler.TestReplicationHandler_398BDAFA08197A52-001/solr-instance-001'
   [junit4]   2> 1019449 INFO  (TEST-TestReplicationHandler.doTestDetails-seed#[398BDAFA08197A52]) [    ] o.a.s.c.SolrResourceLoader JNDI not configured for solr (NoInitialContextEx)
   [junit4]   2> 1019449 INFO  (TEST-TestReplicationHandler.doTestDetails-seed#[398BDAFA08197A52]) [    ] o.a.s.c.SolrResourceLoader solr home defaulted to 'solr/' (could not find system property or JNDI)
   [junit4]   2> 1019449 INFO  (TEST-TestReplicationHandler.doTestDetails-seed#[398BDAFA08197A52]) [    ] o.a.s.c.SolrXmlConfig Loading container configuration from /home/jenkins/workspace/Lucene-Solr-trunk-Linux/solr/build/solr-core/test/J1/temp/solr.handler.TestReplicationHandler_398BDAFA08197A52-001/solr-instance-001/solr.xml
   [junit4]   2> 1019462 INFO  (TEST-TestReplicationHandler.doTestDetails-seed#[398BDAFA08197A52]) [    ] o.a.s.c.CorePropertiesLocator Config-defined core root directory: /home/jenkins/workspace/Lucene-Solr-trunk-Linux/solr/build/solr-core/test/J1/temp/solr.handler.TestReplicationHandler_398BDAFA08197A52-001/solr-instance-001/.
   [junit4]   2> 1019462 INFO  (TEST-TestReplicationHandler.doTestDetails-seed#[398BDAFA08197A52]) [    ] o.a.s.c.CoreContainer New CoreContainer 17268273
   [junit4]   2> 1019462 INFO  (TEST-TestReplicationHandler.doTestDetails-seed#[398BDAFA08197A52]) [    ] o.a.s.c.CoreContainer Loading cores into CoreContainer [instanceDir=/home/jenkins/workspace/Lucene-Solr-trunk-Linux/solr/build/solr-core/test/J1/temp/solr.handler.TestReplicationHandler_398BDAFA08197A52-001/solr-instance-001]
   [junit4]   2> 1019462 WARN  (TEST-TestReplicationHandler.doTestDetails-seed#[398BDAFA08197A52]) [    ] o.a.s.c.CoreContainer Couldn't add files from /home/jenkins/workspace/Lucene-Solr-trunk-Linux/solr/build/solr-core/test/J1/temp/solr.handler.TestReplicationHandler_398BDAFA08197A52-001/solr-instance-001/lib to classpath: /home/jenkins/workspace/Lucene-Solr-trunk-Linux/solr/build/solr-core/test/J1/temp/solr.handler.TestReplicationHandler_398BDAFA08197A52-001/solr-instance-001/lib
   [junit4]   2> 1019462 INFO  (TEST-TestReplicationHandler.doTestDetails-seed#[398BDAFA08197A52]) [    ] o.a.s.h.c.HttpShardHandlerFactory created with socketTimeout : 90000,urlScheme : ,connTimeout : 15000,maxConnectionsPerHost : 20,maxConnections : 10000,corePoolSize : 0,maximumPoolSize : 2147483647,maxThreadIdleTime : 5,sizeOfQueue : -1,fairnessPolicy : false,useRetries : false,
   [junit4]   2> 1019463 INFO  (TEST-TestReplicationHandler.doTestDetails-seed#[398BDAFA08197A52]) [    ] o.a.s.u.UpdateShardHandler Creating UpdateShardHandler HTTP client with params: socketTimeout=340000&connTimeout=45000&retry=true
   [junit4]   2> 1019464 INFO  (TEST-TestReplicationHandler.doTestDetails-seed#[398BDAFA08197A52]) [    ] o.a.s.l.LogWatcher SLF4J impl is org.slf4j.impl.Log4jLoggerFactory
   [junit4]   2> 1019464 INFO  (TEST-TestReplicationHandler.doTestDetails-seed#[398BDAFA08197A52]) [    ] o.a.s.l.LogWatcher Registering Log Listener [Log4j (org.slf4j.impl.Log4jLoggerFactory)]
   [junit4]   2> 1019464 INFO  (TEST-TestReplicationHandler.doTestDetails-seed#[398BDAFA08197A52]) [    ] o.a.s.c.CoreContainer Security conf doesn't exist. Skipping setup for authorization module.
   [junit4]   2> 1019464 INFO  (TEST-TestReplicationHandler.doTestDetails-seed#[398BDAFA08197A52]) [    ] o.a.s.c.CoreContainer No authentication plugin used.
   [junit4]   2> 1019464 INFO  (TEST-TestReplicationHandler.doTestDetails-seed#[398BDAFA08197A52]) [    ] o.a.s.c.CorePropertiesLocator Looking for core definitions underneath /home/jenkins/workspace/Lucene-Solr-trunk-Linux/solr/build/solr-core/test/J1/temp/solr.handler.TestReplicationHandler_398BDAFA08197A52-001/solr-instance-001/.
   [junit4]   2> 1019465 INFO  (TEST-TestReplicationHandler.doTestDetails-seed#[398BDAFA08197A52]) [    ] o.a.s.c.CoreDescriptor Created CoreDescriptor: {name=collection1, config=solrconfig.xml, loadOnStartup=true, schema=schema.xml, configSetProperties=configsetprops.json, transient=false, dataDir=data/}
   [junit4]   2> 1019465 INFO  (TEST-TestReplicationHandler.doTestDetails-seed#[398BDAFA08197A52]) [    ] o.a.s.c.CorePropertiesLocator Found core collection1 in /home/jenkins/workspace/Lucene-Solr-trunk-Linux/solr/build/solr-core/test/J1/temp/solr.handler.TestReplicationHandler_398BDAFA08197A52-001/solr-instance-001/./collection1
   [junit4]   2> 1019465 INFO  (TEST-TestReplicationHandler.doTestDetails-seed#[398BDAFA08197A52]) [    ] o.a.s.c.CorePropertiesLocator Found 1 core definitions
   [junit4]   2> 1019466 INFO  (coreLoadExecutor-2978-thread-1) [    ] o.a.s.c.SolrResourceLoader new SolrResourceLoader for directory: '/home/jenkins/workspace/Lucene-Solr-trunk-Linux/solr/build/solr-core/test/J1/temp/solr.handler.TestReplicationHandler_398BDAFA08197A52-001/solr-instance-001/collection1'
   [junit4]   2> 1019466 INFO  (TEST-TestReplicationHandler.doTestDetails-seed#[398BDAFA08197A52]) [    ] o.a.s.s.SolrDispatchFilter user.dir=/home/jenkins/workspace/Lucene-Solr-trunk-Linux/solr/build/solr-core/test/J1
   [junit4]   2> 1019466 INFO  (TEST-TestReplicationHandler.doTestDetails-seed#[398BDAFA08197A52]) [    ] o.a.s.s.SolrDispatchFilter SolrDispatchFilter.init() done
   [junit4]   2> 1019466 INFO  (coreLoadExecutor-2978-thread-1) [    ] o.a.s.c.SolrResourceLoader JNDI not configured for solr (NoInitialContextEx)
   [junit4]   2> 1019466 INFO  (coreLoadExecutor-2978-thread-1) [    ] o.a.s.c.SolrResourceLoader solr home defaulted to 'solr/' (could not find system property or JNDI)
   [junit4]   2> 1019473 INFO  (coreLoadExecutor-2978-thread-1) [    ] o.a.s.c.SolrConfig current version of requestparams : -1
   [junit4]   2> 1019483 INFO  (coreLoadExecutor-2978-thread-1) [    ] o.a.s.c.SolrConfig Using Lucene MatchVersion: 6.0.0
   [junit4]   2> 1019498 INFO  (coreLoadExecutor-2978-thread-1) [    ] o.a.s.c.SolrConfig Loaded SolrConfig: solrconfig.xml
   [junit4]   2> 1019501 INFO  (coreLoadExecutor-2978-thread-1) [    ] o.a.s.s.IndexSchema [collection1] Schema name=test
   [junit4]   2> 1019504 INFO  (coreLoadExecutor-2978-thread-1) [    ] o.a.s.s.IndexSchema unique key field: id
   [junit4]   2> 1019505 INFO  (coreLoadExecutor-2978-thread-1) [    ] o.a.s.c.ConfigSetProperties Did not find ConfigSet properties, assuming default properties: Can't find resource 'configsetprops.json' in classpath or '/home/jenkins/workspace/Lucene-Solr-trunk-Linux/solr/build/solr-core/test/J1/temp/solr.handler.TestReplicationHandler_398BDAFA08197A52-001/solr-instance-001/collection1'
   [junit4]   2> 1019505 INFO  (coreLoadExecutor-2978-thread-1) [    ] o.a.s.c.CoreContainer Creating SolrCore 'collection1' using configuration from instancedir /home/jenkins/workspace/Lucene-Solr-trunk-Linux/solr/build/solr-core/test/J1/temp/solr.handler.TestReplicationHandler_398BDAFA08197A52-001/solr-instance-001/./collection1
   [junit4]   2> 1019506 INFO  (coreLoadExecutor-2978-thread-1) [    ] o.a.s.c.SolrCore org.apache.solr.core.MockDirectoryFactory
   [junit4]   2> 1019506 INFO  (coreLoadExecutor-2978-thread-1) [    ] o.a.s.c.SolrCore [[collection1] ] Opening new SolrCore at [/home/jenkins/workspace/Lucene-Solr-trunk-Linux/solr/build/solr-core/test/J1/temp/solr.handler.TestReplicationHandler_398BDAFA08197A52-001/solr-instance-001/collection1], dataDir=[/home/jenkins/workspace/Lucene-Solr-trunk-Linux/solr/build/solr-core/test/J1/temp/solr.handler.TestReplicationHandler_398BDAFA08197A52-001/solr-instance-001/./collection1/data/]
   [junit4]   2> 1019506 INFO  (coreLoadExecutor-2978-thread-1) [    ] o.a.s.c.SolrCore JMX monitoring not detected for core: collection1
   [junit4]   2> 1019506 INFO  (coreLoadExecutor-2978-thread-1) [    ] o.a.s.c.CachingDirectoryFactory return new directory for /home/jenkins/workspace/Lucene-Solr-trunk-Linux/solr/build/solr-core/test/J1/temp/solr.handler.TestReplicationHandler_398BDAFA08197A52-001/solr-instance-001/./collection1/data
   [junit4]   2> 1019506 INFO  (coreLoadExecutor-2978-thread-1) [    ] o.a.s.c.SolrCore New index directory detected: old=null new=/home/jenkins/workspace/Lucene-Solr-trunk-Linux/solr/build/solr-core/test/J1/temp/solr.handler.TestReplicationHandler_398BDAFA08197A52-001/solr-instance-001/./collection1/data/index/
   [junit4]   2> 1019506 WARN  (coreLoadExecutor-2978-thread-1) [    ] o.a.s.c.SolrCore [collection1] Solr index directory '/home/jenkins/workspace/Lucene-Solr-trunk-Linux/solr/build/solr-core/test/J1/temp/solr.handler.TestReplicationHandler_398BDAFA08197A52-001/solr-instance-001/./collection1/data/index' doesn't exist. Creating new index...
   [junit4]   2> 1019507 INFO  (coreLoadExecutor-2978-thread-1) [    ] o.a.s.c.CachingDirectoryFactory return new directory for /home/jenkins/workspace/Lucene-Solr-trunk-Linux/solr/build/solr-core/test/J1/temp/solr.handler.TestReplicationHandler_398BDAFA08197A52-001/solr-instance-001/./collection1/data/index
   [junit4]   2> 1019507 INFO  (coreLoadExecutor-2978-thread-1) [    ] o.a.s.u.RandomMergePolicy RandomMergePolicy wrapping class org.apache.lucene.index.TieredMergePolicy: [TieredMergePolicy: maxMergeAtOnce=30, maxMergeAtOnceExplicit=12, maxMergedSegmentMB=0.6103515625, floorSegmentMB=0.6337890625, forceMergeDeletesPctAllowed=6.47055123689521, segmentsPerTier=41.0, maxCFSSegmentSizeMB=8.796093022207999E12, noCFSRatio=0.0
   [junit4]   2> 1019508 INFO  (coreLoadExecutor-2978-thread-1) [    ] o.a.s.c.SolrDeletionPolicy SolrDeletionPolicy.onCommit: commits: num=1
   [junit4]   2> 	commit{dir=MockDirectoryWrapper(RAMDirectory@1eb5b5b lockFactory=org.apache.lucene.store.SingleInstanceLockFactory@7bd4fd),segFN=segments_1,generation=1}
   [junit4]   2> 1019508 INFO  (coreLoadExecutor-2978-thread-1) [    ] o.a.s.c.SolrDeletionPolicy newest commit generation = 1
   [junit4]   2> 1019508 INFO  (OldIndexDirectoryCleanupThreadForCore-collection1) [    ] o.a.s.c.SolrCore Looking for old index directories to cleanup for core collection1 in /home/jenkins/workspace/Lucene-Solr-trunk-Linux/solr/build/solr-core/test/J1/temp/solr.handler.TestReplicationHandler_398BDAFA08197A52-001/solr-instance-001/./collection1/data/
   [junit4]   2> 1019509 INFO  (coreLoadExecutor-2978-thread-1) [    ] o.a.s.c.SolrCore no updateRequestProcessorChain defined as default, creating implicit default
   [junit4]   2> 1019510 INFO  (coreLoadExecutor-2978-thread-1) [    ] o.a.s.h.l.XMLLoader xsltCacheLifetimeSeconds=60
   [junit4]   2> 1019511 INFO  (coreLoadExecutor-2978-thread-1) [    ] o.a.s.h.l.XMLLoader xsltCacheLifetimeSeconds=60
   [junit4]   2> 1019512 INFO  (coreLoadExecutor-2978-thread-1) [    ] o.a.s.h.l.XMLLoader xsltCacheLifetimeSeconds=60
   [junit4]   2> 1019512 INFO  (coreLoadExecutor-2978-thread-1) [    ] o.a.s.h.l.XMLLoader xsltCacheLifetimeSeconds=60
   [junit4]   2> 1019516 INFO  (coreLoadExecutor-2978-thread-1) [    ] o.a.s.c.PluginBag requestHandler : 'lazy' created with startup=lazy 
   [junit4]   2> 1019516 INFO  (coreLoadExecutor-2978-thread-1) [    ] o.a.s.c.RequestHandlers Registered paths: /admin/mbeans,standard,lazy,/update/json/docs,/admin/luke,/export,/get,/admin/properties,/update/json,/admin/threads,/update/csv,/sql,/admin/segments,/admin/system,/replication,defaults,/config,/stream,/schema,/admin/plugins,/admin/logging,/admin/ping,/update,/admin/file
   [junit4]   2> 1019516 INFO  (coreLoadExecutor-2978-thread-1) [    ] o.a.s.c.SolrCore Using default statsCache cache: org.apache.solr.search.stats.LocalStatsCache
   [junit4]   2> 1019517 INFO  (coreLoadExecutor-2978-thread-1) [    ] o.a.s.u.CommitTracker Hard AutoCommit: disabled
   [junit4]   2> 1019517 INFO  (coreLoadExecutor-2978-thread-1) [    ] o.a.s.u.CommitTracker Soft AutoCommit: disabled
   [junit4]   2> 1019517 INFO  (coreLoadExecutor-2978-thread-1) [    ] o.a.s.u.RandomMergePolicy RandomMergePolicy wrapping class org.apache.lucene.index.TieredMergePolicy: [TieredMergePolicy: maxMergeAtOnce=20, maxMergeAtOnceExplicit=34, maxMergedSegmentMB=39.40625, floorSegmentMB=2.1103515625, forceMergeDeletesPctAllowed=14.34135401036879, segmentsPerTier=23.0, maxCFSSegmentSizeMB=8.796093022207999E12, noCFSRatio=0.36826825463528656
   [junit4]   2> 1019517 INFO  (coreLoadExecutor-2978-thread-1) [    ] o.a.s.c.SolrDeletionPolicy SolrDeletionPolicy.onInit: commits: num=1
   [junit4]   2> 	commit{dir=MockDirectoryWrapper(RAMDirectory@1eb5b5b lockFactory=org.apache.lucene.store.SingleInstanceLockFactory@7bd4fd),segFN=segments_1,generation=1}
   [junit4]   2> 1019517 INFO  (coreLoadExecutor-2978-thread-1) [    ] o.a.s.c.SolrDeletionPolicy newest commit generation = 1
   [junit4]   2> 1019517 INFO  (coreLoadExecutor-2978-thread-1) [    ] o.a.s.s.SolrIndexSearcher Opening [Searcher@1fb96f[collection1] main]
   [junit4]   2> 1019517 INFO  (coreLoadExecutor-2978-thread-1) [    ] o.a.s.r.ManagedResourceStorage File-based storage initialized to use dir: /home/jenkins/workspace/Lucene-Solr-trunk-Linux/solr/build/solr-core/test/J1/temp/solr.handler.TestReplicationHandler_398BDAFA08197A52-001/solr-instance-001/collection1/conf
   [junit4]   2> 1019517 INFO  (coreLoadExecutor-2978-thread-1) [    ] o.a.s.r.RestManager Initializing RestManager with initArgs: {storageDir=/home/jenkins/workspace/Lucene-Solr-trunk-Linux/solr/build/solr-core/test/J1/temp/solr.handler.TestReplicationHandler_398BDAFA08197A52-001/solr-instance-001/collection1/conf}
   [junit4]   2> 1019517 INFO  (coreLoadExecutor-2978-thread-1) [    ] o.a.s.r.ManagedResourceStorage Reading _rest_managed.json using file:dir=/home/jenkins/workspace/Lucene-Solr-trunk-Linux/solr/build/solr-core/test/J1/temp/solr.handler.TestReplicationHandler_398BDAFA08197A52-001/solr-instance-001/collection1/conf
   [junit4]   2> 1019518 INFO  (coreLoadExecutor-2978-thread-1) [    ] o.a.s.r.RestManager Initializing 0 registered ManagedResources
   [junit4]   2> 1019518 INFO  (coreLoadExecutor-2978-thread-1) [    ] o.a.s.h.ReplicationHandler Replication enabled for following config files: schema.xml,xslt/dummy.xsl
   [junit4]   2> 1019518 INFO  (coreLoadExecutor-2978-thread-1) [    ] o.a.s.h.ReplicationHandler Commits will be reserved for  10000
   [junit4]   2> 1019518 INFO  (searcherExecutor-2979-thread-1) [    ] o.a.s.c.SolrCore [collection1] Registered new searcher Searcher@1fb96f[collection1] main{ExitableDirectoryReader(UninvertingDirectoryReader())}
   [junit4]   2> 1019518 INFO  (coreLoadExecutor-2978-thread-1) [    ] o.a.s.c.CoreContainer registering core: collection1
   [junit4]   2> 1019967 INFO  (TEST-TestReplicationHandler.doTestDetails-seed#[398BDAFA08197A52]) [    ] o.a.s.SolrTestCaseJ4 Writing core.properties file to /home/jenkins/workspace/Lucene-Solr-trunk-Linux/solr/build/solr-core/test/J1/temp/solr.handler.TestReplicationHandler_398BDAFA08197A52-001/solr-instance-002/collection1
   [junit4]   2> 1019969 INFO  (TEST-TestReplicationHandler.doTestDetails-seed#[398BDAFA08197A52]) [    ] o.e.j.s.Server jetty-9.2.13.v20150730
   [junit4]   2> 1019970 INFO  (TEST-TestReplicationHandler.doTestDetails-seed#[398BDAFA08197A52]) [    ] o.e.j.s.h.ContextHandler Started o.e.j.s.ServletContextHandler@cb8d32{/solr,null,AVAILABLE}
   [junit4]   2> 1019971 INFO  (TEST-TestReplicationHandler.doTestDetails-seed#[398BDAFA08197A52]) [    ] o.e.j.s.ServerConnector Started ServerConnector@7aee59{HTTP/1.1}{127.0.0.1:53428}
   [junit4]   2> 1019971 INFO  (TEST-TestReplicationHandler.doTestDetails-seed#[398BDAFA08197A52]) [    ] o.e.j.s.Server Started @1021126ms
   [junit4]   2> 1019971 INFO  (TEST-TestReplicationHandler.doTestDetails-seed#[398BDAFA08197A52]) [    ] o.a.s.c.s.e.JettySolrRunner Jetty properties: {solr.data.dir=/home/jenkins/workspace/Lucene-Solr-trunk-Linux/solr/build/solr-core/test/J1/temp/solr.handler.TestReplicationHandler_398BDAFA08197A52-001/solr-instance-002/collection1/data, hostContext=/solr, hostPort=53428}
   [junit4]   2> 1019971 INFO  (TEST-TestReplicationHandler.doTestDetails-seed#[398BDAFA08197A52]) [    ] o.a.s.s.SolrDispatchFilter SolrDispatchFilter.init(): sun.misc.Launcher$AppClassLoader@1eb6432
   [junit4]   2> 1019971 INFO  (TEST-TestReplicationHandler.doTestDetails-seed#[398BDAFA08197A52]) [    ] o.a.s.c.SolrResourceLoader new SolrResourceLoader for directory: '/home/jenkins/workspace/Lucene-Solr-trunk-Linux/solr/build/solr-core/test/J1/temp/solr.handler.TestReplicationHandler_398BDAFA08197A52-001/solr-instance-002'
   [junit4]   2> 1019971 INFO  (TEST-TestReplicationHandler.doTestDetails-seed#[398BDAFA08197A52]) [    ] o.a.s.c.SolrResourceLoader JNDI not configured for solr (NoInitialContextEx)
   [junit4]   2> 1019971 INFO  (TEST-TestReplicationHandler.doTestDetails-seed#[398BDAFA08197A52]) [    ] o.a.s.c.SolrResourceLoader solr home defaulted to 'solr/' (could not find system property or JNDI)
   [junit4]   2> 1019972 INFO  (TEST-TestReplicationHandler.doTestDetails-seed#[398BDAFA08197A52]) [    ] o.a.s.c.SolrXmlConfig Loading container configuration from /home/jenkins/workspace/Lucene-Solr-trunk-Linux/solr/build/solr-core/test/J1/temp/solr.handler.TestReplicationHandler_398BDAFA08197A52-001/solr-instance-002/solr.xml
   [junit4]   2> 1019975 INFO  (TEST-TestReplicationHandler.doTestDetails-seed#[398BDAFA08197A52]) [    ] o.a.s.c.CorePropertiesLocator Config-defined core root directory: /home/jenkins/workspace/Lucene-Solr-trunk-Linux/solr/build/solr-core/test/J1/temp/solr.handler.TestReplicationHandler_398BDAFA08197A52-001/solr-instance-002/.
   [junit4]   2> 1019975 INFO  (TEST-TestReplicationHandler.doTestDetails-seed#[398BDAFA08197A52]) [    ] o.a.s.c.CoreContainer New CoreContainer 8816860
   [junit4]   2> 1019976 INFO  (TEST-TestReplicationHandler.doTestDetails-seed#[398BDAFA08197A52]) [    ] o.a.s.c.CoreContainer Loading cores into CoreContainer [instanceDir=/home/jenkins/workspace/Lucene-Solr-trunk-Linux/solr/build/solr-core/test/J1/temp/solr.handler.TestReplicationHandler_398BDAFA08197A52-001/solr-instance-002]
   [junit4]   2> 1019976 WARN  (TEST-TestReplicationHandler.doTestDetails-seed#[398BDAFA08197A52]) [    ] o.a.s.c.CoreContainer Couldn't add files from /home/jenkins/workspace/Lucene-Solr-trunk-Linux/solr/build/solr-core/test/J1/temp/solr.handler.TestReplicationHandler_398BDAFA08197A52-001/solr-instance-002/lib to classpath: /home/jenkins/workspace/Lucene-Solr-trunk-Linux/solr/build/solr-core/test/J1/temp/solr.handler.TestReplicationHandler_398BDAFA08197A52-001/solr-instance-002/lib
   [junit4]   2> 1019976 INFO  (TEST-TestReplicationHandler.doTestDetails-seed#[398BDAFA08197A52]) [    ] o.a.s.h.c.HttpShardHandlerFactory created with socketTimeout : 90000,urlScheme : ,connTimeout : 15000,maxConnectionsPerHost : 20,maxConnections : 10000,corePoolSize : 0,maximumPoolSize : 2147483647,maxThreadIdleTime : 5,sizeOfQueue : -1,fairnessPolicy : false,useRetries : false,
   [junit4]   2> 1019977 INFO  (TEST-TestReplicationHandler.doTestDetails-seed#[398BDAFA08197A52]) [    ] o.a.s.u.UpdateShardHandler Creating UpdateShardHandler HTTP client with params: socketTimeout=340000&connTimeout=45000&retry=true
   [junit4]   2> 1019977 INFO  (TEST-TestReplicationHandler.doTestDetails-seed#[398BDAFA08197A52]) [    ] o.a.s.l.LogWatcher SLF4J impl is org.slf4j.impl.Log4jLoggerFactory
   [junit4]   2> 1019977 INFO  (TEST-TestReplicationHandler.doTestDetails-seed#[398BDAFA08197A52]) [    ] o.a.s.l.LogWatcher Registering Log Listener [Log4j (org.slf4j.impl.Log4jLoggerFactory)]
   [junit4]   2> 1019977 INFO  (TEST-TestReplicationHandler.doTestDetails-seed#[398BDAFA08197A52]) [    ] o.a.s.c.CoreContainer Security conf doesn't exist. Skipping setup for authorization module.
   [junit4]   2> 1019977 INFO  (TEST-TestReplicationHandler.doTestDetails-seed#[398BDAFA08197A52]) [    ] o.a.s.c.CoreContainer No authentication plugin used.
   [junit4]   2> 1019977 INFO  (TEST-TestReplicationHandler.doTestDetails-seed#[398BDAFA08197A52]) [    ] o.a.s.c.CorePropertiesLocator Looking for core definitions underneath /home/jenkins/workspace/Lucene-Solr-trunk-Linux/solr/build/solr-core/test/J1/temp/solr.handler.TestReplicationHandler_398BDAFA08197A52-001/solr-instance-002/.
   [junit4]   2> 1019978 INFO  (TEST-TestReplicationHandler.doTestDetails-seed#[398BDAFA08197A52]) [    ] o.a.s.c.CoreDescriptor Created CoreDescriptor: {name=collection1, config=solrconfig.xml, loadOnStartup=true, schema=schema.xml, configSetProperties=configsetprops.json, transient=false, dataDir=data/}
   [junit4]   2> 1019978 INFO  (TEST-TestReplicationHandler.doTestDetails-seed#[398BDAFA08197A52]) [    ] o.a.s.c.CorePropertiesLocator Found core collection1 in /home/jenkins/workspace/Lucene-Solr-trunk-Linux/solr/build/solr-core/test/J1/temp/solr.handler.TestReplicationHandler_398BDAFA08197A52-001/solr-instance-002/./collection1
   [junit4]   2> 1019978 INFO  (TEST-TestReplicationHandler.doTestDetails-seed#[398BDAFA08197A52]) [    ] o.a.s.c.CorePropertiesLocator Found 1 core definitions
   [junit4]   2> 1019979 INFO  (coreLoadExecutor-2988-thread-1) [    ] o.a.s.c.SolrResourceLoader new SolrResourceLoader for directory: '/home/jenkins/workspace/Lucene-Solr-trunk-Linux/solr/build/solr-core/test/J1/temp/solr.handler.TestReplicationHandler_398BDAFA08197A52-001/solr-instance-002/collection1'
   [junit4]   2> 1019979 INFO  (TEST-TestReplicationHandler.doTestDetails-seed#[398BDAFA08197A52]) [    ] o.a.s.s.SolrDispatchFilter user.dir=/home/jenkins/workspace/Lucene-Solr-trunk-Linux/solr/build/solr-core/test/J1
   [junit4]   2> 1019979 INFO  (TEST-TestReplicationHandler.doTestDetails-seed#[398BDAFA08197A52]) [    ] o.a.s.s.SolrDispatchFilter SolrDispatchFilter.init() done
   [junit4]   2> 1019979 INFO  (coreLoadExecutor-2988-thread-1) [    ] o.a.s.c.SolrResourceLoader JNDI not configured for solr (NoInitialContextEx)
   [junit4]   2> 1019979 INFO  (coreLoadExecutor-2988-thread-1) [    ] o.a.s.c.SolrResourceLoader solr home defaulted to 'solr/' (could not find system property or JNDI)
   [junit4]   2> 1019984 INFO  (coreLoadExecutor-2988-thread-1) [    ] o.a.s.c.SolrConfig current version of requestparams : -1
   [junit4]   2> 1019987 INFO  (coreLoadExecutor-2988-thread-1) [    ] o.a.s.c.SolrConfig Using Lucene MatchVersion: 6.0.0
   [junit4]   2> 1019992 INFO  (coreLoadExecutor-2988-thread-1) [    ] o.a.s.c.SolrConfig Loaded SolrConfig: solrconfig.xml
   [junit4]   2> 1019994 INFO  (coreLoadExecutor-2988-thread-1) [    ] o.a.s.s.IndexSchema [collection1] Schema name=test
   [junit4]   2> 1019996 INFO  (coreLoadExecutor-2988-thread-1) [    ] o.a.s.s.IndexSchema unique key field: id
   [junit4]   2> 1019997 INFO  (coreLoadExecutor-2988-thread-1) [    ] o.a.s.c.ConfigSetProperties Did not find ConfigSet properties, assuming default properties: Can't find resource 'configsetprops.json' in classpath or '/home/jenkins/workspace/Lucene-Solr-trunk-Linux/solr/build/solr-core/test/J1/temp/solr.handler.TestReplicationHandler_398BDAFA08197A52-001/solr-instance-002/collection1'
   [junit4]   2> 1019997 INFO  (coreLoadExecutor-2988-thread-1) [    ] o.a.s.c.CoreContainer Creating SolrCore 'collection1' using configuration from instancedir /home/jenkins/workspace/Lucene-Solr-trunk-Linux/solr/build/solr-core/test/J1/temp/solr.handler.TestReplicationHandler_398BDAFA08197A52-001/solr-instance-002/./collection1
   [junit4]   2> 1019998 INFO  (coreLoadExecutor-2988-thread-1) [    ] o.a.s.c.SolrCore org.apache.solr.core.MockDirectoryFactory
   [junit4]   2> 1019998 INFO  (coreLoadExecutor-2988-thread-1) [    ] o.a.s.c.SolrCore [[collection1] ] Opening new SolrCore at [/home/jenkins/workspace/Lucene-Solr-trunk-Linux/solr/build/solr-core/test/J1/temp/solr.handler.TestReplicationHandler_398BDAFA08197A52-001/solr-instance-002/collection1], dataDir=[/home/jenkins/workspace/Lucene-Solr-trunk-Linux/solr/build/solr-core/test/J1/temp/solr.handler.TestReplicationHandler_398BDAFA08197A52-001/solr-instance-002/./collection1/data/]
   [junit4]   2> 1019998 INFO  (coreLoadExecutor-2988-thread-1) [    ] o.a.s.c.SolrCore JMX monitoring not detected for core: collection1
   [junit4]   2> 1019998 INFO  (coreLoadExecutor-2988-thread-1) [    ] o.a.s.c.CachingDirectoryFactory return new directory for /home/jenkins/workspace/Lucene-Solr-trunk-Linux/solr/build/solr-core/test/J1/temp/solr.handler.TestReplicationHandler_398BDAFA08197A52-001/solr-instance-002/./collection1/data
   [junit4]   2> 1019998 INFO  (coreLoadExecutor-2988-thread-1) [    ] o.a.s.c.SolrCore New index directory detected: old=null new=/home/jenkins/workspace/Lucene-Solr-trunk-Linux/solr/build/solr-core/test/J1/temp/solr.handler.TestReplicationHandler_398BDAFA08197A52-001/solr-instance-002/./collection1/data/index/
   [junit4]   2> 1019998 WARN  (coreLoadExecutor-2988-thread-1) [    ] o.a.s.c.SolrCore [collection1] Solr index directory '/home/jenkins/workspace/Lucene-Solr-trunk-Linux/solr/build/solr-core/test/J1/temp/solr.handler.TestReplicationHandler_398BDAFA08197A52-001/solr-instance-002/./collection1/data/index' doesn't exist. Creating new index...
   [junit4]   2> 1019998 INFO  (coreLoadExecutor-2988-thread-1) [    ] o.a.s.c.CachingDirectoryFactory return new directory for /home/jenkins/workspace/Lucene-Solr-trunk-Linux/solr/build/solr-core/test/J1/temp/solr.handler.TestReplicationHandler_398BDAFA08197A52-001/solr-instance-002/./collection1/data/index
   [junit4]   2> 1019999 INFO  (coreLoadExecutor-2988-thread-1) [    ] o.a.s.u.RandomMergePolicy RandomMergePolicy wrapping class org.apache.lucene.index.TieredMergePolicy: [TieredMergePolicy: maxMergeAtOnce=30, maxMergeAtOnceExplicit=12, maxMergedSegmentMB=0.6103515625, floorSegmentMB=0.6337890625, forceMergeDeletesPctAllowed=6.47055123689521, segmentsPerTier=41.0, maxCFSSegmentSizeMB=8.796093022207999E12, noCFSRatio=0.0
   [junit4]   2> 1019999 INFO  (coreLoadExecutor-2988-thread-1) [    ] o.a.s.c.SolrDeletionPolicy SolrDeletionPolicy.onCommit: commits: num=1
   [junit4]   2> 	commit{dir=MockDirectoryWrapper(RAMDirectory@1eb4671 lockFactory=org.apache.lucene.store.SingleInstanceLockFactory@2b0462),segFN=segments_1,generation=1}
   [junit4]   2> 1019999 INFO  (coreLoadExecutor-2988-thread-1) [    ] o.a.s.c.SolrDeletionPolicy newest commit generation = 1
   [junit4]   2> 1019999 INFO  (OldIndexDirectoryCleanupThreadForCore-collection1) [    ] o.a.s.c.SolrCore Looking for old index directories to cleanup for core collection1 in /home/jenkins/workspace/Lucene-Solr-trunk-Linux/solr/build/solr-core/test/J1/temp/solr.handler.TestReplicationHandler_398BDAFA08197A52-001/solr-instance-002/./collection1/data/
   [junit4]   2> 1020000 INFO  (coreLoadExecutor-2988-thread-1) [    ] o.a.s.c.SolrCore no updateRequestProcessorChain defined as default, creating implicit default
   [junit4]   2> 1020001 INFO  (coreLoadExecutor-2988-thread-1) [    ] o.a.s.h.l.XMLLoader xsltCacheLifetimeSeconds=60
   [junit4]   2> 1020002 INFO  (coreLoadExecutor-2988-thread-1) [    ] o.a.s.h.l.XMLLoader xsltCacheLifetimeSeconds=60
   [junit4]   2> 1020002 INFO  (coreLoadExecutor-2988-thread-1) [    ] o.a.s.h.l.XMLLoader xsltCacheLifetimeSeconds=60
   [junit4]   2> 1020003 INFO  (coreLoadExecutor-2988-thread-1) [    ] o.a.s.h.l.XMLLoader xsltCacheLifetimeSeconds=60
   [junit4]   2> 1020004 INFO  (coreLoadExecutor-2988-thread-1) [    ] o.a.s.c.PluginBag requestHandler : 'lazy' created with startup=lazy 
   [junit4]   2> 1020004 INFO  (coreLoadExecutor-2988-thread-1) [    ] o.a.s.c.RequestHandlers Registered paths: /admin/mbeans,standard,lazy,/update/json/docs,/admin/luke,/export,/get,/admin/properties,/update/json,/admin/threads,/update/csv,/sql,/admin/segments,/admin/system,/replication,defaults,/config,/stream,/schema,/admin/plugins,/admin/logging,/admin/ping,/update,/admin/file
   [junit4]   2> 1020004 INFO  (coreLoadExecutor-2988-thread-1) [    ] o.a.s.c.SolrCore Using default statsCache cache: org.apache.solr.search.stats.LocalStatsCache
   [junit4]   2> 1020005 INFO  (coreLoadExecutor-2988-thread-1) [    ] o.a.s.u.CommitTracker Hard AutoCommit: disabled
   [junit4]   2> 1020005 INFO  (coreLoadExecutor-2988-thread-1) [    ] o.a.s.u.CommitTracker Soft AutoCommit: disabled
   [junit4]   2> 1020005 INFO  (coreLoadExecutor-2988-thread-1) [    ] o.a.s.u.RandomMergePolicy RandomMergePolicy wrapping class org.apache.lucene.index.TieredMergePolicy: [TieredMergePolicy: maxMergeAtOnce=20, maxMergeAtOnceExplicit=34, maxMergedSegmentMB=39.40625, floorSegmentMB=2.1103515625, forceMergeDeletesPctAllowed=14.34135401036879, segmentsPerTier=23.0, maxCFSSegmentSizeMB=8.796093022207999E12, noCFSRatio=0.36826825463528656
   [junit4]   2> 1020005 INFO  (coreLoadExecutor-2988-thread-1) [    ] o.a.s.c.SolrDeletionPolicy SolrDeletionPolicy.onInit: commits: num=1
   [junit4]   2> 	commit{dir=MockDirectoryWrapper(RAMDirectory@1eb4671 lockFactory=org.apache.lucene.store.SingleInstanceLockFactory@2b0462),segFN=segments_1,generation=1}
   [junit4]   2> 1020005 INFO  (coreLoadExecutor-2988-thread-1) [    ] o.a.s.c.SolrDeletionPolicy newest commit generation = 1
   [junit4]   2> 1020005 INFO  (coreLoadExecutor-2988-thread-1) [    ] o.a.s.s.SolrIndexSearcher Opening [Searcher@21010a[collection1] main]
   [junit4]   2> 1020005 INFO  (coreLoadExecutor-2988-thread-1) [    ] o.a.s.r.ManagedResourceStorage File-based storage initialized to use dir: /home/jenkins/workspace/Lucene-Solr-trunk-Linux/solr/build/solr-core/test/J1/temp/solr.handler.TestReplicationHandler_398BDAFA08197A52-001/solr-instance-002/collection1/conf
   [junit4]   2> 1020005 INFO  (coreLoadExecutor-2988-thread-1) [    ] o.a.s.r.RestManager Initializing RestManager with initArgs: {storageDir=/home/jenkins/workspace/Lucene-Solr-trunk-Linux/solr/build/solr-core/test/J1/temp/solr.handler.TestReplicationHandler_398BDAFA08197A52-001/solr-instance-002/collection1/conf}
   [junit4]   2> 1020005 INFO  (coreLoadExecutor-2988-thread-1) [    ] o.a.s.r.ManagedResourceStorage Reading _rest_managed.json using file:dir=/home/jenkins/workspace/Lucene-Solr-trunk-Linux/solr/build/solr-core/test/J1/temp/solr.handler.TestReplicationHandler_398BDAFA08197A52-001/solr-instance-002/collection1/conf
   [junit4]   2> 1020006 INFO  (coreLoadExecutor-2988-thread-1) [    ] o.a.s.r.RestManager Initializing 0 registered ManagedResources
   [junit4]   2> 1020006 INFO  (coreLoadExecutor-2988-thread-1) [    ] o.a.s.h.ReplicationHandler Poll scheduled at an interval of 1000ms
   [junit4]   2> 1020007 INFO  (searcherExecutor-2989-thread-1) [    ] o.a.s.c.SolrCore [collection1] Registered new searcher Searcher@21010a[collection1] main{ExitableDirectoryReader(UninvertingDirectoryReader())}
   [junit4]   2> 1020007 INFO  (coreLoadExecutor-2988-thread-1) [    ] o.a.s.c.CoreContainer registering core: collection1
   [junit4]   2> 1020010 INFO  (qtp20638415-7234) [    ] o.a.s.c.S.Request [collection1]  webapp=/solr path=/replication params={qt=/replication&wt=javabin&version=2&command=indexversion} status=0 QTime=0
   [junit4]   2> 1020481 INFO  (qtp20638415-7235) [    ] o.a.s.c.S.Request [collection1]  webapp=/solr path=/select params={q=*:*&sort=id+desc&wt=javabin&version=2} hits=0 status=0 QTime=0
   [junit4]   2> 1020483 INFO  (qtp20638415-7236) [    ] o.a.s.c.S.Request [collection1]  webapp=/solr path=/replication params={_trace=getDetails&qt=/replication&wt=javabin&version=2&command=details} status=0 QTime=0
   [junit4]   2> 1020487 INFO  (qtp20638415-7234) [    ] o.a.s.c.S.Request [collection1]  webapp=/solr path=/replication params={slave=false&qt=/replication&wt=javabin&version=2&command=details} status=0 QTime=0
   [junit4]   2> 1020487 INFO  (qtp13266789-7252) [    ] o.a.s.c.S.Request [collection1]  webapp=/solr path=/replication params={_trace=getDetails&qt=/replication&wt=javabin&version=2&command=details} status=0 QTime=2
   [junit4]   2> 1020490 INFO  (qtp20638415-7235) [    ] o.a.s.u.p.LogUpdateProcessorFactory [collection1]  webapp=/solr path=/update params={wt=javabin&version=2}{add=[0]} 0 0
   [junit4]   2> 1020492 INFO  (qtp20638415-7236) [    ] o.a.s.u.DirectUpdateHandler2 start commit{,optimize=false,openSearcher=true,waitSearcher=true,expungeDeletes=false,softCommit=false,prepareCommit=false}
   [junit4]   2> 1020493 INFO  (qtp20638415-7236) [    ] o.a.s.c.SolrDeletionPolicy SolrDeletionPolicy.onCommit: commits: num=2
   [junit4]   2> 	commit{dir=MockDirectoryWrapper(RAMDirectory@1eb5b5b lockFactory=org.apache.lucene.store.SingleInstanceLockFactory@7bd4fd),segFN=segments_1,generation=1}
   [junit4]   2> 	commit{dir=MockDirectoryWrapper(RAMDirectory@1eb5b5b lockFactory=org.apache.lucene.store.SingleInstanceLockFactory@7bd4fd),segFN=segments_2,generation=2}
   [junit4]   2> 1020493 INFO  (qtp20638415-7236) [    ] o.a.s.c.SolrDeletionPolicy newest commit generation = 2
   [junit4]   2> 1020494 INFO  (qtp20638415-7236) [    ] o.a.s.s.SolrIndexSearcher Opening [Searcher@1926667[collection1] main]
   [junit4]   2> 1020494 INFO  (qtp20638415-7236) [    ] o.a.s.u.DirectUpdateHandler2 end_commit_flush
   [junit4]   2> 1020494 INFO  (searcherExecutor-2979-thread-1) [    ] o.a.s.c.SolrCore [collection1] Registered new searcher Searcher@1926667[collection1] main{ExitableDirectoryReader(UninvertingDirectoryReader(Uninverting(_0(6.0.0):C1)))}
   [junit4]   2> 1020495 INFO  (qtp20638415-7236) [    ] o.a.s.u.p.LogUpdateProcessorFactory [collection1]  webapp=/solr path=/update params={waitSearcher=true&commit=true&softCommit=false&wt=javabin&version=2}{commit=} 0 2
   [junit4]   2> 1020497 WARN  (explicit-fetchindex-cmd) [    ] o.a.s.h.IndexFetcher 'masterUrl' must be specified without the /replication suffix
   [junit4]   2> 1020499 INFO  (qtp20638415-7234) [    ] o.a.s.c.S.Request [collection1]  webapp=/solr path=/replication params={qt=/replication&wt=javabin&version=2&command=indexversion} status=0 QTime=0
   [junit4]   2> 1020499 INFO  (explicit-fetchindex-cmd) [    ] o.a.s.h.IndexFetcher Master's generation: 2
   [junit4]   2> 1020499 INFO  (explicit-fetchindex-cmd) [    ] o.a.s.h.IndexFetcher Slave's generation: 1
   [junit4]   2> 1020499 INFO  (explicit-fetchindex-cmd) [    ] o.a.s.h.IndexFetcher Starting replication process
   [junit4]   2> 1020502 INFO  (qtp20638415-7235) [    ] o.a.s.c.S.Request [collection1]  webapp=/solr path=/replication params={generation=2&qt=/replication&wt=javabin&version=2&command=filelist} status=0 QTime=0
   [junit4]   2> 1020502 INFO  (explicit-fetchindex-cmd) [    ] o.a.s.h.IndexFetcher Number of files in latest index in master: 10
   [junit4]   2> 1020502 INFO  (explicit-fetchindex-cmd) [    ] o.a.s.c.CachingDirectoryFactory return new directory for /home/jenkins/workspace/Lucene-Solr-trunk-Linux/solr/build/solr-core/test/J1/temp/solr.handler.TestReplicationHandler_398BDAFA08197A52-001/solr-instance-002/./collection1/data/index.20160111132608978
   [junit4]   2> 1020502 INFO  (explicit-fetchindex-cmd) [    ] o.a.s.u.DefaultSolrCoreState Rollback old IndexWriter... core=collection1
   [junit4]   2> 1020503 INFO  (explicit-fetchindex-cmd) [    ] o.a.s.u.RandomMergePolicy RandomMergePolicy wrapping class org.apache.lucene.index.AlcoholicMergePolicy: [AlcoholicMergePolicy: minMergeSize=0, mergeFactor=10, maxMergeSize=725521630, maxMergeSizeForForcedMerge=9223372036854775807, calibrateSizeByDeletes=true, maxMergeDocs=2147483647, maxCFSSegmentSizeMB=8.796093022207999E12, noCFSRatio=0.1]
   [junit4]   2> 1020503 INFO  (explicit-fetchindex-cmd) [    ] o.a.s.c.SolrDeletionPolicy SolrDeletionPolicy.onInit: commits: num=1
   [junit4]   2> 	commit{dir=MockDirectoryWrapper(RAMDirectory@1eb4671 lockFactory=org.apache.lucene.store.SingleInstanceLockFactory@2b0462),segFN=segments_1,generation=1}
   [junit4]   2> 1020503 INFO  (explicit-fetchindex-cmd) [    ] o.a.s.c.SolrDeletionPolicy newest commit generation = 1
   [junit4]   2> 1020503 INFO  (explicit-fetchindex-cmd) [    ] o.a.s.u.DefaultSolrCoreState New IndexWriter is ready to be used.
   [junit4]   2> 1020503 INFO  (explicit-fetchindex-cmd) [    ] o.a.s.c.SolrDeletionPolicy SolrDeletionPolicy.onCommit: commits: num=1
   [junit4]   2> 	commit{dir=MockDirectoryWrapper(RAMDirectory@1eb4671 lockFactory=org.apache.lucene.store.SingleInstanceLockFactory@2b0462),segFN=segments_1,generation=1}
   [junit4]   2> 1020503 INFO  (explicit-fetchindex-cmd) [    ] o.a.s.c.SolrDeletionPolicy newest commit generation = 1
   [junit4]   2> 1020503 INFO  (explicit-fetchindex-cmd) [    ] o.a.s.u.DefaultSolrCoreState Rollback old IndexWriter... core=collection1
   [junit4]   2> 1020503 INFO  (explicit-fetchindex-cmd) [    ] o.a.s.h.IndexFetcher Starting download (fullCopy=false) to MockDirectoryWrapper(RAMDirectory@17e2040 lockFactory=org.apache.lucene.store.SingleInstanceLockFactory@6e745a)
   [junit4]   2> 1020505 INFO  (qtp20638415-7236) [    ] o.a.s.c.S.Request [collection1]  webapp=/solr path=/replication params={generation=2&qt=/replication&file=_0.si&checksum=true&wt=filestream&command=filecontent} status=0 QTime=0
   [junit4]   2> 1020507 INFO  (qtp20638415-7234) [    ] o.a.s.c.S.Request [collection1]  webapp=/solr path=/replication params={generation=2&qt=/replication&file=_0_Lucene50_0.doc&checksum=true&wt=filestream&command=filecontent} status=0 QTime=0
   [junit4]   2> 1020509 INFO  (qtp20638415-7235) [    ] o.a.s.c.S.Request [collection1]  webapp=/solr path=/replication params={generation=2&qt=/replication&file=_0_Lucene50_0.tim&checksum=true&wt=filestream&command=filecontent} status=0 QTime=0
   [junit4]   2> 1020511 INFO  (qtp20638415-7236) [    ] o.a.s.c.S.Request [collection1]  webapp=/solr path=/replication params={generation=2&qt=/replication&file=_0.nvd&checksum=true&wt=filestream&command=filecontent} status=0 QTime=0
   [junit4]   2> 1020513 INFO  (qtp20638415-7234) [    ] o.a.s.c.S.Request [collection1]  webapp=/solr path=/replication params={generation=2&qt=/replication&file=_0.fdx&checksum=true&wt=filestream&command=filecontent} status=0 QTime=0
   [junit4]   2> 1020515 INFO  (qtp20638415-7235) [    ] o.a.s.c.S.Request [collection1]  webapp=/solr path=/replication params={generation=2&qt=/replication&file=_0_Lucene50_0.tip&checksum=true&wt=filestream&command=filecontent} status=0 QTime=0
   [junit4]   2> 1020517 INFO  (qtp20638415-7236) [    ] o.a.s.c.S.Request [collection1]  webapp=/solr path=/replication params={generation=2&qt=/replication&file=_0.fdt&checksum=true&wt=filestream&command=filecontent} status=0 QTime=0
   [junit4]   2> 1020519 INFO  (qtp20638415-7234) [    ] o.a.s.c.S.Request [collection1]  webapp=/solr path=/replication params={generation=2&qt=/replication&file=_0.fnm&checksum=true&wt=filestream&command=filecontent} status=0 QTime=0
   [junit4]   2> 1020521 INFO  (qtp20638415-7235) [    ] o.a.s.c.S.Request [collection1]  webapp=/solr path=/replication params={generation=2&qt=/replication&file=_0.nvm&checksum=true&wt=filestream&command=filecontent} status=0 QTime=0
   [junit4]   2> 1020523 INFO  (qtp20638415-7236) [    ] o.a.s.c.S.Request [collection1]  webapp=/solr path=/replication params={generation=2&qt=/replication&file=segments_2&checksum=true&wt=filestream&command=filecontent} status=0 QTime=0
   [junit4]   2> 1020523 INFO  (explicit-fetchindex-cmd) [    ] o.a.s.h.IndexFetcher Total time taken for download (fullCopy=false,bytesDownloaded=1663) : 0 secs (null bytes/sec) to MockDirectoryWrapper(RAMDirectory@17e2040 lockFactory=org.apache.lucene.store.SingleInstanceLockFactory@6e745a)
   [junit4]   2> 1020524 INFO  (explicit-fetchindex-cmd) [    ] o.a.s.u.RandomMergePolicy RandomMergePolicy wrapping class org.apache.lucene.index.LogByteSizeMergePolicy: [LogByteSizeMergePolicy: minMergeSize=1677721, mergeFactor=34, maxMergeSize=2147483648, maxMergeSizeForForcedMerge=9223372036854775807, calibrateSizeByDeletes=true, maxMergeDocs=2147483647, maxCFSSegmentSizeMB=8.796093022207999E12, noCFSRatio=1.0]
   [junit4]   2> 1020525 INFO  (explicit-fetchindex-cmd) [    ] o.a.s.c.SolrDeletionPolicy SolrDeletionPolicy.onInit: commits: num=2
   [junit4]   2> 	commit{dir=MockDirectoryWrapper(RAMDirectory@1eb4671 lockFactory=org.apache.lucene.store.SingleInstanceLockFactory@2b0462),segFN=segments_1,generation=1}
   [junit4]   2> 	commit{dir=MockDirectoryWrapper(RAMDirectory@1eb4671 lockFactory=org.apache.lucene.store.SingleInstanceLockFactory@2b0462),segFN=segments_2,generation=2}
   [junit4]   2> 1020525 INFO  (explicit-fetchindex-cmd) [    ] o.a.s.c.SolrDeletionPolicy newest commit generation = 2
   [junit4]   2> 1020525 INFO  (explicit-fetchindex-cmd) [    ] o.a.s.u.DefaultSolrCoreState New IndexWriter is ready to be used.
   [junit4]   2> 1020525 INFO  (explicit-fetchindex-cmd) [    ] o.a.s.s.SolrIndexSearcher Opening [Searcher@1ad7e00[collection1] main]
   [junit4]   2> 1020526 INFO  (searcherExecutor-2989-thread-1) [    ] o.a.s.c.SolrCore [collection1] Registered new searcher Searcher@1ad7e00[collection1] main{ExitableDirectoryReader(UninvertingDirectoryReader(Uninverting(_0(6.0.0):C1)))}
   [junit4]   2> 1020526 INFO  (explicit-fetchindex-cmd) [    ] o.a.s.c.CachingDirectoryFactory looking to close /home/jenkins/workspace/Lucene-Solr-trunk-Linux/solr/build/solr-core/test/J1/temp/solr.handler.TestReplicationHandler_398BDAFA08197A52-001/solr-instance-002/./collection1/data/index.20160111132608978 [CachedDir<<refCount=0;path=/home/jenkins/workspace/Lucene-Solr-trunk-Linux/solr/build/solr-core/test/J1/temp/solr.handler.TestReplicationHandler_398BDAFA08197A52-001/solr-instance-002/./collection1/data/index.20160111132608978;done=true>>]
   [junit4]   2> 1020526 INFO  (explicit-fetchindex-cmd) [    ] o.a.s.c.CachingDirectoryFactory Closing directory: /home/jenkins/workspace/Lucene-Solr-trunk-Linux/solr/build/solr-core/test/J1/temp/solr.handler.TestReplicationHandler_398BDAFA08197A52-001/solr-instance-002/./collection1/data/index.20160111132608978
   [junit4]   2> 1020526 INFO  (qtp13266789-7253) [    ] o.a.s.c.S.Request [collection1]  webapp=/solr path=/replication params={wait=true&masterUrl=http://127.0.0.1:54252/solr/collection1/replication&command=fetchindex} status=0 QTime=29
   [junit4]   2> 1020533 INFO  (qtp20638415-7234) [    ] o.a.s.c.S.Request [collection1]  webapp=/solr path=/replication params={slave=false&qt=/replication&wt=javabin&version=2&command=details} status=0 QTime=0
   [junit4]   2> 1020534 INFO  (qtp13266789-7254) [    ] o.a.s.c.S.Request [collection1]  webapp=/solr path=/replication params={_trace=getDetails&qt=/replication&wt=javabin&version=2&command=details} status=0 QTime=2
   [junit4]   2> 1020536 INFO  (qtp20638415-7235) [    ] o.a.s.u.p.LogUpdateProcessorFactory [collection1]  webapp=/solr path=/update params={wt=javabin&version=2}{add=[1]} 0 0
   [junit4]   2> 1020537 INFO  (qtp20638415-7236) [    ] o.a.s.u.DirectUpdateHandler2 start commit{,optimize=false,openSearcher=true,waitSearcher=true,expungeDeletes=false,softCommit=false,prepareCommit=false}
   [junit4]   2> 1020539 INFO  (qtp20638415-7236) [    ] o.a.s.c.SolrDeletionPolicy SolrDeletionPolicy.onCommit: commits: num=3
   [junit4]   2> 	commit{dir=MockDirectoryWrapper(RAMDirectory@1eb5b5b lockFactory=org.apache.lucene.store.SingleInstanceLockFactory@7bd4fd),segFN=segments_1,generation=1}
   [junit4]   2> 	commit{dir=MockDirectoryWrapper(RAMDirectory@1eb5b5b lockFactory=org.apache.lucene.store.SingleInstanceLockFactory@7bd4fd),segFN=segments_2,generation=2}
   [junit4]   2> 	commit{dir=MockDirectoryWrapper(RAMDirectory@1eb5b5b lockFactory=org.apache.lucene.store.SingleInstanceLockFactory@7bd4fd),segFN=segments_3,generation=3}
   [junit4]   2> 1020539 INFO  (qtp20638415-7236) [    ] o.a.s.c.SolrDeletionPolicy newest commit generation = 3
   [junit4]   2> 1020539 INFO  (qtp20638415-7236) [    ] o.a.s.s.SolrIndexSearcher Opening [Searcher@1facd16[collection1] main]
   [junit4]   2> 1020539 INFO  (qtp20638415-7236) [    ] o.a.s.u.DirectUpdateHandler2 end_commit_flush
   [junit4]   2> 1020539 INFO  (searcherExecutor-2979-thread-1) [    ] o.a.s.c.SolrCore [collection1] Registered new searcher Searcher@1facd16[collection1] main{ExitableDirectoryReader(UninvertingDirectoryReader(Uninverting(_0(6.0.0):C1) Uninverting(_1(6.0.0):C1)))}
   [junit4]   2> 1020540 INFO  (qtp20638415-7236) [    ] o.a.s.u.p.LogUpdateProcessorFactory [collection1]  webapp=/solr path=/update params={waitSearcher=true&commit=true&softCommit=false&wt=javabin&version=2}{commit=} 0 2
   [junit4]   2> 1020541 WARN  (explicit-fetchindex-cmd) [    ] o.a.s.h.IndexFetcher 'masterUrl' must be specified without the /replication suffix
   [junit4]   2> 1020543 INFO  (qtp20638415-7234) [    ] o.a.s.c.S.Request [collection1]  webapp=/solr path=/replication params={qt=/replication&wt=javabin&version=2&command=indexversion} status=0 QTime=0
   [junit4]   2> 1020543 INFO  (explicit-fetchindex-cmd) [    ] o.a.s.h.IndexFetcher Master's generation: 3
   [junit4]   2> 1020543 INFO  (explicit-fetchindex-cmd) [    ] o.a.s.h.IndexFetcher Slave's generation: 2
   [junit4]   2> 1020543 INFO  (explicit-fetchindex-cmd) [    ] o.a.s.h.IndexFetcher Starting replication process
   [junit4]   2> 1020545 INFO  (qtp20638415-7235) [    ] o.a.s.c.S.Request [collection1]  webapp=/solr path=/replication params={generation=3&qt=/replication&wt=javabin&version=2&command=filelist} status=0 QTime=0
   [junit4]   2> 1020546 INFO  (explicit-fetchindex-cmd) [    ] o.a.s.h.IndexFetcher Number of files in latest index in master: 19
   [junit4]   2> 1020546 INFO  (explicit-fetchindex-cmd) [    ] o.a.s.c.CachingDirectoryFactory return new directory for /home/jenkins/workspace/Lucene-Solr-trunk-Linux/solr/build/solr-core/test/J1/temp/solr.handler.TestReplicationHandler_398BDAFA08197A52-001/solr-instance-002/./collection1/data/index.20160111132609022
   [junit4]   2> 1020546 INFO  (explicit-fetchindex-cmd) [    ] o.a.s.u.DefaultSolrCoreState Rollback old IndexWriter... core=collection1
   [junit4]   2> 1020547 INFO  (explicit-fetchindex-cmd) [    ] o.a.s.u.RandomMergePolicy RandomMergePolicy wrapping class org.apache.lucene.index.AlcoholicMergePolicy: [AlcoholicMergePolicy: minMergeSize=0, mergeFactor=10, maxMergeSize=725521630, maxMergeSizeForForcedMerge=9223372036854775807, calibrateSizeByDeletes=true, maxMergeDocs=2147483647, maxCFSSegmentSizeMB=8.796093022207999E12, noCFSRatio=0.1]
   [junit4]   2> 1020548 INFO  (explicit-fetchindex-cmd) [    ] o.a.s.c.SolrDeletionPolicy SolrDeletionPolicy.onInit: commits: num=1
   [junit4]   2> 	commit{dir=MockDirectoryWrapper(RAMDirectory@1eb4671 lockFactory=org.apache.lucene.store.SingleInstanceLockFactory@2b0462),segFN=segments_2,generation=2}
   [junit4]   2> 1020548 INFO  (explicit-fetchindex-cmd) [    ] o.a.s.c.SolrDeletionPolicy newest commit generation = 2
   [junit4]   2> 1020548 INFO  (explicit-fetchindex-cmd) [    ] o.a.s.u.DefaultSolrCoreState New IndexWriter is ready to be used.
   [junit4]   2> 1020548 INFO  (explicit-fetchindex-cmd) [    ] o.a.s.c.SolrDeletionPolicy SolrDeletionPolicy.onCommit: commits: num=1
   [junit4]   2> 	commit{dir=MockDirectoryWrapper(RAMDirectory@1eb4671 lockFactory=org.apache.lucene.store.SingleInstanceLockFactory@2b0462),segFN=segments_2,generation=2}
   [junit4]   2> 1020548 INFO  (explicit-fetchindex-cmd) [    ] o.a.s.c.SolrDeletionPolicy newest commit generation = 2
   [junit4]   2> 1020548 INFO  (explicit-fetchindex-cmd) [    ] o.a.s.u.DefaultSolrCoreState Rollback old IndexWriter... core=collection1
   [junit4]   2> 1020548 INFO  (explicit-fetchindex-cmd) [    ] o.a.s.h.IndexFetcher Starting download (fullCopy=false) to MockDirectoryWrapper(RAMDirectory@142164 lockFactory=org.apache.lucene.store.SingleInstanceLockFactory@1dd805f)
   [junit4]   2> 1020548 INFO  (explicit-fetchindex-cmd) [    ] o.a.s.h.IndexFetcher Skipping download for _0.si because it already exists
   [junit4]   2> 1020548 INFO  (explicit-fetchindex-cmd) [    ] o.a.s.h.IndexFetcher Skipping download for _0_Lucene50_0.doc because it already exists
   [junit4]   2> 1020548 INFO  (explicit-fetchindex-cmd) [    ] o.a.s.h.IndexFetcher Skipping download for _0_Lucene50_0.tim because it already exists
   [junit4]   2> 1020548 INFO  (explicit-fetchindex-cmd) [    ] o.a.s.h.IndexFetcher Skipping download for _0.nvd because it already exists
   [junit4]   2> 1020548 INFO  (explicit-fetchindex-cmd) [    ] o.a.s.h.IndexFetcher Skipping download for _0.fdx because it already exists
   [junit4]   2> 1020548 INFO  (explicit-fetchindex-cmd) [    ] o.a.s.h.IndexFetcher Skipping download for _0_Lucene50_0.tip because it already exists
   [junit4]   2> 1020549 INFO  (explicit-fetchindex-cmd) [    ] o.a.s.h.IndexFetcher Skipping download for _0.fdt because it already exists
   [junit4]   2> 1020549 INFO  (explicit-fetchindex-cmd) [    ] o.a.s.h.IndexFetcher Skipping download for _0.fnm because it already exists
   [junit4]   2> 1020549 INFO  (explicit-fetchindex-cmd) [    ] o.a.s.h.IndexFetcher Skipping download for _0.nvm because it already exists
   [junit4]   2> 1020550 INFO  (qtp20638415-7236) [    ] o.a.s.c.S.Request [collection1]  webapp=/solr path=/replication params={generation=3&qt=/replication&file=_1_Lucene50_0.doc&checksum=true&wt=filestream&command=filecontent} status=0 QTime=0
   [junit4]   2> 1020552 INFO  (qtp20638415-7234) [    ] o.a.s.c.S.Request [collection1]  webapp=/solr path=/replication params={generation=3&qt=/replication&file=_1_Lucene50_0.tim&checksum=true&wt=filestream&command=filecontent} status=0 QTime=0
   [junit4]   2> 1020554 INFO  (qtp20638415-7235) [    ] o.a.s.c.S.Request [collection1]  webapp=/solr path=/replication params={generation=3&qt=/replication&file=_1.si&checksum=true&wt=filestream&command=filecontent} status=0 QTime=0
   [junit4]   2> 1020556 INFO  (qtp20638415-7236) [    ] o.a.s.c.S.Request [collection1]  webapp=/solr path=/replication params={generation=3&qt=/replication&file=_1.nvd&checksum=true&wt=filestream&command=filecontent} status=0 QTime=0
   [junit4]   2> 1020558 INFO  (qtp20638415-7234) [    ] o.a.s.c.S.Request [collection1]  webapp=/solr path=/replication params={generation=3&qt=/replication&file=_1.fdx&checksum=true&wt=filestream&command=filecontent} status=0 QTime=0
   [junit4]   2> 1020560 INFO  (qtp20638415-7235) [    ] o.a.s.c.S.Request [collection1]  webapp=/solr path=/replication params={generation=3&qt=/replication&file=_1.fnm&checksum=true&wt=filestream&command=filecontent} status=0 QTime=0
   [junit4]   2> 1020561 INFO  (qtp20638415-7236) [    ] o.a.s.c.S.Request [collection1]  webapp=/solr path=/replication params={generation=3&qt=/replication&file=_1.nvm&checksum=true&wt=filestream&command=filecontent} status=0 QTime=0
   [junit4]   2> 1020563 INFO  (qtp20638415-7234) [    ] o.a.s.c.S.Request [collection1]  webapp=/solr path=/replication params={generation=3&qt=/replication&file=_1.fdt&checksum=true&wt=filestream&command=filecontent} status=0 QTime=0
   [junit4]   2> 1020565 INFO  (qtp20638415-7235) [    ] o.a.s.c.S.Request [collection1]  webapp=/solr path=/replication params={generation=3&qt=/replication&file=_1_Lucene50_0.tip&checksum=true&wt=filestream&command=filecontent} status=0 QTime=0
   [junit4]   2> 1020567 INFO  (qtp20638415-7236) [    ] o.a.s.c.S.Request [collection1]  webapp=/solr path=/replication params={generation=3&qt=/replication&file=segments_3&checksum=true&wt=filestream&command=filecontent} status=0 QTime=0
   [junit4]   2> 1020567 INFO  (explicit-fetchindex-cmd) [    ] o.a.s.h.IndexFetcher Total time taken for download (fullCopy=false,bytesDownloaded=1744) : 0 secs (null bytes/sec) to MockDirectoryWrapper(RAMDirectory@142164 lockFactory=org.apache.lucene.store.SingleInstanceLockFactory@1dd805f)
   [junit4]   2> 1020568 INFO  (explicit-fetchindex-cmd) [    ] o.a.s.u.RandomMergePolicy RandomMergePolicy wrapping class org.apache.lucene.index.LogByteSizeMergePolicy: [LogByteSizeMergePolicy: minMergeSize=1677721, mergeFactor=34, maxMergeSize=2147483648, maxMergeSizeForForcedMerge=9223372036854775807, calibrateSizeByDeletes=true, maxMergeDocs=2147483647, maxCFSSegmentSizeMB=8.796093022207999E12, noCFSRatio=1.0]
   [junit4]   2> 1020569 INFO  (explicit-fetchindex-cmd) [    ] o.a.s.c.SolrDeletionPolicy SolrDeletionPolicy.onInit: commits: num=2
   [junit4]   2> 	commit{dir=MockDirectoryWrapper(RAMDirectory@1eb4671 lockFactory=org.apache.lucene.store.SingleInstanceLockFactory@2b0462),segFN=segments_2,generation=2}
   [junit4]   2> 	commit{dir=MockDirectoryWrapper(RAMDirectory@1eb4671 lockFactory=org.apache.lucene.store.SingleInstanceLockFactory@2b0462),segFN=segments_3,generation=3}
   [junit4]   2> 1020569 INFO  (explicit-fetchindex-cmd) [    ] o.a.s.c.SolrDeletionPolicy newest commit generation = 3
   [junit4]   2> 1020569 INFO  (explicit-fetchindex-cmd) [    ] o.a.s.u.DefaultSolrCoreState New IndexWriter is ready to be used.
   [junit4]   2> 1020570 INFO  (explicit-fetchindex-cmd) [    ] o.a.s.s.SolrIndexSearcher Opening [Searcher@a9e26b[collection1] main]
   [junit4]   2> 1020570 INFO  (searcherExecutor-2989-thread-1) [    ] o.a.s.c.SolrCore [collection1] Registered new searcher Searcher@a9e26b[collection1] main{ExitableDirectoryReader(UninvertingDirectoryReader(Uninverting(_0(6.0.0):C1) Uninverting(_1(6.0.0):C1)))}
   [junit4]   2> 1020570 INFO  (explicit-fetchindex-cmd) [    ] o.a.s.c.CachingDirectoryFactory looking to close /home/jenkins/workspace/Lucene-Solr-trunk-Linux/solr/build/solr-core/test/J1/temp/solr.handler.TestReplicationHandler_398BDAFA08197A52-001/solr-instance-002/./collection1/data/index.20160111132609022 [CachedDir<<refCount=0;path=/home/jenkins/workspace/Lucene-Solr-trunk-Linux/solr/build/solr-core/test/J1/temp/solr.handler.TestReplicationHandler_398BDAFA08197A52-001/solr-instance-002/./collection1/data/index.20160111132609022;done=true>>]
   [junit4]   2> 1020570 INFO  (explicit-fetchindex-cmd) [    ] o.a.s.c.CachingDirectoryFactory Closing directory: /home/jenkins/workspace/Lucene-Solr-trunk-Linux/solr/build/solr-core/test/J1/temp/solr.handler.TestReplicationHandler_398BDAFA08197A52-001/solr-instance-002/./collection1/data/index.20160111132609022
   [junit4]   2> 1020570 INFO  (qtp13266789-7252) [    ] o.a.s.c.S.Request [collection1]  webapp=/solr path=/replication params={wait=true&masterUrl=http://127.0.0.1:54252/solr/collection1/replication&command=fetchindex} status=0 QTime=29
   [junit4]   2> 1020574 INFO  (qtp20638415-7234) [    ] o.a.s.c.S.Request [collection1]  webapp=/solr path=/replication params={slave=false&qt=/replication&wt=javabin&version=2&command=details} status=0 QTime=0
   [junit4]   2> 1020574 INFO  (qtp13266789-7253) [    ] o.a.s.c.S.Request [collection1]  webapp=/solr path=/replication params={_trace=getDetails&qt=/replication&wt=javabin&version=2&command=details} status=0 QTime=2
   [junit4]   2> 1020576 INFO  (qtp20638415-7235) [    ] o.a.s.u.p.LogUpdateProcessorFactory [collection1]  webapp=/solr path=/update params={wt=javabin&version=2}{add=[2]} 0 0
   [junit4]   2> 1020578 INFO  (qtp20638415-7236) [    ] o.a.s.u.DirectUpdateHandler2 start commit{,optimize=false,openSearcher=true,waitSearcher=true,expungeDeletes=false,softCommit=false,prepareCommit=false}
   [junit4]   2> 1020580 INFO  (qtp20638415-7236) [    ] o.a.s.c.SolrDeletionPolicy SolrDeletionPolicy.onCommit: commits: num=4
   [junit4]   2> 	commit{dir=MockDirectoryWrapper(RAMDirectory@1eb5b5b lockFactory=org.apache.lucene.store.SingleInstanceLockFactory@7bd4fd),segFN=segments_1,generation=1}
   [junit4]   2> 	commit{dir=MockDirectoryWrapper(RAMDirectory@1eb5b5b lockFactory=org.apache.lucene.store.SingleInstanceLockFactory@7bd4fd),segFN=segments_2,generation=2}
   [junit4]   2> 	commit{dir=MockDirectoryWrapper(RAMDirectory@1eb5b5b lockFactory=org.apache.lucene.store.SingleInstanceLockFactory@7bd4fd),segFN=segments_3,generation=3}
   [junit4]   2> 	commit{dir=MockDirectoryWrapper(RAMDirectory@1eb5b5b lockFactory=org.apache.lucene.store.SingleInstanceLockFactory@7bd4fd),segFN=segments_4,generation=4}
   [junit4]   2> 1020580 INFO  (qtp20638415-7236) [    ] o.a.s.c.SolrDeletionPolicy newest commit generation = 4
   [junit4]   2> 1020580 INFO  (qtp20638415-7236) [    ] o.a.s.s.SolrIndexSearcher Opening [Searcher@c14f32[collection1] main]
   [junit4]   2> 1020580 INFO  (qtp20638415-7236) [    ] o.a.s.u.DirectUpdateHandler2 end_commit_flush
   [junit4]   2> 1020580 INFO  (searcherExecutor-2979-thread-1) [    ] o.a.s.c.SolrCore [collection1] Registered new searcher Searcher@c14f32[collection1] main{ExitableDirectoryReader(UninvertingDirectoryReader(Uninverting(_0(6.0.0):C1) Uninverting(_1(6.0.0):C1) Uninverting(_2(6.0.0):C1)))}
   [junit4]   2> 1020580 INFO  (qtp20638415-7236) [    ] o.a.s.u.p.LogUpdateProcessorFactory [collection1]  webapp=/solr path=/update params={waitSearcher=true&commit=true&softCommit=false&wt=javabin&version=2}{commit=} 0 2
   [junit4]   2> 1020581 WARN  (explicit-fetchindex-cmd) [    ] o.a.s.h.IndexFetcher 'masterUrl' must be specified without the /replication suffix
   [junit4]   2> 1020584 INFO  (qtp20638415-7234) [    ] o.a.s.c.S.Request [collection1]  webapp=/solr path=/replication params={qt=/replication&wt=javabin&version=2&command=indexversion} status=0 QTime=0
   [junit4]   2> 1020584 INFO  (explicit-fetchindex-cmd) [    ] o.a.s.h.IndexFetcher Master's generation: 4
   [junit4]   2> 1020584 INFO  (explicit-fetchindex-cmd) [    ] o.a.s.h.IndexFetcher Slave's generation: 3
   [junit4]   2> 1020584 INFO  (explicit-fetchindex-cmd) [    ] o.a.s.h.IndexFetcher Starting replication process
   [junit4]   2> 1020586 INFO  (qtp20638415-7235) [    ] o.a.s.c.S.Request [collection1]  webapp=/solr path=/replication params={generation=4&qt=/replication&wt=javabin&version=2&command=filelist} status=0 QTime=0
   [junit4]   2> 1020586 INFO  (explicit-fetchindex-cmd) [    ] o.a.s.h.IndexFetcher Number of files in latest index in master: 28
   [junit4]   2> 1020587 INFO  (explicit-fetchindex-cmd) [    ] o.a.s.c.CachingDirectoryFactory return new directory for /home/jenkins/workspace/Lucene-Solr-trunk-Linux/solr/build/solr-core/test/J1/temp/solr.handler.TestReplicationHandler_398BDAFA08197A52-001/solr-instance-002/./collection1/data/index.20160111132609062
   [junit4]   2> 1020587 INFO  (explicit-fetchindex-cmd) [    ] o.a.s.u.DefaultSolrCoreState Rollback old IndexWriter... core=collection1
   [junit4]   2> 1020588 INFO  (explicit-fetchindex-cmd) [    ] o.a.s.u.RandomMergePolicy RandomMergePolicy wrapping class org.apache.lucene.index.AlcoholicMergePolicy: [AlcoholicMergePolicy: minMergeSize=0, mergeFactor=10, maxMergeSize=725521630, maxMergeSizeForForcedMerge=9223372036854775807, calibrateSizeByDeletes=true, maxMergeDocs=2147483647, maxCFSSegmentSizeMB=8.796093022207999E12, noCFSRatio=0.1]
   [junit4]   2> 1020588 INFO  (explicit-fetchindex-cmd) [    ] o.a.s.c.SolrDeletionPolicy SolrDeletionPolicy.onInit: commits: num=1
   [junit4]   2> 	commit{dir=MockDirectoryWrapper(RAMDirectory@1eb4671 lockFactory=org.apache.lucene.store.SingleInstanceLockFactory@2b0462),segFN=segments_3,generation=3}
   [junit4]   2> 1020588 INFO  (explicit-fetchindex-cmd) [    ] o.a.s.c.SolrDeletionPolicy newest commit generation = 3
   [junit4]   2> 1020588 INFO  (explicit-fetchindex-cmd) [    ] o.a.s.u.DefaultSolrCoreState New IndexWriter is ready to be used.
   [junit4]   2> 1020588 INFO  (explicit-fetchindex-cmd) [    ] o.a.s.c.SolrDeletionPolicy SolrDeletionPolicy.onCommit: commits: num=1
   [junit4]   2> 	commit{dir=MockDirectoryWrapper(RAMDirectory@1eb4671 lockFactory=org.apache.lucene.store.SingleInstanceLockFactory@2b0462),segFN=segments_3,generation=3}
   [junit4]   2> 1020588 INFO  (explicit-fetchindex-cmd) [    ] o.a.s.c.SolrDeletionPolicy newest commit generation = 3
   [junit4]   2> 1020588 INFO  (explicit-fetchindex-cmd) [    ] o.a.s.u.DefaultSolrCoreState Rollback old IndexWriter... core=collection1
   [junit4]   2> 1020589 INFO  (explicit-fetchindex-cmd) [    ] o.a.s.h.IndexFetcher Starting download (fullCopy=false) to MockDirectoryWrapper(RAMDirectory@154de2b lockFactory=org.apache.lucene.store.SingleInstanceLockFactory@4e7680)
   [junit4]   2> 1020589 INFO  (explicit-fetchindex-cmd) [    ] o.a.s.h.IndexFetcher Skipping download for _0.si because it already exists
   [junit4]   2> 1020589 INFO  (explicit-fetchindex-cmd) [    ] o.a.s.h.IndexFetcher Skipping download for _0_Lucene50_0.doc because it already exists
   [junit4]   2> 1020589 INFO  (explicit-fetchindex-cmd) [    ] o.a.s.h.IndexFetcher Skipping download for _0_Lucene50_0.tim because it already exists
   [junit4]   2> 1020589 INFO  (explicit-fetchindex-cmd) [    ] o.a.s.h.IndexFetcher Skipping download for _0.nvd because it already exists
   [junit4]   2> 1020589 INFO  (explicit-fetchindex-cmd) [    ] o.a.s.h.IndexFetcher Skipping download for _0.fdx because it already exists
   [junit4]   2> 1020589 INFO  (explicit-fetchindex-cmd) [    ] o.a.s.h.IndexFetcher Skipping download for _0_Lucene50_0.tip because it already exists
   [junit4]   2> 1020589 INFO  (explicit-fetchindex-cmd) [    ] o.a.s.h.IndexFetcher Skipping download for _0.fdt because it already exists
   [junit4]   2> 1020589 INFO  (explicit-fetchindex-cmd) [    ] o.a.s.h.IndexFetcher Skipping download for _0.fnm because it already exists
   [junit4]   2> 1020589 INFO  (explicit-fetchindex-cmd) [    ] o.a.s.h.IndexFetcher Skipping download for _0.nvm because it already exists
   [junit4]   2> 1020589 INFO  (explicit-fetchindex-cmd) [    ] o.a.s.h.IndexFetcher Skipping download for _1_Lucene50_0.doc because it already exists
   [junit4]   2> 1020589 INFO  (explicit-fetchindex-cmd) [    ] o.a.s.h.IndexFetcher Skipping download for _1_Lucene50_0.tim because it already exists
   [junit4]   2> 1020589 INFO  (explicit-fetchindex-cmd) [    ] o.a.s.h.IndexFetcher Skipping download for _1.si because it already exists
   [junit4]   2> 1020589 INFO  (explicit-fetchindex-cmd) [    ] o.a.s.h.IndexFetcher Skipping download for _1.nvd because it already exists
   [junit4]   2> 1020589 INFO  (explicit-fetchindex-cmd) [    ] o.a.s.h.IndexFetcher Skipping download for _1.fdx because it already exists
   [junit4]   2> 1020589 INFO  (explicit-fetchindex-cmd) [    ] o.a.s.h.IndexFetcher Skipping download for _1.fnm because it already exists
   [junit4]   2> 1020589 INFO  (explicit-fetchindex-cmd) [    ] o.a.s.h.IndexFetcher Skipping download for _1.nvm because it already exists
   [junit4]   2> 1020589 INFO  (explicit-fetchindex-cmd) [    ] o.a.s.h.IndexFetcher Skipping download for _1.fdt because it already exists
   [junit4]   2> 1020589 INFO  (explicit-fetchindex-cmd) [    ] o.a.s.h.IndexFetcher Skipping download for _1_Lucene50_0.tip because it already exists
   [junit4]   2> 1020591 INFO  (qtp20638415-7236) [    ] o.a.s.c.S.Request [collection1]  webapp=/solr path=/replication params={generation=4&qt=/replication&file=_2.nvd&checksum=true&wt=filestream&command=filecontent} status=0 QTime=0
   [junit4]   2> 1020593 INFO  (qtp20638415-7234) [    ] o.a.s.c.S.Request [collection1]  webapp=/solr path=/replication params={generation=4&qt=/replication&file=_2.si&checksum=true&wt=filestream&command=filecontent} status=0 QTime=0
   [junit4]   2> 1020595 INFO  (qtp20638415-7235) [    ] o.a.s.c.S.Request [collection1]  webapp=/solr path=/replication params={generation=4&qt=/replication&file=_2.fdt&checksum=true&wt=filestream&command=filecontent} status=0 QTime=0
   [junit4]   2> 1020597 INFO  (qtp20638415-7236) [    ] o.a.s.c.S.Request [collection1]  webapp=/solr path=/replication params={generation=4&qt=/replication&file=_2.fnm&checksum=true&wt=filestream&command=filecontent} status=0 QTime=0
   [junit4]   2> 1020599 INFO  (qtp20638415-7234) [    ] o.a.s.c.S.Request [collection1]  webapp=/solr path=/replication params={generation=4&qt=/replication&file=_2.nvm&checksum=true&wt=filestream&command=filecontent} status=0 QTime=0
   [junit4]   2> 1020601 INFO  (qtp20638415-7235) [    ] o.a.s.c.S.Request [collection1]  webapp=/solr path=/replication params={generation=4&qt=/replication&file=_2.fdx&checksum=true&wt=filestream&command=filecontent} status=0 QTime=0
   [junit4]   2> 1020603 INFO  (qtp20638415-7236) [    ] o.a.s.c.S.Request [collection1]  webapp=/solr path=/replication params={generation=4&qt=/replication&file=_2_Lucene50_0.doc&checksum=true&wt=filestream&command=filecontent} status=0 QTime=0
   [junit4]   2> 1020610 INFO  (qtp20638415-7234) [    ] o.a.s.c.S.Request [collection1]  webapp=/solr path=/replication params={generation=4&qt=/replication&file=_2_Lucene50_0.tim&checksum=true&wt=filestream&command=filecontent} status=0 QTime=0
   [junit4]   2> 1020612 INFO  (qtp20638415-7235) [    ] o.a.s.c.S.Request [collection1]  webapp=/solr path=/replication params={generation=4&qt=/replication&file=_2_Lucene50_0.tip&checksum=true&wt=filestream&command=filecontent} status=0 QTime=0
   [junit4]   2> 1020614 INFO  (qtp20638415-7236) [    ] o.a.s.c.S.Request [collection1]  webapp=/solr path=/replication params={generation=4&qt=/replication&file=segments_4&checksum=true&wt=filestream&command=filecontent} status=0 QTime=0
   [junit4]   2> 1020614 INFO  (explicit-fetchindex-cmd) [    ] o.a.s.h.IndexFetcher Total time taken for download (fullCopy=false,bytesDownloaded=1825) : 0 secs (null bytes/sec) to MockDirectoryWrapper(RAMDirectory@154de2b lockFactory=org.apache.lucene.store.SingleInstanceLockFactory@4e7680)
   [junit4]   2> 1020615 INFO  (explicit-fetchindex-cmd) [    ] o.a.s.u.RandomMergePolicy RandomMergePolicy wrapping class org.apache.lucene.index.LogByteSizeMergePolicy: [LogByteSizeMergePolicy: minMergeSize=1677721, mergeFactor=34, maxMergeSize=2147483648, maxMergeSizeForForcedMerge=9223372036854775807, calibrateSizeByDeletes=true, maxMergeDocs=2147483647, maxCFSSegmentSizeMB=8.796093022207999E12, noCFSRatio=1.0]
   [junit4]   2> 1020616 INFO  (explicit-fetchindex-cmd) [    ] o.a.s.c.SolrDeletionPolicy SolrDeletionPolicy.onInit: commits: num=2
   [junit4]   2> 	commit{dir=MockDirectoryWrapper(RAMDirectory@1eb4671 lockFactory=org.apache.lucene.store.SingleInstanceLockFactory@2b0462),segFN=segments_3,generation=3}
   [junit4]   2> 	commit{dir=MockDirectoryWrapper(RAMDirectory@1eb4671 lockFactory=org.apache.lucene.store.SingleInstanceLockFactory@2b0462),segFN=segments_4,generation=4}
   [junit4]   2> 1020616 INFO  (explicit-fetchindex-cmd) [    ] o.a.s.c.SolrDeletionPolicy newest commit generation = 4
   [junit4]   2> 1020616 INFO  (explicit-fetchindex-cmd) [    ] o.a.s.u.DefaultSolrCoreState New IndexWriter is ready to be used.
   [junit4]   2> 1020617 INFO  (explicit-fetchindex-cmd) [    ] o.a.s.s.SolrIndexSearcher Opening [Searcher@1268cbf[collection1] main]
   [junit4]   2> 1020617 INFO  (searcherExecutor-2989-thread-1) [    ] o.a.s.c.SolrCore [collection1] Registered new searcher Searcher@1268cbf[collection1] main{ExitableDirectoryReader(UninvertingDirectoryReader(Uninverting(_0(6.0.0):C1) Uninverting(_1(6.0.0):C1) Uninverting(_2(6.0.0):C1)))}
   [junit4]   2> 1020617 INFO  (explicit-fetchindex-cmd) [    ] o.a.s.c.CachingDirectoryFactory looking to close /home/jenkins/workspace/Lucene-Solr-trunk-Linux/solr/build/solr-core/test/J1/temp/solr.handler.TestReplicationHandler_398BDAFA08197A52-001/solr-instance-002/./collection1/data/index.20160111132609062 [CachedDir<<refCount=0;path=/home/jenkins/workspace/Lucene-Solr-trunk-Linux/solr/build/solr-core/test/J1/temp/solr.handler.TestReplicationHandler_398BDAFA08197A52-001/solr-instance-002/./collection1/data/index.20160111132609062;done=true>>]
   [junit4]   2> 1020618 INFO  (explicit-fetchindex-cmd) [    ] o.a.s.c.CachingDirectoryFactory Closing directory: /home/jenkins/workspace/Lucene-Solr-trunk-Linux/solr/build/solr-core/test/J1/temp/solr.handler.TestReplicationHandler_398BDAFA08197A52-001/solr-instance-002/./collection1/data/index.20160111132609062
   [junit4]   2> 1020618 INFO  (qtp13266789-7254) [    ] o.a.s.c.S.Request [collection1]  webapp=/solr path=/replication params={wait=true&masterUrl=http://127.0.0.1:54252/solr/collection1/replication&command=fetchindex} status=0 QTime=36
   [junit4]   2> 1020618 INFO  (TEST-TestReplicationHandler.doTestDetails-seed#[398BDAFA08197A52]) [    ] o.a.s.SolrTestCaseJ4 Writing core.properties file to /home/jenkins/workspace/Lucene-Solr-trunk-Linux/solr/build/solr-core/test/J1/temp/solr.handler.TestReplicationHandler_398BDAFA08197A52-001/solr-instance-003/collection1
   [junit4]   2> 1020621 INFO  (TEST-TestReplicationHandler.doTestDetails-seed#[398BDAFA08197A52]) [    ] o.e.j.s.Server jetty-9.2.13.v20150730
   [junit4]   2> 1020622 INFO  (TEST-TestReplicationHandler.doTestDetails-seed#[398BDAFA08197A52]) [    ] o.e.j.s.h.ContextHandler Started o.e.j.s.ServletContextHandler@14921e9{/solr,null,AVAILABLE}
   [junit4]   2> 1020622 INFO  (TEST-TestReplicationHandler.doTestDetails-seed#[398BDAFA08197A52]) [    ] o.e.j.s.ServerConnector Started ServerConnector@1c475cd{HTTP/1.1}{127.0.0.1:53754}
   [junit4]   2> 1020622 INFO  (TEST-TestReplicationHandler.doTestDetails-seed#[398BDAFA08197A52]) [    ] o.e.j.s.Server Started @1021777ms
   [junit4]   2> 1020622 INFO  (TEST-TestReplicationHandler.doTestDetails-seed#[398BDAFA08197A52]) [    ] o.a.s.c.s.e.JettySolrRunner Jetty properties: {solr.data.dir=/home/jenkins/workspace/Lucene-Solr-trunk-Linux/solr/build/solr-core/test/J1/temp/solr.handler.TestReplicationHandler_398BDAFA08197A52-001/solr-instance-003/collection1/data, hostContext=/solr, hostPort=53754}
   [junit4]   2> 1020622 INFO  (TEST-TestReplicationHandler.doTestDetails-seed#[398BDAFA08197A52]) [    ] o.a.s.s.SolrDispatchFilter SolrDispatchFilter.init(): sun.misc.Launcher$AppClassLoader@1eb6432
   [junit4]   2> 1020622 INFO  (TEST-TestReplicationHandler.doTestDetails-seed#[398BDAFA08197A52]) [    ] o.a.s.c.SolrResourceLoader new SolrResourceLoader for directory: '/home/jenkins/workspace/Lucene-Solr-trunk-Linux/solr/build/solr-core/test/J1/temp/solr.handler.TestReplicationHandler_398BDAFA08197A52-001/solr-instance-003'
   [junit4]   2> 1020623 INFO  (TEST-TestReplicationHandler.doTestDetails-seed#[398BDAFA08197A52]) [    ] o.a.s.c.SolrResourceLoader JNDI not configured for solr (NoInitialContextEx)
   [junit4]   2> 1020623 INFO  (TEST-TestReplicationHandler.doTestDetails-seed#[398BDAFA08197A52]) [    ] o.a.s.c.SolrResourceLoader solr home defaulted to 'solr/' (could not find system property or JNDI)
   [junit4]   2> 1020623 INFO  (TEST-TestReplicationHandler.doTestDetails-seed#[398BDAFA08197A52]) [    ] o.a.s.c.SolrXmlConfig Loading container configuration from /home/jenkins/workspace/Lucene-Solr-trunk-Linux/solr/build/solr-core/test/J1/temp/solr.handler.TestReplicationHandler_398BDAFA08197A52-001/solr-instance-003/solr.xml
   [junit4]   2> 1020628 INFO  (TEST-TestReplicationHandler.doTestDetails-seed#[398BDAFA08197A52]) [    ] o.a.s.c.CorePropertiesLocator Config-defined core root directory: /home/jenkins/workspace/Lucene-Solr-trunk-Linux/solr/build/solr-core/test/J1/temp/solr.handler.TestReplicationHandler_398BDAFA08197A52-001/solr-instance-003/.
   [junit4]   2> 1020628 INFO  (TEST-TestReplicationHandler.doTestDetails-seed#[398BDAFA08197A52]) [    ] o.a.s.c.CoreContainer New CoreContainer 23415377
   [junit4]   2> 1020628 INFO  (TEST-TestReplicationHandler.doTestDetails-seed#[398BDAFA08197A52]) [    ] o.a.s.c.CoreContainer Loading cores into CoreContainer [instanceDir=/home/jenkins/workspace/Lucene-Solr-trunk-Linux/solr/build/solr-core/test/J1/temp/solr.handler.TestReplicationHandler_398BDAFA08197A52-001/solr-instance-003]
   [junit4]   2> 1020628 WARN  (TEST-TestReplicationHandler.doTestDetails-seed#[398BDAFA08197A52]) [    ] o.a.s.c.CoreContainer Couldn't add files from /home/jenkins/workspace/Lucene-Solr-trunk-Linux/solr/build/solr-core/test/J1/temp/solr.handler.TestReplicationHandler_398BDAFA08197A52-001/solr-instance-003/lib to classpath: /home/jenkins/workspace/Lucene-Solr-trunk-Linux/solr/build/solr-core/test/J1/temp/solr.handler.TestReplicationHandler_398BDAFA08197A52-001/solr-instance-003/lib
   [junit4]   2> 1020628 INFO  (TEST-TestReplicationHandler.doTestDetails-seed#[398BDAFA08197A52]) [    ] o.a.s.h.c.HttpShardHandlerFactory created with socketTimeout : 90000,urlScheme : ,connTimeout : 15000,maxConnectionsPerHost : 20,maxConnections : 10000,corePoolSize : 0,maximumPoolSize : 2147483647,maxThreadIdleTime : 5,sizeOfQueue : -1,fairnessPolicy : false,useRetries : false,
   [junit4]   2> 1020629 INFO  (TEST-TestReplicationHandler.doTestDetails-seed#[398BDAFA08197A52]) [    ] o.a.s.u.UpdateShardHandler Creating UpdateShardHandler HTTP client with params: socketTimeout=340000&connTimeout=45000&retry=true
   [junit4]   2> 1020629 INFO  (TEST-TestReplicationHandler.doTestDetails-seed#[398BDAFA08197A52]) [    ] o.a.s.l.LogWatcher SLF4J impl is org.slf4j.impl.Log4jLoggerFactory
   [junit4]   2> 1020629 INFO  (TEST-TestReplicationHandler.doTestDetails-seed#[398BDAFA08197A52]) [    ] o.a.s.l.LogWatcher Registering Log Listener [Log4j (org.slf4j.impl.Log4jLoggerFactory)]
   [junit4]   2> 1020629 INFO  (TEST-TestReplicationHandler.doTestDetails-seed#[398BDAFA08197A52]) [    ] o.a.s.c.CoreContainer Security conf doesn't exist. Skipping setup for authorization module.
   [junit4]   2> 1020629 INFO  (TEST-TestReplicationHandler.doTestDetails-seed#[398BDAFA08197A52]) [    ] o.a.s.c.CoreContainer No authentication plugin used.
   [junit4]   2> 1020629 INFO  (TEST-TestReplicationHandler.doTestDetails-seed#[398BDAFA08197A52]) [    ] o.a.s.c.CorePropertiesLocator Looking for core definitions underneath /home/jenkins/workspace/Lucene-Solr-trunk-Linux/solr/build/solr-core/test/J1/temp/solr.handler.TestReplicationHandler_398BDAFA08197A52-001/solr-instance-003/.
   [junit4]   2> 1020630 INFO  (TEST-TestReplicationHandler.doTestDetails-seed#[398BDAFA08197A52]) [    ] o.a.s.c.CoreDescriptor Created CoreDescriptor: {name=collection1, config=solrconfig.xml, loadOnStartup=true, schema=schema.xml, configSetProperties=configsetprops.json, transient=false, dataDir=data/}
   [junit4]   2> 1020630 INFO  (TEST-TestReplicationHandler.doTestDetails-seed#[398BDAFA08197A52]) [    ] o.a.s.c.CorePropertiesLocator Found core collection1 in /home/jenkins/workspace/Lucene-Solr-trunk-Linux/solr/build/solr-core/test/J1/temp/solr.handler.TestReplicationHandler_398BDAFA08197A52-001/solr-instance-003/./collection1
   [junit4]   2> 1020630 INFO  (TEST-TestReplicationHandler.doTestDetails-seed#[398BDAFA08197A52]) [    ] o.a.s.c.CorePropertiesLocator Found 1 core definitions
   [junit4]   2> 1020631 INFO  (coreLoadExecutor-3002-thread-1) [    ] o.a.s.c.SolrResourceLoader new SolrResourceLoader for directory: '/home/jenkins/workspace/Lucene-Solr-trunk-Linux/solr/build/solr-core/test/J1/temp/solr.handler.TestReplicationHandler_398BDAFA08197A52-001/solr-instance-003/collection1'
   [junit4]   2> 1020631 INFO  (TEST-TestReplicationHandler.doTestDetails-seed#[398BDAFA08197A52]) [    ] o.a.s.s.SolrDispatchFilter user.dir=/home/jenkins/workspace/Lucene-Solr-trunk-Linux/solr/build/solr-core/test/J1
   [junit4]   2> 1020631 INFO  (TEST-TestReplicationHandler.doTestDetails-seed#[398BDAFA08197A52]) [    ] o.a.s.s.SolrDispatchFilter SolrDispatchFilter.init() done
   [junit4]   2> 1020631 INFO  (coreLoadExecutor-3002-thread-1) [    ] o.a.s.c.SolrResourceLoader JNDI not configured for solr (NoInitialContextEx)
   [junit4]   2> 1020631 INFO  (coreLoadExecutor-3002-thread-1) [    ] o.a.s.c.SolrResourceLoader solr home defaulted to 'solr/' (could not find system property or JNDI)
   [junit4]   2> 1020637 INFO  (coreLoadExecutor-3002-thread-1) [    ] o.a.s.c.SolrConfig current version of requestparams : -1
   [junit4]   2> 1020639 INFO  (coreLoadExecutor-3002-thread-1) [    ] o.a.s.c.SolrConfig Using Lucene MatchVersion: 6.0.0
   [junit4]   2> 1020644 INFO  (coreLoadExecutor-3002-thread-1) [    ] o.a.s.c.SolrConfig Loaded SolrConfig: solrconfig.xml
   [junit4]   2> 1020647 INFO  (coreLoadExecutor-3002-thread-1) [    ] o.a.s.s.IndexSchema [collection1] Schema name=test
   [junit4]   2> 1020649 INFO  (coreLoadExecutor-3002-thread-1) [    ] o.a.s.s.IndexSchema unique key field: id
   [junit4]   2> 1020650 INFO  (coreLoadExecutor-3002-thread-1) [    ] o.a.s.c.ConfigSetProperties Did not find ConfigSet properties, assuming default properties: Can't find resource 'configsetprops.json' in classpath or '/home/jenkins/workspace/Lucene-Solr-trunk-Linux/solr/build/solr-core/test/J1/temp/solr.handler.TestReplicationHandler_398BDAFA08197A52-001/solr-instance-003/collection1'
   [junit4]   2> 1020650 INFO  (coreLoadExecutor-3002-thread-1) [    ] o.a.s.c.CoreContainer Creating SolrCore 'collection1' using configuration from instancedir /home/jenkins/workspace/Lucene-Solr-trunk-Linux/solr/build/solr-core/test/J1/temp/solr.handler.TestReplicationHandler_398BDAFA08197A52-001/solr-instance-003/./collection1
   [junit4]   2> 1020650 INFO  (coreLoadExecutor-3002-thread-1) [    ] o.a.s.c.SolrCore org.apache.solr.core.MockDirectoryFactory
   [junit4]   2> 1020650 INFO  (coreLoadExecutor-3002-thread-1) [    ] o.a.s.c.SolrCore [[collection1] ] Opening new SolrCore at [/home/jenkins/workspace/Lucene-Solr-trunk-Linux/solr/build/solr-core/test/J1/temp/solr.handler.TestReplicationHandler_398BDAFA08197A52-001/solr-instance-003/collection1], dataDir=[/home/jenkins/workspace/Lucene-Solr-trunk-Linux/solr/build/solr-core/test/J1/temp/solr.handler.TestReplicationHandler_398BDAFA08197A52-001/solr-instance-003/./collection1/data/]
   [junit4]   2> 1020650 INFO  (coreLoadExecutor-3002-thread-1) [    ] o.a.s.c.SolrCore JMX monitoring not detected for core: collection1
   [junit4]   2> 1020651 INFO  (coreLoadExecutor-3002-thread-1) [    ] o.a.s.c.CachingDirectoryFactory return new directory for /home/jenkins/workspace/Lucene-Solr-trunk-Linux/solr/build/solr-core/test/J1/temp/solr.handler.TestReplicationHandler_398BDAFA08197A52-001/solr-instance-003/./collection1/data
   [junit4]   2> 1020651 INFO  (coreLoadExecutor-3002-thread-1) [    ] o.a.s.c.SolrCore New index directory detected: old=null new=/home/jenkins/workspace/Lucene-Solr-trunk-Linux/solr/build/solr-core/test/J1/temp/solr.handler.TestReplicationHandler_398BDAFA08197A52-001/solr-instance-003/./collection1/data/index/
   [junit4]   2> 1020651 WARN  (coreLoadExecutor-3002-thread-1) [    ] o.a.s.c.SolrCore [collection1] Solr index directory '/home/jenkins/workspace/Lucene-Solr-trunk-Linux/solr/build/solr-core/test/J1/temp/solr.handler.TestReplicationHandler_398BDAFA08197A52-001/solr-instance-003/./collection1/data/index' doesn't exist. Creating new index...
   [junit4]   2> 1020651 INFO  (coreLoadExecutor-3002-thread-1) [    ] o.a.s.c.CachingDirectoryFactory return new directory for /home/jenkins/workspace/Lucene-Solr-trunk-Linux/solr/build/solr-core/test/J1/temp/solr.handler.TestReplicationHandler_398BDAFA08197A52-001/solr-instance-003/./collection1/data/index
   [junit4]   2> 1020651 INFO  (coreLoadExecutor-3002-thread-1) [    ] o.a.s.u.RandomMergePolicy RandomMergePolicy wrapping class org.apache.lucene.index.TieredMergePolicy: [TieredMergePolicy: maxMergeAtOnce=30, maxMergeAtOnceExplicit=12, maxMergedSegmentMB=0.6103515625, floorSegmentMB=0.6337890625, forceMergeDeletesPctAllowed=6.47055123689521, segmentsPerTier=41.0, maxCFSSegmentSizeMB=8.796093022207999E12, noCFSRatio=0.0
   [junit4]   2> 1020652 INFO  (coreLoadExecutor-3002-thread-1) [    ] o.a.s.c.SolrDeletionPolicy SolrDeletionPolicy.onCommit: commits: num=1
   [junit4]   2> 	commit{dir=MockDirectoryWrapper(RAMDirectory@6cf3b2 lockFactory=org.apache.lucene.store.SingleInstanceLockFactory@245518),segFN=segments_1,generation=1}
   [junit4]   2> 1020652 INFO  (coreLoadExecutor-3002-thread-1) [    ] o.a.s.c.SolrDeletionPolicy newest commit generation = 1
   [junit4]   2> 1020652 INFO  (OldIndexDirectoryCleanupThreadForCore-collection1) [    ] o.a.s.c.SolrCore Looking for old index directories to cleanup for core collection1 in /home/jenkins/workspace/Lucene-Solr-trunk-Linux/solr/build/solr-core/test/J1/temp/solr.handler.TestReplicationHandler_398BDAFA08197A52-001/solr-instance-003/./collection1/data/
   [junit4]   2> 1020653 INFO  (coreLoadExecutor-3002-thread-1) [    ] o.a.s.c.SolrCore no updateRequestProcessorChain defined as default, creating implicit default
   [junit4]   2> 1020654 INFO  (coreLoadExecutor-3002-thread-1) [    ] o.a.s.h.l.XMLLoader xsltCacheLifetimeSeconds=60
   [junit4]   2> 1020655 INFO  (coreLoadExecutor-3002-thread-1) [    ] o.a.s.h.l.XMLLoader xsltCacheLifetimeSeconds=60
   [junit4]   2> 1020656 INFO  (coreLoadExecutor-3002-thread-1) [    ] o.a.s.h.l.XMLLoader xsltCacheLifetimeSeconds=60
   [junit4]   2> 1020656 INFO  (coreLoadExecutor-3002-thread-1) [    ] o.a.s.h.l.XMLLoader xsltCacheLifetimeSeconds=60
   [junit4]   2> 1020657 INFO  (coreLoadExecutor-3002-thread-1) [    ] o.a.s.c.PluginBag requestHandler : 'lazy' created with startup=lazy 
   [junit4]   2> 1020657 INFO  (coreLoadExecutor-3002-thread-1) [    ] o.a.s.c.RequestHandlers Registered paths: /admin/mbeans,standard,lazy,/update/json/docs,/admin/luke,/export,/get,/admin/properties,/update/json,/admin/threads,/update/csv,/sql,/admin/segments,/admin/system,/replication,defaults,/config,/stream,/schema,/admin/plugins,/admin/logging,/admin/ping,/update,/admin/file
   [junit4]   2> 1020657 INFO  (coreLoadExecutor-3002-thread-1) [    ] o.a.s.c.SolrCore Using default statsCache cache: org.apache.solr.search.stats.LocalStatsCache
   [junit4]   2> 1020658 INFO  (coreLoadExecutor-3002-thread-1) [    ] o.a.s.u.CommitTracker Hard AutoCommit: disabled
   [junit4]   2> 1020658 INFO  (coreLoadExecutor-3002-thread-1) [    ] o.a.s.u.CommitTracker Soft AutoCommit: disabled
   [junit4]   2> 1020658 INFO  (coreLoadExecutor-3002-thread-1) [    ] o.a.s.u.RandomMergePolicy RandomMergePolicy wrapping class org.apache.lucene.index.TieredMergePolicy: [TieredMergePolicy: maxMergeAtOnce=20, maxMergeAtOnceExplicit=34, maxMergedSegmentMB=39.40625, floorSegmentMB=2.1103515625, forceMergeDeletesPctAllowed=14.34135401036879, segmentsPerTier=23.0, maxCFSSegmentSizeMB=8.796093022207999E12, noCFSRatio=0.36826825463528656
   [junit4]   2> 1020658 INFO  (coreLoadExecutor-3002-thread-1) [    ] o.a.s.c.SolrDeletionPolicy SolrDeletionPolicy.onInit: commits: num=1
   [junit4]   2> 	commit{dir=MockDirectoryWrapper(RAMDirectory@6cf3b2 lockFactory=org.apache.lucene.store.SingleInstanceLockFactory@245518),segFN=segments_1,generation=1}
   [junit4]   2> 1020658 INFO  (coreLoadExecutor-3002-thread-1) [    ] o.a.s.c.SolrDeletionPolicy newest commit generation = 1
   [junit4]   2> 1020658 INFO  (coreLoadExecutor-3002-thread-1) [    ] o.a.s.s.SolrIndexSearcher Opening [Searcher@35b949[collection1] main]
   [junit4]   2> 1020658 INFO  (coreLoadExecutor-3002-thread-1) [    ] o.a.s.r.ManagedResourceStorage File-based storage initialized to use dir: /home/jenkins/workspace/Lucene-Solr-trunk-Linux/solr/build/solr-core/test/J1/temp/solr.handler.TestReplicationHandler_398BDAFA08197A52-001/solr-instance-003/collection1/conf
   [junit4]   2> 1020658 INFO  (coreLoadExecutor-3002-thread-1) [    ] o.a.s.r.RestManager Initializing RestManager with initArgs: {storageDir=/home/jenkins/workspace/Lucene-Solr-trunk-Linux/solr/build/solr-core/test/J1/temp/solr.handler.TestReplicationHandler_398BDAFA08197A52-001/solr-instance-003/collection1/conf}
   [junit4]   2> 1020659 INFO  (coreLoadExecutor-3002-thread-1) [    ] o.a.s.r.ManagedResourceStorage Reading _rest_managed.json using file:dir=/home/jenkins/workspace/Lucene-Solr-trunk-Linux/solr/build/solr-core/test/J1/temp/solr.handler.TestReplicatio

[...truncated too long message...]

97A52-001/solr-instance-027/./collection1/data/index [CachedDir<<refCount=0;path=/home/jenkins/workspace/Lucene-Solr-trunk-Linux/solr/build/solr-core/test/J1/temp/solr.handler.TestReplicationHandler_398BDAFA08197A52-001/solr-instance-027/./collection1/data/index;done=false>>]
   [junit4]   2> 1128847 INFO  (TEST-TestReplicationHandler.testEmptyCommits-seed#[398BDAFA08197A52]) [    ] o.a.s.c.CachingDirectoryFactory Closing directory: /home/jenkins/workspace/Lucene-Solr-trunk-Linux/solr/build/solr-core/test/J1/temp/solr.handler.TestReplicationHandler_398BDAFA08197A52-001/solr-instance-027/./collection1/data/index
   [junit4]   2> 1128847 INFO  (TEST-TestReplicationHandler.testEmptyCommits-seed#[398BDAFA08197A52]) [    ] o.a.s.c.CachingDirectoryFactory looking to close /home/jenkins/workspace/Lucene-Solr-trunk-Linux/solr/build/solr-core/test/J1/temp/solr.handler.TestReplicationHandler_398BDAFA08197A52-001/solr-instance-027/./collection1/data [CachedDir<<refCount=0;path=/home/jenkins/workspace/Lucene-Solr-trunk-Linux/solr/build/solr-core/test/J1/temp/solr.handler.TestReplicationHandler_398BDAFA08197A52-001/solr-instance-027/./collection1/data;done=false>>]
   [junit4]   2> 1128847 INFO  (TEST-TestReplicationHandler.testEmptyCommits-seed#[398BDAFA08197A52]) [    ] o.a.s.c.CachingDirectoryFactory Closing directory: /home/jenkins/workspace/Lucene-Solr-trunk-Linux/solr/build/solr-core/test/J1/temp/solr.handler.TestReplicationHandler_398BDAFA08197A52-001/solr-instance-027/./collection1/data
   [junit4]   2> 1128848 INFO  (TEST-TestReplicationHandler.testEmptyCommits-seed#[398BDAFA08197A52]) [    ] o.e.j.s.h.ContextHandler Stopped o.e.j.s.ServletContextHandler@12ebdd6{/solr,null,UNAVAILABLE}
   [junit4]   2> 1128849 INFO  (TEST-TestReplicationHandler.testEmptyCommits-seed#[398BDAFA08197A52]) [    ] o.e.j.s.ServerConnector Stopped ServerConnector@684930{HTTP/1.1}{127.0.0.1:0}
   [junit4]   2> 1128849 INFO  (TEST-TestReplicationHandler.testEmptyCommits-seed#[398BDAFA08197A52]) [    ] o.a.s.c.CoreContainer Shutting down CoreContainer instance=5466559
   [junit4]   2> 1128849 INFO  (TEST-TestReplicationHandler.testEmptyCommits-seed#[398BDAFA08197A52]) [    ] o.a.s.c.SolrCore [collection1]  CLOSING SolrCore org.apache.solr.core.SolrCore@1b20bdb
   [junit4]   2> 1128849 INFO  (TEST-TestReplicationHandler.testEmptyCommits-seed#[398BDAFA08197A52]) [    ] o.a.s.u.DirectUpdateHandler2 closing DirectUpdateHandler2{commits=0,autocommits=0,soft autocommits=0,optimizes=0,rollbacks=0,expungeDeletes=0,docsPending=0,adds=0,deletesById=0,deletesByQuery=0,errors=0,cumulative_adds=0,cumulative_deletesById=0,cumulative_deletesByQuery=0,cumulative_errors=0}
   [junit4]   2> 1128849 INFO  (TEST-TestReplicationHandler.testEmptyCommits-seed#[398BDAFA08197A52]) [    ] o.a.s.u.SolrCoreState Closing SolrCoreState
   [junit4]   2> 1128849 INFO  (TEST-TestReplicationHandler.testEmptyCommits-seed#[398BDAFA08197A52]) [    ] o.a.s.u.DefaultSolrCoreState SolrCoreState ref count has reached 0 - closing IndexWriter
   [junit4]   2> 1128849 INFO  (TEST-TestReplicationHandler.testEmptyCommits-seed#[398BDAFA08197A52]) [    ] o.a.s.u.DefaultSolrCoreState closing IndexWriter with IndexWriterCloser
   [junit4]   2> 1128850 INFO  (TEST-TestReplicationHandler.testEmptyCommits-seed#[398BDAFA08197A52]) [    ] o.a.s.c.SolrCore [collection1] Closing main searcher on request.
   [junit4]   2> 1128850 INFO  (TEST-TestReplicationHandler.testEmptyCommits-seed#[398BDAFA08197A52]) [    ] o.a.s.c.CachingDirectoryFactory Closing MockDirectoryFactory - 2 directories currently being tracked
   [junit4]   2> 1128850 INFO  (TEST-TestReplicationHandler.testEmptyCommits-seed#[398BDAFA08197A52]) [    ] o.a.s.c.CachingDirectoryFactory looking to close /home/jenkins/workspace/Lucene-Solr-trunk-Linux/solr/build/solr-core/test/J1/temp/solr.handler.TestReplicationHandler_398BDAFA08197A52-001/solr-instance-028/./collection1/data [CachedDir<<refCount=0;path=/home/jenkins/workspace/Lucene-Solr-trunk-Linux/solr/build/solr-core/test/J1/temp/solr.handler.TestReplicationHandler_398BDAFA08197A52-001/solr-instance-028/./collection1/data;done=false>>]
   [junit4]   2> 1128850 INFO  (TEST-TestReplicationHandler.testEmptyCommits-seed#[398BDAFA08197A52]) [    ] o.a.s.c.CachingDirectoryFactory Closing directory: /home/jenkins/workspace/Lucene-Solr-trunk-Linux/solr/build/solr-core/test/J1/temp/solr.handler.TestReplicationHandler_398BDAFA08197A52-001/solr-instance-028/./collection1/data
   [junit4]   2> 1128850 INFO  (TEST-TestReplicationHandler.testEmptyCommits-seed#[398BDAFA08197A52]) [    ] o.a.s.c.CachingDirectoryFactory looking to close /home/jenkins/workspace/Lucene-Solr-trunk-Linux/solr/build/solr-core/test/J1/temp/solr.handler.TestReplicationHandler_398BDAFA08197A52-001/solr-instance-028/./collection1/data/index [CachedDir<<refCount=0;path=/home/jenkins/workspace/Lucene-Solr-trunk-Linux/solr/build/solr-core/test/J1/temp/solr.handler.TestReplicationHandler_398BDAFA08197A52-001/solr-instance-028/./collection1/data/index;done=false>>]
   [junit4]   2> 1128850 INFO  (TEST-TestReplicationHandler.testEmptyCommits-seed#[398BDAFA08197A52]) [    ] o.a.s.c.CachingDirectoryFactory Closing directory: /home/jenkins/workspace/Lucene-Solr-trunk-Linux/solr/build/solr-core/test/J1/temp/solr.handler.TestReplicationHandler_398BDAFA08197A52-001/solr-instance-028/./collection1/data/index
   [junit4]   2> 1128851 INFO  (TEST-TestReplicationHandler.testEmptyCommits-seed#[398BDAFA08197A52]) [    ] o.e.j.s.h.ContextHandler Stopped o.e.j.s.ServletContextHandler@1f7a1ab{/solr,null,UNAVAILABLE}
   [junit4]   2> 1128852 INFO  (SUITE-TestReplicationHandler-seed#[398BDAFA08197A52]-worker) [    ] o.a.s.SolrTestCaseJ4 ###deleteCore
   [junit4]   2> NOTE: leaving temporary files on disk at: /home/jenkins/workspace/Lucene-Solr-trunk-Linux/solr/build/solr-core/test/J1/temp/solr.handler.TestReplicationHandler_398BDAFA08197A52-001
   [junit4]   2> NOTE: test params are: codec=FastCompressingStoredFields(storedFieldsFormat=CompressingStoredFieldsFormat(compressionMode=FAST, chunkSize=16656, maxDocsPerChunk=100, blockSize=790), termVectorsFormat=CompressingTermVectorsFormat(compressionMode=FAST, chunkSize=16656, blockSize=790)), sim=ClassicSimilarity, locale=fy_NL, timezone=Pacific/Norfolk
   [junit4]   2> NOTE: Linux 3.19.0-42-generic i386/Oracle Corporation 9-ea (32-bit)/cpus=12,threads=1,free=83493824,total=409468928
   [junit4]   2> NOTE: All tests run in this JVM: [TestInfoStreamLogging, NotRequiredUniqueKeyTest, DistributedExpandComponentTest, TestMiniSolrCloudClusterBase, BasicFunctionalityTest, ClusterStateUpdateTest, TestSerializedLuceneMatchVersion, TestQuerySenderNoQuery, TestFileDictionaryLookup, DOMUtilTest, WordBreakSolrSpellCheckerTest, HdfsDirectoryTest, SoftAutoCommitTest, TestExactStatsCache, TestConfigSetsAPIExclusivity, TestCoreContainer, TermVectorComponentTest, HdfsChaosMonkeySafeLeaderTest, UniqFieldsUpdateProcessorFactoryTest, HighlighterMaxOffsetTest, TestTrie, SparseHLLTest, TermsComponentTest, FacetPivotSmallTest, TestSmileRequest, TestQueryUtils, TestMinMaxOnMultiValuedField, TestComplexPhraseQParserPlugin, TestDistribDocBasedVersion, HttpPartitionTest, RulesTest, TestBM25SimilarityFactory, ChaosMonkeySafeLeaderTest, MBeansHandlerTest, ZkStateReaderTest, MoreLikeThisHandlerTest, TestDefaultStatsCache, TestBlobHandler, TestScoreJoinQPScore, SortByFunctionTest, ConvertedLegacyTest, RecoveryAfterSoftCommitTest, OpenCloseCoreStressTest, BJQParserTest, SpellCheckCollatorTest, SolrCmdDistributorTest, TestBinaryResponseWriter, ExitableDirectoryReaderTest, SuggesterFSTTest, MultiTermTest, TestSimpleTrackingShardHandler, TestHashPartitioner, TestFiltering, RestartWhileUpdatingTest, TestSolrCoreProperties, TestBulkSchemaAPI, ChaosMonkeyNothingIsSafeTest, TestCodecSupport, TestSolrDeletionPolicy2, TestPartialUpdateDeduplication, TestFieldCollectionResource, ConnectionManagerTest, CloneFieldUpdateProcessorFactoryTest, MergeStrategyTest, BlockCacheTest, TestDocBasedVersionConstraints, CollectionsAPIDistributedZkTest, DirectSolrSpellCheckerTest, SimpleMLTQParserTest, TestDistributedGrouping, ZkSolrClientTest, TestSolrDynamicMBean, TestUniqueKeyFieldResource, NumericFieldsTest, OpenExchangeRatesOrgProviderTest, DocValuesMissingTest, DeleteLastCustomShardedReplicaTest, TestSurroundQueryParser, TestFilteredDocIdSet, TestRTimerTree, SpatialFilterTest, TestSchemaResource, SolrInfoMBeanTest, OverseerRolesTest, SolrXmlInZkTest, BadCopyFieldTest, TimeZoneUtilsTest, SimplePostToolTest, TestAddFieldRealTimeGet, SmileWriterTest, TestDefaultSearchFieldResource, SyncSliceTest, OverseerTest, TestReplicationHandler]
   [junit4] Completed [305/575 (1!)] on J1 in 109.44s, 13 tests, 1 error <<< FAILURES!

[...truncated 863 lines...]
BUILD FAILED
/home/jenkins/workspace/Lucene-Solr-trunk-Linux/build.xml:784: The following error occurred while executing this line:
/home/jenkins/workspace/Lucene-Solr-trunk-Linux/build.xml:728: The following error occurred while executing this line:
/home/jenkins/workspace/Lucene-Solr-trunk-Linux/build.xml:59: The following error occurred while executing this line:
/home/jenkins/workspace/Lucene-Solr-trunk-Linux/solr/build.xml:233: The following error occurred while executing this line:
/home/jenkins/workspace/Lucene-Solr-trunk-Linux/solr/common-build.xml:516: The following error occurred while executing this line:
/home/jenkins/workspace/Lucene-Solr-trunk-Linux/lucene/common-build.xml:1424: The following error occurred while executing this line:
/home/jenkins/workspace/Lucene-Solr-trunk-Linux/lucene/common-build.xml:981: There were test failures: 575 suites (8 ignored), 2290 tests, 1 error, 115 ignored (70 assumptions) [seed: 398BDAFA08197A52]

Total time: 54 minutes 58 seconds
Build step 'Invoke Ant' marked build as failure
Archiving artifacts
[WARNINGS] Skipping publisher since build result is FAILURE
Recording test results
Email was triggered for: Failure - Any
Sending email for trigger: Failure - Any



Mime
View raw message