lucene-dev mailing list archives

Site index · List index
Message view « Date » · « Thread »
Top « Date » · « Thread »
From Policeman Jenkins Server <jenk...@thetaphi.de>
Subject [JENKINS] Lucene-Solr-5.x-Windows (32bit/jdk1.7.0_80) - Build # 5408 - Failure!
Date Sun, 10 Jan 2016 16:27:11 GMT
Build: http://jenkins.thetaphi.de/job/Lucene-Solr-5.x-Windows/5408/
Java: 32bit/jdk1.7.0_80 -client -XX:+UseParallelGC

1 tests failed.
FAILED:  junit.framework.TestSuite.org.apache.solr.handler.TestSolrConfigHandlerCloud

Error Message:
ObjectTracker found 3 object(s) that were not released!!! [MockDirectoryWrapper, MockDirectoryWrapper, MDCAwareThreadPoolExecutor]

Stack Trace:
java.lang.AssertionError: ObjectTracker found 3 object(s) that were not released!!! [MockDirectoryWrapper, MockDirectoryWrapper, MDCAwareThreadPoolExecutor]
	at __randomizedtesting.SeedInfo.seed([353B07C2896C3E8]:0)
	at org.junit.Assert.fail(Assert.java:93)
	at org.junit.Assert.assertTrue(Assert.java:43)
	at org.junit.Assert.assertNull(Assert.java:551)
	at org.apache.solr.SolrTestCaseJ4.afterClass(SolrTestCaseJ4.java:228)
	at sun.reflect.GeneratedMethodAccessor21.invoke(Unknown Source)
	at sun.reflect.DelegatingMethodAccessorImpl.invoke(DelegatingMethodAccessorImpl.java:43)
	at java.lang.reflect.Method.invoke(Method.java:606)
	at com.carrotsearch.randomizedtesting.RandomizedRunner.invoke(RandomizedRunner.java:1764)
	at com.carrotsearch.randomizedtesting.RandomizedRunner$7.evaluate(RandomizedRunner.java:834)
	at com.carrotsearch.randomizedtesting.rules.StatementAdapter.evaluate(StatementAdapter.java:36)
	at com.carrotsearch.randomizedtesting.rules.SystemPropertiesRestoreRule$1.evaluate(SystemPropertiesRestoreRule.java:57)
	at org.apache.lucene.util.AbstractBeforeAfterRule$1.evaluate(AbstractBeforeAfterRule.java:46)
	at com.carrotsearch.randomizedtesting.rules.StatementAdapter.evaluate(StatementAdapter.java:36)
	at org.apache.lucene.util.TestRuleStoreClassName$1.evaluate(TestRuleStoreClassName.java:42)
	at com.carrotsearch.randomizedtesting.rules.NoShadowingOrOverridesOnMethodsRule$1.evaluate(NoShadowingOrOverridesOnMethodsRule.java:40)
	at com.carrotsearch.randomizedtesting.rules.NoShadowingOrOverridesOnMethodsRule$1.evaluate(NoShadowingOrOverridesOnMethodsRule.java:40)
	at com.carrotsearch.randomizedtesting.rules.StatementAdapter.evaluate(StatementAdapter.java:36)
	at com.carrotsearch.randomizedtesting.rules.StatementAdapter.evaluate(StatementAdapter.java:36)
	at com.carrotsearch.randomizedtesting.rules.StatementAdapter.evaluate(StatementAdapter.java:36)
	at org.apache.lucene.util.TestRuleAssertionsRequired$1.evaluate(TestRuleAssertionsRequired.java:54)
	at org.apache.lucene.util.TestRuleMarkFailure$1.evaluate(TestRuleMarkFailure.java:48)
	at org.apache.lucene.util.TestRuleIgnoreAfterMaxFailures$1.evaluate(TestRuleIgnoreAfterMaxFailures.java:65)
	at org.apache.lucene.util.TestRuleIgnoreTestSuites$1.evaluate(TestRuleIgnoreTestSuites.java:55)
	at com.carrotsearch.randomizedtesting.rules.StatementAdapter.evaluate(StatementAdapter.java:36)
	at com.carrotsearch.randomizedtesting.ThreadLeakControl$StatementRunner.run(ThreadLeakControl.java:367)
	at java.lang.Thread.run(Thread.java:745)




Build Log:
[...truncated 11274 lines...]
   [junit4] Suite: org.apache.solr.handler.TestSolrConfigHandlerCloud
   [junit4]   2> Creating dataDir: C:\Users\JenkinsSlave\workspace\Lucene-Solr-5.x-Windows\solr\build\solr-core\test\J0\temp\solr.handler.TestSolrConfigHandlerCloud_353B07C2896C3E8-001\init-core-data-001
   [junit4]   2> 2892976 INFO  (SUITE-TestSolrConfigHandlerCloud-seed#[353B07C2896C3E8]-worker) [    ] o.a.s.SolrTestCaseJ4 Randomized ssl (false) and clientAuth (true)
   [junit4]   2> 2892976 INFO  (SUITE-TestSolrConfigHandlerCloud-seed#[353B07C2896C3E8]-worker) [    ] o.a.s.BaseDistributedSearchTestCase Setting hostContext system property: /ow_me/r
   [junit4]   2> 2892979 INFO  (TEST-TestSolrConfigHandlerCloud.test-seed#[353B07C2896C3E8]) [    ] o.a.s.c.ZkTestServer STARTING ZK TEST SERVER
   [junit4]   2> 2892980 INFO  (Thread-6999) [    ] o.a.s.c.ZkTestServer client port:0.0.0.0/0.0.0.0:0
   [junit4]   2> 2892980 INFO  (Thread-6999) [    ] o.a.s.c.ZkTestServer Starting server
   [junit4]   2> 2893078 INFO  (TEST-TestSolrConfigHandlerCloud.test-seed#[353B07C2896C3E8]) [    ] o.a.s.c.ZkTestServer start zk server on port:62314
   [junit4]   2> 2893078 INFO  (TEST-TestSolrConfigHandlerCloud.test-seed#[353B07C2896C3E8]) [    ] o.a.s.c.c.SolrZkClient Using default ZkCredentialsProvider
   [junit4]   2> 2893080 INFO  (TEST-TestSolrConfigHandlerCloud.test-seed#[353B07C2896C3E8]) [    ] o.a.s.c.c.ConnectionManager Waiting for client to connect to ZooKeeper
   [junit4]   2> 2893082 INFO  (zkCallback-2279-thread-1) [    ] o.a.s.c.c.ConnectionManager Watcher org.apache.solr.common.cloud.ConnectionManager@1c74e15 name:ZooKeeperConnection Watcher:127.0.0.1:62314 got event WatchedEvent state:SyncConnected type:None path:null path:null type:None
   [junit4]   2> 2893082 INFO  (TEST-TestSolrConfigHandlerCloud.test-seed#[353B07C2896C3E8]) [    ] o.a.s.c.c.ConnectionManager Client is connected to ZooKeeper
   [junit4]   2> 2893082 INFO  (TEST-TestSolrConfigHandlerCloud.test-seed#[353B07C2896C3E8]) [    ] o.a.s.c.c.SolrZkClient Using default ZkACLProvider
   [junit4]   2> 2893082 INFO  (TEST-TestSolrConfigHandlerCloud.test-seed#[353B07C2896C3E8]) [    ] o.a.s.c.c.SolrZkClient makePath: /solr
   [junit4]   2> 2893085 INFO  (TEST-TestSolrConfigHandlerCloud.test-seed#[353B07C2896C3E8]) [    ] o.a.s.c.c.SolrZkClient Using default ZkCredentialsProvider
   [junit4]   2> 2893086 INFO  (TEST-TestSolrConfigHandlerCloud.test-seed#[353B07C2896C3E8]) [    ] o.a.s.c.c.ConnectionManager Waiting for client to connect to ZooKeeper
   [junit4]   2> 2893087 INFO  (zkCallback-2280-thread-1) [    ] o.a.s.c.c.ConnectionManager Watcher org.apache.solr.common.cloud.ConnectionManager@4151c2 name:ZooKeeperConnection Watcher:127.0.0.1:62314/solr got event WatchedEvent state:SyncConnected type:None path:null path:null type:None
   [junit4]   2> 2893088 INFO  (TEST-TestSolrConfigHandlerCloud.test-seed#[353B07C2896C3E8]) [    ] o.a.s.c.c.ConnectionManager Client is connected to ZooKeeper
   [junit4]   2> 2893088 INFO  (TEST-TestSolrConfigHandlerCloud.test-seed#[353B07C2896C3E8]) [    ] o.a.s.c.c.SolrZkClient Using default ZkACLProvider
   [junit4]   2> 2893088 INFO  (TEST-TestSolrConfigHandlerCloud.test-seed#[353B07C2896C3E8]) [    ] o.a.s.c.c.SolrZkClient makePath: /collections/collection1
   [junit4]   2> 2893090 INFO  (TEST-TestSolrConfigHandlerCloud.test-seed#[353B07C2896C3E8]) [    ] o.a.s.c.c.SolrZkClient makePath: /collections/collection1/shards
   [junit4]   2> 2893092 INFO  (TEST-TestSolrConfigHandlerCloud.test-seed#[353B07C2896C3E8]) [    ] o.a.s.c.c.SolrZkClient makePath: /collections/control_collection
   [junit4]   2> 2893094 INFO  (TEST-TestSolrConfigHandlerCloud.test-seed#[353B07C2896C3E8]) [    ] o.a.s.c.c.SolrZkClient makePath: /collections/control_collection/shards
   [junit4]   2> 2893096 INFO  (TEST-TestSolrConfigHandlerCloud.test-seed#[353B07C2896C3E8]) [    ] o.a.s.c.AbstractZkTestCase put C:\Users\JenkinsSlave\workspace\Lucene-Solr-5.x-Windows\solr\core\src\test-files\solr\collection1\conf\solrconfig-tlog.xml to /configs/conf1/solrconfig.xml
   [junit4]   2> 2893096 INFO  (TEST-TestSolrConfigHandlerCloud.test-seed#[353B07C2896C3E8]) [    ] o.a.s.c.c.SolrZkClient makePath: /configs/conf1/solrconfig.xml
   [junit4]   2> 2893099 INFO  (TEST-TestSolrConfigHandlerCloud.test-seed#[353B07C2896C3E8]) [    ] o.a.s.c.AbstractZkTestCase put C:\Users\JenkinsSlave\workspace\Lucene-Solr-5.x-Windows\solr\core\src\test-files\solr\collection1\conf\schema.xml to /configs/conf1/schema.xml
   [junit4]   2> 2893099 INFO  (TEST-TestSolrConfigHandlerCloud.test-seed#[353B07C2896C3E8]) [    ] o.a.s.c.c.SolrZkClient makePath: /configs/conf1/schema.xml
   [junit4]   2> 2893102 INFO  (TEST-TestSolrConfigHandlerCloud.test-seed#[353B07C2896C3E8]) [    ] o.a.s.c.AbstractZkTestCase put C:\Users\JenkinsSlave\workspace\Lucene-Solr-5.x-Windows\solr\core\src\test-files\solr\collection1\conf\solrconfig.snippet.randomindexconfig.xml to /configs/conf1/solrconfig.snippet.randomindexconfig.xml
   [junit4]   2> 2893102 INFO  (TEST-TestSolrConfigHandlerCloud.test-seed#[353B07C2896C3E8]) [    ] o.a.s.c.c.SolrZkClient makePath: /configs/conf1/solrconfig.snippet.randomindexconfig.xml
   [junit4]   2> 2893103 INFO  (TEST-TestSolrConfigHandlerCloud.test-seed#[353B07C2896C3E8]) [    ] o.a.s.c.AbstractZkTestCase put C:\Users\JenkinsSlave\workspace\Lucene-Solr-5.x-Windows\solr\core\src\test-files\solr\collection1\conf\stopwords.txt to /configs/conf1/stopwords.txt
   [junit4]   2> 2893103 INFO  (TEST-TestSolrConfigHandlerCloud.test-seed#[353B07C2896C3E8]) [    ] o.a.s.c.c.SolrZkClient makePath: /configs/conf1/stopwords.txt
   [junit4]   2> 2893105 INFO  (TEST-TestSolrConfigHandlerCloud.test-seed#[353B07C2896C3E8]) [    ] o.a.s.c.AbstractZkTestCase put C:\Users\JenkinsSlave\workspace\Lucene-Solr-5.x-Windows\solr\core\src\test-files\solr\collection1\conf\protwords.txt to /configs/conf1/protwords.txt
   [junit4]   2> 2893106 INFO  (TEST-TestSolrConfigHandlerCloud.test-seed#[353B07C2896C3E8]) [    ] o.a.s.c.c.SolrZkClient makePath: /configs/conf1/protwords.txt
   [junit4]   2> 2893108 INFO  (TEST-TestSolrConfigHandlerCloud.test-seed#[353B07C2896C3E8]) [    ] o.a.s.c.AbstractZkTestCase put C:\Users\JenkinsSlave\workspace\Lucene-Solr-5.x-Windows\solr\core\src\test-files\solr\collection1\conf\currency.xml to /configs/conf1/currency.xml
   [junit4]   2> 2893108 INFO  (TEST-TestSolrConfigHandlerCloud.test-seed#[353B07C2896C3E8]) [    ] o.a.s.c.c.SolrZkClient makePath: /configs/conf1/currency.xml
   [junit4]   2> 2893110 INFO  (TEST-TestSolrConfigHandlerCloud.test-seed#[353B07C2896C3E8]) [    ] o.a.s.c.AbstractZkTestCase put C:\Users\JenkinsSlave\workspace\Lucene-Solr-5.x-Windows\solr\core\src\test-files\solr\collection1\conf\enumsConfig.xml to /configs/conf1/enumsConfig.xml
   [junit4]   2> 2893110 INFO  (TEST-TestSolrConfigHandlerCloud.test-seed#[353B07C2896C3E8]) [    ] o.a.s.c.c.SolrZkClient makePath: /configs/conf1/enumsConfig.xml
   [junit4]   2> 2893112 INFO  (TEST-TestSolrConfigHandlerCloud.test-seed#[353B07C2896C3E8]) [    ] o.a.s.c.AbstractZkTestCase put C:\Users\JenkinsSlave\workspace\Lucene-Solr-5.x-Windows\solr\core\src\test-files\solr\collection1\conf\open-exchange-rates.json to /configs/conf1/open-exchange-rates.json
   [junit4]   2> 2893113 INFO  (TEST-TestSolrConfigHandlerCloud.test-seed#[353B07C2896C3E8]) [    ] o.a.s.c.c.SolrZkClient makePath: /configs/conf1/open-exchange-rates.json
   [junit4]   2> 2893115 INFO  (TEST-TestSolrConfigHandlerCloud.test-seed#[353B07C2896C3E8]) [    ] o.a.s.c.AbstractZkTestCase put C:\Users\JenkinsSlave\workspace\Lucene-Solr-5.x-Windows\solr\core\src\test-files\solr\collection1\conf\mapping-ISOLatin1Accent.txt to /configs/conf1/mapping-ISOLatin1Accent.txt
   [junit4]   2> 2893115 INFO  (TEST-TestSolrConfigHandlerCloud.test-seed#[353B07C2896C3E8]) [    ] o.a.s.c.c.SolrZkClient makePath: /configs/conf1/mapping-ISOLatin1Accent.txt
   [junit4]   2> 2893117 INFO  (TEST-TestSolrConfigHandlerCloud.test-seed#[353B07C2896C3E8]) [    ] o.a.s.c.AbstractZkTestCase put C:\Users\JenkinsSlave\workspace\Lucene-Solr-5.x-Windows\solr\core\src\test-files\solr\collection1\conf\old_synonyms.txt to /configs/conf1/old_synonyms.txt
   [junit4]   2> 2893117 INFO  (TEST-TestSolrConfigHandlerCloud.test-seed#[353B07C2896C3E8]) [    ] o.a.s.c.c.SolrZkClient makePath: /configs/conf1/old_synonyms.txt
   [junit4]   2> 2893120 INFO  (TEST-TestSolrConfigHandlerCloud.test-seed#[353B07C2896C3E8]) [    ] o.a.s.c.AbstractZkTestCase put C:\Users\JenkinsSlave\workspace\Lucene-Solr-5.x-Windows\solr\core\src\test-files\solr\collection1\conf\synonyms.txt to /configs/conf1/synonyms.txt
   [junit4]   2> 2893120 INFO  (TEST-TestSolrConfigHandlerCloud.test-seed#[353B07C2896C3E8]) [    ] o.a.s.c.c.SolrZkClient makePath: /configs/conf1/synonyms.txt
   [junit4]   2> 2893621 INFO  (TEST-TestSolrConfigHandlerCloud.test-seed#[353B07C2896C3E8]) [    ] o.a.s.SolrTestCaseJ4 Writing core.properties file to C:\Users\JenkinsSlave\workspace\Lucene-Solr-5.x-Windows\solr\build\solr-core\test\J0\temp\solr.handler.TestSolrConfigHandlerCloud_353B07C2896C3E8-001\control-001\cores\collection1
   [junit4]   2> 2893624 INFO  (TEST-TestSolrConfigHandlerCloud.test-seed#[353B07C2896C3E8]) [    ] o.e.j.s.Server jetty-9.2.13.v20150730
   [junit4]   2> 2893626 INFO  (TEST-TestSolrConfigHandlerCloud.test-seed#[353B07C2896C3E8]) [    ] o.e.j.s.h.ContextHandler Started o.e.j.s.ServletContextHandler@1b2b09c{/ow_me/r,null,AVAILABLE}
   [junit4]   2> 2893627 INFO  (TEST-TestSolrConfigHandlerCloud.test-seed#[353B07C2896C3E8]) [    ] o.e.j.s.ServerConnector Started ServerConnector@68d7c4{HTTP/1.1}{127.0.0.1:62321}
   [junit4]   2> 2893627 INFO  (TEST-TestSolrConfigHandlerCloud.test-seed#[353B07C2896C3E8]) [    ] o.e.j.s.Server Started @2896271ms
   [junit4]   2> 2893627 INFO  (TEST-TestSolrConfigHandlerCloud.test-seed#[353B07C2896C3E8]) [    ] o.a.s.c.s.e.JettySolrRunner Jetty properties: {solr.data.dir=C:\Users\JenkinsSlave\workspace\Lucene-Solr-5.x-Windows\solr\build\solr-core\test\J0\temp\solr.handler.TestSolrConfigHandlerCloud_353B07C2896C3E8-001\tempDir-001/control/data, coreRootDirectory=C:\Users\JenkinsSlave\workspace\Lucene-Solr-5.x-Windows\solr\build\solr-core\test\J0\..\..\..\..\..\..\..\..\..\Users\JenkinsSlave\workspace\Lucene-Solr-5.x-Windows\solr\build\solr-core\test\J0\temp\solr.handler.TestSolrConfigHandlerCloud_353B07C2896C3E8-001\control-001\cores, hostPort=62321, hostContext=/ow_me/r}
   [junit4]   2> 2893628 INFO  (TEST-TestSolrConfigHandlerCloud.test-seed#[353B07C2896C3E8]) [    ] o.a.s.s.SolrDispatchFilter SolrDispatchFilter.init(): sun.misc.Launcher$AppClassLoader@6d23ea
   [junit4]   2> 2893628 INFO  (TEST-TestSolrConfigHandlerCloud.test-seed#[353B07C2896C3E8]) [    ] o.a.s.c.SolrResourceLoader new SolrResourceLoader for directory: 'C:\Users\JenkinsSlave\workspace\Lucene-Solr-5.x-Windows\solr\build\solr-core\test\J0\temp\solr.handler.TestSolrConfigHandlerCloud_353B07C2896C3E8-001\control-001'
   [junit4]   2> 2893628 INFO  (TEST-TestSolrConfigHandlerCloud.test-seed#[353B07C2896C3E8]) [    ] o.a.s.c.SolrResourceLoader JNDI not configured for solr (NoInitialContextEx)
   [junit4]   2> 2893628 INFO  (TEST-TestSolrConfigHandlerCloud.test-seed#[353B07C2896C3E8]) [    ] o.a.s.c.SolrResourceLoader solr home defaulted to 'solr/' (could not find system property or JNDI)
   [junit4]   2> 2893628 INFO  (TEST-TestSolrConfigHandlerCloud.test-seed#[353B07C2896C3E8]) [    ] o.a.s.c.c.SolrZkClient Using default ZkCredentialsProvider
   [junit4]   2> 2893629 INFO  (TEST-TestSolrConfigHandlerCloud.test-seed#[353B07C2896C3E8]) [    ] o.a.s.c.c.ConnectionManager Waiting for client to connect to ZooKeeper
   [junit4]   2> 2893631 INFO  (zkCallback-2281-thread-1) [    ] o.a.s.c.c.ConnectionManager Watcher org.apache.solr.common.cloud.ConnectionManager@19ec8f1 name:ZooKeeperConnection Watcher:127.0.0.1:62314/solr got event WatchedEvent state:SyncConnected type:None path:null path:null type:None
   [junit4]   2> 2893631 INFO  (TEST-TestSolrConfigHandlerCloud.test-seed#[353B07C2896C3E8]) [    ] o.a.s.c.c.ConnectionManager Client is connected to ZooKeeper
   [junit4]   2> 2893631 INFO  (TEST-TestSolrConfigHandlerCloud.test-seed#[353B07C2896C3E8]) [    ] o.a.s.c.c.SolrZkClient Using default ZkACLProvider
   [junit4]   2> 2893632 INFO  (TEST-TestSolrConfigHandlerCloud.test-seed#[353B07C2896C3E8]) [    ] o.a.s.s.SolrDispatchFilter Loading solr.xml from SolrHome (not found in ZooKeeper)
   [junit4]   2> 2893633 INFO  (TEST-TestSolrConfigHandlerCloud.test-seed#[353B07C2896C3E8]) [    ] o.a.s.c.SolrXmlConfig Loading container configuration from C:\Users\JenkinsSlave\workspace\Lucene-Solr-5.x-Windows\solr\build\solr-core\test\J0\temp\solr.handler.TestSolrConfigHandlerCloud_353B07C2896C3E8-001\control-001\solr.xml
   [junit4]   2> 2893660 INFO  (TEST-TestSolrConfigHandlerCloud.test-seed#[353B07C2896C3E8]) [    ] o.a.s.c.CorePropertiesLocator Config-defined core root directory: C:\Users\JenkinsSlave\workspace\Lucene-Solr-5.x-Windows\solr\build\solr-core\test\J0\..\..\..\..\..\..\..\..\..\Users\JenkinsSlave\workspace\Lucene-Solr-5.x-Windows\solr\build\solr-core\test\J0\temp\solr.handler.TestSolrConfigHandlerCloud_353B07C2896C3E8-001\control-001\cores
   [junit4]   2> 2893660 INFO  (TEST-TestSolrConfigHandlerCloud.test-seed#[353B07C2896C3E8]) [    ] o.a.s.c.CoreContainer New CoreContainer 6919996
   [junit4]   2> 2893660 INFO  (TEST-TestSolrConfigHandlerCloud.test-seed#[353B07C2896C3E8]) [    ] o.a.s.c.CoreContainer Loading cores into CoreContainer [instanceDir=C:\Users\JenkinsSlave\workspace\Lucene-Solr-5.x-Windows\solr\build\solr-core\test\J0\temp\solr.handler.TestSolrConfigHandlerCloud_353B07C2896C3E8-001\control-001]
   [junit4]   2> 2893660 WARN  (TEST-TestSolrConfigHandlerCloud.test-seed#[353B07C2896C3E8]) [    ] o.a.s.c.CoreContainer Couldn't add files from C:\Users\JenkinsSlave\workspace\Lucene-Solr-5.x-Windows\solr\build\solr-core\test\J0\temp\solr.handler.TestSolrConfigHandlerCloud_353B07C2896C3E8-001\control-001\lib to classpath: C:\Users\JenkinsSlave\workspace\Lucene-Solr-5.x-Windows\solr\build\solr-core\test\J0\temp\solr.handler.TestSolrConfigHandlerCloud_353B07C2896C3E8-001\control-001\lib
   [junit4]   2> 2893660 INFO  (TEST-TestSolrConfigHandlerCloud.test-seed#[353B07C2896C3E8]) [    ] o.a.s.h.c.HttpShardHandlerFactory created with socketTimeout : 90000,urlScheme : ,connTimeout : 15000,maxConnectionsPerHost : 20,maxConnections : 10000,corePoolSize : 0,maximumPoolSize : 2147483647,maxThreadIdleTime : 5,sizeOfQueue : -1,fairnessPolicy : false,useRetries : false,
   [junit4]   2> 2893663 INFO  (TEST-TestSolrConfigHandlerCloud.test-seed#[353B07C2896C3E8]) [    ] o.a.s.u.UpdateShardHandler Creating UpdateShardHandler HTTP client with params: socketTimeout=340000&connTimeout=45000&retry=true
   [junit4]   2> 2893664 INFO  (TEST-TestSolrConfigHandlerCloud.test-seed#[353B07C2896C3E8]) [    ] o.a.s.l.LogWatcher SLF4J impl is org.slf4j.impl.Log4jLoggerFactory
   [junit4]   2> 2893664 INFO  (TEST-TestSolrConfigHandlerCloud.test-seed#[353B07C2896C3E8]) [    ] o.a.s.l.LogWatcher Registering Log Listener [Log4j (org.slf4j.impl.Log4jLoggerFactory)]
   [junit4]   2> 2893664 INFO  (TEST-TestSolrConfigHandlerCloud.test-seed#[353B07C2896C3E8]) [    ] o.a.s.c.ZkContainer Zookeeper client=127.0.0.1:62314/solr
   [junit4]   2> 2893664 INFO  (TEST-TestSolrConfigHandlerCloud.test-seed#[353B07C2896C3E8]) [    ] o.a.s.c.ZkController zkHost includes chroot
   [junit4]   2> 2893664 INFO  (TEST-TestSolrConfigHandlerCloud.test-seed#[353B07C2896C3E8]) [    ] o.a.s.c.c.SolrZkClient Using default ZkCredentialsProvider
   [junit4]   2> 2893666 INFO  (TEST-TestSolrConfigHandlerCloud.test-seed#[353B07C2896C3E8]) [    ] o.a.s.c.c.ConnectionManager Waiting for client to connect to ZooKeeper
   [junit4]   2> 2893667 INFO  (zkCallback-2283-thread-1) [    ] o.a.s.c.c.ConnectionManager Watcher org.apache.solr.common.cloud.ConnectionManager@8bf30d name:ZooKeeperConnection Watcher:127.0.0.1:62314 got event WatchedEvent state:SyncConnected type:None path:null path:null type:None
   [junit4]   2> 2893667 INFO  (TEST-TestSolrConfigHandlerCloud.test-seed#[353B07C2896C3E8]) [    ] o.a.s.c.c.ConnectionManager Client is connected to ZooKeeper
   [junit4]   2> 2893668 INFO  (TEST-TestSolrConfigHandlerCloud.test-seed#[353B07C2896C3E8]) [    ] o.a.s.c.c.SolrZkClient Using default ZkACLProvider
   [junit4]   2> 2893670 INFO  (TEST-TestSolrConfigHandlerCloud.test-seed#[353B07C2896C3E8]) [n:127.0.0.1:62321_ow_me%2Fr    ] o.a.s.c.c.ConnectionManager Waiting for client to connect to ZooKeeper
   [junit4]   2> 2893671 INFO  (zkCallback-2284-thread-1-processing-n:127.0.0.1:62321_ow_me%2Fr) [n:127.0.0.1:62321_ow_me%2Fr    ] o.a.s.c.c.ConnectionManager Watcher org.apache.solr.common.cloud.ConnectionManager@6bab0b name:ZooKeeperConnection Watcher:127.0.0.1:62314/solr got event WatchedEvent state:SyncConnected type:None path:null path:null type:None
   [junit4]   2> 2893671 INFO  (TEST-TestSolrConfigHandlerCloud.test-seed#[353B07C2896C3E8]) [n:127.0.0.1:62321_ow_me%2Fr    ] o.a.s.c.c.ConnectionManager Client is connected to ZooKeeper
   [junit4]   2> 2893672 INFO  (TEST-TestSolrConfigHandlerCloud.test-seed#[353B07C2896C3E8]) [n:127.0.0.1:62321_ow_me%2Fr    ] o.a.s.c.c.SolrZkClient makePath: /overseer/queue
   [junit4]   2> 2893676 INFO  (TEST-TestSolrConfigHandlerCloud.test-seed#[353B07C2896C3E8]) [n:127.0.0.1:62321_ow_me%2Fr    ] o.a.s.c.c.SolrZkClient makePath: /overseer/collection-queue-work
   [junit4]   2> 2893680 INFO  (TEST-TestSolrConfigHandlerCloud.test-seed#[353B07C2896C3E8]) [n:127.0.0.1:62321_ow_me%2Fr    ] o.a.s.c.c.SolrZkClient makePath: /overseer/collection-map-running
   [junit4]   2> 2893682 INFO  (TEST-TestSolrConfigHandlerCloud.test-seed#[353B07C2896C3E8]) [n:127.0.0.1:62321_ow_me%2Fr    ] o.a.s.c.c.SolrZkClient makePath: /overseer/collection-map-completed
   [junit4]   2> 2893683 INFO  (TEST-TestSolrConfigHandlerCloud.test-seed#[353B07C2896C3E8]) [n:127.0.0.1:62321_ow_me%2Fr    ] o.a.s.c.c.SolrZkClient makePath: /overseer/collection-map-failure
   [junit4]   2> 2893686 INFO  (TEST-TestSolrConfigHandlerCloud.test-seed#[353B07C2896C3E8]) [n:127.0.0.1:62321_ow_me%2Fr    ] o.a.s.c.c.SolrZkClient makePath: /live_nodes
   [junit4]   2> 2893688 INFO  (TEST-TestSolrConfigHandlerCloud.test-seed#[353B07C2896C3E8]) [n:127.0.0.1:62321_ow_me%2Fr    ] o.a.s.c.c.SolrZkClient makePath: /aliases.json
   [junit4]   2> 2893690 INFO  (TEST-TestSolrConfigHandlerCloud.test-seed#[353B07C2896C3E8]) [n:127.0.0.1:62321_ow_me%2Fr    ] o.a.s.c.c.SolrZkClient makePath: /clusterstate.json
   [junit4]   2> 2893691 INFO  (TEST-TestSolrConfigHandlerCloud.test-seed#[353B07C2896C3E8]) [n:127.0.0.1:62321_ow_me%2Fr    ] o.a.s.c.c.SolrZkClient makePath: /security.json
   [junit4]   2> 2893692 INFO  (TEST-TestSolrConfigHandlerCloud.test-seed#[353B07C2896C3E8]) [n:127.0.0.1:62321_ow_me%2Fr    ] o.a.s.c.ZkController Register node as live in ZooKeeper:/live_nodes/127.0.0.1:62321_ow_me%2Fr
   [junit4]   2> 2893693 INFO  (TEST-TestSolrConfigHandlerCloud.test-seed#[353B07C2896C3E8]) [n:127.0.0.1:62321_ow_me%2Fr    ] o.a.s.c.c.SolrZkClient makePath: /live_nodes/127.0.0.1:62321_ow_me%2Fr
   [junit4]   2> 2893695 INFO  (TEST-TestSolrConfigHandlerCloud.test-seed#[353B07C2896C3E8]) [n:127.0.0.1:62321_ow_me%2Fr    ] o.a.s.c.c.SolrZkClient makePath: /overseer_elect
   [junit4]   2> 2893696 INFO  (TEST-TestSolrConfigHandlerCloud.test-seed#[353B07C2896C3E8]) [n:127.0.0.1:62321_ow_me%2Fr    ] o.a.s.c.c.SolrZkClient makePath: /overseer_elect/election
   [junit4]   2> 2893698 INFO  (TEST-TestSolrConfigHandlerCloud.test-seed#[353B07C2896C3E8]) [n:127.0.0.1:62321_ow_me%2Fr    ] o.a.s.c.Overseer Overseer (id=null) closing
   [junit4]   2> 2893699 INFO  (TEST-TestSolrConfigHandlerCloud.test-seed#[353B07C2896C3E8]) [n:127.0.0.1:62321_ow_me%2Fr    ] o.a.s.c.LeaderElector Joined leadership election with path: /overseer_elect/election/95187287043801092-127.0.0.1:62321_ow_me%2Fr-n_0000000000
   [junit4]   2> 2893699 INFO  (TEST-TestSolrConfigHandlerCloud.test-seed#[353B07C2896C3E8]) [n:127.0.0.1:62321_ow_me%2Fr    ] o.a.s.c.OverseerElectionContext I am going to be the leader 127.0.0.1:62321_ow_me%2Fr
   [junit4]   2> 2893699 INFO  (TEST-TestSolrConfigHandlerCloud.test-seed#[353B07C2896C3E8]) [n:127.0.0.1:62321_ow_me%2Fr    ] o.a.s.c.c.SolrZkClient makePath: /overseer_elect/leader
   [junit4]   2> 2893702 INFO  (TEST-TestSolrConfigHandlerCloud.test-seed#[353B07C2896C3E8]) [n:127.0.0.1:62321_ow_me%2Fr    ] o.a.s.c.Overseer Overseer (id=95187287043801092-127.0.0.1:62321_ow_me%2Fr-n_0000000000) starting
   [junit4]   2> 2893704 INFO  (TEST-TestSolrConfigHandlerCloud.test-seed#[353B07C2896C3E8]) [n:127.0.0.1:62321_ow_me%2Fr    ] o.a.s.c.c.SolrZkClient makePath: /overseer/queue-work
   [junit4]   2> 2893710 INFO  (TEST-TestSolrConfigHandlerCloud.test-seed#[353B07C2896C3E8]) [n:127.0.0.1:62321_ow_me%2Fr    ] o.a.s.c.OverseerAutoReplicaFailoverThread Starting OverseerAutoReplicaFailoverThread autoReplicaFailoverWorkLoopDelay=10000 autoReplicaFailoverWaitAfterExpiration=30000 autoReplicaFailoverBadNodeExpiration=60000
   [junit4]   2> 2893711 INFO  (OverseerCollectionConfigSetProcessor-95187287043801092-127.0.0.1:62321_ow_me%2Fr-n_0000000000) [n:127.0.0.1:62321_ow_me%2Fr    ] o.a.s.c.OverseerTaskProcessor Process current queue of overseer operations
   [junit4]   2> 2893711 INFO  (TEST-TestSolrConfigHandlerCloud.test-seed#[353B07C2896C3E8]) [n:127.0.0.1:62321_ow_me%2Fr    ] o.a.s.c.c.ZkStateReader Updating cluster state from ZooKeeper... 
   [junit4]   2> 2893711 INFO  (OverseerStateUpdate-95187287043801092-127.0.0.1:62321_ow_me%2Fr-n_0000000000) [n:127.0.0.1:62321_ow_me%2Fr    ] o.a.s.c.Overseer Starting to work on the main queue
   [junit4]   2> 2893742 INFO  (TEST-TestSolrConfigHandlerCloud.test-seed#[353B07C2896C3E8]) [n:127.0.0.1:62321_ow_me%2Fr    ] o.a.s.c.CoreContainer Security conf doesn't exist. Skipping setup for authorization module.
   [junit4]   2> 2893742 INFO  (TEST-TestSolrConfigHandlerCloud.test-seed#[353B07C2896C3E8]) [n:127.0.0.1:62321_ow_me%2Fr    ] o.a.s.c.CoreContainer No authentication plugin used.
   [junit4]   2> 2893743 INFO  (TEST-TestSolrConfigHandlerCloud.test-seed#[353B07C2896C3E8]) [n:127.0.0.1:62321_ow_me%2Fr    ] o.a.s.c.CorePropertiesLocator Looking for core definitions underneath C:\Users\JenkinsSlave\workspace\Lucene-Solr-5.x-Windows\solr\build\solr-core\test\J0\..\..\..\..\..\..\..\..\..\Users\JenkinsSlave\workspace\Lucene-Solr-5.x-Windows\solr\build\solr-core\test\J0\temp\solr.handler.TestSolrConfigHandlerCloud_353B07C2896C3E8-001\control-001\cores
   [junit4]   2> 2893746 INFO  (TEST-TestSolrConfigHandlerCloud.test-seed#[353B07C2896C3E8]) [n:127.0.0.1:62321_ow_me%2Fr    ] o.a.s.c.CoreDescriptor Created CoreDescriptor: {schema=schema.xml, collection=control_collection, coreNodeName=, config=solrconfig.xml, transient=false, shard=, configSetProperties=configsetprops.json, name=collection1, loadOnStartup=true, dataDir=data\}
   [junit4]   2> 2893746 INFO  (TEST-TestSolrConfigHandlerCloud.test-seed#[353B07C2896C3E8]) [n:127.0.0.1:62321_ow_me%2Fr    ] o.a.s.c.CorePropertiesLocator Found core collection1 in C:\Users\JenkinsSlave\workspace\Lucene-Solr-5.x-Windows\solr\build\solr-core\test\J0\..\..\..\..\..\..\..\..\..\Users\JenkinsSlave\workspace\Lucene-Solr-5.x-Windows\solr\build\solr-core\test\J0\temp\solr.handler.TestSolrConfigHandlerCloud_353B07C2896C3E8-001\control-001\cores\collection1
   [junit4]   2> 2893746 INFO  (TEST-TestSolrConfigHandlerCloud.test-seed#[353B07C2896C3E8]) [n:127.0.0.1:62321_ow_me%2Fr    ] o.a.s.c.CorePropertiesLocator Found 1 core definitions
   [junit4]   2> 2893748 INFO  (TEST-TestSolrConfigHandlerCloud.test-seed#[353B07C2896C3E8]) [n:127.0.0.1:62321_ow_me%2Fr    ] o.a.s.s.SolrDispatchFilter user.dir=C:\Users\JenkinsSlave\workspace\Lucene-Solr-5.x-Windows\solr\build\solr-core\test\J0
   [junit4]   2> 2893749 INFO  (TEST-TestSolrConfigHandlerCloud.test-seed#[353B07C2896C3E8]) [n:127.0.0.1:62321_ow_me%2Fr    ] o.a.s.s.SolrDispatchFilter SolrDispatchFilter.init() done
   [junit4]   2> 2893749 INFO  (coreLoadExecutor-7700-thread-1-processing-n:127.0.0.1:62321_ow_me%2Fr) [n:127.0.0.1:62321_ow_me%2Fr c:control_collection   x:collection1] o.a.s.c.ZkController publishing state=down
   [junit4]   2> 2893749 INFO  (coreLoadExecutor-7700-thread-1-processing-n:127.0.0.1:62321_ow_me%2Fr) [n:127.0.0.1:62321_ow_me%2Fr c:control_collection   x:collection1] o.a.s.c.ZkController numShards not found on descriptor - reading it from system property
   [junit4]   2> 2893750 INFO  (OverseerStateUpdate-95187287043801092-127.0.0.1:62321_ow_me%2Fr-n_0000000000) [n:127.0.0.1:62321_ow_me%2Fr    ] o.a.s.c.Overseer processMessage: queueSize: 1, message = {
   [junit4]   2>   "numShards":"1",
   [junit4]   2>   "node_name":"127.0.0.1:62321_ow_me%2Fr",
   [junit4]   2>   "core":"collection1",
   [junit4]   2>   "collection":"control_collection",
   [junit4]   2>   "base_url":"http://127.0.0.1:62321/ow_me/r",
   [junit4]   2>   "operation":"state",
   [junit4]   2>   "shard":null,
   [junit4]   2>   "roles":null,
   [junit4]   2>   "state":"down"} current state version: 0
   [junit4]   2> 2893750 INFO  (coreLoadExecutor-7700-thread-1-processing-n:127.0.0.1:62321_ow_me%2Fr) [n:127.0.0.1:62321_ow_me%2Fr c:control_collection   x:collection1] o.a.s.c.ZkController look for our core node name
   [junit4]   2> 2893750 INFO  (OverseerStateUpdate-95187287043801092-127.0.0.1:62321_ow_me%2Fr-n_0000000000) [n:127.0.0.1:62321_ow_me%2Fr    ] o.a.s.c.o.ReplicaMutator Update state numShards=1 message={
   [junit4]   2>   "numShards":"1",
   [junit4]   2>   "node_name":"127.0.0.1:62321_ow_me%2Fr",
   [junit4]   2>   "core":"collection1",
   [junit4]   2>   "collection":"control_collection",
   [junit4]   2>   "base_url":"http://127.0.0.1:62321/ow_me/r",
   [junit4]   2>   "operation":"state",
   [junit4]   2>   "shard":null,
   [junit4]   2>   "roles":null,
   [junit4]   2>   "state":"down"}
   [junit4]   2> 2893751 INFO  (OverseerStateUpdate-95187287043801092-127.0.0.1:62321_ow_me%2Fr-n_0000000000) [n:127.0.0.1:62321_ow_me%2Fr    ] o.a.s.c.o.ClusterStateMutator building a new cName: control_collection
   [junit4]   2> 2893752 INFO  (OverseerStateUpdate-95187287043801092-127.0.0.1:62321_ow_me%2Fr-n_0000000000) [n:127.0.0.1:62321_ow_me%2Fr    ] o.a.s.c.o.ReplicaMutator Assigning new node to shard shard=shard1
   [junit4]   2> 2893753 INFO  (zkCallback-2284-thread-1-processing-n:127.0.0.1:62321_ow_me%2Fr) [n:127.0.0.1:62321_ow_me%2Fr    ] o.a.s.c.c.ZkStateReader A cluster state change: [WatchedEvent state:SyncConnected type:NodeDataChanged path:/clusterstate.json], has occurred - updating... (live nodes size: [1])
   [junit4]   2> 2894731 INFO  (coreLoadExecutor-7700-thread-1-processing-n:127.0.0.1:62321_ow_me%2Fr) [n:127.0.0.1:62321_ow_me%2Fr c:control_collection   x:collection1] o.a.s.c.ZkController waiting to find shard id in clusterstate for collection1
   [junit4]   2> 2894731 INFO  (coreLoadExecutor-7700-thread-1-processing-n:127.0.0.1:62321_ow_me%2Fr) [n:127.0.0.1:62321_ow_me%2Fr c:control_collection   x:collection1] o.a.s.c.ZkController Check for collection zkNode:control_collection
   [junit4]   2> 2894732 INFO  (coreLoadExecutor-7700-thread-1-processing-n:127.0.0.1:62321_ow_me%2Fr) [n:127.0.0.1:62321_ow_me%2Fr c:control_collection   x:collection1] o.a.s.c.ZkController Collection zkNode exists
   [junit4]   2> 2894732 INFO  (coreLoadExecutor-7700-thread-1-processing-n:127.0.0.1:62321_ow_me%2Fr) [n:127.0.0.1:62321_ow_me%2Fr c:control_collection   x:collection1] o.a.s.c.c.ZkStateReader Load collection config from: [/collections/control_collection]
   [junit4]   2> 2894733 INFO  (coreLoadExecutor-7700-thread-1-processing-n:127.0.0.1:62321_ow_me%2Fr) [n:127.0.0.1:62321_ow_me%2Fr c:control_collection   x:collection1] o.a.s.c.c.ZkStateReader path=[/collections/control_collection] [configName]=[conf1] specified config exists in ZooKeeper
   [junit4]   2> 2894733 INFO  (coreLoadExecutor-7700-thread-1-processing-n:127.0.0.1:62321_ow_me%2Fr) [n:127.0.0.1:62321_ow_me%2Fr c:control_collection   x:collection1] o.a.s.c.SolrResourceLoader new SolrResourceLoader for directory: 'C:\Users\JenkinsSlave\workspace\Lucene-Solr-5.x-Windows\solr\build\solr-core\test\J0\temp\solr.handler.TestSolrConfigHandlerCloud_353B07C2896C3E8-001\control-001\cores\collection1'
   [junit4]   2> 2894733 INFO  (coreLoadExecutor-7700-thread-1-processing-n:127.0.0.1:62321_ow_me%2Fr) [n:127.0.0.1:62321_ow_me%2Fr c:control_collection   x:collection1] o.a.s.c.SolrResourceLoader JNDI not configured for solr (NoInitialContextEx)
   [junit4]   2> 2894733 INFO  (coreLoadExecutor-7700-thread-1-processing-n:127.0.0.1:62321_ow_me%2Fr) [n:127.0.0.1:62321_ow_me%2Fr c:control_collection   x:collection1] o.a.s.c.SolrResourceLoader solr home defaulted to 'solr/' (could not find system property or JNDI)
   [junit4]   2> 2894736 INFO  (coreLoadExecutor-7700-thread-1-processing-n:127.0.0.1:62321_ow_me%2Fr) [n:127.0.0.1:62321_ow_me%2Fr c:control_collection   x:collection1] o.a.s.c.Config loaded config solrconfig.xml with version 0 
   [junit4]   2> 2894746 INFO  (coreLoadExecutor-7700-thread-1-processing-n:127.0.0.1:62321_ow_me%2Fr) [n:127.0.0.1:62321_ow_me%2Fr c:control_collection   x:collection1] o.a.s.c.SolrConfig current version of requestparams : -1
   [junit4]   2> 2894763 INFO  (coreLoadExecutor-7700-thread-1-processing-n:127.0.0.1:62321_ow_me%2Fr) [n:127.0.0.1:62321_ow_me%2Fr c:control_collection   x:collection1] o.a.s.c.SolrConfig Using Lucene MatchVersion: 5.5.0
   [junit4]   2> 2894803 INFO  (coreLoadExecutor-7700-thread-1-processing-n:127.0.0.1:62321_ow_me%2Fr) [n:127.0.0.1:62321_ow_me%2Fr c:control_collection   x:collection1] o.a.s.c.SolrConfig Loaded SolrConfig: solrconfig.xml
   [junit4]   2> 2894813 INFO  (coreLoadExecutor-7700-thread-1-processing-n:127.0.0.1:62321_ow_me%2Fr) [n:127.0.0.1:62321_ow_me%2Fr c:control_collection   x:collection1] o.a.s.s.IndexSchema [collection1] Schema name=test
   [junit4]   2> 2895121 INFO  (coreLoadExecutor-7700-thread-1-processing-n:127.0.0.1:62321_ow_me%2Fr) [n:127.0.0.1:62321_ow_me%2Fr c:control_collection   x:collection1] o.a.s.s.OpenExchangeRatesOrgProvider Initialized with rates=open-exchange-rates.json, refreshInterval=1440.
   [junit4]   2> 2895132 INFO  (coreLoadExecutor-7700-thread-1-processing-n:127.0.0.1:62321_ow_me%2Fr) [n:127.0.0.1:62321_ow_me%2Fr c:control_collection   x:collection1] o.a.s.s.IndexSchema default search field in schema is text
   [junit4]   2> 2895133 INFO  (coreLoadExecutor-7700-thread-1-processing-n:127.0.0.1:62321_ow_me%2Fr) [n:127.0.0.1:62321_ow_me%2Fr c:control_collection   x:collection1] o.a.s.s.IndexSchema unique key field: id
   [junit4]   2> 2895144 INFO  (coreLoadExecutor-7700-thread-1-processing-n:127.0.0.1:62321_ow_me%2Fr) [n:127.0.0.1:62321_ow_me%2Fr c:control_collection   x:collection1] o.a.s.s.FileExchangeRateProvider Reloading exchange rates from file currency.xml
   [junit4]   2> 2895150 INFO  (coreLoadExecutor-7700-thread-1-processing-n:127.0.0.1:62321_ow_me%2Fr) [n:127.0.0.1:62321_ow_me%2Fr c:control_collection   x:collection1] o.a.s.s.FileExchangeRateProvider Reloading exchange rates from file currency.xml
   [junit4]   2> 2895154 INFO  (coreLoadExecutor-7700-thread-1-processing-n:127.0.0.1:62321_ow_me%2Fr) [n:127.0.0.1:62321_ow_me%2Fr c:control_collection   x:collection1] o.a.s.s.OpenExchangeRatesOrgProvider Reloading exchange rates from open-exchange-rates.json
   [junit4]   2> 2895154 INFO  (coreLoadExecutor-7700-thread-1-processing-n:127.0.0.1:62321_ow_me%2Fr) [n:127.0.0.1:62321_ow_me%2Fr c:control_collection   x:collection1] o.a.s.s.OpenExchangeRatesOrgProvider Reloading exchange rates from open-exchange-rates.json
   [junit4]   2> 2895158 INFO  (coreLoadExecutor-7700-thread-1-processing-n:127.0.0.1:62321_ow_me%2Fr) [n:127.0.0.1:62321_ow_me%2Fr c:control_collection   x:collection1] o.a.s.c.ConfigSetProperties Did not find ConfigSet properties, assuming default properties: Can't find resource 'configsetprops.json' in classpath or '/configs/conf1', cwd=C:\Users\JenkinsSlave\workspace\Lucene-Solr-5.x-Windows\solr\build\solr-core\test\J0
   [junit4]   2> 2895158 INFO  (coreLoadExecutor-7700-thread-1-processing-n:127.0.0.1:62321_ow_me%2Fr) [n:127.0.0.1:62321_ow_me%2Fr c:control_collection   x:collection1] o.a.s.c.CoreContainer Creating SolrCore 'collection1' using configuration from collection control_collection
   [junit4]   2> 2895158 INFO  (coreLoadExecutor-7700-thread-1-processing-n:127.0.0.1:62321_ow_me%2Fr) [n:127.0.0.1:62321_ow_me%2Fr c:control_collection s:shard1 r:core_node1 x:collection1] o.a.s.c.SolrCore org.apache.solr.core.MockDirectoryFactory
   [junit4]   2> 2895158 INFO  (coreLoadExecutor-7700-thread-1-processing-n:127.0.0.1:62321_ow_me%2Fr) [n:127.0.0.1:62321_ow_me%2Fr c:control_collection s:shard1 r:core_node1 x:collection1] o.a.s.c.SolrCore [[collection1] ] Opening new SolrCore at [C:\Users\JenkinsSlave\workspace\Lucene-Solr-5.x-Windows\solr\build\solr-core\test\J0\temp\solr.handler.TestSolrConfigHandlerCloud_353B07C2896C3E8-001\control-001\cores\collection1], dataDir=[C:\Users\JenkinsSlave\workspace\Lucene-Solr-5.x-Windows\solr\build\solr-core\test\J0\..\..\..\..\..\..\..\..\..\Users\JenkinsSlave\workspace\Lucene-Solr-5.x-Windows\solr\build\solr-core\test\J0\temp\solr.handler.TestSolrConfigHandlerCloud_353B07C2896C3E8-001\control-001\cores\collection1\data\]
   [junit4]   2> 2895158 INFO  (coreLoadExecutor-7700-thread-1-processing-n:127.0.0.1:62321_ow_me%2Fr) [n:127.0.0.1:62321_ow_me%2Fr c:control_collection s:shard1 r:core_node1 x:collection1] o.a.s.c.JmxMonitoredMap JMX monitoring is enabled. Adding Solr mbeans to JMX Server: com.sun.jmx.mbeanserver.JmxMBeanServer@dd825d
   [junit4]   2> 2895159 INFO  (coreLoadExecutor-7700-thread-1-processing-n:127.0.0.1:62321_ow_me%2Fr) [n:127.0.0.1:62321_ow_me%2Fr c:control_collection s:shard1 r:core_node1 x:collection1] o.a.s.c.CachingDirectoryFactory return new directory for C:\Users\JenkinsSlave\workspace\Lucene-Solr-5.x-Windows\solr\build\solr-core\test\J0\..\..\..\..\..\..\..\..\..\Users\JenkinsSlave\workspace\Lucene-Solr-5.x-Windows\solr\build\solr-core\test\J0\temp\solr.handler.TestSolrConfigHandlerCloud_353B07C2896C3E8-001\control-001\cores\collection1\data\
   [junit4]   2> 2895159 INFO  (coreLoadExecutor-7700-thread-1-processing-n:127.0.0.1:62321_ow_me%2Fr) [n:127.0.0.1:62321_ow_me%2Fr c:control_collection s:shard1 r:core_node1 x:collection1] o.a.s.c.SolrCore New index directory detected: old=null new=C:\Users\JenkinsSlave\workspace\Lucene-Solr-5.x-Windows\solr\build\solr-core\test\J0\..\..\..\..\..\..\..\..\..\Users\JenkinsSlave\workspace\Lucene-Solr-5.x-Windows\solr\build\solr-core\test\J0\temp\solr.handler.TestSolrConfigHandlerCloud_353B07C2896C3E8-001\control-001\cores\collection1\data\index/
   [junit4]   2> 2895159 WARN  (coreLoadExecutor-7700-thread-1-processing-n:127.0.0.1:62321_ow_me%2Fr) [n:127.0.0.1:62321_ow_me%2Fr c:control_collection s:shard1 r:core_node1 x:collection1] o.a.s.c.SolrCore [collection1] Solr index directory 'C:\Users\JenkinsSlave\workspace\Lucene-Solr-5.x-Windows\solr\build\solr-core\test\J0\..\..\..\..\..\..\..\..\..\Users\JenkinsSlave\workspace\Lucene-Solr-5.x-Windows\solr\build\solr-core\test\J0\temp\solr.handler.TestSolrConfigHandlerCloud_353B07C2896C3E8-001\control-001\cores\collection1\data\index' doesn't exist. Creating new index...
   [junit4]   2> 2895159 INFO  (coreLoadExecutor-7700-thread-1-processing-n:127.0.0.1:62321_ow_me%2Fr) [n:127.0.0.1:62321_ow_me%2Fr c:control_collection s:shard1 r:core_node1 x:collection1] o.a.s.c.CachingDirectoryFactory return new directory for C:\Users\JenkinsSlave\workspace\Lucene-Solr-5.x-Windows\solr\build\solr-core\test\J0\..\..\..\..\..\..\..\..\..\Users\JenkinsSlave\workspace\Lucene-Solr-5.x-Windows\solr\build\solr-core\test\J0\temp\solr.handler.TestSolrConfigHandlerCloud_353B07C2896C3E8-001\control-001\cores\collection1\data\index
   [junit4]   2> 2895160 INFO  (coreLoadExecutor-7700-thread-1-processing-n:127.0.0.1:62321_ow_me%2Fr) [n:127.0.0.1:62321_ow_me%2Fr c:control_collection s:shard1 r:core_node1 x:collection1] o.a.s.u.RandomMergePolicy RandomMergePolicy wrapping class org.apache.lucene.index.LogByteSizeMergePolicy: [LogByteSizeMergePolicy: minMergeSize=1677721, mergeFactor=15, maxMergeSize=2147483648, maxMergeSizeForForcedMerge=9223372036854775807, calibrateSizeByDeletes=false, maxMergeDocs=2147483647, maxCFSSegmentSizeMB=8.796093022207999E12, noCFSRatio=0.33941624184106534]
   [junit4]   2> 2895160 INFO  (coreLoadExecutor-7700-thread-1-processing-n:127.0.0.1:62321_ow_me%2Fr) [n:127.0.0.1:62321_ow_me%2Fr c:control_collection s:shard1 r:core_node1 x:collection1] o.a.s.c.SolrDeletionPolicy SolrDeletionPolicy.onCommit: commits: num=1
   [junit4]   2> 	commit{dir=MockDirectoryWrapper(RAMDirectory@13861d9 lockFactory=org.apache.lucene.store.SingleInstanceLockFactory@a0152a),segFN=segments_1,generation=1}
   [junit4]   2> 2895160 INFO  (coreLoadExecutor-7700-thread-1-processing-n:127.0.0.1:62321_ow_me%2Fr) [n:127.0.0.1:62321_ow_me%2Fr c:control_collection s:shard1 r:core_node1 x:collection1] o.a.s.c.SolrDeletionPolicy newest commit generation = 1
   [junit4]   2> 2895161 INFO  (OldIndexDirectoryCleanupThreadForCore-collection1) [n:127.0.0.1:62321_ow_me%2Fr c:control_collection s:shard1 r:core_node1 x:collection1] o.a.s.c.SolrCore Looking for old index directories to cleanup for core collection1 in C:\Users\JenkinsSlave\workspace\Lucene-Solr-5.x-Windows\solr\build\solr-core\test\J0\..\..\..\..\..\..\..\..\..\Users\JenkinsSlave\workspace\Lucene-Solr-5.x-Windows\solr\build\solr-core\test\J0\temp\solr.handler.TestSolrConfigHandlerCloud_353B07C2896C3E8-001\control-001\cores\collection1\data\
   [junit4]   2> 2895161 WARN  (OldIndexDirectoryCleanupThreadForCore-collection1) [n:127.0.0.1:62321_ow_me%2Fr c:control_collection s:shard1 r:core_node1 x:collection1] o.a.s.c.DirectoryFactory C:\Users\JenkinsSlave\workspace\Lucene-Solr-5.x-Windows\solr\build\solr-core\test\J0\..\..\..\..\..\..\..\..\..\Users\JenkinsSlave\workspace\Lucene-Solr-5.x-Windows\solr\build\solr-core\test\J0\temp\solr.handler.TestSolrConfigHandlerCloud_353B07C2896C3E8-001\control-001\cores\collection1\data\ does not point to a valid data directory; skipping clean-up of old index directories.
   [junit4]   2> 2895163 INFO  (coreLoadExecutor-7700-thread-1-processing-n:127.0.0.1:62321_ow_me%2Fr) [n:127.0.0.1:62321_ow_me%2Fr c:control_collection s:shard1 r:core_node1 x:collection1] o.a.s.u.p.UpdateRequestProcessorChain creating updateRequestProcessorChain "nodistrib"
   [junit4]   2> 2895163 INFO  (coreLoadExecutor-7700-thread-1-processing-n:127.0.0.1:62321_ow_me%2Fr) [n:127.0.0.1:62321_ow_me%2Fr c:control_collection s:shard1 r:core_node1 x:collection1] o.a.s.u.p.UpdateRequestProcessorChain creating updateRequestProcessorChain "dedupe"
   [junit4]   2> 2895163 INFO  (coreLoadExecutor-7700-thread-1-processing-n:127.0.0.1:62321_ow_me%2Fr) [n:127.0.0.1:62321_ow_me%2Fr c:control_collection s:shard1 r:core_node1 x:collection1] o.a.s.u.p.UpdateRequestProcessorChain inserting DistributedUpdateProcessorFactory into updateRequestProcessorChain "dedupe"
   [junit4]   2> 2895164 INFO  (coreLoadExecutor-7700-thread-1-processing-n:127.0.0.1:62321_ow_me%2Fr) [n:127.0.0.1:62321_ow_me%2Fr c:control_collection s:shard1 r:core_node1 x:collection1] o.a.s.u.p.UpdateRequestProcessorChain creating updateRequestProcessorChain "stored_sig"
   [junit4]   2> 2895164 INFO  (coreLoadExecutor-7700-thread-1-processing-n:127.0.0.1:62321_ow_me%2Fr) [n:127.0.0.1:62321_ow_me%2Fr c:control_collection s:shard1 r:core_node1 x:collection1] o.a.s.u.p.UpdateRequestProcessorChain inserting DistributedUpdateProcessorFactory into updateRequestProcessorChain "stored_sig"
   [junit4]   2> 2895164 INFO  (coreLoadExecutor-7700-thread-1-processing-n:127.0.0.1:62321_ow_me%2Fr) [n:127.0.0.1:62321_ow_me%2Fr c:control_collection s:shard1 r:core_node1 x:collection1] o.a.s.u.p.UpdateRequestProcessorChain creating updateRequestProcessorChain "distrib-dup-test-chain-explicit"
   [junit4]   2> 2895164 INFO  (coreLoadExecutor-7700-thread-1-processing-n:127.0.0.1:62321_ow_me%2Fr) [n:127.0.0.1:62321_ow_me%2Fr c:control_collection s:shard1 r:core_node1 x:collection1] o.a.s.u.p.UpdateRequestProcessorChain creating updateRequestProcessorChain "distrib-dup-test-chain-implicit"
   [junit4]   2> 2895164 INFO  (coreLoadExecutor-7700-thread-1-processing-n:127.0.0.1:62321_ow_me%2Fr) [n:127.0.0.1:62321_ow_me%2Fr c:control_collection s:shard1 r:core_node1 x:collection1] o.a.s.u.p.UpdateRequestProcessorChain inserting DistributedUpdateProcessorFactory into updateRequestProcessorChain "distrib-dup-test-chain-implicit"
   [junit4]   2> 2895164 INFO  (coreLoadExecutor-7700-thread-1-processing-n:127.0.0.1:62321_ow_me%2Fr) [n:127.0.0.1:62321_ow_me%2Fr c:control_collection s:shard1 r:core_node1 x:collection1] o.a.s.c.SolrCore no updateRequestProcessorChain defined as default, creating implicit default
   [junit4]   2> 2895164 WARN  (coreLoadExecutor-7700-thread-1-processing-n:127.0.0.1:62321_ow_me%2Fr) [n:127.0.0.1:62321_ow_me%2Fr c:control_collection s:shard1 r:core_node1 x:collection1] o.a.s.c.RequestHandlers INVALID paramSet a in requestHandler {type = requestHandler,name = /dump,class = DumpRequestHandler,args = {defaults={a=A,b=B}}}
   [junit4]   2> 2895172 INFO  (coreLoadExecutor-7700-thread-1-processing-n:127.0.0.1:62321_ow_me%2Fr) [n:127.0.0.1:62321_ow_me%2Fr c:control_collection s:shard1 r:core_node1 x:collection1] o.a.s.h.l.XMLLoader xsltCacheLifetimeSeconds=60
   [junit4]   2> 2895174 INFO  (coreLoadExecutor-7700-thread-1-processing-n:127.0.0.1:62321_ow_me%2Fr) [n:127.0.0.1:62321_ow_me%2Fr c:control_collection s:shard1 r:core_node1 x:collection1] o.a.s.h.l.XMLLoader xsltCacheLifetimeSeconds=60
   [junit4]   2> 2895175 INFO  (coreLoadExecutor-7700-thread-1-processing-n:127.0.0.1:62321_ow_me%2Fr) [n:127.0.0.1:62321_ow_me%2Fr c:control_collection s:shard1 r:core_node1 x:collection1] o.a.s.h.l.XMLLoader xsltCacheLifetimeSeconds=60
   [junit4]   2> 2895177 INFO  (coreLoadExecutor-7700-thread-1-processing-n:127.0.0.1:62321_ow_me%2Fr) [n:127.0.0.1:62321_ow_me%2Fr c:control_collection s:shard1 r:core_node1 x:collection1] o.a.s.h.l.XMLLoader xsltCacheLifetimeSeconds=60
   [junit4]   2> 2895181 INFO  (coreLoadExecutor-7700-thread-1-processing-n:127.0.0.1:62321_ow_me%2Fr) [n:127.0.0.1:62321_ow_me%2Fr c:control_collection s:shard1 r:core_node1 x:collection1] o.a.s.c.RequestHandlers Registered paths: /admin/logging,/config,/dump,/admin/file,/admin/properties,standard,/admin/luke,/admin/plugins,/admin/segments,/admin/mbeans,/get,/admin/ping,/update/csv,/admin/system,/update/json/docs,/update/json,/schema,/replication,/update,/admin/threads
   [junit4]   2> 2895183 INFO  (coreLoadExecutor-7700-thread-1-processing-n:127.0.0.1:62321_ow_me%2Fr) [n:127.0.0.1:62321_ow_me%2Fr c:control_collection s:shard1 r:core_node1 x:collection1] o.a.s.c.SolrCore Using default statsCache cache: org.apache.solr.search.stats.LocalStatsCache
   [junit4]   2> 2895184 INFO  (coreLoadExecutor-7700-thread-1-processing-n:127.0.0.1:62321_ow_me%2Fr) [n:127.0.0.1:62321_ow_me%2Fr c:control_collection s:shard1 r:core_node1 x:collection1] o.a.s.u.UpdateHandler Using UpdateLog implementation: org.apache.solr.update.UpdateLog
   [junit4]   2> 2895184 INFO  (coreLoadExecutor-7700-thread-1-processing-n:127.0.0.1:62321_ow_me%2Fr) [n:127.0.0.1:62321_ow_me%2Fr c:control_collection s:shard1 r:core_node1 x:collection1] o.a.s.u.UpdateLog Initializing UpdateLog: dataDir= defaultSyncLevel=FLUSH numRecordsToKeep=100 maxNumLogsToKeep=10 numVersionBuckets=65536
   [junit4]   2> 2895186 INFO  (coreLoadExecutor-7700-thread-1-processing-n:127.0.0.1:62321_ow_me%2Fr) [n:127.0.0.1:62321_ow_me%2Fr c:control_collection s:shard1 r:core_node1 x:collection1] o.a.s.u.CommitTracker Hard AutoCommit: disabled
   [junit4]   2> 2895186 INFO  (coreLoadExecutor-7700-thread-1-processing-n:127.0.0.1:62321_ow_me%2Fr) [n:127.0.0.1:62321_ow_me%2Fr c:control_collection s:shard1 r:core_node1 x:collection1] o.a.s.u.CommitTracker Soft AutoCommit: disabled
   [junit4]   2> 2895186 INFO  (coreLoadExecutor-7700-thread-1-processing-n:127.0.0.1:62321_ow_me%2Fr) [n:127.0.0.1:62321_ow_me%2Fr c:control_collection s:shard1 r:core_node1 x:collection1] o.a.s.u.RandomMergePolicy RandomMergePolicy wrapping class org.apache.lucene.index.LogByteSizeMergePolicy: [LogByteSizeMergePolicy: minMergeSize=1677721, mergeFactor=47, maxMergeSize=2147483648, maxMergeSizeForForcedMerge=9223372036854775807, calibrateSizeByDeletes=false, maxMergeDocs=2147483647, maxCFSSegmentSizeMB=8.796093022207999E12, noCFSRatio=0.22653357963842513]
   [junit4]   2> 2895186 INFO  (coreLoadExecutor-7700-thread-1-processing-n:127.0.0.1:62321_ow_me%2Fr) [n:127.0.0.1:62321_ow_me%2Fr c:control_collection s:shard1 r:core_node1 x:collection1] o.a.s.c.SolrDeletionPolicy SolrDeletionPolicy.onInit: commits: num=1
   [junit4]   2> 	commit{dir=MockDirectoryWrapper(RAMDirectory@13861d9 lockFactory=org.apache.lucene.store.SingleInstanceLockFactory@a0152a),segFN=segments_1,generation=1}
   [junit4]   2> 2895187 INFO  (coreLoadExecutor-7700-thread-1-processing-n:127.0.0.1:62321_ow_me%2Fr) [n:127.0.0.1:62321_ow_me%2Fr c:control_collection s:shard1 r:core_node1 x:collection1] o.a.s.c.SolrDeletionPolicy newest commit generation = 1
   [junit4]   2> 2895187 INFO  (coreLoadExecutor-7700-thread-1-processing-n:127.0.0.1:62321_ow_me%2Fr) [n:127.0.0.1:62321_ow_me%2Fr c:control_collection s:shard1 r:core_node1 x:collection1] o.a.s.s.SolrIndexSearcher Opening Searcher@11bfa8d[collection1] main
   [junit4]   2> 2895187 INFO  (coreLoadExecutor-7700-thread-1-processing-n:127.0.0.1:62321_ow_me%2Fr) [n:127.0.0.1:62321_ow_me%2Fr c:control_collection s:shard1 r:core_node1 x:collection1] o.a.s.c.c.ZkStateReader Load collection config from: [/collections/control_collection]
   [junit4]   2> 2895188 INFO  (coreLoadExecutor-7700-thread-1-processing-n:127.0.0.1:62321_ow_me%2Fr) [n:127.0.0.1:62321_ow_me%2Fr c:control_collection s:shard1 r:core_node1 x:collection1] o.a.s.c.c.ZkStateReader path=[/collections/control_collection] [configName]=[conf1] specified config exists in ZooKeeper
   [junit4]   2> 2895188 INFO  (coreLoadExecutor-7700-thread-1-processing-n:127.0.0.1:62321_ow_me%2Fr) [n:127.0.0.1:62321_ow_me%2Fr c:control_collection s:shard1 r:core_node1 x:collection1] o.a.s.r.ManagedResourceStorage Setting up ZooKeeper-based storage for the RestManager with znodeBase: /configs/conf1
   [junit4]   2> 2895188 INFO  (coreLoadExecutor-7700-thread-1-processing-n:127.0.0.1:62321_ow_me%2Fr) [n:127.0.0.1:62321_ow_me%2Fr c:control_collection s:shard1 r:core_node1 x:collection1] o.a.s.r.ManagedResourceStorage Configured ZooKeeperStorageIO with znodeBase: /configs/conf1
   [junit4]   2> 2895188 INFO  (coreLoadExecutor-7700-thread-1-processing-n:127.0.0.1:62321_ow_me%2Fr) [n:127.0.0.1:62321_ow_me%2Fr c:control_collection s:shard1 r:core_node1 x:collection1] o.a.s.r.RestManager Initializing RestManager with initArgs: {}
   [junit4]   2> 2895188 INFO  (coreLoadExecutor-7700-thread-1-processing-n:127.0.0.1:62321_ow_me%2Fr) [n:127.0.0.1:62321_ow_me%2Fr c:control_collection s:shard1 r:core_node1 x:collection1] o.a.s.r.ManagedResourceStorage Reading _rest_managed.json using ZooKeeperStorageIO:path=/configs/conf1
   [junit4]   2> 2895189 INFO  (coreLoadExecutor-7700-thread-1-processing-n:127.0.0.1:62321_ow_me%2Fr) [n:127.0.0.1:62321_ow_me%2Fr c:control_collection s:shard1 r:core_node1 x:collection1] o.a.s.r.ManagedResourceStorage No data found for znode /configs/conf1/_rest_managed.json
   [junit4]   2> 2895189 INFO  (coreLoadExecutor-7700-thread-1-processing-n:127.0.0.1:62321_ow_me%2Fr) [n:127.0.0.1:62321_ow_me%2Fr c:control_collection s:shard1 r:core_node1 x:collection1] o.a.s.r.ManagedResourceStorage Loaded null at path _rest_managed.json using ZooKeeperStorageIO:path=/configs/conf1
   [junit4]   2> 2895189 INFO  (coreLoadExecutor-7700-thread-1-processing-n:127.0.0.1:62321_ow_me%2Fr) [n:127.0.0.1:62321_ow_me%2Fr c:control_collection s:shard1 r:core_node1 x:collection1] o.a.s.r.RestManager Initializing 0 registered ManagedResources
   [junit4]   2> 2895189 INFO  (coreLoadExecutor-7700-thread-1-processing-n:127.0.0.1:62321_ow_me%2Fr) [n:127.0.0.1:62321_ow_me%2Fr c:control_collection s:shard1 r:core_node1 x:collection1] o.a.s.h.ReplicationHandler Commits will be reserved for  10000
   [junit4]   2> 2895190 INFO  (searcherExecutor-7701-thread-1-processing-n:127.0.0.1:62321_ow_me%2Fr x:collection1 c:control_collection s:shard1 r:core_node1) [n:127.0.0.1:62321_ow_me%2Fr c:control_collection s:shard1 r:core_node1 x:collection1] o.a.s.c.SolrCore [collection1] Registered new searcher Searcher@11bfa8d[collection1] main{ExitableDirectoryReader(UninvertingDirectoryReader())}
   [junit4]   2> 2895190 INFO  (coreLoadExecutor-7700-thread-1-processing-n:127.0.0.1:62321_ow_me%2Fr) [n:127.0.0.1:62321_ow_me%2Fr c:control_collection s:shard1 r:core_node1 x:collection1] o.a.s.u.UpdateLog Looking up max value of version field to seed version buckets
   [junit4]   2> 2895190 INFO  (coreLoadExecutor-7700-thread-1-processing-n:127.0.0.1:62321_ow_me%2Fr) [n:127.0.0.1:62321_ow_me%2Fr c:control_collection s:shard1 r:core_node1 x:collection1] o.a.s.u.VersionInfo Refreshing highest value of _version_ for 65536 version buckets from index
   [junit4]   2> 2895190 INFO  (coreLoadExecutor-7700-thread-1-processing-n:127.0.0.1:62321_ow_me%2Fr) [n:127.0.0.1:62321_ow_me%2Fr c:control_collection s:shard1 r:core_node1 x:collection1] o.a.s.u.VersionInfo No terms found for _version_, cannot seed version bucket highest value from index
   [junit4]   2> 2895190 INFO  (coreLoadExecutor-7700-thread-1-processing-n:127.0.0.1:62321_ow_me%2Fr) [n:127.0.0.1:62321_ow_me%2Fr c:control_collection s:shard1 r:core_node1 x:collection1] o.a.s.u.UpdateLog Could not find max version in index or recent updates, using new clock 1522996595015024640
   [junit4]   2> 2895192 INFO  (coreLoadExecutor-7700-thread-1-processing-n:127.0.0.1:62321_ow_me%2Fr) [n:127.0.0.1:62321_ow_me%2Fr c:control_collection s:shard1 r:core_node1 x:collection1] o.a.s.u.UpdateLog Took 1.0ms to seed version buckets with highest version 1522996595015024640
   [junit4]   2> 2895192 INFO  (coreLoadExecutor-7700-thread-1-processing-n:127.0.0.1:62321_ow_me%2Fr) [n:127.0.0.1:62321_ow_me%2Fr c:control_collection s:shard1 r:core_node1 x:collection1] o.a.s.c.ZkController watch zkdir /configs/conf1
   [junit4]   2> 2895193 INFO  (coreLoadExecutor-7700-thread-1-processing-n:127.0.0.1:62321_ow_me%2Fr) [n:127.0.0.1:62321_ow_me%2Fr c:control_collection s:shard1 r:core_node1 x:collection1] o.a.s.c.CoreContainer registering core: collection1
   [junit4]   2> 2895193 INFO  (coreZkRegister-7694-thread-1-processing-n:127.0.0.1:62321_ow_me%2Fr x:collection1 c:control_collection s:shard1 r:core_node1) [n:127.0.0.1:62321_ow_me%2Fr c:control_collection s:shard1 r:core_node1 x:collection1] o.a.s.c.ZkController Register replica - core:collection1 address:http://127.0.0.1:62321/ow_me/r collection:control_collection shard:shard1
   [junit4]   2> 2895194 INFO  (coreZkRegister-7694-thread-1-processing-n:127.0.0.1:62321_ow_me%2Fr x:collection1 c:control_collection s:shard1 r:core_node1) [n:127.0.0.1:62321_ow_me%2Fr c:control_collection s:shard1 r:core_node1 x:collection1] o.a.s.c.c.SolrZkClient makePath: /collections/control_collection/leader_elect/shard1/election
   [junit4]   2> 2895199 INFO  (coreZkRegister-7694-thread-1-processing-n:127.0.0.1:62321_ow_me%2Fr x:collection1 c:control_collection s:shard1 r:core_node1) [n:127.0.0.1:62321_ow_me%2Fr c:control_collection s:shard1 r:core_node1 x:collection1] o.a.s.c.LeaderElector Joined leadership election with path: /collections/control_collection/leader_elect/shard1/election/95187287043801092-core_node1-n_0000000000
   [junit4]   2> 2895199 INFO  (coreZkRegister-7694-thread-1-processing-n:127.0.0.1:62321_ow_me%2Fr x:collection1 c:control_collection s:shard1 r:core_node1) [n:127.0.0.1:62321_ow_me%2Fr c:control_collection s:shard1 r:core_node1 x:collection1] o.a.s.c.ShardLeaderElectionContext Running the leader process for shard=shard1 and weAreReplacement=false and leaderVoteWait=10000
   [junit4]   2> 2895201 INFO  (coreZkRegister-7694-thread-1-processing-n:127.0.0.1:62321_ow_me%2Fr x:collection1 c:control_collection s:shard1 r:core_node1) [n:127.0.0.1:62321_ow_me%2Fr c:control_collection s:shard1 r:core_node1 x:collection1] o.a.s.c.ShardLeaderElectionContext Enough replicas found to continue.
   [junit4]   2> 2895201 INFO  (coreZkRegister-7694-thread-1-processing-n:127.0.0.1:62321_ow_me%2Fr x:collection1 c:control_collection s:shard1 r:core_node1) [n:127.0.0.1:62321_ow_me%2Fr c:control_collection s:shard1 r:core_node1 x:collection1] o.a.s.c.ShardLeaderElectionContext I may be the new leader - try and sync
   [junit4]   2> 2895201 INFO  (coreZkRegister-7694-thread-1-processing-n:127.0.0.1:62321_ow_me%2Fr x:collection1 c:control_collection s:shard1 r:core_node1) [n:127.0.0.1:62321_ow_me%2Fr c:control_collection s:shard1 r:core_node1 x:collection1] o.a.s.c.SyncStrategy Sync replicas to http://127.0.0.1:62321/ow_me/r/collection1/
   [junit4]   2> 2895201 INFO  (coreZkRegister-7694-thread-1-processing-n:127.0.0.1:62321_ow_me%2Fr x:collection1 c:control_collection s:shard1 r:core_node1) [n:127.0.0.1:62321_ow_me%2Fr c:control_collection s:shard1 r:core_node1 x:collection1] o.a.s.c.SyncStrategy Sync Success - now sync replicas to me
   [junit4]   2> 2895202 INFO  (OverseerStateUpdate-95187287043801092-127.0.0.1:62321_ow_me%2Fr-n_0000000000) [n:127.0.0.1:62321_ow_me%2Fr    ] o.a.s.c.Overseer processMessage: queueSize: 1, message = {
   [junit4]   2>   "operation":"leader",
   [junit4]   2>   "shard":"shard1",
   [junit4]   2>   "collection":"control_collection"} current state version: 1
   [junit4]   2> 2895202 INFO  (coreZkRegister-7694-thread-1-processing-n:127.0.0.1:62321_ow_me%2Fr x:collection1 c:control_collection s:shard1 r:core_node1) [n:127.0.0.1:62321_ow_me%2Fr c:control_collection s:shard1 r:core_node1 x:collection1] o.a.s.c.SyncStrategy http://127.0.0.1:62321/ow_me/r/collection1/ has no replicas
   [junit4]   2> 2895203 INFO  (coreZkRegister-7694-thread-1-processing-n:127.0.0.1:62321_ow_me%2Fr x:collection1 c:control_collection s:shard1 r:core_node1) [n:127.0.0.1:62321_ow_me%2Fr c:control_collection s:shard1 r:core_node1 x:collection1] o.a.s.c.c.SolrZkClient makePath: /collections/control_collection/leaders/shard1
   [junit4]   2> 2895206 INFO  (coreZkRegister-7694-thread-1-processing-n:127.0.0.1:62321_ow_me%2Fr x:collection1 c:control_collection s:shard1 r:core_node1) [n:127.0.0.1:62321_ow_me%2Fr c:control_collection s:shard1 r:core_node1 x:collection1] o.a.s.c.ShardLeaderElectionContextBase Creating leader registration node
   [junit4]   2> 2895209 INFO  (coreZkRegister-7694-thread-1-processing-n:127.0.0.1:62321_ow_me%2Fr x:collection1 c:control_collection s:shard1 r:core_node1) [n:127.0.0.1:62321_ow_me%2Fr c:control_collection s:shard1 r:core_node1 x:collection1] o.a.s.c.ShardLeaderElectionContext I am the new leader: http://127.0.0.1:62321/ow_me/r/collection1/ shard1
   [junit4]   2> 2895210 INFO  (OverseerStateUpdate-95187287043801092-127.0.0.1:62321_ow_me%2Fr-n_0000000000) [n:127.0.0.1:62321_ow_me%2Fr    ] o.a.s.c.Overseer processMessage: queueSize: 1, message = {
   [junit4]   2>   "operation":"leader",
   [junit4]   2>   "shard":"shard1",
   [junit4]   2>   "collection":"control_collection",
   [junit4]   2>   "base_url":"http://127.0.0.1:62321/ow_me/r",
   [junit4]   2>   "core":"collection1",
   [junit4]   2>   "state":"active"} current state version: 1
   [junit4]   2> 2895220 INFO  (TEST-TestSolrConfigHandlerCloud.test-seed#[353B07C2896C3E8]) [    ] o.a.s.c.c.SolrZkClient Using default ZkCredentialsProvider
   [junit4]   2> 2895221 INFO  (TEST-TestSolrConfigHandlerCloud.test-seed#[353B07C2896C3E8]) [    ] o.a.s.c.c.ConnectionManager Waiting for client to connect to ZooKeeper
   [junit4]   2> 2895222 INFO  (zkCallback-2286-thread-1) [    ] o.a.s.c.c.ConnectionManager Watcher org.apache.solr.common.cloud.ConnectionManager@eabac1 name:ZooKeeperConnection Watcher:127.0.0.1:62314/solr got event WatchedEvent state:SyncConnected type:None path:null path:null type:None
   [junit4]   2> 2895222 INFO  (TEST-TestSolrConfigHandlerCloud.test-seed#[353B07C2896C3E8]) [    ] o.a.s.c.c.ConnectionManager Client is connected to ZooKeeper
   [junit4]   2> 2895222 INFO  (TEST-TestSolrConfigHandlerCloud.test-seed#[353B07C2896C3E8]) [    ] o.a.s.c.c.SolrZkClient Using default ZkACLProvider
   [junit4]   2> 2895222 INFO  (TEST-TestSolrConfigHandlerCloud.test-seed#[353B07C2896C3E8]) [    ] o.a.s.c.c.ZkStateReader Updating cluster state from ZooKeeper... 
   [junit4]   2> 2895226 INFO  (TEST-TestSolrConfigHandlerCloud.test-seed#[353B07C2896C3E8]) [    ] o.a.s.c.ChaosMonkey monkey: init - expire sessions:false cause connection loss:false
   [junit4]   2> 2895311 INFO  (zkCallback-2286-thread-1) [    ] o.a.s.c.c.ZkStateReader A cluster state change: [WatchedEvent state:SyncConnected type:NodeDataChanged path:/clusterstate.json], has occurred - updating... (live nodes size: [1])
   [junit4]   2> 2895311 INFO  (zkCallback-2284-thread-1-processing-n:127.0.0.1:62321_ow_me%2Fr) [n:127.0.0.1:62321_ow_me%2Fr    ] o.a.s.c.c.ZkStateReader A cluster state change: [WatchedEvent state:SyncConnected type:NodeDataChanged path:/clusterstate.json], has occurred - updating... (live nodes size: [1])
   [junit4]   2> 2895359 INFO  (coreZkRegister-7694-thread-1-processing-n:127.0.0.1:62321_ow_me%2Fr x:collection1 c:control_collection s:shard1 r:core_node1) [n:127.0.0.1:62321_ow_me%2Fr c:control_collection s:shard1 r:core_node1 x:collection1] o.a.s.c.ZkController We are http://127.0.0.1:62321/ow_me/r/collection1/ and leader is http://127.0.0.1:62321/ow_me/r/collection1/
   [junit4]   2> 2895359 INFO  (coreZkRegister-7694-thread-1-processing-n:127.0.0.1:62321_ow_me%2Fr x:collection1 c:control_collection s:shard1 r:core_node1) [n:127.0.0.1:62321_ow_me%2Fr c:control_collection s:shard1 r:core_node1 x:collection1] o.a.s.c.ZkController No LogReplay needed for core=collection1 baseURL=http://127.0.0.1:62321/ow_me/r
   [junit4]   2> 2895359 INFO  (coreZkRegister-7694-thread-1-processing-n:127.0.0.1:62321_ow_me%2Fr x:collection1 c:control_collection s:shard1 r:core_node1) [n:127.0.0.1:62321_ow_me%2Fr c:control_collection s:shard1 r:core_node1 x:collection1] o.a.s.c.ZkController I am the leader, no recovery necessary
   [junit4]   2> 2895359 INFO  (coreZkRegister-7694-thread-1-processing-n:127.0.0.1:62321_ow_me%2Fr x:collection1 c:control_collection s:shard1 r:core_node1) [n:127.0.0.1:62321_ow_me%2Fr c:control_collection s:shard1 r:core_node1 x:collection1] o.a.s.c.ZkController publishing state=active
   [junit4]   2> 2895359 INFO  (coreZkRegister-7694-thread-1-processing-n:127.0.0.1:62321_ow_me%2Fr x:collection1 c:control_collection s:shard1 r:core_node1) [n:127.0.0.1:62321_ow_me%2Fr c:control_collection s:shard1 r:core_node1 x:collection1] o.a.s.c.ZkController numShards not found on descriptor - reading it from system property
   [junit4]   2> 2895362 INFO  (OverseerStateUpdate-95187287043801092-127.0.0.1:62321_ow_me%2Fr-n_0000000000) [n:127.0.0.1:62321_ow_me%2Fr    ] o.a.s.c.Overseer processMessage: queueSize: 1, message = {
   [junit4]   2>   "numShards":"2",
   [junit4]   2>   "node_name":"127.0.0.1:62321_ow_me%2Fr",
   [junit4]   2>   "core":"collection1",
   [junit4]   2>   "collection":"control_collection",
   [junit4]   2>   "base_url":"http://127.0.0.1:62321/ow_me/r",
   [junit4]   2>   "operation":"state",
   [junit4]   2>   "shard":"shard1",
   [junit4]   2>   "core_node_name":"core_node1",
   [junit4]   2>   "roles":null,
   [junit4]   2>   "state":"active"} current state version: 2
   [junit4]   2> 2895362 INFO  (OverseerStateUpdate-95187287043801092-127.0.0.1:62321_ow_me%2Fr-n_0000000000) [n:127.0.0.1:62321_ow_me%2Fr    ] o.a.s.c.o.ReplicaMutator Update state numShards=2 message={
   [junit4]   2>   "numShards":"2",
   [junit4]   2>   "node_name":"127.0.0.1:62321_ow_me%2Fr",
   [junit4]   2>   "core":"collection1",
   [junit4]   2>   "collection":"control_collection",
   [junit4]   2>   "base_url":"http://127.0.0.1:62321/ow_me/r",
   [junit4]   2>   "operation":"state",
   [junit4]   2>   "shard":"shard1",
   [junit4]   2>   "core_node_name":"core_node1",
   [junit4]   2>   "roles":null,
   [junit4]   2>   "state":"active"}
   [junit4]   2> 2895465 INFO  (zkCallback-2286-thread-1) [    ] o.a.s.c.c.ZkStateReader A cluster state change: [WatchedEvent state:SyncConnected type:NodeDataChanged path:/clusterstate.json], has occurred - updating... (live nodes size: [1])
   [junit4]   2> 2895465 INFO  (zkCallback-2284-thread-1-processing-n:127.0.0.1:62321_ow_me%2Fr) [n:127.0.0.1:62321_ow_me%2Fr    ] o.a.s.c.c.ZkStateReader A cluster state change: [WatchedEvent state:SyncConnected type:NodeDataChanged path:/clusterstate.json], has occurred - updating... (live nodes size: [1])
   [junit4]   2> 2895624 INFO  (TEST-TestSolrConfigHandlerCloud.test-seed#[353B07C2896C3E8]) [    ] o.a.s.SolrTestCaseJ4 Writing core.properties file to C:\Users\JenkinsSlave\workspace\Lucene-Solr-5.x-Windows\solr\build\solr-core\test\J0\temp\solr.handler.TestSolrConfigHandlerCloud_353B07C2896C3E8-001\shard-1-001\cores\collection1
   [junit4]   2> 2895626 INFO  (TEST-TestSolrConfigHandlerCloud.test-seed#[353B07C2896C3E8]) [    ] o.a.s.c.AbstractFullDistribZkTestBase create jetty 1 in directory C:\Users\JenkinsSlave\workspace\Lucene-Solr-5.x-Windows\solr\build\solr-core\test\J0\temp\solr.handler.TestSolrConfigHandlerCloud_353B07C2896C3E8-001\shard-1-001
   [junit4]   2> 2895627 INFO  (TEST-TestSolrConfigHandlerCloud.test-seed#[353B07C2896C3E8]) [    ] o.e.j.s.Server jetty-9.2.13.v20150730
   [junit4]   2> 2895631 INFO  (TEST-TestSolrConfigHandlerCloud.test-seed#[353B07C2896C3E8]) [    ] o.e.j.s.h.ContextHandler Started o.e.j.s.ServletContextHandler@11b38e3{/ow_me/r,null,AVAILABLE}
   [junit4]   2> 2895631 INFO  (TEST-TestSolrConfigHandlerCloud.test-seed#[353B07C2896C3E8]) [    ] o.e.j.s.ServerConnector Started ServerConnector@33cf09{HTTP/1.1}{127.0.0.1:62337}
   [junit4]   2> 2895631 INFO  (TEST-TestSolrConfigHandlerCloud.test-seed#[353B07C2896C3E8]) [    ] o.e.j.s.Server Started @2898275ms
   [junit4]   2> 2895632 INFO  (TEST-TestSolrConfigHandlerCloud.test-seed#[353B07C2896C3E8]) [    ] o.a.s.c.s.e.JettySolrRunner Jetty properties: {solr.data.dir=C:\Users\JenkinsSlave\workspace\Lucene-Solr-5.x-Windows\solr\build\solr-core\test\J0\temp\solr.handler.TestSolrConfigHandlerCloud_353B07C2896C3E8-001\tempDir-001/jetty1, hostPort=62337, solrconfig=solrconfig.xml, hostContext=/ow_me/r, coreRootDirectory=C:\Users\JenkinsSlave\workspace\Lucene-Solr-5.x-Windows\solr\build\solr-core\test\J0\temp\solr.handler.TestSolrConfigHandlerCloud_353B07C2896C3E8-001\shard-1-001\cores}
   [junit4]   2> 2895632 INFO  (TEST-TestSolrConfigHandlerCloud.test-seed#[353B07C2896C3E8]) [    ] o.a.s.s.SolrDispatchFilter SolrDispatchFilter.init(): sun.misc.Launcher$AppClassLoader@6d23ea
   [junit4]   2> 2895632 INFO  (TEST-TestSolrConfigHandlerCloud.test-seed#[353B07C2896C3E8]) [    ] o.a.s.c.SolrResourceLoader new SolrResourceLoader for directory: 'C:\Users\JenkinsSlave\workspace\Lucene-Solr-5.x-Windows\solr\build\solr-core\test\J0\temp\solr.handler.TestSolrConfigHandlerCloud_353B07C2896C3E8-001\shard-1-001'
   [junit4]   2> 2895632 INFO  (TEST-TestSolrConfigHandlerCloud.test-seed#[353B07C2896C3E8]) [    ] o.a.s.c.SolrResourceLoader JNDI not configured for solr (NoInitialContextEx)
   [junit4]   2> 2895632 INFO  (TEST-TestSolrConfigHandlerCloud.test-seed#[353B07C2896C3E8]) [    ] o.a.s.c.SolrResourceLoader solr home defaulted to 'solr/' (could not find system property or JNDI)
   [junit4]   2> 2895633 INFO  (TEST-TestSolrConfigHandlerCloud.test-seed#[353B07C2896C3E8]) [    ] o.a.s.c.c.SolrZkClient Using default ZkCredentialsProvider
   [junit4]   2> 2895633 INFO  (TEST-TestSolrConfigHandlerCloud.test-seed#[353B07C2896C3E8]) [    ] o.a.s.c.c.ConnectionManager Waiting for client to connect to ZooKeeper
   [junit4]   2> 2895635 INFO  (zkCallback-2287-thread-1) [    ] o.a.s.c.c.ConnectionManager Watcher org.apache.solr.common.cloud.ConnectionManager@106aac4 name:ZooKeeperConnection Watcher:127.0.0.1:62314/solr got event WatchedEvent state:SyncConnected type:None path:null path:null type:None
   [junit4]   2> 2895635 INFO  (TEST-TestSolrConfigHandlerCloud.test-seed#[353B07C2896C3E8]) [    ] o.a.s.c.c.ConnectionManager Client is connected to ZooKeeper
   [junit4]   2> 2895635 INFO  (TEST-TestSolrConfigHandlerCloud.test-seed#[353B07C2896C3E8]) [    ] o.a.s.c.c.SolrZkClient Using default ZkACLProvider
   [junit4]   2> 2895636 INFO  (TEST-TestSolrConfigHandlerCloud.test-seed#[353B07C2896C3E8]) [    ] o.a.s.s.SolrDispatchFilter Loading solr.xml from SolrHome (not found in ZooKeeper)
   [junit4]   2> 2895636 INFO  (TEST-TestSolrConfigHandlerCloud.test-seed#[353B07C2896C3E8]) [    ] o.a.s.c.SolrXmlConfig Loading container configuration from C:\Users\JenkinsSlave\workspace\Lucene-Solr-5.x-Windows\solr\build\solr-core\test\J0\temp\solr.handler.TestSolrConfigHandlerCloud_353B07C2896C3E8-001\shard-1-001\solr.xml
   [junit4]   2> 2895664 INFO  (TEST-TestSolrConfigHandlerCloud.test-seed#[353B07C2896C3E8]) [    ] o.a.s.c.CorePropertiesLocator Config-defined core root directory: C:\Users\JenkinsSlave\workspace\Lucene-Solr-5.x-Windows\solr\build\solr-core\test\J0\temp\solr.handler.TestSolrConfigHandlerCloud_353B07C2896C3E8-001\shard-1-001\cores
   [junit4]   2> 2895664 INFO  (TEST-TestSolrConfigHandlerCloud.test-seed#[353B07C2896C3E8]) [    ] o.a.s.c.CoreContainer New CoreContainer 11866642
   [junit4]   2> 2895664 INFO  (TEST-TestSolrConfigHandlerCloud.test-seed#[353B07C2896C3E8]) [    ] o.a.s.c.CoreContainer Loading cores into CoreContainer [instanceDir=C:\Users\JenkinsSlave\workspace\Lucene-Solr-5.x-Windows\solr\build\solr-core\test\J0\temp\solr.handler.TestSolrConfigHandlerCloud_353B07C2896C3E8-001\shard-1-001]
   [junit4]   2> 2895664 WARN  (TEST-TestSolrConfigHandlerCloud.test-seed#[353B07C2896C3E8]) [    ] o.a.s.c.CoreContainer Couldn't add files from C:\Users\JenkinsSlave\workspace\Lucene-Solr-5.x-Windows\solr\build\solr-core\test\J0\temp\solr.handler.TestSolrConfigHandlerCloud_353B07C2896C3E8-001\shard-1-001\lib to classpath: C:\Users\JenkinsSlave\workspace\Lucene-Solr-5.x-Windows\solr\build\solr-core\test\J0\temp\solr.handler.TestSolrConfigHandlerCloud_353B07C2896C3E8-001\shard-1-001\lib
   [junit4]   2> 2895665 INFO  (TEST-TestSolrConfigHandlerCloud.test-seed#[353B07C2896C3E8]) [    ] o.a.s.h.c.HttpShardHandlerFactory created with socketTimeout : 90000,urlScheme : ,connTimeout : 15000,maxConnectionsPerHost : 20,maxConnections : 10000,corePoolSize : 0,maximumPoolSize : 2147483647,maxThreadIdleTime : 5,sizeOfQueue : -1,fairnessPolicy : false,useRetries : false,
   [junit4]   2> 2895667 INFO  (TEST-TestSolrConfigHandlerCloud.test-seed#[353B07C2896C3E8]) [    ] o.a.s.u.UpdateShardHandler Creating UpdateShardHandler HTTP client with params: socketTimeout=340000&connTimeout=45000&retry=true
   [junit4]   2> 2895668 INFO  (TEST-TestSolrConfigHandlerCloud.test-seed#[353B07C2896C3E8]) [    ] o.a.s.l.LogWatcher SLF4J impl is org.slf4j.impl.Log4jLoggerFactory
   [junit4]   2> 2895668 INFO  (TEST-TestSolrConfigHandlerCloud.test-seed#[353B07C2896C3E8]) [    ] o.a.s.l.LogWatcher Registering Log Listener [Log4j (org.slf4j.impl.Log4jLoggerFactory)]
   [junit4]   2> 2895668 INFO  (TEST-TestSolrConfigHandlerCloud.test-seed#[353B07C2896C3E8]) [    ] o.a.s.c.ZkContainer Zookeeper client=127.0.0.1:62314/solr
   [junit4]   2> 2895668 INFO  (TEST-TestSolrConfigHandlerCloud.test-seed#[353B07C2896C3E8]) [    ] o.a.s.c.ZkController zkHost includes chroot
   [junit4]   2> 2895668 INFO  (TEST-TestSolrConfigHandlerCloud.test-seed#[353B07C2896C3E8]) [    ] o.a.s.c.c.SolrZkClient Using default ZkCredentialsProvider
   [junit4]   2> 2895668 INFO  (TEST-TestSolrConfigHandlerCloud.test-seed#[353B07C2896C3E8]) [    ] o.a.s.c.c.ConnectionManager Waiting for client to connect to ZooKeeper
   [junit4]   2> 2895670 INFO  (zkCallback-2289-thread-1) [    ] o.a.s.c.c.ConnectionManager Watcher org.apache.solr.common.cloud.ConnectionManager@4b729 name:ZooKeeperConnection Watcher:127.0.0.1:62314 got event WatchedEvent state:SyncConnected type:None path:null path:null type:None
   [junit4]   2> 2895670 INFO  (TEST-TestSolrConfigHandlerCloud.test-seed#[353B07C2896C3E8]) [    ] o.a.s.c.c.ConnectionManager Client is connected to ZooKeeper
   [junit4]   2> 2895670 INFO  (TEST-TestSolrConfigHandlerCloud.test-seed#[353B07C2896C3E8]) [    ] o.a.s.c.c.SolrZkClient Using default ZkACLProvider
   [junit4]   2> 2895672 INFO  (TEST-TestSolrConfigHandlerCloud.test-seed#[353B07C2896C3E8]) [n:127.0.0.1:62337_ow_me%2Fr    ] o.a.s.c.c.ConnectionManager Waiting for client to connect to ZooKeeper
   [junit4]   2> 2895675 INFO  (zkCallback-2290-thread-1-processing-n:127.0.0.1:62337_ow_me%2Fr) [n:127.0.0.1:62337_ow_me%2Fr    ] o.a.s.c.c.ConnectionManager Watcher org.apache.solr.common.cloud.ConnectionManager@20224f name:ZooKeeperConnection Watcher:127.0.0.1:62314/solr got event WatchedEvent state:SyncConnected type:None path:null path:null type:None
   [junit4]   2> 2895675 INFO  (TEST-TestSolrConfigHandlerCloud.test-seed#[353B07C2896C3E8]) [n:127.0.0.1:62337_ow_me%2Fr    ] o.a.s.c.c.ConnectionManager Client is connected to ZooKeeper
   [junit4]   2> 2895681 INFO  (TEST-TestSolrConfigHandlerCloud.test-seed#[353B07C2896C3E8]) [n:127.0.0.1:62337_ow_me%2Fr    ] o.a.s.c.c.ZkStateReader Updating cluster state from ZooKeeper... 
   [junit4]   2> 2896667 INFO  (TEST-TestSolrConfigHandlerCloud.test-seed#[353B07C2896C3E8]) [n:127.0.0.1:62337_ow_me%2Fr    ] o.a.s.c.ZkController Register node as live in ZooKeeper:/live_nodes/127.0.0.1:62337_ow_me%2Fr
   [junit4]   2> 2896667 INFO  (TEST-TestSolrConfigHandlerCloud.test-seed#[353B07C2896C3E8]) [n:127.0.0.1:62337_ow_me%2Fr    ] o.a.s.c.c.SolrZkClient makePath: /live_nodes/127.0.0.1:62337_ow_me%2Fr
   [junit4]   2> 2896669 INFO  (zkCallback-2286-thread-1) [    ] o.a.s.c.c.ZkStateReader A live node change: [WatchedEvent state:SyncConnected type:NodeChildrenChanged path:/live_nodes], has occurred - updating... (live nodes size: [1])
   [junit4]   2> 2896669 INFO  (zkCallback-2284-thread-1-processing-n:127.0.0.1:62321_ow_me%2Fr) [n:127.0.0.1:62321_ow_me%2Fr    ] o.a.s.c.c.ZkStateReader A live node change: [WatchedEvent state:SyncConnected type:NodeChildrenChanged path:/live_nodes], has occurred - updating... (live nodes size: [1])
   [junit4]   2> 2896669 INFO  (zkCallback-2290-thread-1-processing-n:127.0.0.1:62337_ow_me%2Fr) [n:127.0.0.1:62337_ow_me%2Fr    ] o.a.s.c.c.ZkStateReader A live node change: [WatchedEvent state:SyncConnected type:NodeChildrenChanged path:/live_nodes], has occurred - updating... (live nodes size: [1])
   [junit4]   2> 2896671 INFO  (TEST-TestSolrConfigHandlerCloud.test-seed#[353B07C2896C3E8]) [n:127.0.0.1:62337_ow_me%2Fr    ] o.a.s.c.Overseer Overseer (id=null) closing
   [junit4]   2> 2896672 INFO  (TEST-TestSolrConfigHandlerCloud.test-seed#[353B07C2896C3E8]) [n:127.0.0.1:62337_ow_me%2Fr    ] o.a.s.c.LeaderElector Joined leadership election with path: /overseer_elect/election/95187287043801096-127.0.0.1:62337_ow_me%2Fr-n_0000000001
   [junit4]   2> 2896672 INFO  (TEST-TestSolrConfigHandlerCloud.test-seed#[353B07C2896C3E8]) [n:127.0.0.1:62337_ow_me%2Fr    ] o.a.s.c.LeaderElector Watching path /overseer_elect/election/95187287043801092-127.0.0.1:62321_ow_me%2Fr-n_0000000000 to know if I could be the leader
   [junit4]   2> 2896721 INFO  (TEST-TestSolrConfigHandlerCloud.test-seed#[353B07C2896C3E8]) [n:127.0.0.1:62337_ow_me%2Fr    ] o.a.s.c.CoreContainer Security conf doesn't exist. Skipping setup for authorization module.
   [junit4]   2> 2896721 INFO  (TEST-TestSolrConfigHandlerCloud.test-seed#[353B07C2896C3E8]) [n:127.0.0.1:62337_ow_me%2Fr    ] o.a.s.c.CoreContainer No authentication plugin used.
   [junit4]   2> 2896722 INFO  (TEST-TestSolrConfigHandlerCloud.test-seed#[353B07C2896C3E8]) [n:127.0.0.1:62337_ow_me%2Fr    ] o.a.s.c.CorePropertiesLocator Looking for core definitions underneath C:\Users\JenkinsSlave\workspace\Lucene-Solr-5.x-Windows\solr\build\solr-core\test\J0\temp\solr.handler.TestSolrConfigHandlerCloud_353B07C2896C3E8-001\shard-1-001\cores
   [junit4]   2> 2896724 INFO  (TEST-TestSolrConfigHandlerCloud.test-seed#[353B07C2896C3E8]) [n:127.0.0.1:62337_ow_me%2Fr    ] o.a.s.c.CoreDescriptor Created CoreDescriptor: {shard=, collection=collection1, transient=false, dataDir=data\, loadOnStartup=true, name=collection1, config=solrconfig.xml, schema=schema.xml, coreNodeName=, configSetProperties=configsetprops.json}
   [junit4]   2> 2896724 INFO  (TEST-TestSolrConfigHandlerCloud.test-seed#[353B07C2896C3E8]) [n:127.0.0.1:62337_ow_me%2Fr    ] o.a.s.c.CorePropertiesLocator Found core collection1 in C:\Users\JenkinsSlave\workspace\Lucene-Solr-5.x-Windows\solr\build\solr-core\test\J0\temp\solr.handler.TestSolrConfigHandlerCloud_353B07C2896C3E8-001\shard-1-001\cores\collection1
   [junit4]   2> 2896724 INFO  (TEST-TestSolrConfigHandlerCloud.test-seed#[353B07C2896C3E8]) [n:127.0.0.1:62337_ow_me%2Fr    ] o.a.s.c.CorePropertiesLocator Found 1 core definitions
   [junit4]   2> 2896727 INFO  (TEST-TestSolrConfigHandlerCloud.test-seed#[353B07C2896C3E8]) [n:127.0.0.1:62337_ow_me%2Fr    ] o.a.s.s.SolrDispatchFilter user.dir=C:\Users\JenkinsSlave\workspace\Lucene-Solr-5.x-Windows\solr\build\solr-core\test\J0
   [junit4]   2> 2896727 INFO  (coreLoadExecutor-7711-thread-1-processing-n:127.0.0.1:62337_ow_me%2Fr) [n:127.0.0.1:62337_ow_me%2Fr c:collection1   x:collection1] o.a.s.c.ZkController publishing state=down
   [junit4]   2> 2896727 INFO  (coreLoadExecutor-7711-thread-1-processing-n:127.0.0.1:62337_ow_me%2Fr) [n:127.0.0.1:62337_ow_me%2Fr c:collection1   x:collection1] o.a.s.c.ZkController numShards not found on descriptor - reading it from system property
   [junit4]   2> 2896727 INFO  (TEST-TestSolrConfigHandlerCloud.test-seed#[353B07C2896C3E8]) [n:127.0.0.1:62337_ow_me%2Fr    ] o.a.s.s.SolrDispatchFilter SolrDispatchFilter.init() done
   [junit4]   2> 2896730 INFO  (coreLoadExecutor-7711-thread-1-processing-n:127.0.0.1:62337_ow_me%2Fr) [n:127.0.0.1:62337_ow_me%2Fr c:collection1   x:collection1] o.a.s.c.ZkController look for our core node name
   [junit4]   2> 2896730 INFO  (OverseerStateUpdate-95187287043801092-127.0.0.1:62321_ow_me%2Fr-n_0000000000) [n:127.0.0.1:62321_ow_me%2Fr    ] o.a.s.c.Overseer processMessage: queueSize: 1, message = {
   [junit4]   2>   "numShards":"2",
   [junit4]   2>   "node_name":"127.0.0.1:62337_ow_me%2Fr",
   [junit4]   2>   "core":"collection1",
   [junit4]   2>   "collection":"collection1",
   [junit4]   2>   "base_url":"http://127.0.0.1:62337/ow_me/r",
   [junit4]   2>   "operation":"state",
   [junit4]   2>   "shard":null,
   [junit4]   2>   "roles":null,
   [junit4]   2>   "state":"down"} current state version: 3
   [junit4]   2> 2896730 INFO  (OverseerStateUpdate-95187287043801092-127.0.0.1:62321_ow_me%2Fr-n_0000000000) [n:127.0.0.1:62321_ow_me%2Fr    ] o.a.s.c.o.ReplicaMutator Update state numShards=2 message={
   [junit4]   2>   "numShards":"2",
   [junit4]   2>   "node_name":"127.0.0.1:62337_ow_me%2Fr",
   [junit4]   2>   "core":"collection1",
   [junit4]   2>   "collection":"collection1",
   [junit4]   2>   "base_url":"http://127.0.0.1:62337/ow_me/r",
   [junit4]   2>   "operation":"state",
   [junit4]   2>   "shard":null,
   [junit4]   2>   "roles":null,
   [junit4]   2>   "state":"down"}
   [junit4]   2> 2896730 INFO  (OverseerStateUpdate-95187287043801092-127.0.0.1:62321_ow_me%2Fr-n_0000000000) [n:127.0.0.1:62321_ow_me%2Fr    ] o.a.s.c.o.ClusterStateMutator building a new cName: collection1
   [junit4]   2> 2896731 INFO  (OverseerStateUpdate-95187287043801092-127.0.0.1:62321_ow_me%2Fr-n_0000000000) [n:127.0.0.1:62321_ow_me%2Fr    ] o.a.s.c.o.ReplicaMutator Assigning new node to shard shard=shard1
   [junit4]   2> 2896841 INFO  (zkCallback-2284-thread-1-processing-n:127.0.0.1:62321_ow_me%2Fr) [n:127.0.0.1:62321_ow_me%2Fr    ] o.a.s.c.c.ZkStateReader A cluster state change: [WatchedEvent state:SyncConnected type:NodeDataChanged path:/clusterstate.json], has occurred - updating... (live nodes size: [2])
   [junit4]   2> 2896841 INFO  (zkCallback-2286-thread-1) [    ] o.a.s.c.c.ZkStateReader A cluster state change: [WatchedEvent state:SyncConnected type:NodeDataChanged path:/clusterstate.json], has occurred - updating... (live nodes size: [2])
   [junit4]   2> 2896841 INFO  (zkCallback-2290-thread-1-processing-n:127.0.0.1:62337_ow_me%2Fr) [n:127.0.0.1:62337_ow_me%2Fr    ] o.a.s.c.c.ZkStateReader A cluster state change: [WatchedEvent state:SyncConnected type:NodeDataChanged path:/clusterstate.json], has occurred - updating... (live nodes size: [2])
   [junit4]   2> 2897808 INFO  (coreLoadExecutor-7711-thread-1-processing-n:127.0.0.1:62337_ow_me%2Fr) [n:127.0.0.1:62337_ow_me%2Fr c:collection1   x:collection1] o.a.s.c.ZkController waiting to find shard id in clusterstate for collection1
   [junit4]   2> 2897808 INFO  (coreLoadExecutor-7711-thread-1-processing-n:127.0.0.1:62337_ow_me%2Fr) [n:127.0.0.1:62337_ow_me%2Fr c:collection1   x:collection1] o.a.s.c.ZkController Check for collection zkNode:collection1
   [junit4]   2> 2897808 INFO  (coreLoadExecutor-7711-thread-1-processing-n:127.0.0.1:62337_ow_me%2Fr) [n:127.0.0.1:62337_ow_me%2Fr c:collection1   x:collection1] o.a.s.c.ZkController Collection zkNode exists
   [junit4]   2> 2897809 INFO  (coreLoadExecutor-7711-thread-1-processing-n:127.0.0.1:62337_ow_me%2Fr) [n:127.0.0.1:62337_ow_me%2Fr c:collection1   x:collection1] o.a.s.c.c.ZkStateReader Load collection config from: [/collections/collection1]
   [junit4]   2> 2897809 INFO  (coreLoadExecutor-7711-thread-1-processing-n:127.0.0.1:62337_ow_me%2Fr) [n:127.0.0.1:62337_ow_me%2Fr c:collection1   x:collection1] o.a.s.c.c.ZkStateReader path=[/collections/collection1] [configName]=[conf1] specified config exists in ZooKeeper
   [junit4]   2> 2897809 INFO  (coreLoadExecutor-7711-thread-1-processing-n:127.0.0.1:62337_ow_me%2Fr) [n:127.0.0.1:62337_ow_me%2Fr c:collection1   x:collection1] o.a.s.c.SolrResourceLoader new SolrResourceLoader for directory: 'C:\Users\JenkinsSlave\workspace\Lucene-Solr-5.x-Windows\solr\build\solr-core\test\J0\temp\solr.handler.TestSolrConfigHandlerCloud_353B07C2896C3E8-001\shard-1-001\cores\collection1'
   [junit4]   2> 2897810 INFO  (coreLoadExecutor-7711-thread-1-processing-n:127.0.0.1:62337_ow_me%2Fr) [n:127.0.0.1:62337_ow_me%2Fr c:collection1   x:collection1] o.a.s.c.SolrResourceLoader JNDI not configured for solr (NoInitialContextEx)
   [junit4]   2> 2897810 INFO  (coreLoadExecutor-7711-thread-1-processing-n:127.0.0.1:62337_ow_me%2Fr) [n:127.0.0.1:62337_ow_me%2Fr c:collection1   x:collection1] o.a.s.c.SolrResourceLoader solr home defaulted to 'solr/' (could not find system property or JNDI)
   [junit4]   2> 2897813 INFO  (coreLoadExecutor-7711-thread-1-processing-n:127.0.0.1:62337_ow_me%2Fr) [n:127.0.0.1:62337_ow_me%2Fr c:collection1   x:collection1] o.a.s.c.Config loaded config solrconfig.xml with version 0 
   [junit4]   2> 2897822 INFO  (coreLoadExecutor-7711-thread-1-processing-n:127.0.0.1:62337_ow_me%2Fr) [n:127.0.0.1:62337_ow_me%2Fr c:collection1   x:collection1] o.a.s.c.SolrConfig current version of requestparams : -1
   [junit4]   2> 2897843 INFO  (coreLoadExecutor-7711-thread-1-processing-n:127.0.0.1:62337_ow_me%2Fr) [n:127.0.0.1:62337_ow_me%2Fr c:collection1   x:collection1] o.a.s.c.SolrConfig Using Lucene MatchVersion: 5.5.0
   [junit4]   2> 2897894 INFO  (coreLoadExecutor-7711-thread-1-processing-n:127.0.0.1:62337_ow_me%2Fr) [n:127.0.0.1:62337_ow_me%2Fr c:collection1   x:collection1] o.a.s.c.SolrConfig Loaded SolrConfig: solrconfig.xml
   [junit4]   2> 2897907 INFO  (coreLoadExecutor-7711-thread-1-processing-n:127.0.0.1:62337_ow_me%2Fr) [n:127.0.0.1:62337_ow_me%2Fr c:collection1   x:collection1] o.a.s.s.IndexSchema [collection1] Schema name=test
   [junit4]   2> 2898259 INFO  (coreLoadExecutor-7711-thread-1-processing-n:127.0.0.1:62337_ow_me%2Fr) [n:127.0.0.1:62337_ow_me%2Fr c:collection1   x:collection1] o.a.s.s.OpenExchangeRatesOrgProvider Initialized with rates=open-exchange-rates.json, refreshInterval=1440.
   [junit4]   2> 2898272 INFO  (coreLoadExecutor-7711-thread-1-processing-n:127.0.0.1:62337_ow_me%2Fr) [n:127.0.0.1:62337_ow_me%2Fr c:collection1   x:collection1] o.a.s.s.IndexSchema default search field in schema is text
   [junit4]   2> 2898274 INFO  (coreLoadExecutor-7711-thread-1-processing-n:127.0.0.1:62337_ow_me%2Fr) [n:127.0.0.1:62337_ow_me%2Fr c:collection1   x:collection1] o.a.s.s.IndexSchema unique key field: id
   [junit4]   2> 2898287 INFO  (coreLoadExecutor-7711-thread-1-processing-n:127.0.0.1:62337_ow_me%2Fr) [n:127.0.0.1:62337_ow_me%2Fr c:collection1   x:collection1] o.a.s.s.FileExchangeRateProvider Reloading exchange rates from file currency.xml
   [junit4]   2> 2898291 INFO  (coreLoadExecutor-7711-thread-1-processing-n:127.0.0.1:62337_ow_me%2Fr) [n:127.0.0.1:62337_ow_me%2Fr c:collection1   x:collection1] o.a.s.s.FileExchangeRateProvider Reloading exchange rates from file currency.xml
   [junit4]   2> 2898295 INFO  (coreLoadExecutor-7711-thread-1-processing-n:127.0.0.1:62337_ow_me%2Fr) [n:127.0.0.1:62337_ow_me%2Fr c:collection1   x:collection1] o.a.s.s.OpenExchangeRatesOrgProvider Reloading exchange rates from open-exchange-rates.json
   [junit4]   2> 2898296 INFO  (coreLoadExecutor-7711-thread-1-processing-n:127.0.0.1:62337_ow_me%2Fr) [n:127.0.0.1:62337_ow_me%2Fr c:collection1   x:collection1] o.a.s.s.OpenExchangeRatesOrgProvider Reloading exchange rates from open-exchange-rates.json
   [junit4]   2> 2898300 INFO  (coreLoadExecutor-7711-thread-1-processing-n:127.0.0.1:62337_ow_me%2Fr) [n:127.0.0.1:62337_ow_me%2Fr c:collection1   x:collection1] o.a.s.c.ConfigSetProperties Did not find ConfigSet properties, assuming default properties: Can't find resource 'configsetprops.json' in classpath or '/configs/conf1', cwd=C:\Users\JenkinsSlave\workspace\Lucene-Solr-5.x-Windows\solr\build\solr-core\test\J0
   [junit4]   2> 2898302 INFO  (coreLoadExecutor-7711-thread-1-processing-n:127.0.0.1:62337_ow_me%2Fr) [n:127.0.0.1:62337_ow_me%2Fr c:collection1   x:collection1] o.a.s.c.CoreContainer Creating SolrCore 'collection1' using configuration from collection collection1
   [junit4]   2> 2898302 INFO  (coreLoadExecutor-7711-thread-1-processing-n:127.0.0.1:62337_ow_me%2Fr) [n:127.0.0.1:62337_ow_me%2Fr c:collection1 s:shard1 r:core_node1 x:collection1] o.a.s.c.SolrCore org.apache.solr.core.MockDirectoryFactory
   [junit4]   2> 2898302 INFO  (coreLoadExecutor-7711-thread-1-processing-n:127.0.0.1:62337_ow_me%2Fr) [n:127.0.0.1:62337_ow_me%2Fr c:collection1 s:shard1 r:core_node1 x:collection1] o.a.s.c.SolrCore [[collection1] ] Opening new SolrCore at [C:\Users\JenkinsSlave\workspace\Lucene-Solr-5.x-Windows\solr\build\solr-core\test\J0\temp\solr.handler.TestSolrConfigHandlerCloud_353B07C2896C3E8-001\shard-1-001\cores\collection1], dataDir=[C:\Users\JenkinsSlave\workspace\Lucene-Solr-5.x-Windows\solr\build\solr-core\test\J0\temp\solr.handler.TestSolrConfigHandlerCloud_353B07C2896C3E8-001\shard-1-001\cores\collection1\data\]
   [junit4]   2> 2898302 INFO  (coreLoadExecutor-7711-thread-1-processing-n:127.0.0.1:62337_ow_me%2Fr) [n:127.0.0.1:62337_ow_me%2Fr c:collection1 s:shard1 r:core_node1 x:collection1] o.a.s.c.JmxMonitoredMap JMX monitoring is enabled. Adding Solr mbeans to JMX Server: com.sun.jmx.mbeanserver.JmxMBeanServer@dd825d
   [junit4]   2> 2898303 INFO  (coreLoadExecutor-7711-thread-1-processing-n:127.0.0.1:62337_ow_me%2Fr) [n:127.0.0.1:62337_ow_me%2Fr c:collection1 s:shard1 r:core_node1 x:collection1] o.a.s.c.CachingDirectoryFactory return new directory for C:\Users\JenkinsSlave\workspace\Lucene-Solr-5.x-Windows\solr\build\solr-core\test\J0\temp\solr.handler.TestSolrConfigHandlerCloud_353B07C2896C3E8-001\shard-1-001\cores\collection1\data\
   [junit4]   2> 2898303 INFO  (coreLoadExecutor-7711-thread-1-processing-n:127.0.0.1:62337_ow_me%2Fr) [n:127.0.0.1:62337_ow_me%2Fr c:collection1 s:shard1 r:core_node1 x:collection1] o.a.s.c.SolrCore New index directory detected: old=null new=C:\Users\JenkinsSlave\workspace\Lucene-Solr-5.x-Windows\solr\build\solr-core\test\J0\temp\solr.handler.TestSolrConfigHandlerCloud_353B07C2896C3E8-001\shard-1-001\cores\collection1\data\index/
   [junit4]   2> 2898303 WARN  (coreLoadExecutor-7711-thread-1-processing-n:127.0.0.1:62337_ow_me%2Fr) [n:127.0.0.1:62337_ow_me%2Fr c:collection1 s:shard1 r:core_node1 x:collection1] o.a.s.c.SolrCore [collection1] Solr index directory 'C:\Users\JenkinsSlave\workspace\Lucene-Solr-5.x-Windows\solr\build\solr-core\test\J0\temp\solr.handler.TestSolrConfigHandlerCloud_353B07C2896C3E8-001\shard-1-001\cores\collection1\data\index' doesn't exist. Creating new index...
   [junit4]   2> 2898303 INFO  (coreLoadExecutor-7711-thread-1-processing-n:127.0.0.1:62337_ow_me%2Fr) [n:127.0.0.1:62337_ow_me%2Fr c:collection1 s:shard1 r:core_node1 x:collection1] o.a.s.c.CachingDirectoryFactory return new directory for C:\Users\JenkinsSlave\workspace\Lucene-Solr-5.x-Windows\solr\build\solr-core\test\J0\temp\solr.handler.TestSolrConfigHandlerCloud_353B07C2896C3E8-001\shard-1-001\cores\collection1\data\index
   [junit4]   2> 2898303 INFO  (coreLoadExecutor-7711-thread-1-processing-n:127.0.0.1:62337_ow_me%2Fr) [n:127.0.0.1:62337_ow_me%2Fr c:collection1 s:shard1 r:core_node1 x:collection1] o.a.s.u.RandomMergePolicy RandomMergePolicy wrapping class org.apache.lucene.index.LogByteSizeMergePolicy: [LogByteSizeMergePolicy: minMergeSize=1677721, mergeFactor=15, maxMergeSize=2147483648, maxMergeSizeForForcedMerge=9223372036854775807, calibrateSizeByDeletes=false, maxMergeDocs=2147483647, maxCFSSegmentSizeMB=8.796093022207999E12, noCFSRatio=0.33941624184106534]
   [junit4]   2> 2898304 INFO  (coreLoadExecutor-7711-thread-1-processing-n:127.0.0.1:62337_ow_me%2Fr) [n:127.0.0.1:62337_ow_me%2Fr c:collection1 s:shard1 r:core_node1 x:collection1] o.a.s.c.SolrDeletionPolicy SolrDeletionPolicy.onCommit: commits: num=1
   [junit4]   2> 	commit{dir=MockDirectoryWrapper(RAMDirectory@983c62 lockFactory=org.apache.lucene.store.SingleInstanceLockFactory@a44e70),segFN=segments_1,generation=1}
   [junit4]   2> 2898304

[...truncated too long message...]

5.x-Windows\solr\build\solr-core\test\J0\temp\solr.handler.TestSolrConfigHandlerCloud_353B07C2896C3E8-001\shard-4-001\cores\collection1\data\index;done=false>>]
   [junit4]   2> 2971479 INFO  (Thread-7227) [n:127.0.0.1:62398_ow_me%2Fr c:collection1 s:shard2 r:core_node4 x:collection1] o.a.s.c.CachingDirectoryFactory Closing directory: C:\Users\JenkinsSlave\workspace\Lucene-Solr-5.x-Windows\solr\build\solr-core\test\J0\..\..\..\..\..\..\..\..\..\Users\JenkinsSlave\workspace\Lucene-Solr-5.x-Windows\solr\build\solr-core\test\J0\temp\solr.handler.TestSolrConfigHandlerCloud_353B07C2896C3E8-001\shard-4-001\cores\collection1\data\index
   [junit4]   2> 2971479 WARN  (Thread-7227) [n:127.0.0.1:62398_ow_me%2Fr c:collection1 s:shard2 r:core_node4 x:collection1] o.a.s.c.SolrCores Tried to remove core collection1 from pendingCoreOps and it wasn't there. 
   [junit4]   2> 2971479 WARN  (Thread-7227) [n:127.0.0.1:62398_ow_me%2Fr c:collection1 s:shard2 r:core_node4 x:collection1] o.a.s.c.ZkController listener throws error
   [junit4]   2> org.apache.solr.common.SolrException: Unable to reload core [collection1]
   [junit4]   2> 	at org.apache.solr.core.CoreContainer.reload(CoreContainer.java:925)
   [junit4]   2> 	at org.apache.solr.core.SolrCore$11.run(SolrCore.java:2583)
   [junit4]   2> 	at org.apache.solr.cloud.ZkController$5.run(ZkController.java:2441)
   [junit4]   2> Caused by: org.apache.solr.common.SolrException: Could not find config name for collection:collection1
   [junit4]   2> 	at org.apache.solr.core.SolrCore.<init>(SolrCore.java:821)
   [junit4]   2> 	at org.apache.solr.core.SolrCore.reload(SolrCore.java:461)
   [junit4]   2> 	at org.apache.solr.core.CoreContainer.reload(CoreContainer.java:920)
   [junit4]   2> 	... 2 more
   [junit4]   2> Caused by: org.apache.solr.common.SolrException: Could not find config name for collection:collection1
   [junit4]   2> 	at org.apache.solr.rest.ManagedResourceStorage.newStorageIO(ManagedResourceStorage.java:102)
   [junit4]   2> 	at org.apache.solr.core.SolrCore.initRestManager(SolrCore.java:2376)
   [junit4]   2> 	at org.apache.solr.core.SolrCore.<init>(SolrCore.java:797)
   [junit4]   2> 	... 4 more
   [junit4]   2> NOTE: test params are: codec=HighCompressionCompressingStoredFields(storedFieldsFormat=CompressingStoredFieldsFormat(compressionMode=HIGH_COMPRESSION, chunkSize=5105, maxDocsPerChunk=5, blockSize=145), termVectorsFormat=CompressingTermVectorsFormat(compressionMode=HIGH_COMPRESSION, chunkSize=5105, blockSize=145)), sim=RandomSimilarityProvider(queryNorm=false,coord=yes): {}, locale=nl_NL, timezone=Pacific/Niue
   [junit4]   2> NOTE: Windows 7 6.1 x86/Oracle Corporation 1.7.0_80 (32-bit)/cpus=3,threads=1,free=204397664,total=476315648
   [junit4]   2> NOTE: All tests run in this JVM: [SolrTestCaseJ4Test, TestFieldTypeCollectionResource, ChaosMonkeyNothingIsSafeTest, ScriptEngineTest, SoftAutoCommitTest, ConjunctionSolrSpellCheckerTest, TestStressVersions, JavabinLoaderTest, TestSchemaManager, HdfsWriteToMultipleCollectionsTest, SyncSliceTest, SpatialFilterTest, TestSmileRequest, TestCSVLoader, LeaderInitiatedRecoveryOnShardRestartTest, TestBulkSchemaConcurrent, BadCopyFieldTest, ForceLeaderTest, HdfsBasicDistributedZk2Test, TestCollationFieldDocValues, TestArbitraryIndexDir, DocumentBuilderTest, TestCursorMarkWithoutUniqueKey, CloudMLTQParserTest, TestFastLRUCache, DirectoryFactoryTest, TestDFRSimilarityFactory, SimpleFacetsTest, SuggestComponentContextFilterQueryTest, TestQuerySenderNoQuery, TestUpdate, AddSchemaFieldsUpdateProcessorFactoryTest, SolrRequestParserTest, TestDynamicFieldCollectionResource, TestCodecSupport, AliasIntegrationTest, ZkControllerTest, TestConfigOverlay, CustomCollectionTest, TermsComponentTest, TestConfigSetsAPIZkFailure, UUIDFieldTest, TestMinMaxOnMultiValuedField, XsltUpdateRequestHandlerTest, DistribDocExpirationUpdateProcessorTest, CollectionStateFormat2Test, TestBlendedInfixSuggestions, TestSortingResponseWriter, TestSort, URLClassifyProcessorTest, TestRandomForceMergePolicy, HdfsRestartWhileUpdatingTest, DistributedSpellCheckComponentTest, TestSolrDeletionPolicy1, DistributedQueueTest, FastVectorHighlighterTest, ZkCLITest, TestLuceneMatchVersion, ConfigSetsAPITest, RulesTest, XmlUpdateRequestHandlerTest, OverseerTaskQueueTest, AsyncCallRequestStatusResponseTest, DistributedFacetPivotSmallAdvancedTest, HdfsThreadLeakTest, TestManagedSchemaDynamicFieldResource, DirectUpdateHandlerTest, TestConfigSetsAPI, TestShortCircuitedRequests, FacetPivotSmallTest, HdfsCollectionsAPIDistributedZkTest, RemoteQueryErrorTest, TestExactSharedStatsCache, TestInitQParser, BadComponentTest, TestTolerantSearch, HdfsLockFactoryTest, BlockCacheTest, TestInfoStreamLogging, TestMacros, TestCoreContainer, TestPivotHelperCode, TestLMDirichletSimilarityFactory, TestReplicationHandler, RegexBoostProcessorTest, PrimitiveFieldTypeTest, TestNRTOpen, SampleTest, DistributedQueryComponentOptimizationTest, TestOverriddenPrefixQueryForCustomFieldType, MBeansHandlerTest, HLLUtilTest, PrimUtilsTest, TestSerializedLuceneMatchVersion, SolrIndexConfigTest, RestartWhileUpdatingTest, QueryElevationComponentTest, TestHashPartitioner, TestReqParamsAPI, TestPerFieldSimilarityWithDefaultOverride, HighlighterTest, TestRebalanceLeaders, TestSolrCLIRunExample, TriLevelCompositeIdRoutingTest, TestPseudoReturnFields, TestStandardQParsers, SharedFSAutoReplicaFailoverUtilsTest, TestSearcherReuse, ReturnFieldsTest, DOMUtilTest, TestElisionMultitermQuery, DistributedQueryElevationComponentTest, TestExclusionRuleCollectionAccess, PolyFieldTest, TestHighlightDedupGrouping, RequestLoggingTest, TestDefaultStatsCache, TestFieldCollectionResource, DocumentAnalysisRequestHandlerTest, DateRangeFieldTest, MultiThreadedOCPTest, TestSearchPerf, TestFunctionQuery, CheckHdfsIndexTest, PreAnalyzedFieldTest, CloudExitableDirectoryReaderTest, SSLMigrationTest, TestMergePolicyConfig, TestShardHandlerFactory, TestSolrDynamicMBean, SystemInfoHandlerTest, SolrCoreTest, PathHierarchyTokenizerFactoryTest, TestConfig, TestPartialUpdateDeduplication, TestMissingGroups, BasicDistributedZkTest, CollectionsAPIDistributedZkTest, ShardRoutingTest, FullSolrCloudDistribCmdsTest, TestRandomDVFaceting, ShardRoutingCustomTest, TestDistributedSearch, PeerSyncTest, BasicFunctionalityTest, TestIndexSearcher, CurrencyFieldXmlFileTest, TestCoreDiscovery, TestExtendedDismaxParser, SuggesterFSTTest, TestFoldingMultitermQuery, SuggesterTest, TestAtomicUpdateErrorCases, TestWordDelimiterFilterFactory, StatelessScriptUpdateProcessorFactoryTest, TestRemoteStreaming, IndexBasedSpellCheckerTest, DisMaxRequestHandlerTest, StandardRequestHandlerTest, DirectSolrSpellCheckerTest, TestOmitPositions, RequestHandlersTest, MoreLikeThisHandlerTest, FieldAnalysisRequestHandlerTest, JSONWriterTest, TestAnalyzedSuggestions, TestPHPSerializedResponseWriter, CSVRequestHandlerTest, TestComponentsName, TestLFUCache, ExternalFileFieldSortTest, DirectSolrConnectionTest, SpellPossibilityIteratorTest, TestCharFilters, SynonymTokenizerTest, EchoParamsTest, TestPerFieldSimilarity, TestIBSimilarityFactory, TimeZoneUtilsTest, DateFieldTest, FileUtilsTest, CursorPagingTest, TestDistributedMissingSort, CollectionReloadTest, CollectionsAPIAsyncDistributedZkTest, DeleteLastCustomShardedReplicaTest, DeleteShardTest, DistribJoinFromCollectionTest, LeaderInitiatedRecoveryOnCommitTest, OutOfBoxZkACLAndCredentialsProvidersTest, OverriddenZkACLAndCredentialsProvidersTest, OverseerStatusTest, ReplicationFactorTest, RollingRestartTest, SharedFSAutoReplicaFailoverTest, SolrCloudExampleTest, TestAuthenticationFramework, TestDistribDocBasedVersion, TestMiniSolrCloudClusterBase, TestRequestForwarding, TestSolrCloudWithKerberosAlt, ZkStateWriterTest, TestDynamicLoading, TestReplicationHandlerBackup, TestRestoreCore, TestSolrConfigHandlerCloud]
   [junit4]   2> NOTE: reproduce with: ant test  -Dtestcase=TestSolrConfigHandlerCloud -Dtests.seed=353B07C2896C3E8 -Dtests.slow=true -Dtests.locale=nl_NL -Dtests.timezone=Pacific/Niue -Dtests.asserts=true -Dtests.file.encoding=ISO-8859-1
   [junit4] ERROR   0.00s J0 | TestSolrConfigHandlerCloud (suite) <<<
   [junit4]    > Throwable #1: java.lang.AssertionError: ObjectTracker found 3 object(s) that were not released!!! [MockDirectoryWrapper, MockDirectoryWrapper, MDCAwareThreadPoolExecutor]
   [junit4]    > 	at __randomizedtesting.SeedInfo.seed([353B07C2896C3E8]:0)
   [junit4]    > 	at org.apache.solr.SolrTestCaseJ4.afterClass(SolrTestCaseJ4.java:228)
   [junit4]    > 	at java.lang.Thread.run(Thread.java:745)
   [junit4] Completed [480/563 (1!)] on J0 in 80.37s, 1 test, 1 failure <<< FAILURES!

[...truncated 277 lines...]
BUILD FAILED
C:\Users\JenkinsSlave\workspace\Lucene-Solr-5.x-Windows\build.xml:794: The following error occurred while executing this line:
C:\Users\JenkinsSlave\workspace\Lucene-Solr-5.x-Windows\build.xml:738: The following error occurred while executing this line:
C:\Users\JenkinsSlave\workspace\Lucene-Solr-5.x-Windows\build.xml:59: The following error occurred while executing this line:
C:\Users\JenkinsSlave\workspace\Lucene-Solr-5.x-Windows\solr\build.xml:233: The following error occurred while executing this line:
C:\Users\JenkinsSlave\workspace\Lucene-Solr-5.x-Windows\solr\common-build.xml:526: The following error occurred while executing this line:
C:\Users\JenkinsSlave\workspace\Lucene-Solr-5.x-Windows\lucene\common-build.xml:1444: The following error occurred while executing this line:
C:\Users\JenkinsSlave\workspace\Lucene-Solr-5.x-Windows\lucene\common-build.xml:1000: There were test failures: 563 suites (7 ignored), 2236 tests, 1 suite-level error, 93 ignored (49 assumptions) [seed: 353B07C2896C3E8]

Total time: 71 minutes 33 seconds
Build step 'Invoke Ant' marked build as failure
Archiving artifacts
[WARNINGS] Skipping publisher since build result is FAILURE
Recording test results
Email was triggered for: Failure - Any
Sending email for trigger: Failure - Any



Mime
View raw message