lucene-dev mailing list archives

Site index · List index
Message view « Date » · « Thread »
Top « Date » · « Thread »
From Apache Jenkins Server <jenk...@builds.apache.org>
Subject [JENKINS] Lucene-Solr-Tests-5.3-Java7 - Build # 30 - Failure
Date Wed, 20 Jan 2016 00:08:08 GMT
Build: https://builds.apache.org/job/Lucene-Solr-Tests-5.3-Java7/30/

1 tests failed.
FAILED:  org.apache.solr.cloud.OverseerStatusTest.test

Error Message:
No stats for split in OverseerCollectionProcessor expected:<1> but was:<2>

Stack Trace:
java.lang.AssertionError: No stats for split in OverseerCollectionProcessor expected:<1> but was:<2>
	at __randomizedtesting.SeedInfo.seed([B7A9B1CA329179CE:3FFD8E109C6D1436]:0)
	at org.junit.Assert.fail(Assert.java:93)
	at org.junit.Assert.failNotEquals(Assert.java:647)
	at org.junit.Assert.assertEquals(Assert.java:128)
	at org.apache.solr.cloud.OverseerStatusTest.test(OverseerStatusTest.java:91)
	at sun.reflect.NativeMethodAccessorImpl.invoke0(Native Method)
	at sun.reflect.NativeMethodAccessorImpl.invoke(NativeMethodAccessorImpl.java:57)
	at sun.reflect.DelegatingMethodAccessorImpl.invoke(DelegatingMethodAccessorImpl.java:43)
	at java.lang.reflect.Method.invoke(Method.java:606)
	at com.carrotsearch.randomizedtesting.RandomizedRunner.invoke(RandomizedRunner.java:1627)
	at com.carrotsearch.randomizedtesting.RandomizedRunner$6.evaluate(RandomizedRunner.java:836)
	at com.carrotsearch.randomizedtesting.RandomizedRunner$7.evaluate(RandomizedRunner.java:872)
	at com.carrotsearch.randomizedtesting.RandomizedRunner$8.evaluate(RandomizedRunner.java:886)
	at org.apache.solr.BaseDistributedSearchTestCase$ShardsRepeatRule$ShardsFixedStatement.callStatement(BaseDistributedSearchTestCase.java:963)
	at org.apache.solr.BaseDistributedSearchTestCase$ShardsRepeatRule$ShardsStatement.evaluate(BaseDistributedSearchTestCase.java:938)
	at com.carrotsearch.randomizedtesting.rules.SystemPropertiesRestoreRule$1.evaluate(SystemPropertiesRestoreRule.java:57)
	at org.apache.lucene.util.TestRuleSetupTeardownChained$1.evaluate(TestRuleSetupTeardownChained.java:50)
	at org.apache.lucene.util.AbstractBeforeAfterRule$1.evaluate(AbstractBeforeAfterRule.java:46)
	at org.apache.lucene.util.TestRuleThreadAndTestName$1.evaluate(TestRuleThreadAndTestName.java:49)
	at org.apache.lucene.util.TestRuleIgnoreAfterMaxFailures$1.evaluate(TestRuleIgnoreAfterMaxFailures.java:65)
	at org.apache.lucene.util.TestRuleMarkFailure$1.evaluate(TestRuleMarkFailure.java:48)
	at com.carrotsearch.randomizedtesting.rules.StatementAdapter.evaluate(StatementAdapter.java:36)
	at com.carrotsearch.randomizedtesting.ThreadLeakControl$StatementRunner.run(ThreadLeakControl.java:365)
	at com.carrotsearch.randomizedtesting.ThreadLeakControl.forkTimeoutingTask(ThreadLeakControl.java:798)
	at com.carrotsearch.randomizedtesting.ThreadLeakControl$3.evaluate(ThreadLeakControl.java:458)
	at com.carrotsearch.randomizedtesting.RandomizedRunner.runSingleTest(RandomizedRunner.java:845)
	at com.carrotsearch.randomizedtesting.RandomizedRunner$3.evaluate(RandomizedRunner.java:747)
	at com.carrotsearch.randomizedtesting.RandomizedRunner$4.evaluate(RandomizedRunner.java:781)
	at com.carrotsearch.randomizedtesting.RandomizedRunner$5.evaluate(RandomizedRunner.java:792)
	at com.carrotsearch.randomizedtesting.rules.StatementAdapter.evaluate(StatementAdapter.java:36)
	at com.carrotsearch.randomizedtesting.rules.SystemPropertiesRestoreRule$1.evaluate(SystemPropertiesRestoreRule.java:57)
	at org.apache.lucene.util.AbstractBeforeAfterRule$1.evaluate(AbstractBeforeAfterRule.java:46)
	at com.carrotsearch.randomizedtesting.rules.StatementAdapter.evaluate(StatementAdapter.java:36)
	at org.apache.lucene.util.TestRuleStoreClassName$1.evaluate(TestRuleStoreClassName.java:42)
	at com.carrotsearch.randomizedtesting.rules.NoShadowingOrOverridesOnMethodsRule$1.evaluate(NoShadowingOrOverridesOnMethodsRule.java:39)
	at com.carrotsearch.randomizedtesting.rules.NoShadowingOrOverridesOnMethodsRule$1.evaluate(NoShadowingOrOverridesOnMethodsRule.java:39)
	at com.carrotsearch.randomizedtesting.rules.StatementAdapter.evaluate(StatementAdapter.java:36)
	at com.carrotsearch.randomizedtesting.rules.StatementAdapter.evaluate(StatementAdapter.java:36)
	at com.carrotsearch.randomizedtesting.rules.StatementAdapter.evaluate(StatementAdapter.java:36)
	at org.apache.lucene.util.TestRuleAssertionsRequired$1.evaluate(TestRuleAssertionsRequired.java:54)
	at org.apache.lucene.util.TestRuleMarkFailure$1.evaluate(TestRuleMarkFailure.java:48)
	at org.apache.lucene.util.TestRuleIgnoreAfterMaxFailures$1.evaluate(TestRuleIgnoreAfterMaxFailures.java:65)
	at org.apache.lucene.util.TestRuleIgnoreTestSuites$1.evaluate(TestRuleIgnoreTestSuites.java:55)
	at com.carrotsearch.randomizedtesting.rules.StatementAdapter.evaluate(StatementAdapter.java:36)
	at com.carrotsearch.randomizedtesting.ThreadLeakControl$StatementRunner.run(ThreadLeakControl.java:365)
	at java.lang.Thread.run(Thread.java:745)




Build Log:
[...truncated 10406 lines...]
   [junit4] Suite: org.apache.solr.cloud.OverseerStatusTest
   [junit4]   2> Creating dataDir: /x1/jenkins/jenkins-slave/workspace/Lucene-Solr-Tests-5.3-Java7/solr/build/solr-core/test/J0/temp/solr.cloud.OverseerStatusTest_B7A9B1CA329179CE-001/init-core-data-001
   [junit4]   2> 1237189 WARN  (SUITE-OverseerStatusTest-seed#[B7A9B1CA329179CE]-worker) [    ] o.a.s.SolrTestCaseJ4 startTrackingSearchers: numOpens=2 numCloses=2
   [junit4]   2> 1237189 INFO  (SUITE-OverseerStatusTest-seed#[B7A9B1CA329179CE]-worker) [    ] o.a.s.BaseDistributedSearchTestCase Setting hostContext system property: /
   [junit4]   2> 1237198 INFO  (TEST-OverseerStatusTest.test-seed#[B7A9B1CA329179CE]) [    ] o.a.s.c.ZkTestServer STARTING ZK TEST SERVER
   [junit4]   2> 1237203 INFO  (Thread-2362) [    ] o.a.s.c.ZkTestServer client port:0.0.0.0/0.0.0.0:0
   [junit4]   2> 1237203 INFO  (Thread-2362) [    ] o.a.s.c.ZkTestServer Starting server
   [junit4]   2> 1237303 INFO  (TEST-OverseerStatusTest.test-seed#[B7A9B1CA329179CE]) [    ] o.a.s.c.ZkTestServer start zk server on port:36866
   [junit4]   2> 1237304 INFO  (TEST-OverseerStatusTest.test-seed#[B7A9B1CA329179CE]) [    ] o.a.s.c.c.SolrZkClient Using default ZkCredentialsProvider
   [junit4]   2> 1237305 INFO  (TEST-OverseerStatusTest.test-seed#[B7A9B1CA329179CE]) [    ] o.a.s.c.c.ConnectionManager Waiting for client to connect to ZooKeeper
   [junit4]   2> 1237312 INFO  (zkCallback-553-thread-1) [    ] o.a.s.c.c.ConnectionManager Watcher org.apache.solr.common.cloud.ConnectionManager@3a22d2cc name:ZooKeeperConnection Watcher:127.0.0.1:36866 got event WatchedEvent state:SyncConnected type:None path:null path:null type:None
   [junit4]   2> 1237312 INFO  (TEST-OverseerStatusTest.test-seed#[B7A9B1CA329179CE]) [    ] o.a.s.c.c.ConnectionManager Client is connected to ZooKeeper
   [junit4]   2> 1237313 INFO  (TEST-OverseerStatusTest.test-seed#[B7A9B1CA329179CE]) [    ] o.a.s.c.c.SolrZkClient Using default ZkACLProvider
   [junit4]   2> 1237313 INFO  (TEST-OverseerStatusTest.test-seed#[B7A9B1CA329179CE]) [    ] o.a.s.c.c.SolrZkClient makePath: /solr
   [junit4]   2> 1237329 INFO  (TEST-OverseerStatusTest.test-seed#[B7A9B1CA329179CE]) [    ] o.a.s.c.c.SolrZkClient Using default ZkCredentialsProvider
   [junit4]   2> 1237347 INFO  (TEST-OverseerStatusTest.test-seed#[B7A9B1CA329179CE]) [    ] o.a.s.c.c.ConnectionManager Waiting for client to connect to ZooKeeper
   [junit4]   2> 1237349 INFO  (zkCallback-554-thread-1) [    ] o.a.s.c.c.ConnectionManager Watcher org.apache.solr.common.cloud.ConnectionManager@65f4f55b name:ZooKeeperConnection Watcher:127.0.0.1:36866/solr got event WatchedEvent state:SyncConnected type:None path:null path:null type:None
   [junit4]   2> 1237349 INFO  (TEST-OverseerStatusTest.test-seed#[B7A9B1CA329179CE]) [    ] o.a.s.c.c.ConnectionManager Client is connected to ZooKeeper
   [junit4]   2> 1237349 INFO  (TEST-OverseerStatusTest.test-seed#[B7A9B1CA329179CE]) [    ] o.a.s.c.c.SolrZkClient Using default ZkACLProvider
   [junit4]   2> 1237349 INFO  (TEST-OverseerStatusTest.test-seed#[B7A9B1CA329179CE]) [    ] o.a.s.c.c.SolrZkClient makePath: /collections/collection1
   [junit4]   2> 1237351 INFO  (TEST-OverseerStatusTest.test-seed#[B7A9B1CA329179CE]) [    ] o.a.s.c.c.SolrZkClient makePath: /collections/collection1/shards
   [junit4]   2> 1237353 INFO  (TEST-OverseerStatusTest.test-seed#[B7A9B1CA329179CE]) [    ] o.a.s.c.c.SolrZkClient makePath: /collections/control_collection
   [junit4]   2> 1237354 INFO  (TEST-OverseerStatusTest.test-seed#[B7A9B1CA329179CE]) [    ] o.a.s.c.c.SolrZkClient makePath: /collections/control_collection/shards
   [junit4]   2> 1237355 INFO  (TEST-OverseerStatusTest.test-seed#[B7A9B1CA329179CE]) [    ] o.a.s.c.AbstractZkTestCase put /x1/jenkins/jenkins-slave/workspace/Lucene-Solr-Tests-5.3-Java7/solr/core/src/test-files/solr/collection1/conf/solrconfig-tlog.xml to /configs/conf1/solrconfig.xml
   [junit4]   2> 1237356 INFO  (TEST-OverseerStatusTest.test-seed#[B7A9B1CA329179CE]) [    ] o.a.s.c.c.SolrZkClient makePath: /configs/conf1/solrconfig.xml
   [junit4]   2> 1237358 INFO  (TEST-OverseerStatusTest.test-seed#[B7A9B1CA329179CE]) [    ] o.a.s.c.AbstractZkTestCase put /x1/jenkins/jenkins-slave/workspace/Lucene-Solr-Tests-5.3-Java7/solr/core/src/test-files/solr/collection1/conf/schema15.xml to /configs/conf1/schema.xml
   [junit4]   2> 1237358 INFO  (TEST-OverseerStatusTest.test-seed#[B7A9B1CA329179CE]) [    ] o.a.s.c.c.SolrZkClient makePath: /configs/conf1/schema.xml
   [junit4]   2> 1237360 INFO  (TEST-OverseerStatusTest.test-seed#[B7A9B1CA329179CE]) [    ] o.a.s.c.AbstractZkTestCase put /x1/jenkins/jenkins-slave/workspace/Lucene-Solr-Tests-5.3-Java7/solr/core/src/test-files/solr/collection1/conf/solrconfig.snippet.randomindexconfig.xml to /configs/conf1/solrconfig.snippet.randomindexconfig.xml
   [junit4]   2> 1237360 INFO  (TEST-OverseerStatusTest.test-seed#[B7A9B1CA329179CE]) [    ] o.a.s.c.c.SolrZkClient makePath: /configs/conf1/solrconfig.snippet.randomindexconfig.xml
   [junit4]   2> 1237362 INFO  (TEST-OverseerStatusTest.test-seed#[B7A9B1CA329179CE]) [    ] o.a.s.c.AbstractZkTestCase put /x1/jenkins/jenkins-slave/workspace/Lucene-Solr-Tests-5.3-Java7/solr/core/src/test-files/solr/collection1/conf/stopwords.txt to /configs/conf1/stopwords.txt
   [junit4]   2> 1237362 INFO  (TEST-OverseerStatusTest.test-seed#[B7A9B1CA329179CE]) [    ] o.a.s.c.c.SolrZkClient makePath: /configs/conf1/stopwords.txt
   [junit4]   2> 1237363 INFO  (TEST-OverseerStatusTest.test-seed#[B7A9B1CA329179CE]) [    ] o.a.s.c.AbstractZkTestCase put /x1/jenkins/jenkins-slave/workspace/Lucene-Solr-Tests-5.3-Java7/solr/core/src/test-files/solr/collection1/conf/protwords.txt to /configs/conf1/protwords.txt
   [junit4]   2> 1237364 INFO  (TEST-OverseerStatusTest.test-seed#[B7A9B1CA329179CE]) [    ] o.a.s.c.c.SolrZkClient makePath: /configs/conf1/protwords.txt
   [junit4]   2> 1237365 INFO  (TEST-OverseerStatusTest.test-seed#[B7A9B1CA329179CE]) [    ] o.a.s.c.AbstractZkTestCase put /x1/jenkins/jenkins-slave/workspace/Lucene-Solr-Tests-5.3-Java7/solr/core/src/test-files/solr/collection1/conf/currency.xml to /configs/conf1/currency.xml
   [junit4]   2> 1237366 INFO  (TEST-OverseerStatusTest.test-seed#[B7A9B1CA329179CE]) [    ] o.a.s.c.c.SolrZkClient makePath: /configs/conf1/currency.xml
   [junit4]   2> 1237367 INFO  (TEST-OverseerStatusTest.test-seed#[B7A9B1CA329179CE]) [    ] o.a.s.c.AbstractZkTestCase put /x1/jenkins/jenkins-slave/workspace/Lucene-Solr-Tests-5.3-Java7/solr/core/src/test-files/solr/collection1/conf/enumsConfig.xml to /configs/conf1/enumsConfig.xml
   [junit4]   2> 1237367 INFO  (TEST-OverseerStatusTest.test-seed#[B7A9B1CA329179CE]) [    ] o.a.s.c.c.SolrZkClient makePath: /configs/conf1/enumsConfig.xml
   [junit4]   2> 1237369 INFO  (TEST-OverseerStatusTest.test-seed#[B7A9B1CA329179CE]) [    ] o.a.s.c.AbstractZkTestCase put /x1/jenkins/jenkins-slave/workspace/Lucene-Solr-Tests-5.3-Java7/solr/core/src/test-files/solr/collection1/conf/open-exchange-rates.json to /configs/conf1/open-exchange-rates.json
   [junit4]   2> 1237369 INFO  (TEST-OverseerStatusTest.test-seed#[B7A9B1CA329179CE]) [    ] o.a.s.c.c.SolrZkClient makePath: /configs/conf1/open-exchange-rates.json
   [junit4]   2> 1237371 INFO  (TEST-OverseerStatusTest.test-seed#[B7A9B1CA329179CE]) [    ] o.a.s.c.AbstractZkTestCase put /x1/jenkins/jenkins-slave/workspace/Lucene-Solr-Tests-5.3-Java7/solr/core/src/test-files/solr/collection1/conf/mapping-ISOLatin1Accent.txt to /configs/conf1/mapping-ISOLatin1Accent.txt
   [junit4]   2> 1237371 INFO  (TEST-OverseerStatusTest.test-seed#[B7A9B1CA329179CE]) [    ] o.a.s.c.c.SolrZkClient makePath: /configs/conf1/mapping-ISOLatin1Accent.txt
   [junit4]   2> 1237373 INFO  (TEST-OverseerStatusTest.test-seed#[B7A9B1CA329179CE]) [    ] o.a.s.c.AbstractZkTestCase put /x1/jenkins/jenkins-slave/workspace/Lucene-Solr-Tests-5.3-Java7/solr/core/src/test-files/solr/collection1/conf/old_synonyms.txt to /configs/conf1/old_synonyms.txt
   [junit4]   2> 1237373 INFO  (TEST-OverseerStatusTest.test-seed#[B7A9B1CA329179CE]) [    ] o.a.s.c.c.SolrZkClient makePath: /configs/conf1/old_synonyms.txt
   [junit4]   2> 1237375 INFO  (TEST-OverseerStatusTest.test-seed#[B7A9B1CA329179CE]) [    ] o.a.s.c.AbstractZkTestCase put /x1/jenkins/jenkins-slave/workspace/Lucene-Solr-Tests-5.3-Java7/solr/core/src/test-files/solr/collection1/conf/synonyms.txt to /configs/conf1/synonyms.txt
   [junit4]   2> 1237375 INFO  (TEST-OverseerStatusTest.test-seed#[B7A9B1CA329179CE]) [    ] o.a.s.c.c.SolrZkClient makePath: /configs/conf1/synonyms.txt
   [junit4]   2> 1238099 INFO  (TEST-OverseerStatusTest.test-seed#[B7A9B1CA329179CE]) [    ] o.a.s.SolrTestCaseJ4 Writing core.properties file to /x1/jenkins/jenkins-slave/workspace/Lucene-Solr-Tests-5.3-Java7/solr/build/solr-core/test/J0/temp/solr.cloud.OverseerStatusTest_B7A9B1CA329179CE-001/control-001/cores/collection1
   [junit4]   2> 1238108 INFO  (TEST-OverseerStatusTest.test-seed#[B7A9B1CA329179CE]) [    ] o.e.j.s.Server jetty-9.2.11.v20150529
   [junit4]   2> 1238158 INFO  (TEST-OverseerStatusTest.test-seed#[B7A9B1CA329179CE]) [    ] o.e.j.s.h.ContextHandler Started o.e.j.s.ServletContextHandler@547d8e7{/,null,AVAILABLE}
   [junit4]   2> 1238161 INFO  (TEST-OverseerStatusTest.test-seed#[B7A9B1CA329179CE]) [    ] o.e.j.s.ServerConnector Started ServerConnector@1935921{HTTP/1.1}{127.0.0.1:45931}
   [junit4]   2> 1238162 INFO  (TEST-OverseerStatusTest.test-seed#[B7A9B1CA329179CE]) [    ] o.e.j.s.Server Started @1243632ms
   [junit4]   2> 1238162 INFO  (TEST-OverseerStatusTest.test-seed#[B7A9B1CA329179CE]) [    ] o.a.s.c.s.e.JettySolrRunner Jetty properties: {hostPort=45931, solr.data.dir=/x1/jenkins/jenkins-slave/workspace/Lucene-Solr-Tests-5.3-Java7/solr/build/solr-core/test/J0/temp/solr.cloud.OverseerStatusTest_B7A9B1CA329179CE-001/tempDir-001/control/data, hostContext=/, coreRootDirectory=/x1/jenkins/jenkins-slave/workspace/Lucene-Solr-Tests-5.3-Java7/solr/build/solr-core/test/J0/../../../../../../../../../../x1/jenkins/jenkins-slave/workspace/Lucene-Solr-Tests-5.3-Java7/solr/build/solr-core/test/J0/temp/solr.cloud.OverseerStatusTest_B7A9B1CA329179CE-001/control-001/cores}
   [junit4]   2> 1238162 INFO  (TEST-OverseerStatusTest.test-seed#[B7A9B1CA329179CE]) [    ] o.a.s.s.SolrDispatchFilter SolrDispatchFilter.init(): sun.misc.Launcher$AppClassLoader@5f57402b
   [junit4]   2> 1238162 INFO  (TEST-OverseerStatusTest.test-seed#[B7A9B1CA329179CE]) [    ] o.a.s.c.SolrResourceLoader new SolrResourceLoader for directory: '/x1/jenkins/jenkins-slave/workspace/Lucene-Solr-Tests-5.3-Java7/solr/build/solr-core/test/J0/../../../../../../../../../../x1/jenkins/jenkins-slave/workspace/Lucene-Solr-Tests-5.3-Java7/solr/build/solr-core/test/J0/temp/solr.cloud.OverseerStatusTest_B7A9B1CA329179CE-001/control-001/'
   [junit4]   2> 1238187 INFO  (TEST-OverseerStatusTest.test-seed#[B7A9B1CA329179CE]) [    ] o.a.s.c.c.SolrZkClient Using default ZkCredentialsProvider
   [junit4]   2> 1238189 INFO  (TEST-OverseerStatusTest.test-seed#[B7A9B1CA329179CE]) [    ] o.a.s.c.c.ConnectionManager Waiting for client to connect to ZooKeeper
   [junit4]   2> 1238192 INFO  (zkCallback-555-thread-1) [    ] o.a.s.c.c.ConnectionManager Watcher org.apache.solr.common.cloud.ConnectionManager@353a1358 name:ZooKeeperConnection Watcher:127.0.0.1:36866/solr got event WatchedEvent state:SyncConnected type:None path:null path:null type:None
   [junit4]   2> 1238192 INFO  (TEST-OverseerStatusTest.test-seed#[B7A9B1CA329179CE]) [    ] o.a.s.c.c.ConnectionManager Client is connected to ZooKeeper
   [junit4]   2> 1238192 INFO  (TEST-OverseerStatusTest.test-seed#[B7A9B1CA329179CE]) [    ] o.a.s.c.c.SolrZkClient Using default ZkACLProvider
   [junit4]   2> 1238209 INFO  (TEST-OverseerStatusTest.test-seed#[B7A9B1CA329179CE]) [    ] o.a.s.s.SolrDispatchFilter Loading solr.xml from SolrHome (not found in ZooKeeper)
   [junit4]   2> 1238209 INFO  (TEST-OverseerStatusTest.test-seed#[B7A9B1CA329179CE]) [    ] o.a.s.c.SolrXmlConfig Loading container configuration from /x1/jenkins/jenkins-slave/workspace/Lucene-Solr-Tests-5.3-Java7/solr/build/solr-core/test/J0/../../../../../../../../../../x1/jenkins/jenkins-slave/workspace/Lucene-Solr-Tests-5.3-Java7/solr/build/solr-core/test/J0/temp/solr.cloud.OverseerStatusTest_B7A9B1CA329179CE-001/control-001/solr.xml
   [junit4]   2> 1238225 INFO  (TEST-OverseerStatusTest.test-seed#[B7A9B1CA329179CE]) [    ] o.a.s.c.CoresLocator Config-defined core root directory: /x1/jenkins/jenkins-slave/workspace/Lucene-Solr-Tests-5.3-Java7/solr/build/solr-core/test/J0/../../../../../../../../../../x1/jenkins/jenkins-slave/workspace/Lucene-Solr-Tests-5.3-Java7/solr/build/solr-core/test/J0/temp/solr.cloud.OverseerStatusTest_B7A9B1CA329179CE-001/control-001/cores
   [junit4]   2> 1238225 INFO  (TEST-OverseerStatusTest.test-seed#[B7A9B1CA329179CE]) [    ] o.a.s.c.CoreContainer New CoreContainer 1414631437
   [junit4]   2> 1238226 INFO  (TEST-OverseerStatusTest.test-seed#[B7A9B1CA329179CE]) [    ] o.a.s.c.CoreContainer Loading cores into CoreContainer [instanceDir=/x1/jenkins/jenkins-slave/workspace/Lucene-Solr-Tests-5.3-Java7/solr/build/solr-core/test/J0/../../../../../../../../../../x1/jenkins/jenkins-slave/workspace/Lucene-Solr-Tests-5.3-Java7/solr/build/solr-core/test/J0/temp/solr.cloud.OverseerStatusTest_B7A9B1CA329179CE-001/control-001/]
   [junit4]   2> 1238226 INFO  (TEST-OverseerStatusTest.test-seed#[B7A9B1CA329179CE]) [    ] o.a.s.c.CoreContainer loading shared library: /x1/jenkins/jenkins-slave/workspace/Lucene-Solr-Tests-5.3-Java7/solr/build/solr-core/test/J0/../../../../../../../../../../x1/jenkins/jenkins-slave/workspace/Lucene-Solr-Tests-5.3-Java7/solr/build/solr-core/test/J0/temp/solr.cloud.OverseerStatusTest_B7A9B1CA329179CE-001/control-001/lib
   [junit4]   2> 1238226 WARN  (TEST-OverseerStatusTest.test-seed#[B7A9B1CA329179CE]) [    ] o.a.s.c.SolrResourceLoader Can't find (or read) directory to add to classloader: lib (resolved as: /x1/jenkins/jenkins-slave/workspace/Lucene-Solr-Tests-5.3-Java7/solr/build/solr-core/test/J0/../../../../../../../../../../x1/jenkins/jenkins-slave/workspace/Lucene-Solr-Tests-5.3-Java7/solr/build/solr-core/test/J0/temp/solr.cloud.OverseerStatusTest_B7A9B1CA329179CE-001/control-001/lib).
   [junit4]   2> 1238236 INFO  (TEST-OverseerStatusTest.test-seed#[B7A9B1CA329179CE]) [    ] o.a.s.h.c.HttpShardHandlerFactory created with socketTimeout : 90000,urlScheme : ,connTimeout : 15000,maxConnectionsPerHost : 20,maxConnections : 10000,corePoolSize : 0,maximumPoolSize : 2147483647,maxThreadIdleTime : 5,sizeOfQueue : -1,fairnessPolicy : false,useRetries : false,
   [junit4]   2> 1238237 INFO  (TEST-OverseerStatusTest.test-seed#[B7A9B1CA329179CE]) [    ] o.a.s.u.UpdateShardHandler Creating UpdateShardHandler HTTP client with params: socketTimeout=340000&connTimeout=45000&retry=true
   [junit4]   2> 1238238 INFO  (TEST-OverseerStatusTest.test-seed#[B7A9B1CA329179CE]) [    ] o.a.s.l.LogWatcher SLF4J impl is org.slf4j.impl.Log4jLoggerFactory
   [junit4]   2> 1238238 INFO  (TEST-OverseerStatusTest.test-seed#[B7A9B1CA329179CE]) [    ] o.a.s.l.LogWatcher Registering Log Listener [Log4j (org.slf4j.impl.Log4jLoggerFactory)]
   [junit4]   2> 1238238 INFO  (TEST-OverseerStatusTest.test-seed#[B7A9B1CA329179CE]) [    ] o.a.s.c.ZkContainer Zookeeper client=127.0.0.1:36866/solr
   [junit4]   2> 1238238 INFO  (TEST-OverseerStatusTest.test-seed#[B7A9B1CA329179CE]) [    ] o.a.s.c.ZkController zkHost includes chroot
   [junit4]   2> 1238239 INFO  (TEST-OverseerStatusTest.test-seed#[B7A9B1CA329179CE]) [    ] o.a.s.c.c.SolrZkClient Using default ZkCredentialsProvider
   [junit4]   2> 1238239 INFO  (TEST-OverseerStatusTest.test-seed#[B7A9B1CA329179CE]) [    ] o.a.s.c.c.ConnectionManager Waiting for client to connect to ZooKeeper
   [junit4]   2> 1238241 INFO  (zkCallback-557-thread-1) [    ] o.a.s.c.c.ConnectionManager Watcher org.apache.solr.common.cloud.ConnectionManager@784b51d1 name:ZooKeeperConnection Watcher:127.0.0.1:36866 got event WatchedEvent state:SyncConnected type:None path:null path:null type:None
   [junit4]   2> 1238241 INFO  (TEST-OverseerStatusTest.test-seed#[B7A9B1CA329179CE]) [    ] o.a.s.c.c.ConnectionManager Client is connected to ZooKeeper
   [junit4]   2> 1238241 INFO  (TEST-OverseerStatusTest.test-seed#[B7A9B1CA329179CE]) [    ] o.a.s.c.c.SolrZkClient Using default ZkACLProvider
   [junit4]   2> 1238244 INFO  (TEST-OverseerStatusTest.test-seed#[B7A9B1CA329179CE]) [n:127.0.0.1:45931_    ] o.a.s.c.c.ConnectionManager Waiting for client to connect to ZooKeeper
   [junit4]   2> 1238272 INFO  (zkCallback-558-thread-1-processing-n:127.0.0.1:45931_) [n:127.0.0.1:45931_    ] o.a.s.c.c.ConnectionManager Watcher org.apache.solr.common.cloud.ConnectionManager@6dd0ae42 name:ZooKeeperConnection Watcher:127.0.0.1:36866/solr got event WatchedEvent state:SyncConnected type:None path:null path:null type:None
   [junit4]   2> 1238272 INFO  (TEST-OverseerStatusTest.test-seed#[B7A9B1CA329179CE]) [n:127.0.0.1:45931_    ] o.a.s.c.c.ConnectionManager Client is connected to ZooKeeper
   [junit4]   2> 1238280 INFO  (TEST-OverseerStatusTest.test-seed#[B7A9B1CA329179CE]) [n:127.0.0.1:45931_    ] o.a.s.c.c.SolrZkClient makePath: /overseer/queue
   [junit4]   2> 1238293 INFO  (TEST-OverseerStatusTest.test-seed#[B7A9B1CA329179CE]) [n:127.0.0.1:45931_    ] o.a.s.c.c.SolrZkClient makePath: /overseer/collection-queue-work
   [junit4]   2> 1238295 INFO  (TEST-OverseerStatusTest.test-seed#[B7A9B1CA329179CE]) [n:127.0.0.1:45931_    ] o.a.s.c.c.SolrZkClient makePath: /overseer/collection-map-running
   [junit4]   2> 1238297 INFO  (TEST-OverseerStatusTest.test-seed#[B7A9B1CA329179CE]) [n:127.0.0.1:45931_    ] o.a.s.c.c.SolrZkClient makePath: /overseer/collection-map-completed
   [junit4]   2> 1238299 INFO  (TEST-OverseerStatusTest.test-seed#[B7A9B1CA329179CE]) [n:127.0.0.1:45931_    ] o.a.s.c.c.SolrZkClient makePath: /overseer/collection-map-failure
   [junit4]   2> 1238301 INFO  (TEST-OverseerStatusTest.test-seed#[B7A9B1CA329179CE]) [n:127.0.0.1:45931_    ] o.a.s.c.c.SolrZkClient makePath: /live_nodes
   [junit4]   2> 1238302 INFO  (TEST-OverseerStatusTest.test-seed#[B7A9B1CA329179CE]) [n:127.0.0.1:45931_    ] o.a.s.c.c.SolrZkClient makePath: /aliases.json
   [junit4]   2> 1238303 INFO  (TEST-OverseerStatusTest.test-seed#[B7A9B1CA329179CE]) [n:127.0.0.1:45931_    ] o.a.s.c.c.SolrZkClient makePath: /clusterstate.json
   [junit4]   2> 1238305 INFO  (TEST-OverseerStatusTest.test-seed#[B7A9B1CA329179CE]) [n:127.0.0.1:45931_    ] o.a.s.c.c.SolrZkClient makePath: /security.json
   [junit4]   2> 1238305 INFO  (TEST-OverseerStatusTest.test-seed#[B7A9B1CA329179CE]) [n:127.0.0.1:45931_    ] o.a.s.c.ZkController Register node as live in ZooKeeper:/live_nodes/127.0.0.1:45931_
   [junit4]   2> 1238306 INFO  (TEST-OverseerStatusTest.test-seed#[B7A9B1CA329179CE]) [n:127.0.0.1:45931_    ] o.a.s.c.c.SolrZkClient makePath: /live_nodes/127.0.0.1:45931_
   [junit4]   2> 1238307 INFO  (TEST-OverseerStatusTest.test-seed#[B7A9B1CA329179CE]) [n:127.0.0.1:45931_    ] o.a.s.c.c.SolrZkClient makePath: /overseer_elect
   [junit4]   2> 1238309 INFO  (TEST-OverseerStatusTest.test-seed#[B7A9B1CA329179CE]) [n:127.0.0.1:45931_    ] o.a.s.c.c.SolrZkClient makePath: /overseer_elect/election
   [junit4]   2> 1238311 INFO  (TEST-OverseerStatusTest.test-seed#[B7A9B1CA329179CE]) [n:127.0.0.1:45931_    ] o.a.s.c.Overseer Overseer (id=null) closing
   [junit4]   2> 1238311 INFO  (TEST-OverseerStatusTest.test-seed#[B7A9B1CA329179CE]) [n:127.0.0.1:45931_    ] o.a.s.c.LeaderElector Joined leadership election with path: /overseer_elect/election/95239913239281668-127.0.0.1:45931_-n_0000000000
   [junit4]   2> 1238312 INFO  (TEST-OverseerStatusTest.test-seed#[B7A9B1CA329179CE]) [n:127.0.0.1:45931_    ] o.a.s.c.OverseerElectionContext I am going to be the leader 127.0.0.1:45931_
   [junit4]   2> 1238312 INFO  (TEST-OverseerStatusTest.test-seed#[B7A9B1CA329179CE]) [n:127.0.0.1:45931_    ] o.a.s.c.c.SolrZkClient makePath: /overseer_elect/leader
   [junit4]   2> 1238313 INFO  (TEST-OverseerStatusTest.test-seed#[B7A9B1CA329179CE]) [n:127.0.0.1:45931_    ] o.a.s.c.Overseer Overseer (id=95239913239281668-127.0.0.1:45931_-n_0000000000) starting
   [junit4]   2> 1238315 INFO  (TEST-OverseerStatusTest.test-seed#[B7A9B1CA329179CE]) [n:127.0.0.1:45931_    ] o.a.s.c.c.SolrZkClient makePath: /overseer/queue-work
   [junit4]   2> 1238322 INFO  (TEST-OverseerStatusTest.test-seed#[B7A9B1CA329179CE]) [n:127.0.0.1:45931_    ] o.a.s.c.OverseerAutoReplicaFailoverThread Starting OverseerAutoReplicaFailoverThread autoReplicaFailoverWorkLoopDelay=10000 autoReplicaFailoverWaitAfterExpiration=30000 autoReplicaFailoverBadNodeExpiration=60000
   [junit4]   2> 1238323 INFO  (OverseerCollectionProcessor-95239913239281668-127.0.0.1:45931_-n_0000000000) [n:127.0.0.1:45931_    ] o.a.s.c.OverseerCollectionProcessor Process current queue of collection creations
   [junit4]   2> 1238329 INFO  (TEST-OverseerStatusTest.test-seed#[B7A9B1CA329179CE]) [n:127.0.0.1:45931_    ] o.a.s.c.c.ZkStateReader Updating cluster state from ZooKeeper... 
   [junit4]   2> 1238330 INFO  (OverseerStateUpdate-95239913239281668-127.0.0.1:45931_-n_0000000000) [n:127.0.0.1:45931_    ] o.a.s.c.Overseer Starting to work on the main queue
   [junit4]   2> 1238381 INFO  (TEST-OverseerStatusTest.test-seed#[B7A9B1CA329179CE]) [n:127.0.0.1:45931_    ] o.a.s.c.CoreContainer Security conf doesn't exist. Skipping setup for authorization module.
   [junit4]   2> 1238381 INFO  (TEST-OverseerStatusTest.test-seed#[B7A9B1CA329179CE]) [n:127.0.0.1:45931_    ] o.a.s.c.CoreContainer No authentication plugin used.
   [junit4]   2> 1238382 INFO  (TEST-OverseerStatusTest.test-seed#[B7A9B1CA329179CE]) [n:127.0.0.1:45931_    ] o.a.s.c.CoresLocator Looking for core definitions underneath /x1/jenkins/jenkins-slave/workspace/Lucene-Solr-Tests-5.3-Java7/solr/build/solr-core/test/J0/../../../../../../../../../../x1/jenkins/jenkins-slave/workspace/Lucene-Solr-Tests-5.3-Java7/solr/build/solr-core/test/J0/temp/solr.cloud.OverseerStatusTest_B7A9B1CA329179CE-001/control-001/cores
   [junit4]   2> 1238383 INFO  (TEST-OverseerStatusTest.test-seed#[B7A9B1CA329179CE]) [n:127.0.0.1:45931_    ] o.a.s.c.SolrCore Created CoreDescriptor: {absoluteInstDir=/x1/jenkins/jenkins-slave/workspace/Lucene-Solr-Tests-5.3-Java7/solr/build/solr-core/test/J0/../../../../../../../../../../x1/jenkins/jenkins-slave/workspace/Lucene-Solr-Tests-5.3-Java7/solr/build/solr-core/test/J0/temp/solr.cloud.OverseerStatusTest_B7A9B1CA329179CE-001/control-001/cores/collection1/, loadOnStartup=true, collection=control_collection, configSetProperties=configsetprops.json, config=solrconfig.xml, transient=false, dataDir=data/, shard=, name=collection1, instanceDir=/x1/jenkins/jenkins-slave/workspace/Lucene-Solr-Tests-5.3-Java7/solr/build/solr-core/test/J0/../../../../../../../../../../x1/jenkins/jenkins-slave/workspace/Lucene-Solr-Tests-5.3-Java7/solr/build/solr-core/test/J0/temp/solr.cloud.OverseerStatusTest_B7A9B1CA329179CE-001/control-001/cores/collection1, schema=schema.xml, coreNodeName=}
   [junit4]   2> 1238384 INFO  (TEST-OverseerStatusTest.test-seed#[B7A9B1CA329179CE]) [n:127.0.0.1:45931_    ] o.a.s.c.CoresLocator Found core collection1 in /x1/jenkins/jenkins-slave/workspace/Lucene-Solr-Tests-5.3-Java7/solr/build/solr-core/test/J0/../../../../../../../../../../x1/jenkins/jenkins-slave/workspace/Lucene-Solr-Tests-5.3-Java7/solr/build/solr-core/test/J0/temp/solr.cloud.OverseerStatusTest_B7A9B1CA329179CE-001/control-001/cores/collection1/
   [junit4]   2> 1238384 INFO  (TEST-OverseerStatusTest.test-seed#[B7A9B1CA329179CE]) [n:127.0.0.1:45931_    ] o.a.s.c.CoresLocator Found 1 core definitions
   [junit4]   2> 1238392 INFO  (coreLoadExecutor-2611-thread-1-processing-n:127.0.0.1:45931_) [n:127.0.0.1:45931_ c:control_collection   x:collection1] o.a.s.c.ZkController publishing state=down
   [junit4]   2> 1238392 INFO  (coreLoadExecutor-2611-thread-1-processing-n:127.0.0.1:45931_) [n:127.0.0.1:45931_ c:control_collection   x:collection1] o.a.s.c.ZkController numShards not found on descriptor - reading it from system property
   [junit4]   2> 1238392 INFO  (TEST-OverseerStatusTest.test-seed#[B7A9B1CA329179CE]) [n:127.0.0.1:45931_    ] o.a.s.s.SolrDispatchFilter user.dir=/x1/jenkins/jenkins-slave/workspace/Lucene-Solr-Tests-5.3-Java7/solr/build/solr-core/test/J0
   [junit4]   2> 1238393 INFO  (TEST-OverseerStatusTest.test-seed#[B7A9B1CA329179CE]) [n:127.0.0.1:45931_    ] o.a.s.s.SolrDispatchFilter SolrDispatchFilter.init() done
   [junit4]   2> 1238393 INFO  (zkCallback-558-thread-1-processing-n:127.0.0.1:45931_) [n:127.0.0.1:45931_    ] o.a.s.c.DistributedQueue NodeChildrenChanged fired on path /overseer/queue state SyncConnected
   [junit4]   2> 1238393 INFO  (coreLoadExecutor-2611-thread-1-processing-n:127.0.0.1:45931_) [n:127.0.0.1:45931_ c:control_collection   x:collection1] o.a.s.c.ZkController look for our core node name
   [junit4]   2> 1238394 INFO  (OverseerStateUpdate-95239913239281668-127.0.0.1:45931_-n_0000000000) [n:127.0.0.1:45931_    ] o.a.s.c.Overseer processMessage: queueSize: 1, message = {
   [junit4]   2>   "state":"down",
   [junit4]   2>   "roles":null,
   [junit4]   2>   "numShards":"1",
   [junit4]   2>   "collection":"control_collection",
   [junit4]   2>   "shard":null,
   [junit4]   2>   "base_url":"http://127.0.0.1:45931",
   [junit4]   2>   "core":"collection1",
   [junit4]   2>   "node_name":"127.0.0.1:45931_",
   [junit4]   2>   "operation":"state"} current state version: 0
   [junit4]   2> 1238396 INFO  (OverseerStateUpdate-95239913239281668-127.0.0.1:45931_-n_0000000000) [n:127.0.0.1:45931_    ] o.a.s.c.o.ReplicaMutator Update state numShards=1 message={
   [junit4]   2>   "state":"down",
   [junit4]   2>   "roles":null,
   [junit4]   2>   "numShards":"1",
   [junit4]   2>   "collection":"control_collection",
   [junit4]   2>   "shard":null,
   [junit4]   2>   "base_url":"http://127.0.0.1:45931",
   [junit4]   2>   "core":"collection1",
   [junit4]   2>   "node_name":"127.0.0.1:45931_",
   [junit4]   2>   "operation":"state"}
   [junit4]   2> 1238396 INFO  (OverseerStateUpdate-95239913239281668-127.0.0.1:45931_-n_0000000000) [n:127.0.0.1:45931_    ] o.a.s.c.o.ClusterStateMutator building a new cName: control_collection
   [junit4]   2> 1238396 INFO  (OverseerStateUpdate-95239913239281668-127.0.0.1:45931_-n_0000000000) [n:127.0.0.1:45931_    ] o.a.s.c.o.ReplicaMutator Assigning new node to shard shard=shard1
   [junit4]   2> 1238398 INFO  (zkCallback-558-thread-1-processing-n:127.0.0.1:45931_) [n:127.0.0.1:45931_    ] o.a.s.c.c.ZkStateReader A cluster state change: WatchedEvent state:SyncConnected type:NodeDataChanged path:/clusterstate.json, has occurred - updating... (live nodes size: 1)
   [junit4]   2> 1238411 INFO  (zkCallback-558-thread-1-processing-n:127.0.0.1:45931_) [n:127.0.0.1:45931_    ] o.a.s.c.c.ZkStateReader Updated cluster state version to 1
   [junit4]   2> 1239393 INFO  (coreLoadExecutor-2611-thread-1-processing-n:127.0.0.1:45931_) [n:127.0.0.1:45931_ c:control_collection   x:collection1] o.a.s.c.ZkController waiting to find shard id in clusterstate for collection1
   [junit4]   2> 1239393 INFO  (coreLoadExecutor-2611-thread-1-processing-n:127.0.0.1:45931_) [n:127.0.0.1:45931_ c:control_collection   x:collection1] o.a.s.c.ZkController Check for collection zkNode:control_collection
   [junit4]   2> 1239395 INFO  (coreLoadExecutor-2611-thread-1-processing-n:127.0.0.1:45931_) [n:127.0.0.1:45931_ c:control_collection   x:collection1] o.a.s.c.ZkController Collection zkNode exists
   [junit4]   2> 1239395 INFO  (coreLoadExecutor-2611-thread-1-processing-n:127.0.0.1:45931_) [n:127.0.0.1:45931_ c:control_collection   x:collection1] o.a.s.c.c.ZkStateReader Load collection config from:/collections/control_collection
   [junit4]   2> 1239397 INFO  (coreLoadExecutor-2611-thread-1-processing-n:127.0.0.1:45931_) [n:127.0.0.1:45931_ c:control_collection   x:collection1] o.a.s.c.c.ZkStateReader path=/collections/control_collection configName=conf1 specified config exists in ZooKeeper
   [junit4]   2> 1239397 INFO  (coreLoadExecutor-2611-thread-1-processing-n:127.0.0.1:45931_) [n:127.0.0.1:45931_ c:control_collection   x:collection1] o.a.s.c.SolrResourceLoader new SolrResourceLoader for directory: '/x1/jenkins/jenkins-slave/workspace/Lucene-Solr-Tests-5.3-Java7/solr/build/solr-core/test/J0/../../../../../../../../../../x1/jenkins/jenkins-slave/workspace/Lucene-Solr-Tests-5.3-Java7/solr/build/solr-core/test/J0/temp/solr.cloud.OverseerStatusTest_B7A9B1CA329179CE-001/control-001/cores/collection1/'
   [junit4]   2> 1239416 INFO  (coreLoadExecutor-2611-thread-1-processing-n:127.0.0.1:45931_) [n:127.0.0.1:45931_ c:control_collection   x:collection1] o.a.s.c.Config loaded config solrconfig.xml with version 0 
   [junit4]   2> 1239424 INFO  (coreLoadExecutor-2611-thread-1-processing-n:127.0.0.1:45931_) [n:127.0.0.1:45931_ c:control_collection   x:collection1] o.a.s.c.SolrConfig current version of requestparams : -1
   [junit4]   2> 1239438 INFO  (coreLoadExecutor-2611-thread-1-processing-n:127.0.0.1:45931_) [n:127.0.0.1:45931_ c:control_collection   x:collection1] o.a.s.c.SolrConfig Using Lucene MatchVersion: 5.3.2
   [junit4]   2> 1239469 INFO  (coreLoadExecutor-2611-thread-1-processing-n:127.0.0.1:45931_) [n:127.0.0.1:45931_ c:control_collection   x:collection1] o.a.s.c.Config Loaded SolrConfig: solrconfig.xml
   [junit4]   2> 1239470 INFO  (coreLoadExecutor-2611-thread-1-processing-n:127.0.0.1:45931_) [n:127.0.0.1:45931_ c:control_collection   x:collection1] o.a.s.s.IndexSchema Reading Solr Schema from /configs/conf1/schema.xml
   [junit4]   2> 1239477 INFO  (coreLoadExecutor-2611-thread-1-processing-n:127.0.0.1:45931_) [n:127.0.0.1:45931_ c:control_collection   x:collection1] o.a.s.s.IndexSchema [collection1] Schema name=test
   [junit4]   2> 1239717 INFO  (coreLoadExecutor-2611-thread-1-processing-n:127.0.0.1:45931_) [n:127.0.0.1:45931_ c:control_collection   x:collection1] o.a.s.s.IndexSchema default search field in schema is text
   [junit4]   2> 1239719 INFO  (coreLoadExecutor-2611-thread-1-processing-n:127.0.0.1:45931_) [n:127.0.0.1:45931_ c:control_collection   x:collection1] o.a.s.s.IndexSchema unique key field: id
   [junit4]   2> 1239720 INFO  (coreLoadExecutor-2611-thread-1-processing-n:127.0.0.1:45931_) [n:127.0.0.1:45931_ c:control_collection   x:collection1] o.a.s.s.FileExchangeRateProvider Reloading exchange rates from file currency.xml
   [junit4]   2> 1239724 INFO  (coreLoadExecutor-2611-thread-1-processing-n:127.0.0.1:45931_) [n:127.0.0.1:45931_ c:control_collection   x:collection1] o.a.s.s.FileExchangeRateProvider Reloading exchange rates from file currency.xml
   [junit4]   2> 1239748 INFO  (coreLoadExecutor-2611-thread-1-processing-n:127.0.0.1:45931_) [n:127.0.0.1:45931_ c:control_collection   x:collection1] o.a.s.c.ConfigSetProperties Did not find ConfigSet properties, assuming default properties: Can't find resource 'configsetprops.json' in classpath or '/configs/conf1', cwd=/x1/jenkins/jenkins-slave/workspace/Lucene-Solr-Tests-5.3-Java7/solr/build/solr-core/test/J0
   [junit4]   2> 1239748 INFO  (coreLoadExecutor-2611-thread-1-processing-n:127.0.0.1:45931_) [n:127.0.0.1:45931_ c:control_collection   x:collection1] o.a.s.c.CoreContainer Creating SolrCore 'collection1' using configuration from collection control_collection
   [junit4]   2> 1239748 INFO  (coreLoadExecutor-2611-thread-1-processing-n:127.0.0.1:45931_) [n:127.0.0.1:45931_ c:control_collection s:shard1 r:core_node1 x:collection1] o.a.s.c.SolrCore org.apache.solr.core.MockDirectoryFactory
   [junit4]   2> 1239749 INFO  (coreLoadExecutor-2611-thread-1-processing-n:127.0.0.1:45931_) [n:127.0.0.1:45931_ c:control_collection s:shard1 r:core_node1 x:collection1] o.a.s.c.SolrCore [[collection1] ] Opening new SolrCore at [/x1/jenkins/jenkins-slave/workspace/Lucene-Solr-Tests-5.3-Java7/solr/build/solr-core/test/J0/../../../../../../../../../../x1/jenkins/jenkins-slave/workspace/Lucene-Solr-Tests-5.3-Java7/solr/build/solr-core/test/J0/temp/solr.cloud.OverseerStatusTest_B7A9B1CA329179CE-001/control-001/cores/collection1/], dataDir=[null]
   [junit4]   2> 1239749 INFO  (coreLoadExecutor-2611-thread-1-processing-n:127.0.0.1:45931_) [n:127.0.0.1:45931_ c:control_collection s:shard1 r:core_node1 x:collection1] o.a.s.c.JmxMonitoredMap JMX monitoring is enabled. Adding Solr mbeans to JMX Server: com.sun.jmx.mbeanserver.JmxMBeanServer@68f64d93
   [junit4]   2> 1239750 INFO  (coreLoadExecutor-2611-thread-1-processing-n:127.0.0.1:45931_) [n:127.0.0.1:45931_ c:control_collection s:shard1 r:core_node1 x:collection1] o.a.s.c.CachingDirectoryFactory return new directory for /x1/jenkins/jenkins-slave/workspace/Lucene-Solr-Tests-5.3-Java7/solr/build/solr-core/test/J0/../../../../../../../../../../x1/jenkins/jenkins-slave/workspace/Lucene-Solr-Tests-5.3-Java7/solr/build/solr-core/test/J0/temp/solr.cloud.OverseerStatusTest_B7A9B1CA329179CE-001/control-001/cores/collection1/data
   [junit4]   2> 1239750 INFO  (coreLoadExecutor-2611-thread-1-processing-n:127.0.0.1:45931_) [n:127.0.0.1:45931_ c:control_collection s:shard1 r:core_node1 x:collection1] o.a.s.c.SolrCore New index directory detected: old=null new=/x1/jenkins/jenkins-slave/workspace/Lucene-Solr-Tests-5.3-Java7/solr/build/solr-core/test/J0/../../../../../../../../../../x1/jenkins/jenkins-slave/workspace/Lucene-Solr-Tests-5.3-Java7/solr/build/solr-core/test/J0/temp/solr.cloud.OverseerStatusTest_B7A9B1CA329179CE-001/control-001/cores/collection1/data/index/
   [junit4]   2> 1239750 WARN  (coreLoadExecutor-2611-thread-1-processing-n:127.0.0.1:45931_) [n:127.0.0.1:45931_ c:control_collection s:shard1 r:core_node1 x:collection1] o.a.s.c.SolrCore [collection1] Solr index directory '/x1/jenkins/jenkins-slave/workspace/Lucene-Solr-Tests-5.3-Java7/solr/build/solr-core/test/J0/../../../../../../../../../../x1/jenkins/jenkins-slave/workspace/Lucene-Solr-Tests-5.3-Java7/solr/build/solr-core/test/J0/temp/solr.cloud.OverseerStatusTest_B7A9B1CA329179CE-001/control-001/cores/collection1/data/index' doesn't exist. Creating new index...
   [junit4]   2> 1239751 INFO  (coreLoadExecutor-2611-thread-1-processing-n:127.0.0.1:45931_) [n:127.0.0.1:45931_ c:control_collection s:shard1 r:core_node1 x:collection1] o.a.s.c.CachingDirectoryFactory return new directory for /x1/jenkins/jenkins-slave/workspace/Lucene-Solr-Tests-5.3-Java7/solr/build/solr-core/test/J0/../../../../../../../../../../x1/jenkins/jenkins-slave/workspace/Lucene-Solr-Tests-5.3-Java7/solr/build/solr-core/test/J0/temp/solr.cloud.OverseerStatusTest_B7A9B1CA329179CE-001/control-001/cores/collection1/data/index
   [junit4]   2> 1239751 INFO  (coreLoadExecutor-2611-thread-1-processing-n:127.0.0.1:45931_) [n:127.0.0.1:45931_ c:control_collection s:shard1 r:core_node1 x:collection1] o.a.s.u.RandomMergePolicy RandomMergePolicy wrapping class org.apache.lucene.index.AlcoholicMergePolicy: [AlcoholicMergePolicy: minMergeSize=0, mergeFactor=10, maxMergeSize=4715336, maxMergeSizeForForcedMerge=9223372036854775807, calibrateSizeByDeletes=true, maxMergeDocs=2147483647, maxCFSSegmentSizeMB=8.796093022207999E12, noCFSRatio=0.1]
   [junit4]   2> 1239752 INFO  (coreLoadExecutor-2611-thread-1-processing-n:127.0.0.1:45931_) [n:127.0.0.1:45931_ c:control_collection s:shard1 r:core_node1 x:collection1] o.a.s.c.SolrCore SolrDeletionPolicy.onCommit: commits: num=1
   [junit4]   2> 	commit{dir=MockDirectoryWrapper(RAMDirectory@a9c5914 lockFactory=org.apache.lucene.store.SingleInstanceLockFactory@1e9c357d),segFN=segments_1,generation=1}
   [junit4]   2> 1239752 INFO  (coreLoadExecutor-2611-thread-1-processing-n:127.0.0.1:45931_) [n:127.0.0.1:45931_ c:control_collection s:shard1 r:core_node1 x:collection1] o.a.s.c.SolrCore newest commit generation = 1
   [junit4]   2> 1239753 INFO  (OldIndexDirectoryCleanupThreadForCore-collection1) [n:127.0.0.1:45931_ c:control_collection s:shard1 r:core_node1 x:collection1] o.a.s.c.SolrCore Looking for old index directories to cleanup for core collection1 in /x1/jenkins/jenkins-slave/workspace/Lucene-Solr-Tests-5.3-Java7/solr/build/solr-core/test/J0/../../../../../../../../../../x1/jenkins/jenkins-slave/workspace/Lucene-Solr-Tests-5.3-Java7/solr/build/solr-core/test/J0/temp/solr.cloud.OverseerStatusTest_B7A9B1CA329179CE-001/control-001/cores/collection1/data/
   [junit4]   2> 1239753 WARN  (OldIndexDirectoryCleanupThreadForCore-collection1) [n:127.0.0.1:45931_ c:control_collection s:shard1 r:core_node1 x:collection1] o.a.s.c.DirectoryFactory /x1/jenkins/jenkins-slave/workspace/Lucene-Solr-Tests-5.3-Java7/solr/build/solr-core/test/J0/../../../../../../../../../../x1/jenkins/jenkins-slave/workspace/Lucene-Solr-Tests-5.3-Java7/solr/build/solr-core/test/J0/temp/solr.cloud.OverseerStatusTest_B7A9B1CA329179CE-001/control-001/cores/collection1/data/ does not point to a valid data directory; skipping clean-up of old index directories.
   [junit4]   2> 1239758 INFO  (coreLoadExecutor-2611-thread-1-processing-n:127.0.0.1:45931_) [n:127.0.0.1:45931_ c:control_collection s:shard1 r:core_node1 x:collection1] o.a.s.u.p.UpdateRequestProcessorChain creating updateRequestProcessorChain "nodistrib"
   [junit4]   2> 1239759 INFO  (coreLoadExecutor-2611-thread-1-processing-n:127.0.0.1:45931_) [n:127.0.0.1:45931_ c:control_collection s:shard1 r:core_node1 x:collection1] o.a.s.u.p.UpdateRequestProcessorChain creating updateRequestProcessorChain "dedupe"
   [junit4]   2> 1239759 INFO  (coreLoadExecutor-2611-thread-1-processing-n:127.0.0.1:45931_) [n:127.0.0.1:45931_ c:control_collection s:shard1 r:core_node1 x:collection1] o.a.s.u.p.UpdateRequestProcessorChain inserting DistributedUpdateProcessorFactory into updateRequestProcessorChain "dedupe"
   [junit4]   2> 1239759 INFO  (coreLoadExecutor-2611-thread-1-processing-n:127.0.0.1:45931_) [n:127.0.0.1:45931_ c:control_collection s:shard1 r:core_node1 x:collection1] o.a.s.u.p.UpdateRequestProcessorChain creating updateRequestProcessorChain "stored_sig"
   [junit4]   2> 1239759 INFO  (coreLoadExecutor-2611-thread-1-processing-n:127.0.0.1:45931_) [n:127.0.0.1:45931_ c:control_collection s:shard1 r:core_node1 x:collection1] o.a.s.u.p.UpdateRequestProcessorChain inserting DistributedUpdateProcessorFactory into updateRequestProcessorChain "stored_sig"
   [junit4]   2> 1239759 INFO  (coreLoadExecutor-2611-thread-1-processing-n:127.0.0.1:45931_) [n:127.0.0.1:45931_ c:control_collection s:shard1 r:core_node1 x:collection1] o.a.s.u.p.UpdateRequestProcessorChain creating updateRequestProcessorChain "distrib-dup-test-chain-explicit"
   [junit4]   2> 1239760 INFO  (coreLoadExecutor-2611-thread-1-processing-n:127.0.0.1:45931_) [n:127.0.0.1:45931_ c:control_collection s:shard1 r:core_node1 x:collection1] o.a.s.u.p.UpdateRequestProcessorChain creating updateRequestProcessorChain "distrib-dup-test-chain-implicit"
   [junit4]   2> 1239760 INFO  (coreLoadExecutor-2611-thread-1-processing-n:127.0.0.1:45931_) [n:127.0.0.1:45931_ c:control_collection s:shard1 r:core_node1 x:collection1] o.a.s.u.p.UpdateRequestProcessorChain inserting DistributedUpdateProcessorFactory into updateRequestProcessorChain "distrib-dup-test-chain-implicit"
   [junit4]   2> 1239760 INFO  (coreLoadExecutor-2611-thread-1-processing-n:127.0.0.1:45931_) [n:127.0.0.1:45931_ c:control_collection s:shard1 r:core_node1 x:collection1] o.a.s.c.SolrCore no updateRequestProcessorChain defined as default, creating implicit default
   [junit4]   2> 1239764 INFO  (coreLoadExecutor-2611-thread-1-processing-n:127.0.0.1:45931_) [n:127.0.0.1:45931_ c:control_collection s:shard1 r:core_node1 x:collection1] o.a.s.h.l.XMLLoader xsltCacheLifetimeSeconds=60
   [junit4]   2> 1239766 INFO  (coreLoadExecutor-2611-thread-1-processing-n:127.0.0.1:45931_) [n:127.0.0.1:45931_ c:control_collection s:shard1 r:core_node1 x:collection1] o.a.s.h.l.XMLLoader xsltCacheLifetimeSeconds=60
   [junit4]   2> 1239767 INFO  (coreLoadExecutor-2611-thread-1-processing-n:127.0.0.1:45931_) [n:127.0.0.1:45931_ c:control_collection s:shard1 r:core_node1 x:collection1] o.a.s.h.l.XMLLoader xsltCacheLifetimeSeconds=60
   [junit4]   2> 1239769 INFO  (coreLoadExecutor-2611-thread-1-processing-n:127.0.0.1:45931_) [n:127.0.0.1:45931_ c:control_collection s:shard1 r:core_node1 x:collection1] o.a.s.h.l.XMLLoader xsltCacheLifetimeSeconds=60
   [junit4]   2> 1239774 INFO  (coreLoadExecutor-2611-thread-1-processing-n:127.0.0.1:45931_) [n:127.0.0.1:45931_ c:control_collection s:shard1 r:core_node1 x:collection1] o.a.s.c.RequestHandlers Registered paths: /config,/admin/plugins,/admin/segments,/update,/schema,/admin/logging,/update/json/docs,/update/json,/admin/system,/admin/file,/admin/properties,/get,standard,/admin/luke,/replication,/admin/mbeans,/admin/threads,/update/csv,/admin/ping
   [junit4]   2> 1239776 INFO  (coreLoadExecutor-2611-thread-1-processing-n:127.0.0.1:45931_) [n:127.0.0.1:45931_ c:control_collection s:shard1 r:core_node1 x:collection1] o.a.s.c.SolrCore Using default statsCache cache: org.apache.solr.search.stats.LocalStatsCache
   [junit4]   2> 1239776 INFO  (coreLoadExecutor-2611-thread-1-processing-n:127.0.0.1:45931_) [n:127.0.0.1:45931_ c:control_collection s:shard1 r:core_node1 x:collection1] o.a.s.u.UpdateHandler Using UpdateLog implementation: org.apache.solr.update.UpdateLog
   [junit4]   2> 1239777 INFO  (coreLoadExecutor-2611-thread-1-processing-n:127.0.0.1:45931_) [n:127.0.0.1:45931_ c:control_collection s:shard1 r:core_node1 x:collection1] o.a.s.u.UpdateLog Initializing UpdateLog: dataDir= defaultSyncLevel=FLUSH numRecordsToKeep=100 maxNumLogsToKeep=10 numVersionBuckets=65536
   [junit4]   2> 1239777 INFO  (coreLoadExecutor-2611-thread-1-processing-n:127.0.0.1:45931_) [n:127.0.0.1:45931_ c:control_collection s:shard1 r:core_node1 x:collection1] o.a.s.c.SolrCore Hard AutoCommit: disabled
   [junit4]   2> 1239778 INFO  (coreLoadExecutor-2611-thread-1-processing-n:127.0.0.1:45931_) [n:127.0.0.1:45931_ c:control_collection s:shard1 r:core_node1 x:collection1] o.a.s.c.SolrCore Soft AutoCommit: disabled
   [junit4]   2> 1239778 INFO  (coreLoadExecutor-2611-thread-1-processing-n:127.0.0.1:45931_) [n:127.0.0.1:45931_ c:control_collection s:shard1 r:core_node1 x:collection1] o.a.s.u.RandomMergePolicy RandomMergePolicy wrapping class org.apache.lucene.index.LogDocMergePolicy: [LogDocMergePolicy: minMergeSize=1000, mergeFactor=33, maxMergeSize=9223372036854775807, maxMergeSizeForForcedMerge=9223372036854775807, calibrateSizeByDeletes=true, maxMergeDocs=2147483647, maxCFSSegmentSizeMB=8.796093022207999E12, noCFSRatio=1.0]
   [junit4]   2> 1239779 INFO  (coreLoadExecutor-2611-thread-1-processing-n:127.0.0.1:45931_) [n:127.0.0.1:45931_ c:control_collection s:shard1 r:core_node1 x:collection1] o.a.s.c.SolrCore SolrDeletionPolicy.onInit: commits: num=1
   [junit4]   2> 	commit{dir=MockDirectoryWrapper(RAMDirectory@a9c5914 lockFactory=org.apache.lucene.store.SingleInstanceLockFactory@1e9c357d),segFN=segments_1,generation=1}
   [junit4]   2> 1239779 INFO  (coreLoadExecutor-2611-thread-1-processing-n:127.0.0.1:45931_) [n:127.0.0.1:45931_ c:control_collection s:shard1 r:core_node1 x:collection1] o.a.s.c.SolrCore newest commit generation = 1
   [junit4]   2> 1239779 INFO  (coreLoadExecutor-2611-thread-1-processing-n:127.0.0.1:45931_) [n:127.0.0.1:45931_ c:control_collection s:shard1 r:core_node1 x:collection1] o.a.s.s.SolrIndexSearcher Opening Searcher@2be3fc30[collection1] main
   [junit4]   2> 1239779 INFO  (coreLoadExecutor-2611-thread-1-processing-n:127.0.0.1:45931_) [n:127.0.0.1:45931_ c:control_collection s:shard1 r:core_node1 x:collection1] o.a.s.c.c.ZkStateReader Load collection config from:/collections/control_collection
   [junit4]   2> 1239781 INFO  (coreLoadExecutor-2611-thread-1-processing-n:127.0.0.1:45931_) [n:127.0.0.1:45931_ c:control_collection s:shard1 r:core_node1 x:collection1] o.a.s.c.c.ZkStateReader path=/collections/control_collection configName=conf1 specified config exists in ZooKeeper
   [junit4]   2> 1239781 INFO  (coreLoadExecutor-2611-thread-1-processing-n:127.0.0.1:45931_) [n:127.0.0.1:45931_ c:control_collection s:shard1 r:core_node1 x:collection1] o.a.s.r.ManagedResourceStorage Setting up ZooKeeper-based storage for the RestManager with znodeBase: /configs/conf1
   [junit4]   2> 1239781 INFO  (coreLoadExecutor-2611-thread-1-processing-n:127.0.0.1:45931_) [n:127.0.0.1:45931_ c:control_collection s:shard1 r:core_node1 x:collection1] o.a.s.r.ManagedResourceStorage Configured ZooKeeperStorageIO with znodeBase: /configs/conf1
   [junit4]   2> 1239782 INFO  (coreLoadExecutor-2611-thread-1-processing-n:127.0.0.1:45931_) [n:127.0.0.1:45931_ c:control_collection s:shard1 r:core_node1 x:collection1] o.a.s.r.RestManager Initializing RestManager with initArgs: {}
   [junit4]   2> 1239782 INFO  (coreLoadExecutor-2611-thread-1-processing-n:127.0.0.1:45931_) [n:127.0.0.1:45931_ c:control_collection s:shard1 r:core_node1 x:collection1] o.a.s.r.ManagedResourceStorage Reading _rest_managed.json using ZooKeeperStorageIO:path=/configs/conf1
   [junit4]   2> 1239782 INFO  (coreLoadExecutor-2611-thread-1-processing-n:127.0.0.1:45931_) [n:127.0.0.1:45931_ c:control_collection s:shard1 r:core_node1 x:collection1] o.a.s.r.ManagedResourceStorage No data found for znode /configs/conf1/_rest_managed.json
   [junit4]   2> 1239783 INFO  (coreLoadExecutor-2611-thread-1-processing-n:127.0.0.1:45931_) [n:127.0.0.1:45931_ c:control_collection s:shard1 r:core_node1 x:collection1] o.a.s.r.ManagedResourceStorage Loaded null at path _rest_managed.json using ZooKeeperStorageIO:path=/configs/conf1
   [junit4]   2> 1239783 INFO  (coreLoadExecutor-2611-thread-1-processing-n:127.0.0.1:45931_) [n:127.0.0.1:45931_ c:control_collection s:shard1 r:core_node1 x:collection1] o.a.s.r.RestManager Initializing 0 registered ManagedResources
   [junit4]   2> 1239783 INFO  (coreLoadExecutor-2611-thread-1-processing-n:127.0.0.1:45931_) [n:127.0.0.1:45931_ c:control_collection s:shard1 r:core_node1 x:collection1] o.a.s.h.ReplicationHandler Commits will be reserved for  10000
   [junit4]   2> 1239784 INFO  (searcherExecutor-2612-thread-1-processing-r:core_node1 c:control_collection s:shard1 x:collection1 n:127.0.0.1:45931_) [n:127.0.0.1:45931_ c:control_collection s:shard1 r:core_node1 x:collection1] o.a.s.c.SolrCore [collection1] Registered new searcher Searcher@2be3fc30[collection1] main{ExitableDirectoryReader(UninvertingDirectoryReader())}
   [junit4]   2> 1239784 INFO  (coreLoadExecutor-2611-thread-1-processing-n:127.0.0.1:45931_) [n:127.0.0.1:45931_ c:control_collection s:shard1 r:core_node1 x:collection1] o.a.s.u.UpdateLog Looking up max value of version field to seed version buckets
   [junit4]   2> 1239784 INFO  (coreLoadExecutor-2611-thread-1-processing-n:127.0.0.1:45931_) [n:127.0.0.1:45931_ c:control_collection s:shard1 r:core_node1 x:collection1] o.a.s.u.VersionInfo Refreshing highest value of _version_ for 65536 version buckets from index
   [junit4]   2> 1239784 INFO  (coreLoadExecutor-2611-thread-1-processing-n:127.0.0.1:45931_) [n:127.0.0.1:45931_ c:control_collection s:shard1 r:core_node1 x:collection1] o.a.s.u.VersionInfo No terms found for _version_, cannot seed version bucket highest value from index
   [junit4]   2> 1239784 INFO  (coreLoadExecutor-2611-thread-1-processing-n:127.0.0.1:45931_) [n:127.0.0.1:45931_ c:control_collection s:shard1 r:core_node1 x:collection1] o.a.s.u.UpdateLog Could not find max version in index or recent updates, using new clock 1523838614526492672
   [junit4]   2> 1239787 INFO  (coreLoadExecutor-2611-thread-1-processing-n:127.0.0.1:45931_) [n:127.0.0.1:45931_ c:control_collection s:shard1 r:core_node1 x:collection1] o.a.s.u.UpdateLog Took 3 ms to seed version buckets with highest version 1523838614526492672
   [junit4]   2> 1239787 INFO  (coreLoadExecutor-2611-thread-1-processing-n:127.0.0.1:45931_) [n:127.0.0.1:45931_ c:control_collection s:shard1 r:core_node1 x:collection1] o.a.s.c.ZkController watch zkdir /configs/conf1
   [junit4]   2> 1239788 INFO  (coreLoadExecutor-2611-thread-1-processing-n:127.0.0.1:45931_) [n:127.0.0.1:45931_ c:control_collection s:shard1 r:core_node1 x:collection1] o.a.s.c.CoreContainer registering core: collection1
   [junit4]   2> 1239788 INFO  (coreZkRegister-2605-thread-1-processing-r:core_node1 c:control_collection s:shard1 x:collection1 n:127.0.0.1:45931_) [n:127.0.0.1:45931_ c:control_collection s:shard1 r:core_node1 x:collection1] o.a.s.c.ZkController Register replica - core:collection1 address:http://127.0.0.1:45931 collection:control_collection shard:shard1
   [junit4]   2> 1239789 INFO  (coreZkRegister-2605-thread-1-processing-r:core_node1 c:control_collection s:shard1 x:collection1 n:127.0.0.1:45931_) [n:127.0.0.1:45931_ c:control_collection s:shard1 r:core_node1 x:collection1] o.a.s.c.c.SolrZkClient makePath: /collections/control_collection/leader_elect/shard1/election
   [junit4]   2> 1239794 INFO  (coreZkRegister-2605-thread-1-processing-r:core_node1 c:control_collection s:shard1 x:collection1 n:127.0.0.1:45931_) [n:127.0.0.1:45931_ c:control_collection s:shard1 r:core_node1 x:collection1] o.a.s.c.LeaderElector Joined leadership election with path: /collections/control_collection/leader_elect/shard1/election/95239913239281668-core_node1-n_0000000000
   [junit4]   2> 1239795 INFO  (coreZkRegister-2605-thread-1-processing-r:core_node1 c:control_collection s:shard1 x:collection1 n:127.0.0.1:45931_) [n:127.0.0.1:45931_ c:control_collection s:shard1 r:core_node1 x:collection1] o.a.s.c.ShardLeaderElectionContext Running the leader process for shard shard1
   [junit4]   2> 1239797 INFO  (zkCallback-558-thread-1-processing-n:127.0.0.1:45931_) [n:127.0.0.1:45931_    ] o.a.s.c.DistributedQueue NodeChildrenChanged fired on path /overseer/queue state SyncConnected
   [junit4]   2> 1239797 INFO  (coreZkRegister-2605-thread-1-processing-r:core_node1 c:control_collection s:shard1 x:collection1 n:127.0.0.1:45931_) [n:127.0.0.1:45931_ c:control_collection s:shard1 r:core_node1 x:collection1] o.a.s.c.ShardLeaderElectionContext Enough replicas found to continue.
   [junit4]   2> 1239797 INFO  (coreZkRegister-2605-thread-1-processing-r:core_node1 c:control_collection s:shard1 x:collection1 n:127.0.0.1:45931_) [n:127.0.0.1:45931_ c:control_collection s:shard1 r:core_node1 x:collection1] o.a.s.c.ShardLeaderElectionContext I may be the new leader - try and sync
   [junit4]   2> 1239798 INFO  (coreZkRegister-2605-thread-1-processing-r:core_node1 c:control_collection s:shard1 x:collection1 n:127.0.0.1:45931_) [n:127.0.0.1:45931_ c:control_collection s:shard1 r:core_node1 x:collection1] o.a.s.c.SyncStrategy Sync replicas to http://127.0.0.1:45931/collection1/
   [junit4]   2> 1239798 INFO  (OverseerStateUpdate-95239913239281668-127.0.0.1:45931_-n_0000000000) [n:127.0.0.1:45931_    ] o.a.s.c.Overseer processMessage: queueSize: 1, message = {
   [junit4]   2>   "operation":"leader",
   [junit4]   2>   "shard":"shard1",
   [junit4]   2>   "collection":"control_collection"} current state version: 1
   [junit4]   2> 1239798 INFO  (coreZkRegister-2605-thread-1-processing-r:core_node1 c:control_collection s:shard1 x:collection1 n:127.0.0.1:45931_) [n:127.0.0.1:45931_ c:control_collection s:shard1 r:core_node1 x:collection1] o.a.s.c.SyncStrategy Sync Success - now sync replicas to me
   [junit4]   2> 1239798 INFO  (coreZkRegister-2605-thread-1-processing-r:core_node1 c:control_collection s:shard1 x:collection1 n:127.0.0.1:45931_) [n:127.0.0.1:45931_ c:control_collection s:shard1 r:core_node1 x:collection1] o.a.s.c.SyncStrategy http://127.0.0.1:45931/collection1/ has no replicas
   [junit4]   2> 1239798 INFO  (coreZkRegister-2605-thread-1-processing-r:core_node1 c:control_collection s:shard1 x:collection1 n:127.0.0.1:45931_) [n:127.0.0.1:45931_ c:control_collection s:shard1 r:core_node1 x:collection1] o.a.s.c.ShardLeaderElectionContext I am the new leader: http://127.0.0.1:45931/collection1/ shard1
   [junit4]   2> 1239799 INFO  (coreZkRegister-2605-thread-1-processing-r:core_node1 c:control_collection s:shard1 x:collection1 n:127.0.0.1:45931_) [n:127.0.0.1:45931_ c:control_collection s:shard1 r:core_node1 x:collection1] o.a.s.c.c.SolrZkClient makePath: /collections/control_collection/leaders/shard1
   [junit4]   2> 1239803 INFO  (zkCallback-558-thread-1-processing-n:127.0.0.1:45931_) [n:127.0.0.1:45931_    ] o.a.s.c.DistributedQueue NodeChildrenChanged fired on path /overseer/queue state SyncConnected
   [junit4]   2> 1239804 INFO  (OverseerStateUpdate-95239913239281668-127.0.0.1:45931_-n_0000000000) [n:127.0.0.1:45931_    ] o.a.s.c.Overseer processMessage: queueSize: 1, message = {
   [junit4]   2>   "operation":"leader",
   [junit4]   2>   "shard":"shard1",
   [junit4]   2>   "collection":"control_collection",
   [junit4]   2>   "base_url":"http://127.0.0.1:45931",
   [junit4]   2>   "core":"collection1",
   [junit4]   2>   "state":"active"} current state version: 1
   [junit4]   2> 1239895 INFO  (TEST-OverseerStatusTest.test-seed#[B7A9B1CA329179CE]) [    ] o.a.s.c.c.SolrZkClient Using default ZkCredentialsProvider
   [junit4]   2> 1239895 INFO  (TEST-OverseerStatusTest.test-seed#[B7A9B1CA329179CE]) [    ] o.a.s.c.c.ConnectionManager Waiting for client to connect to ZooKeeper
   [junit4]   2> 1239901 INFO  (zkCallback-560-thread-1) [    ] o.a.s.c.c.ConnectionManager Watcher org.apache.solr.common.cloud.ConnectionManager@5d7eca8e name:ZooKeeperConnection Watcher:127.0.0.1:36866/solr got event WatchedEvent state:SyncConnected type:None path:null path:null type:None
   [junit4]   2> 1239901 INFO  (TEST-OverseerStatusTest.test-seed#[B7A9B1CA329179CE]) [    ] o.a.s.c.c.ConnectionManager Client is connected to ZooKeeper
   [junit4]   2> 1239902 INFO  (TEST-OverseerStatusTest.test-seed#[B7A9B1CA329179CE]) [    ] o.a.s.c.c.SolrZkClient Using default ZkACLProvider
   [junit4]   2> 1239902 INFO  (TEST-OverseerStatusTest.test-seed#[B7A9B1CA329179CE]) [    ] o.a.s.c.c.ZkStateReader Updating cluster state from ZooKeeper... 
   [junit4]   2> 1239906 INFO  (TEST-OverseerStatusTest.test-seed#[B7A9B1CA329179CE]) [    ] o.a.s.c.ChaosMonkey monkey: init - expire sessions:false cause connection loss:false
   [junit4]   2> 1239910 INFO  (zkCallback-560-thread-1) [    ] o.a.s.c.c.ZkStateReader A cluster state change: WatchedEvent state:SyncConnected type:NodeDataChanged path:/clusterstate.json, has occurred - updating... (live nodes size: 1)
   [junit4]   2> 1239911 INFO  (zkCallback-558-thread-1-processing-n:127.0.0.1:45931_) [n:127.0.0.1:45931_    ] o.a.s.c.c.ZkStateReader A cluster state change: WatchedEvent state:SyncConnected type:NodeDataChanged path:/clusterstate.json, has occurred - updating... (live nodes size: 1)
   [junit4]   2> 1239913 INFO  (zkCallback-560-thread-1) [    ] o.a.s.c.c.ZkStateReader Updated cluster state version to 2
   [junit4]   2> 1239916 INFO  (zkCallback-558-thread-1-processing-n:127.0.0.1:45931_) [n:127.0.0.1:45931_    ] o.a.s.c.c.ZkStateReader Updated cluster state version to 2
   [junit4]   2> 1239955 INFO  (coreZkRegister-2605-thread-1-processing-r:core_node1 c:control_collection s:shard1 x:collection1 n:127.0.0.1:45931_) [n:127.0.0.1:45931_ c:control_collection s:shard1 r:core_node1 x:collection1] o.a.s.c.ZkController We are http://127.0.0.1:45931/collection1/ and leader is http://127.0.0.1:45931/collection1/
   [junit4]   2> 1239956 INFO  (coreZkRegister-2605-thread-1-processing-r:core_node1 c:control_collection s:shard1 x:collection1 n:127.0.0.1:45931_) [n:127.0.0.1:45931_ c:control_collection s:shard1 r:core_node1 x:collection1] o.a.s.c.ZkController No LogReplay needed for core=collection1 baseURL=http://127.0.0.1:45931
   [junit4]   2> 1239956 INFO  (coreZkRegister-2605-thread-1-processing-r:core_node1 c:control_collection s:shard1 x:collection1 n:127.0.0.1:45931_) [n:127.0.0.1:45931_ c:control_collection s:shard1 r:core_node1 x:collection1] o.a.s.c.ZkController I am the leader, no recovery necessary
   [junit4]   2> 1239956 INFO  (coreZkRegister-2605-thread-1-processing-r:core_node1 c:control_collection s:shard1 x:collection1 n:127.0.0.1:45931_) [n:127.0.0.1:45931_ c:control_collection s:shard1 r:core_node1 x:collection1] o.a.s.c.ZkController publishing state=active
   [junit4]   2> 1239956 INFO  (coreZkRegister-2605-thread-1-processing-r:core_node1 c:control_collection s:shard1 x:collection1 n:127.0.0.1:45931_) [n:127.0.0.1:45931_ c:control_collection s:shard1 r:core_node1 x:collection1] o.a.s.c.ZkController numShards not found on descriptor - reading it from system property
   [junit4]   2> 1239958 INFO  (zkCallback-558-thread-1-processing-n:127.0.0.1:45931_) [n:127.0.0.1:45931_    ] o.a.s.c.DistributedQueue NodeChildrenChanged fired on path /overseer/queue state SyncConnected
   [junit4]   2> 1239960 INFO  (OverseerStateUpdate-95239913239281668-127.0.0.1:45931_-n_0000000000) [n:127.0.0.1:45931_    ] o.a.s.c.Overseer processMessage: queueSize: 1, message = {
   [junit4]   2>   "state":"active",
   [junit4]   2>   "roles":null,
   [junit4]   2>   "numShards":"1",
   [junit4]   2>   "collection":"control_collection",
   [junit4]   2>   "shard":"shard1",
   [junit4]   2>   "base_url":"http://127.0.0.1:45931",
   [junit4]   2>   "core":"collection1",
   [junit4]   2>   "node_name":"127.0.0.1:45931_",
   [junit4]   2>   "operation":"state",
   [junit4]   2>   "core_node_name":"core_node1"} current state version: 2
   [junit4]   2> 1239961 INFO  (OverseerStateUpdate-95239913239281668-127.0.0.1:45931_-n_0000000000) [n:127.0.0.1:45931_    ] o.a.s.c.o.ReplicaMutator Update state numShards=1 message={
   [junit4]   2>   "state":"active",
   [junit4]   2>   "roles":null,
   [junit4]   2>   "numShards":"1",
   [junit4]   2>   "collection":"control_collection",
   [junit4]   2>   "shard":"shard1",
   [junit4]   2>   "base_url":"http://127.0.0.1:45931",
   [junit4]   2>   "core":"collection1",
   [junit4]   2>   "node_name":"127.0.0.1:45931_",
   [junit4]   2>   "operation":"state",
   [junit4]   2>   "core_node_name":"core_node1"}
   [junit4]   2> 1240064 INFO  (zkCallback-560-thread-1) [    ] o.a.s.c.c.ZkStateReader A cluster state change: WatchedEvent state:SyncConnected type:NodeDataChanged path:/clusterstate.json, has occurred - updating... (live nodes size: 1)
   [junit4]   2> 1240064 INFO  (zkCallback-558-thread-1-processing-n:127.0.0.1:45931_) [n:127.0.0.1:45931_    ] o.a.s.c.c.ZkStateReader A cluster state change: WatchedEvent state:SyncConnected type:NodeDataChanged path:/clusterstate.json, has occurred - updating... (live nodes size: 1)
   [junit4]   2> 1240066 INFO  (zkCallback-558-thread-1-processing-n:127.0.0.1:45931_) [n:127.0.0.1:45931_    ] o.a.s.c.c.ZkStateReader Updated cluster state version to 3
   [junit4]   2> 1240072 INFO  (zkCallback-560-thread-1) [    ] o.a.s.c.c.ZkStateReader Updated cluster state version to 3
   [junit4]   2> 1240249 INFO  (TEST-OverseerStatusTest.test-seed#[B7A9B1CA329179CE]) [    ] o.a.s.SolrTestCaseJ4 Writing core.properties file to /x1/jenkins/jenkins-slave/workspace/Lucene-Solr-Tests-5.3-Java7/solr/build/solr-core/test/J0/temp/solr.cloud.OverseerStatusTest_B7A9B1CA329179CE-001/shard-1-001/cores/collection1
   [junit4]   2> 1240250 INFO  (TEST-OverseerStatusTest.test-seed#[B7A9B1CA329179CE]) [    ] o.a.s.c.AbstractFullDistribZkTestBase create jetty 1 in directory /x1/jenkins/jenkins-slave/workspace/Lucene-Solr-Tests-5.3-Java7/solr/build/solr-core/test/J0/temp/solr.cloud.OverseerStatusTest_B7A9B1CA329179CE-001/shard-1-001
   [junit4]   2> 1240251 INFO  (TEST-OverseerStatusTest.test-seed#[B7A9B1CA329179CE]) [    ] o.e.j.s.Server jetty-9.2.11.v20150529
   [junit4]   2> 1240253 INFO  (TEST-OverseerStatusTest.test-seed#[B7A9B1CA329179CE]) [    ] o.e.j.s.h.ContextHandler Started o.e.j.s.ServletContextHandler@182d85b7{/,null,AVAILABLE}
   [junit4]   2> 1240254 INFO  (TEST-OverseerStatusTest.test-seed#[B7A9B1CA329179CE]) [    ] o.e.j.s.ServerConnector Started ServerConnector@54a5bdc7{HTTP/1.1}{127.0.0.1:49148}
   [junit4]   2> 1240254 INFO  (TEST-OverseerStatusTest.test-seed#[B7A9B1CA329179CE]) [    ] o.e.j.s.Server Started @1245724ms
   [junit4]   2> 1240254 INFO  (TEST-OverseerStatusTest.test-seed#[B7A9B1CA329179CE]) [    ] o.a.s.c.s.e.JettySolrRunner Jetty properties: {hostPort=49148, hostContext=/, solrconfig=solrconfig.xml, solr.data.dir=/x1/jenkins/jenkins-slave/workspace/Lucene-Solr-Tests-5.3-Java7/solr/build/solr-core/test/J0/temp/solr.cloud.OverseerStatusTest_B7A9B1CA329179CE-001/tempDir-001/jetty1, coreRootDirectory=/x1/jenkins/jenkins-slave/workspace/Lucene-Solr-Tests-5.3-Java7/solr/build/solr-core/test/J0/temp/solr.cloud.OverseerStatusTest_B7A9B1CA329179CE-001/shard-1-001/cores}
   [junit4]   2> 1240254 INFO  (TEST-OverseerStatusTest.test-seed#[B7A9B1CA329179CE]) [    ] o.a.s.s.SolrDispatchFilter SolrDispatchFilter.init(): sun.misc.Launcher$AppClassLoader@5f57402b
   [junit4]   2> 1240254 INFO  (TEST-OverseerStatusTest.test-seed#[B7A9B1CA329179CE]) [    ] o.a.s.c.SolrResourceLoader new SolrResourceLoader for directory: '/x1/jenkins/jenkins-slave/workspace/Lucene-Solr-Tests-5.3-Java7/solr/build/solr-core/test/J0/temp/solr.cloud.OverseerStatusTest_B7A9B1CA329179CE-001/shard-1-001/'
   [junit4]   2> 1240272 INFO  (TEST-OverseerStatusTest.test-seed#[B7A9B1CA329179CE]) [    ] o.a.s.c.c.SolrZkClient Using default ZkCredentialsProvider
   [junit4]   2> 1240273 INFO  (TEST-OverseerStatusTest.test-seed#[B7A9B1CA329179CE]) [    ] o.a.s.c.c.ConnectionManager Waiting for client to connect to ZooKeeper
   [junit4]   2> 1240279 INFO  (zkCallback-561-thread-1) [    ] o.a.s.c.c.ConnectionManager Watcher org.apache.solr.common.cloud.ConnectionManager@3b2e3fed name:ZooKeeperConnection Watcher:127.0.0.1:36866/solr got event WatchedEvent state:SyncConnected type:None path:null path:null type:None
   [junit4]   2> 1240279 INFO  (TEST-OverseerStatusTest.test-seed#[B7A9B1CA329179CE]) [    ] o.a.s.c.c.ConnectionManager Client is connected to ZooKeeper
   [junit4]   2> 1240280 INFO  (TEST-OverseerStatusTest.test-seed#[B7A9B1CA329179CE]) [    ] o.a.s.c.c.SolrZkClient Using default ZkACLProvider
   [junit4]   2> 1240282 INFO  (TEST-OverseerStatusTest.test-seed#[B7A9B1CA329179CE]) [    ] o.a.s.s.SolrDispatchFilter Loading solr.xml from SolrHome (not found in ZooKeeper)
   [junit4]   2> 1240282 INFO  (TEST-OverseerStatusTest.test-seed#[B7A9B1CA329179CE]) [    ] o.a.s.c.SolrXmlConfig Loading container configuration from /x1/jenkins/jenkins-slave/workspace/Lucene-Solr-Tests-5.3-Java7/solr/build/solr-core/test/J0/temp/solr.cloud.OverseerStatusTest_B7A9B1CA329179CE-001/shard-1-001/solr.xml
   [junit4]   2> 1240298 INFO  (TEST-OverseerStatusTest.test-seed#[B7A9B1CA329179CE]) [    ] o.a.s.c.CoresLocator Config-defined core root directory: /x1/jenkins/jenkins-slave/workspace/Lucene-Solr-Tests-5.3-Java7/solr/build/solr-core/test/J0/temp/solr.cloud.OverseerStatusTest_B7A9B1CA329179CE-001/shard-1-001/cores
   [junit4]   2> 1240299 INFO  (TEST-OverseerStatusTest.test-seed#[B7A9B1CA329179CE]) [    ] o.a.s.c.CoreContainer New CoreContainer 705688762
   [junit4]   2> 1240299 INFO  (TEST-OverseerStatusTest.test-seed#[B7A9B1CA329179CE]) [    ] o.a.s.c.CoreContainer Loading cores into CoreContainer [instanceDir=/x1/jenkins/jenkins-slave/workspace/Lucene-Solr-Tests-5.3-Java7/solr/build/solr-core/test/J0/temp/solr.cloud.OverseerStatusTest_B7A9B1CA329179CE-001/shard-1-001/]
   [junit4]   2> 1240299 INFO  (TEST-OverseerStatusTest.test-seed#[B7A9B1CA329179CE]) [    ] o.a.s.c.CoreContainer loading shared library: /x1/jenkins/jenkins-slave/workspace/Lucene-Solr-Tests-5.3-Java7/solr/build/solr-core/test/J0/temp/solr.cloud.OverseerStatusTest_B7A9B1CA329179CE-001/shard-1-001/lib
   [junit4]   2> 1240299 WARN  (TEST-OverseerStatusTest.test-seed#[B7A9B1CA329179CE]) [    ] o.a.s.c.SolrResourceLoader Can't find (or read) directory to add to classloader: lib (resolved as: /x1/jenkins/jenkins-slave/workspace/Lucene-Solr-Tests-5.3-Java7/solr/build/solr-core/test/J0/temp/solr.cloud.OverseerStatusTest_B7A9B1CA329179CE-001/shard-1-001/lib).
   [junit4]   2> 1240308 INFO  (TEST-OverseerStatusTest.test-seed#[B7A9B1CA329179CE]) [    ] o.a.s.h.c.HttpShardHandlerFactory created with socketTimeout : 90000,urlScheme : ,connTimeout : 15000,maxConnectionsPerHost : 20,maxConnections : 10000,corePoolSize : 0,maximumPoolSize : 2147483647,maxThreadIdleTime : 5,sizeOfQueue : -1,fairnessPolicy : false,useRetries : false,
   [junit4]   2> 1240309 INFO  (TEST-OverseerStatusTest.test-seed#[B7A9B1CA329179CE]) [    ] o.a.s.u.UpdateShardHandler Creating UpdateShardHandler HTTP client with params: socketTimeout=340000&connTimeout=45000&retry=true
   [junit4]   2> 1240310 INFO  (TEST-OverseerStatusTest.test-seed#[B7A9B1CA329179CE]) [    ] o.a.s.l.LogWatcher SLF4J impl is org.slf4j.impl.Log4jLoggerFactory
   [junit4]   2> 1240310 INFO  (TEST-OverseerStatusTest.test-seed#[B7A9B1CA329179CE]) [    ] o.a.s.l.LogWatcher Registering Log Listener [Log4j (org.slf4j.impl.Log4jLoggerFactory)]
   [junit4]   2> 1240310 INFO  (TEST-OverseerStatusTest.test-seed#[B7A9B1CA329179CE]) [    ] o.a.s.c.ZkContainer Zookeeper client=127.0.0.1:36866/solr
   [junit4]   2> 1240310 INFO  (TEST-OverseerStatusTest.test-seed#[B7A9B1CA329179CE]) [    ] o.a.s.c.ZkController zkHost includes chroot
   [junit4]   2> 1240310 INFO  (TEST-OverseerStatusTest.test-seed#[B7A9B1CA329179CE]) [    ] o.a.s.c.c.SolrZkClient Using default ZkCredentialsProvider
   [junit4]   2> 1240311 INFO  (TEST-OverseerStatusTest.test-seed#[B7A9B1CA329179CE]) [    ] o.a.s.c.c.ConnectionManager Waiting for client to connect to ZooKeeper
   [junit4]   2> 1240313 INFO  (zkCallback-563-thread-1) [    ] o.a.s.c.c.ConnectionManager Watcher org.apache.solr.common.cloud.ConnectionManager@3d010d32 name:ZooKeeperConnection Watcher:127.0.0.1:36866 got event WatchedEvent state:SyncConnected type:None path:null path:null type:None
   [junit4]   2> 1240313 INFO  (TEST-OverseerStatusTest.test-seed#[B7A9B1CA329179CE]) [    ] o.a.s.c.c.ConnectionManager Client is connected to ZooKeeper
   [junit4]   2> 1240313 INFO  (TEST-OverseerStatusTest.test-seed#[B7A9B1CA329179CE]) [    ] o.a.s.c.c.SolrZkClient Using default ZkACLProvider
   [junit4]   2> 1240316 INFO  (TEST-OverseerStatusTest.test-seed#[B7A9B1CA329179CE]) [n:127.0.0.1:49148_    ] o.a.s.c.c.ConnectionManager Waiting for client to connect to ZooKeeper
   [junit4]   2> 1240317 INFO  (zkCallback-564-thread-1-processing-n:127.0.0.1:49148_) [n:127.0.0.1:49148_    ] o.a.s.c.c.ConnectionManager Watcher org.apache.solr.common.cloud.ConnectionManager@1c6b563c name:ZooKeeperConnection Watcher:127.0.0.1:36866/solr got event WatchedEvent state:SyncConnected type:None path:null path:null type:None
   [junit4]   2> 1240317 INFO  (TEST-OverseerStatusTest.test-seed#[B7A9B1CA329179CE]) [n:127.0.0.1:49148_    ] o.a.s.c.c.ConnectionManager Client is connected to ZooKeeper
   [junit4]   2> 1240339 INFO  (TEST-OverseerStatusTest.test-seed#[B7A9B1CA329179CE]) [n:127.0.0.1:49148_    ] o.a.s.c.c.ZkStateReader Updating cluster state from ZooKeeper... 
   [junit4]   2> 1241346 INFO  (TEST-OverseerStatusTest.test-seed#[B7A9B1CA329179CE]) [n:127.0.0.1:49148_    ] o.a.s.c.ZkController Register node as live in ZooKeeper:/live_nodes/127.0.0.1:49148_
   [junit4]   2> 1241346 INFO  (TEST-OverseerStatusTest.test-seed#[B7A9B1CA329179CE]) [n:127.0.0.1:49148_    ] o.a.s.c.c.SolrZkClient makePath: /live_nodes/127.0.0.1:49148_
   [junit4]   2> 1241351 INFO  (TEST-OverseerStatusTest.test-seed#[B7A9B1CA329179CE]) [n:127.0.0.1:49148_    ] o.a.s.c.Overseer Overseer (id=null) closing
   [junit4]   2> 1241352 INFO  (TEST-OverseerStatusTest.test-seed#[B7A9B1CA329179CE]) [n:127.0.0.1:49148_    ] o.a.s.c.LeaderElector Joined leadership election with path: /overseer_elect/election/95239913239281672-127.0.0.1:49148_-n_0000000001
   [junit4]   2> 1241353 INFO  (TEST-OverseerStatusTest.test-seed#[B7A9B1CA329179CE]) [n:127.0.0.1:49148_    ] o.a.s.c.LeaderElector Watching path /overseer_elect/election/95239913239281668-127.0.0.1:45931_-n_0000000000 to know if I could be the leader
   [junit4]   2> 1241362 INFO  (TEST-OverseerStatusTest.test-seed#[B7A9B1CA329179CE]) [n:127.0.0.1:49148_    ] o.a.s.c.CoreContainer Security conf doesn't exist. Skipping setup for authorization module.
   [junit4]   2> 1241363 INFO  (TEST-OverseerStatusTest.test-seed#[B7A9B1CA329179CE]) [n:127.0.0.1:49148_    ] o.a.s.c.CoreContainer No authentication plugin used.
   [junit4]   2> 1241364 INFO  (TEST-OverseerStatusTest.test-seed#[B7A9B1CA329179CE]) [n:127.0.0.1:49148_    ] o.a.s.c.CoresLocator Looking for core definitions underneath /x1/jenkins/jenkins-slave/workspace/Lucene-Solr-Tests-5.3-Java7/solr/build/solr-core/test/J0/temp/solr.cloud.OverseerStatusTest_B7A9B1CA329179CE-001/shard-1-001/cores
   [junit4]   2> 1241365 INFO  (TEST-OverseerStatusTest.test-seed#[B7A9B1CA329179CE]) [n:127.0.0.1:49148_    ] o.a.s.c.SolrCore Created CoreDescriptor: {absoluteInstDir=/x1/jenkins/jenkins-slave/workspace/Lucene-Solr-Tests-5.3-Java7/solr/build/solr-core/test/J0/temp/solr.cloud.OverseerStatusTest_B7A9B1CA329179CE-001/shard-1-001/cores/collection1/, collection=collection1, name=collection1, shard=, transient=false, configSetProperties=configsetprops.json, dataDir=data/, config=solrconfig.xml, instanceDir=/x1/jenkins/jenkins-slave/workspace/Lucene-Solr-Tests-5.3-Java7/solr/build/solr-core/test/J0/temp/solr.cloud.OverseerStatusTest_B7A9B1CA329179CE-001/shard-1-001/cores/collection1, coreNodeName=, schema=schema.xml, loadOnStartup=true}
   [junit4]   2> 1241365 INFO  (TEST-OverseerStatusTest.test-seed#[B7A9B1CA329179CE]) [n:127.0.0.1:49148_    ] o.a.s.c.CoresLocator Found core collection1 in /x1/jenkins/jenkins-slave/workspace/Lucene-Solr-Tests-5.3-Java7/solr/build/solr-core/test/J0/temp/solr.cloud.OverseerStatusTest_B7A9B1CA329179CE-001/shard-1-001/cores/collection1/
   [junit4]   2> 1241365 INFO  (TEST-OverseerStatusTest.test-seed#[B7A9B1CA329179CE]) [n:127.0.0.1:49148_    ] o.a.s.c.CoresLocator Found 1 core definitions
   [junit4]   2> 1241366 INFO  (coreLoadExecutor-2622-thread-1-processing-n:127.0.0.1:49148_) [n:127.0.0.1:49148_ c:collection1   x:collection1] o.a.s.c.ZkController publishing state=down
   [junit4]   2> 1241366 INFO  (TEST-OverseerStatusTest.test-seed#[B7A9B1CA329179CE]) [n:127.0.0.1:49148_    ] o.a.s.s.SolrDispatchFilter user.dir=/x1/jenkins/jenkins-slave/workspace/Lucene-Solr-Tests-5.3-Java7/solr/build/solr-core/test/J0
   [junit4]   2> 1241367 INFO  (TEST-OverseerStatusTest.test-seed#[B7A9B1CA329179CE]) [n:127.0.0.1:49148_    ] o.a.s.s.SolrDispatchFilter SolrDispatchFilter.init() done
   [junit4]   2> 1241366 INFO  (coreLoadExecutor-2622-thread-1-processing-n:127.0.0.1:49148_) [n:127.0.0.1:49148_ c:collection1   x:collection1] o.a.s.c.ZkController numShards not found on descriptor - reading it from system property
   [junit4]   2> 1241368 INFO  (coreLoadExecutor-2622-thread-1-processing-n:127.0.0.1:49148_) [n:127.0.0.1:49148_ c:collection1   x:collection1] o.a.s.c.ZkController look for our core node name
   [junit4]   2> 1241368 INFO  (zkCallback-558-thread-1-processing-n:127.0.0.1:45931_) [n:127.0.0.1:45931_    ] o.a.s.c.DistributedQueue NodeChildrenChanged fired on path /overseer/queue state SyncConnected
   [junit4]   2> 1241369 INFO  (OverseerStateUpdate-95239913239281668-127.0.0.1:45931_-n_0000000000) [n:127.0.0.1:45931_    ] o.a.s.c.Overseer processMessage: queueSize: 1, message = {
   [junit4]   2>   "state":"down",
   [junit4]   2>   "roles":null,
   [junit4]   2>   "numShards":"1",
   [junit4]   2>   "collection":"collection1",
   [junit4]   2>   "shard":null,
   [junit4]   2>   "base_url":"http://127.0.0.1:49148",
   [junit4]   2>   "core":"collection1",
   [junit4]   2>   "node_name":"127.0.0.1:49148_",
   [junit4]   2>   "operation":"state"} current state version: 3
   [junit4]   2> 1241369 INFO  (OverseerStateUpdate-95239913239281668-127.0.0.1:45931_-n_0000000000) [n:127.0.0.1:45931_    ] o.a.s.c.o.ReplicaMutator Update state numShards=1 message={
   [junit4]   2>   "state":"down",
   [junit4]   2>   "roles":null,
   [junit4]   2>   "numShards":"1",
   [junit4]   2>   "collection":"collection1",
   [junit4]   2>   "shard":null,
   [junit4]   2>   "base_url":"http://127.0.0.1:49148",
   [junit4]   2>   "core":"collection1",
   [junit4]   2>   "node_name":"127.0.0.1:49148_",
   [junit4]   2>   "operation":"state"}
   [junit4]   2> 1241369 INFO  (OverseerStateUpdate-95239913239281668-127.0.0.1:45931_-n_0000000000) [n:127.0.0.1:45931_    ] o.a.s.c.o.ClusterStateMutator building a new cName: collection1
   [junit4]   2> 1241370 INFO  (OverseerStateUpdate-95239913239281668-127.0.0.1:45931_-n_0000000000) [n:127.0.0.1:45931_    ] o.a.s.c.o.ReplicaMutator Assigning new node to shard shard=shard1
   [junit4]   2> 1241473 INFO  (zkCallback-560-thread-1) [    ] o.a.s.c.c.ZkStateReader A cluster state change: WatchedEvent state:SyncConnected type:NodeDataChanged path:/clusterstate.json, has occurred - updating... (live nodes size: 2)
   [junit4]   2> 1241473 INFO  (zkCallback-564-thread-1-processing-n:127.0.0.1:49148_) [n:127.0.0.1:49148_    ] o.a.s.c.c.ZkStateReader A cluster state change: WatchedEvent state:SyncConnected type:NodeDataChanged path:/clusterstate.json, has occurred - updating... (live nodes size: 2)
   [junit4]   2> 1241473 INFO  (zkCallback-558-thread-1-processing-n:127.0.0.1:45931_) [n:127.0.0.1:45931_    ] o.a.s.c.c.ZkStateReader A cluster state change: WatchedEvent state:SyncConnected type:NodeDataChanged path:/clusterstate.json, has occurred - updating... (live nodes size: 2)
   [junit4]   2> 1241475 INFO  (zkCallback-560-thread-1) [    ] o.a.s.c.c.ZkStateReader Updated cluster state version to 4
   [junit4]   2> 1241476 INFO  (zkCallback-564-thread-1-processing-n:127.0.0.1:49148_) [n:127.0.0.1:49148_    ] o.a.s.c.c.ZkStateReader Updated cluster state version to 4
   [junit4]   2> 1241476 INFO  (zkCallback-558-thread-1-processing-n:127.0.0.1:45931_) [n:127.0.0.1:45931_    ] o.a.s.c.c.ZkStateReader Updated cluster state version to 4
   [junit4]   2> 1242368 INFO  (coreLoadExecutor-2622-thread-1-processing-n:127.0.0.1:49148_) [n:127.0.0.1:49148_ c:collection1   x:collection1] o.a.s.c.ZkController waiting to find shard id in clusterstate for collection1
   [junit4]   2> 1242368 INFO  (coreLoadExecutor-2622-thread-1-processing-n:127.0.0.1:49148_) [n:127.0.0.1:49148_ c:collection1   x:collection1] o.a.s.c.ZkController Check for collection zkNode:collection1
   [junit4]   2> 1242369 INFO  (coreLoadExecutor-2622-thread-1-processing-n:127.0.0.1:49148_) [n:127.0.0.1:49148_ c:collection1   x:collection1] o.a.s.c.ZkController Collection zkNode exists
   [junit4]   2> 1242369 INFO  (coreLoadExecutor-2622-thread-1-processing-n:127.0.0.1:49148_) [n:127.0.0.1:49148_ c:collection1   x:collection1] o.a.s.c.c.ZkStateReader Load collection config from:/collections/collection1
   [junit4]   2> 1242370 INFO  (coreLoadExecutor-2622-thread-1-processing-n:127.0.0.1:49148_) [n:127.0.0.1:49148_ c:collection1   x:collection1] o.a.s.c.c.ZkStateReader path=/collections/collection1 configName=conf1 specified config exists in ZooKeeper
   [junit4]   2> 1242370 INFO  (coreLoadExecutor-2622-thread-1-processing-n:127.0.0.1:49148_) [n:127.0.0.1:49148_ c:collection1   x:collection1] o.a.s.c.SolrResourceLoader new SolrResourceLoader for directory: '/x1/jenkins/jenkins-slave/workspace/Lucene-Solr-Tests-5.3-Java7/solr/build/solr-core/test/J0/temp/solr.cloud.OverseerStatusTest_B7A9B1CA329179CE-001/shard-1-001/cores/collection1/'
   [junit4]   2> 1242389 INFO  (coreLoadExecutor-2622-thread-1-processing-n:127.0.0.1:49148_) [n:127.0.0.1:49148_ c:collection1   x:collection1] o.a.s.c.Config loaded config solrconfig.xml with version 0 
   [junit4]   2> 1242397 INFO  (coreLoadExecutor-2622-thread-1-processing-n:127.0.0.1:49148_) [n:127.0.0.1:49148_ c:collection1   x:collection1] o.a.s.c.SolrConfig current version of requestparams : -1
   [junit4]   2> 1242412 INFO  (coreLoadExecutor-2622-thread-1-processing-n:127.0.0.1:49148_) [n:127.0.0.1:49148_ c:collection1   x:collection1] o.a.s.c.SolrConfig Using Lucene MatchVersion: 5.3.2
   [junit4]   2> 1242445 INFO  (coreLoadExecutor-2622-thread-1-processing-n:127.0.0.1:49148_) [n:127.0.0.1:49148_ c:collection1   x:collection1] o.a.s.c.Config Loaded SolrConfig: solrconfig.xml
   [junit4]   2> 1242446 INFO  (coreLoadExecutor-2622-thread-1-processing-n:127.0.0.1:49148_) [n:127.0.0.1:49148_ c:collection1   x:collection1] o.a.s.s.IndexSchema Reading Solr Schema from /configs/conf1/schema.xml
   [junit4]   2> 1242454 INFO  (coreLoadExecutor-2622-thread-1-processing-n:127.0.0.1:49148_) [n:127.0.0.1:49148_ c:collection1   x:collection1] o.a.s.s.IndexSchema [collection1] Schema name=test
   [junit4]   2> 1242674 INFO  (coreLoadExecutor-2622-thread-1-processing-n:127.0.0.1:49148_) [n:127.0.0.1:49148_ c:collection1   x:collection1] o.a.s.s.IndexSchema default search field in schema is text
   [junit4]   2> 1242676 INFO  (coreLoadExecutor-2622-thread-1-processing-n:127.0.0.1:49148_) [n:127.0.0.1:49148_ c:collection1   x:collection1] o.a.s.s.IndexSchema unique key field: id
   [junit4]   2> 1242677 INFO  (coreLoadExecutor-2622-thread-1-processing-n:127.0.0.1:49148_) [n:127.0.0.1:49148_ c:collection1   x:collection1] o.a.s.s.FileExchangeRateProvider Reloading exchange rates from file currency.xml
   [junit4]   2> 1242680 INFO  (coreLoadExecutor-2622-thread-1-processing-n:127.0.0.1:49148_) [n:127.0.0.1:49148_ c:collection1   x:collection1] o.a.s.s.FileExchangeRateProvider Reloading exchange rates from file currency.xml
   [junit4]   2> 1242701 INFO  (coreLoadExecutor-2622-thread-1-processing-n:127.0.0.1:49148_) [n:127.0.0.1:49148_ c:collection1   x:collection1] o.a.s.c.ConfigSetProperties Did not find ConfigSet properties, assuming default properties: Can't find resource 'configsetprops.json' in classpath or '/configs/conf1', cwd=/x1/jenkins/jenkins-slave/workspace/Lucene-Solr-Tests-5.3-Java7/solr/build/solr-core/test/J0
   [junit4]   2> 1242701 INFO  (coreLoadExecutor-2622-thread-1-processing-n:127.0.0.1:49148_) [n:127.0.0.1:49148_ c:collection1   x:collection1] o.a.s.c.CoreContainer Creating SolrCore 'collection1' using configuration from collection collection1
   [junit4]   2> 1242701 INFO  (coreLoadExecutor-2622-thread-1-processing-n:127.0.0.1:49148_) [n:127.0.0.1:49148_ c:collection1 s:shard1 r:core_node1 x:collection1] o.a.s.c.SolrCore org.apache.solr.core.MockDirectoryFactory
   [junit4]   2> 1242701 INFO  (coreLoadExecutor-2622-thread-1-processing-n:127.0.0.1:49148_) [n:127.0.0.1:49148_ c:collection1 s:shard1 r:core_node1 x:collection1] o.a.s.c.SolrCore [[collection1] ] Opening new SolrCore at [/x1/jenkins/jenkins-slave/workspace/Lucene-Solr-Tests-5.3-Java7/solr/build/solr-core/test/J0/temp/solr.cloud.OverseerStatusTest_B7A9B1CA329179CE-001/shard-1-001/cores/collection1/], dataDir=[null]
   [junit4]   2> 1242701 INFO  (coreLoadExecutor-2622-thread-1-processing-n:127.0.0.1:49148_) [n:127.0.0.1:49148_ c:collection1 s:shard1 r:core_node1 x:collection1] o.a.s.c.JmxMonitoredMap JMX monitoring is enabled. Adding Solr mbeans to JMX Server: com.sun.jmx.mbeanserver.JmxMBeanServer@68f64d93
   [junit4]   2> 1242702 INFO  (coreLoadExecutor-2622-thread-1-processing-n:127.0.0.1:49148_) [n:127.0.0.1:49148_ c:collection1 s:shard1 r:core_node1 x:collection1] o.a.s.c.CachingDirectoryFactory return new directory for /x1/jenkins/jenkins-slave/workspace/Lucene-Solr-Tests-5.3-Java7/solr/build/solr-core/test/J0/temp/solr.cloud.OverseerStatusTest_B7A9B1CA329179CE-001/shard-1-001/cores/collection1/data
   [junit4]   2> 1242702 INFO  (coreLoadExecutor-2622-thread-1-processing-n:127.0.0.1:49148_) [n:127.0.0.1:49148_ c:collection1 s:shard1 r:core_node1 x:collection1] o.a.s.c.SolrCore New index directory detected: old=null new=/x1/jenkins/jenkins-slave/workspace/Lucene-Solr-Tests-5.3-Java7/solr/build/solr-core/test/J0/temp/solr.cloud.OverseerStatusTest_B7A9B1CA329179CE-001/shard-1-001/cores/collection1/data/index/
   [junit4]   2> 1242702 WARN  (coreLoadExecutor-2622-thread-1-processing-n:127.0.0.1:49148_) [n:127.0.0.1:49148_ c:collection1 s:shard1 r:core_node1 x:collection1] o.a.s.c.SolrCore [collection1] Solr index directory '/x1/jenkins/jenkins-slave/workspace/Lucene-Solr-Tests-5.3-Java7/solr/build/solr-core/test/J0/temp/solr.cloud.OverseerStatusTest_B7A9B1CA329179CE-001/shard-1-001/cores/collection1/data/index' doesn't exist. Creating new index...
   [junit4]   2> 1242703 INFO  (coreLoadExecutor-2622-thread-1-processing-n:127.0.0.1:49148_) [n:127.0.0.1:49148_ c:collection1 s:shard1 r:core_node1 x:collection1] o.a.s.c.CachingDirectoryFactory return new directory for /x1/jenkins/jenkins-slave/workspace/Lucene-Solr-Tests-5.3-Java7/solr/build/solr-core/test/J0/temp/solr.cloud.OverseerStatusTest_B7A9B1CA329179CE-001/shard-1-001/cores/collection1/data/index
   [junit4]   2> 1242704 INFO  (coreLoadExecutor-2622-thread-1-processing-n:127.0.0.1:49148_) [n:127.0.0.1:49148_ c:collection1 s:shard1 r:core_node1 x:collection1] o.a.s.u.RandomMergePolicy RandomMergePolicy wrapping class org.apache.lucene.index.AlcoholicMergePolicy: [AlcoholicMergePolicy: minMergeSize=0, mergeFactor=10, maxMergeSize=4715336, maxMergeSizeForForcedMerge=9223372036854775807, calibrateSizeByDeletes=true, maxMergeDocs=2147483647, maxCFSSegmentSizeMB=8.796093022207999E12, noCFSRatio=0.1]
   [junit4]   2> 1242705 INFO  (coreLoadExecutor-2622-thread-1-processing-n:127.0.0.1:49148_) [n:127.0.0.1:49148_ c:collection1 s:shard1 r:core_node1 x:collection1] o.a.s.c.SolrCore SolrDeletionPolicy.onCommit: commits: num=1
   [junit4]   2> 	commit{dir=MockDirectoryWrapper(RAMDirectory@781b6f1a lockFactory=org.apache.lucene.store.SingleInstanceLockFactory@511b5190),segFN=segments_1,generation=1}
   [junit4]   2> 1242705 INFO  (coreLoadExecutor-2622-thread-1-processing-n:127.0.0.1:49148_) [n:127.0.0.1:49148_ c:collection1 s:shard1 r:core_node1 x:collection1] o.a.s.c.SolrCore newest commit generation = 1
   [junit4]   2> 1242706 INFO  (OldIndexDirectoryCleanupThreadForCore-collection1) [n:127.0.0.1:49148_ c:collection1 s:shard1 r:core_node1 x:collection1] o.a.s.c.SolrCore Looking for old index directories to cleanup for core collection1 in /x1/jenkins/jenkins-slave/workspace/Lucene-Solr-Tests-5.3-Java7/solr/build/solr-core/test/J0/temp/solr.cloud.OverseerStatusTest_B7A9B1CA329179CE-001/shard-1-001/cores/collection1/data/
   [junit4]   2> 1242707 WARN  (OldIndexDirectoryCleanupThreadForCore-collection1) [n:127.0.0.1:49148_ c:collection1 s:shard1 r:core_node1 x:collection1] o.a.s.c.DirectoryFactory /x1/jenkins/jenkins-slave/workspace/Lucene-Solr-Tests-5.3-Java7/solr/build/solr-core/test/J0/temp/solr.cloud.OverseerStatusTest_B7A9B1CA329179CE-001/shard-1-001/cores/collection1/data/ does not point to a valid data directory; skipping clean-up of old index directories.
   [junit4]   2> 1242713 INFO  (coreLoadExecutor-2622-thread-1-processing-n:127.0.0.1:49148_) [n:127.0.0.1:49148_ c:collection1 s:shard1 r:core_node1 x:collection1] o.a.s.u.p.UpdateRequestProcessorChain creating updateRequestProcessorChain "nodistrib"
   [junit4]   2> 1242714 INFO  (coreLoadExecutor-2622-thread-1-processing-n:127.0.0.1:49148_) [n:127.0.0.1:49148_ c:collection1 s:shard1 r:core_node1 x:collection1] o.a.s.u.p.UpdateRequestProcessorChain creating updateRequestProcessorChain "dedupe"
   [junit4]   2> 1242714 INFO  (coreLoadExecutor-2622-thread-1-processing-n:127.0.0.1:49148_) [n:127.0.0.1:49148_ c:collection1 s:shard1 r:core_node1 x:collection1] o.a.s.u.p.UpdateRequestProcessorChain inserting DistributedUpdateProcessorFactory into updateRequestProcessorChain "dedupe"
   [junit4]   2> 1242714 INFO  (coreLoadExecutor-2622-thread-1-processing-n:127.0.0.1:49148_) [n:127.0.0.1:49148_ c:collection1 s:shard1 r:core_node1 x:collection1] o.a.s.u.p.UpdateRequestProcessorChain creating updateRequestProcessorChain "stored_sig"
   [junit4]   2> 1242714 INFO  (coreLoadExecutor-2622-thread-1-processing-n:127.0.0.1:49148_) [n:127.0.0.1:49148_ c:collection1 s:shard1 r:core_node1 x:collection1] o.a.s.u.p.UpdateRequestProcessorChain inserting DistributedUpdateProcessorFactory into updateRequestProcessorChain "stored_sig"
   [junit4]   2> 1242715 INFO  (coreLoadExecutor-2622-thread-1-processing-n:127.0.0.1:49148_) [n:127.0.0.1:49148_ c:collection1 s:shard1 r:core_node1 x:collection1] o.a.s.u.p.UpdateRequestProcessorChain creating updateRequestProcessorChain "distrib-dup-test-chain-explicit"
   [junit4]   2> 1242715 INFO  (coreLoadExecutor-2622-thread-1-processing-n:127.0.0.1:49148_) [n:127.0.0.1:49148_ c:collection1 s:shard1 r:core_node1 x:collection1] o.a.s.u.p.UpdateRequestProcessorChain creating updateRequestProcessorChain "distrib-dup-test-chain-implicit"
   [junit4]   2> 1242715 INFO  (coreLoadExecutor-2622-thread-1-processing-n:127.0.0.1:49148_) [n:127.0.0.1:49148_ c:collection1 s:shard1 r:core_node1 x:collection1] o.a.s.u.p.UpdateRequestProcessorChain inserting DistributedUpdateProcessorFactory into updateRequestProcessorChain "distrib-dup-test-chain-implicit"
   [junit4]   2> 1242715 INFO  (coreLoadExecutor-2622-thread-1-processing-n:127.0.0.1:49148_) [n:

[...truncated too long message...]

  [junit4]   2> 	at java.lang.Thread.run(Thread.java:745)
   [junit4]   2> 
   [junit4]   2> 1312390 INFO  (qtp736798845-5405) [n:127.0.0.1:49148_    ] o.a.s.s.SolrDispatchFilter [admin] webapp=null path=/admin/collections params={wt=javabin&collection=non_existent_collection&shard=non_existent_shard&action=SPLITSHARD&version=2} status=500 QTime=63247 
   [junit4]   2> 1312391 ERROR (qtp736798845-5405) [n:127.0.0.1:49148_    ] o.a.s.s.SolrDispatchFilter null:org.apache.zookeeper.KeeperException$SessionExpiredException: KeeperErrorCode = Session expired for /overseer/collection-queue-work/qnr-0000000010
   [junit4]   2> 	at org.apache.zookeeper.KeeperException.create(KeeperException.java:127)
   [junit4]   2> 	at org.apache.zookeeper.KeeperException.create(KeeperException.java:51)
   [junit4]   2> 	at org.apache.zookeeper.ZooKeeper.getData(ZooKeeper.java:1155)
   [junit4]   2> 	at org.apache.solr.common.cloud.SolrZkClient$7.execute(SolrZkClient.java:345)
   [junit4]   2> 	at org.apache.solr.common.cloud.SolrZkClient$7.execute(SolrZkClient.java:342)
   [junit4]   2> 	at org.apache.solr.common.cloud.ZkCmdExecutor.retryOperation(ZkCmdExecutor.java:61)
   [junit4]   2> 	at org.apache.solr.common.cloud.SolrZkClient.getData(SolrZkClient.java:342)
   [junit4]   2> 	at org.apache.solr.cloud.DistributedQueue.offer(DistributedQueue.java:412)
   [junit4]   2> 	at org.apache.solr.handler.admin.CollectionsHandler.handleResponse(CollectionsHandler.java:226)
   [junit4]   2> 	at org.apache.solr.handler.admin.CollectionsHandler.handleRequestBody(CollectionsHandler.java:170)
   [junit4]   2> 	at org.apache.solr.handler.RequestHandlerBase.handleRequest(RequestHandlerBase.java:143)
   [junit4]   2> 	at org.apache.solr.servlet.HttpSolrCall.handleAdminRequest(HttpSolrCall.java:678)
   [junit4]   2> 	at org.apache.solr.servlet.HttpSolrCall.call(HttpSolrCall.java:444)
   [junit4]   2> 	at org.apache.solr.servlet.SolrDispatchFilter.doFilter(SolrDispatchFilter.java:215)
   [junit4]   2> 	at org.apache.solr.servlet.SolrDispatchFilter.doFilter(SolrDispatchFilter.java:179)
   [junit4]   2> 	at org.eclipse.jetty.servlet.ServletHandler$CachedChain.doFilter(ServletHandler.java:1652)
   [junit4]   2> 	at org.apache.solr.client.solrj.embedded.JettySolrRunner$DebugFilter.doFilter(JettySolrRunner.java:109)
   [junit4]   2> 	at org.eclipse.jetty.servlet.ServletHandler$CachedChain.doFilter(ServletHandler.java:1652)
   [junit4]   2> 	at org.eclipse.jetty.servlets.UserAgentFilter.doFilter(UserAgentFilter.java:83)
   [junit4]   2> 	at org.eclipse.jetty.servlets.GzipFilter.doFilter(GzipFilter.java:364)
   [junit4]   2> 	at org.eclipse.jetty.servlet.ServletHandler$CachedChain.doFilter(ServletHandler.java:1652)
   [junit4]   2> 	at org.eclipse.jetty.servlet.ServletHandler.doHandle(ServletHandler.java:585)
   [junit4]   2> 	at org.eclipse.jetty.server.session.SessionHandler.doHandle(SessionHandler.java:221)
   [junit4]   2> 	at org.eclipse.jetty.server.handler.ContextHandler.doHandle(ContextHandler.java:1127)
   [junit4]   2> 	at org.eclipse.jetty.servlet.ServletHandler.doScope(ServletHandler.java:515)
   [junit4]   2> 	at org.eclipse.jetty.server.session.SessionHandler.doScope(SessionHandler.java:185)
   [junit4]   2> 	at org.eclipse.jetty.server.handler.ContextHandler.doScope(ContextHandler.java:1061)
   [junit4]   2> 	at org.eclipse.jetty.server.handler.ScopedHandler.handle(ScopedHandler.java:141)
   [junit4]   2> 	at org.eclipse.jetty.server.handler.HandlerWrapper.handle(HandlerWrapper.java:97)
   [junit4]   2> 	at org.eclipse.jetty.server.Server.handle(Server.java:499)
   [junit4]   2> 	at org.eclipse.jetty.server.HttpChannel.handle(HttpChannel.java:310)
   [junit4]   2> 	at org.eclipse.jetty.server.HttpConnection.onFillable(HttpConnection.java:257)
   [junit4]   2> 	at org.eclipse.jetty.io.AbstractConnection$2.run(AbstractConnection.java:540)
   [junit4]   2> 	at org.eclipse.jetty.util.thread.QueuedThreadPool.runJob(QueuedThreadPool.java:635)
   [junit4]   2> 	at org.eclipse.jetty.util.thread.QueuedThreadPool$3.run(QueuedThreadPool.java:555)
   [junit4]   2> 	at java.lang.Thread.run(Thread.java:745)
   [junit4]   2> 
   [junit4]   2> 1312396 INFO  (TEST-OverseerStatusTest.test-seed#[B7A9B1CA329179CE]) [    ] o.e.j.s.ServerConnector Stopped ServerConnector@54a5bdc7{HTTP/1.1}{127.0.0.1:0}
   [junit4]   2> 1312397 INFO  (TEST-OverseerStatusTest.test-seed#[B7A9B1CA329179CE]) [    ] o.e.j.s.h.ContextHandler Stopped o.e.j.s.ServletContextHandler@182d85b7{/,null,UNAVAILABLE}
   [junit4]   2> 1312399 INFO  (TEST-OverseerStatusTest.test-seed#[B7A9B1CA329179CE]) [n:127.0.0.1:49148_ c:collection1 s:shard1 r:core_node1 x:collection1] o.a.s.c.ZkTestServer connecting to 127.0.0.1:36866 36866
   [junit4]   2> 1312574 INFO  (Thread-2362) [    ] o.a.s.c.ZkTestServer connecting to 127.0.0.1:36866 36866
   [junit4]   2> 1312577 WARN  (Thread-2362) [    ] o.a.s.c.ZkTestServer Watch limit violations: 
   [junit4]   2> Maximum concurrent create/delete watches above limit:
   [junit4]   2> 
   [junit4]   2> 	3	/solr/clusterstate.json
   [junit4]   2> 	3	/solr/aliases.json
   [junit4]   2> 	2	/solr/security.json
   [junit4]   2> 	2	/solr/configs/conf1
   [junit4]   2> 
   [junit4]   2> Maximum concurrent children watches above limit:
   [junit4]   2> 
   [junit4]   2> 	3	/solr/live_nodes
   [junit4]   2> 	2	/solr/overseer/collection-queue-work
   [junit4]   2> 	2	/solr/overseer/queue
   [junit4]   2> 
   [junit4]   2> NOTE: reproduce with: ant test  -Dtestcase=OverseerStatusTest -Dtests.method=test -Dtests.seed=B7A9B1CA329179CE -Dtests.multiplier=2 -Dtests.slow=true -Dtests.locale=ar_KW -Dtests.timezone=America/Mexico_City -Dtests.asserts=true -Dtests.file.encoding=US-ASCII
   [junit4] FAILURE 75.4s J0 | OverseerStatusTest.test <<<
   [junit4]    > Throwable #1: java.lang.AssertionError: No stats for split in OverseerCollectionProcessor expected:<1> but was:<2>
   [junit4]    > 	at __randomizedtesting.SeedInfo.seed([B7A9B1CA329179CE:3FFD8E109C6D1436]:0)
   [junit4]    > 	at org.apache.solr.cloud.OverseerStatusTest.test(OverseerStatusTest.java:91)
   [junit4]    > 	at org.apache.solr.BaseDistributedSearchTestCase$ShardsRepeatRule$ShardsFixedStatement.callStatement(BaseDistributedSearchTestCase.java:963)
   [junit4]    > 	at org.apache.solr.BaseDistributedSearchTestCase$ShardsRepeatRule$ShardsStatement.evaluate(BaseDistributedSearchTestCase.java:938)
   [junit4]    > 	at java.lang.Thread.run(Thread.java:745)
   [junit4]   2> 1312585 INFO  (SUITE-OverseerStatusTest-seed#[B7A9B1CA329179CE]-worker) [n:127.0.0.1:49148_ c:collection1 s:shard1 r:core_node1 x:collection1] o.a.s.SolrTestCaseJ4 ###deleteCore
   [junit4]   2> NOTE: leaving temporary files on disk at: /x1/jenkins/jenkins-slave/workspace/Lucene-Solr-Tests-5.3-Java7/solr/build/solr-core/test/J0/temp/solr.cloud.OverseerStatusTest_B7A9B1CA329179CE-001
   [junit4]   2> Jan 19, 2016 11:23:41 PM com.carrotsearch.randomizedtesting.ThreadLeakControl checkThreadLeaks
   [junit4]   2> WARNING: Will linger awaiting termination of 1 leaked thread(s).
   [junit4]   2> NOTE: test params are: codec=Asserting(Lucene53), sim=RandomSimilarityProvider(queryNorm=true,coord=no): {}, locale=ar_KW, timezone=America/Mexico_City
   [junit4]   2> NOTE: Linux 3.13.0-52-generic amd64/Oracle Corporation 1.7.0_80 (64-bit)/cpus=4,threads=1,free=243962880,total=483393536
   [junit4]   2> NOTE: All tests run in this JVM: [MBeansHandlerTest, RulesTest, TestFaceting, TestFieldTypeResource, TestManagedSchema, RequestLoggingTest, SuggesterFSTTest, TestSolr4Spatial2, TestDistribIDF, TestDistributedSearch, TestReRankQParserPlugin, AsyncCallRequestStatusResponseTest, TestHashQParserPlugin, DistributedSpellCheckComponentTest, MigrateRouteKeyTest, TestInfoStreamLogging, CursorPagingTest, TermsComponentTest, ClusterStateTest, TestCSVLoader, TermVectorComponentTest, TestBlobHandler, SolrIndexConfigTest, TestNRTOpen, TestRandomDVFaceting, BasicDistributedZkTest, TestCloudManagedSchema, TestUpdate, LeaderInitiatedRecoveryOnCommitTest, TestSortByMinMaxFunction, TestPostingsSolrHighlighter, SignatureUpdateProcessorFactoryTest, TestDocumentBuilder, TestSweetSpotSimilarityFactory, CursorMarkTest, UUIDFieldTest, BasicZkTest, TestReplicationHandler, CustomCollectionTest, TestOverriddenPrefixQueryForCustomFieldType, UpdateRequestProcessorFactoryTest, TestArbitraryIndexDir, TestIntervalFaceting, TestIndexingPerformance, MultiTermTest, SimplePostToolTest, TestSerializedLuceneMatchVersion, TestReqParamsAPI, UniqFieldsUpdateProcessorFactoryTest, TestMiniSolrCloudClusterSSL, TestSolrIndexConfig, TestSolrCloudWithKerberosAlt, OverseerStatusTest]
   [junit4] Completed [175/533] on J0 in 75.71s, 1 test, 1 failure <<< FAILURES!

[...truncated 1162 lines...]
BUILD FAILED
/x1/jenkins/jenkins-slave/workspace/Lucene-Solr-Tests-5.3-Java7/build.xml:726: The following error occurred while executing this line:
/x1/jenkins/jenkins-slave/workspace/Lucene-Solr-Tests-5.3-Java7/build.xml:670: The following error occurred while executing this line:
/x1/jenkins/jenkins-slave/workspace/Lucene-Solr-Tests-5.3-Java7/build.xml:59: The following error occurred while executing this line:
/x1/jenkins/jenkins-slave/workspace/Lucene-Solr-Tests-5.3-Java7/solr/build.xml:230: The following error occurred while executing this line:
/x1/jenkins/jenkins-slave/workspace/Lucene-Solr-Tests-5.3-Java7/solr/common-build.xml:524: The following error occurred while executing this line:
/x1/jenkins/jenkins-slave/workspace/Lucene-Solr-Tests-5.3-Java7/lucene/common-build.xml:1449: The following error occurred while executing this line:
/x1/jenkins/jenkins-slave/workspace/Lucene-Solr-Tests-5.3-Java7/lucene/common-build.xml:1003: There were test failures: 533 suites, 2104 tests, 1 failure, 42 ignored (30 assumptions)

Total time: 108 minutes 53 seconds
Build step 'Invoke Ant' marked build as failure
Archiving artifacts
Recording test results
Email was triggered for: Failure - Any
Sending email for trigger: Failure - Any



Mime
View raw message