lucene-dev mailing list archives

Site index · List index
Message view « Date » · « Thread »
Top « Date » · « Thread »
From Policeman Jenkins Server <jenk...@thetaphi.de>
Subject [JENKINS] Lucene-Solr-trunk-Linux (64bit/jdk1.8.0_66) - Build # 15482 - Still Failing!
Date Fri, 08 Jan 2016 12:54:43 GMT
Build: http://jenkins.thetaphi.de/job/Lucene-Solr-trunk-Linux/15482/
Java: 64bit/jdk1.8.0_66 -XX:-UseCompressedOops -XX:+UseConcMarkSweepGC

2 tests failed.
FAILED:  org.apache.lucene.index.TestDuelingCodecs.testCrazyReaderEquals

Error Message:
string [80 0 1 26]max value [80 0 1 3d]  block fp 0 was not created from BytesRef.toString?

Stack Trace:
java.lang.IllegalArgumentException: string [80 0 1 26]max value [80 0 1 3d]  block fp 0 was
not created from BytesRef.toString?
	at org.apache.lucene.codecs.simpletext.SimpleTextUtil.fromBytesRefString(SimpleTextUtil.java:106)
	at org.apache.lucene.codecs.simpletext.SimpleTextDimensionalReader.initReader(SimpleTextDimensionalReader.java:97)
	at org.apache.lucene.codecs.simpletext.SimpleTextDimensionalReader.<init>(SimpleTextDimensionalReader.java:73)
	at org.apache.lucene.codecs.simpletext.SimpleTextDimensionalFormat.fieldsReader(SimpleTextDimensionalFormat.java:45)
	at org.apache.lucene.index.SegmentCoreReaders.<init>(SegmentCoreReaders.java:128)
	at org.apache.lucene.index.SegmentReader.<init>(SegmentReader.java:66)
	at org.apache.lucene.index.StandardDirectoryReader$1.doBody(StandardDirectoryReader.java:58)
	at org.apache.lucene.index.StandardDirectoryReader$1.doBody(StandardDirectoryReader.java:50)
	at org.apache.lucene.index.SegmentInfos$FindSegmentsFile.run(SegmentInfos.java:671)
	at org.apache.lucene.index.StandardDirectoryReader.open(StandardDirectoryReader.java:73)
	at org.apache.lucene.index.DirectoryReader.open(DirectoryReader.java:63)
	at org.apache.lucene.index.RandomIndexWriter.getReader(RandomIndexWriter.java:375)
	at org.apache.lucene.index.RandomIndexWriter.getReader(RandomIndexWriter.java:305)
	at org.apache.lucene.index.TestDuelingCodecs.testCrazyReaderEquals(TestDuelingCodecs.java:165)
	at sun.reflect.NativeMethodAccessorImpl.invoke0(Native Method)
	at sun.reflect.NativeMethodAccessorImpl.invoke(NativeMethodAccessorImpl.java:62)
	at sun.reflect.DelegatingMethodAccessorImpl.invoke(DelegatingMethodAccessorImpl.java:43)
	at java.lang.reflect.Method.invoke(Method.java:497)
	at com.carrotsearch.randomizedtesting.RandomizedRunner.invoke(RandomizedRunner.java:1764)
	at com.carrotsearch.randomizedtesting.RandomizedRunner$8.evaluate(RandomizedRunner.java:871)
	at com.carrotsearch.randomizedtesting.RandomizedRunner$9.evaluate(RandomizedRunner.java:907)
	at com.carrotsearch.randomizedtesting.RandomizedRunner$10.evaluate(RandomizedRunner.java:921)
	at org.apache.lucene.util.TestRuleSetupTeardownChained$1.evaluate(TestRuleSetupTeardownChained.java:50)
	at org.apache.lucene.util.AbstractBeforeAfterRule$1.evaluate(AbstractBeforeAfterRule.java:46)
	at org.apache.lucene.util.TestRuleThreadAndTestName$1.evaluate(TestRuleThreadAndTestName.java:49)
	at org.apache.lucene.util.TestRuleIgnoreAfterMaxFailures$1.evaluate(TestRuleIgnoreAfterMaxFailures.java:65)
	at org.apache.lucene.util.TestRuleMarkFailure$1.evaluate(TestRuleMarkFailure.java:48)
	at com.carrotsearch.randomizedtesting.rules.StatementAdapter.evaluate(StatementAdapter.java:36)
	at com.carrotsearch.randomizedtesting.ThreadLeakControl$StatementRunner.run(ThreadLeakControl.java:367)
	at com.carrotsearch.randomizedtesting.ThreadLeakControl.forkTimeoutingTask(ThreadLeakControl.java:809)
	at com.carrotsearch.randomizedtesting.ThreadLeakControl$3.evaluate(ThreadLeakControl.java:460)
	at com.carrotsearch.randomizedtesting.RandomizedRunner.runSingleTest(RandomizedRunner.java:880)
	at com.carrotsearch.randomizedtesting.RandomizedRunner$5.evaluate(RandomizedRunner.java:781)
	at com.carrotsearch.randomizedtesting.RandomizedRunner$6.evaluate(RandomizedRunner.java:816)
	at com.carrotsearch.randomizedtesting.RandomizedRunner$7.evaluate(RandomizedRunner.java:827)
	at org.apache.lucene.util.AbstractBeforeAfterRule$1.evaluate(AbstractBeforeAfterRule.java:46)
	at com.carrotsearch.randomizedtesting.rules.StatementAdapter.evaluate(StatementAdapter.java:36)
	at org.apache.lucene.util.TestRuleStoreClassName$1.evaluate(TestRuleStoreClassName.java:42)
	at com.carrotsearch.randomizedtesting.rules.NoShadowingOrOverridesOnMethodsRule$1.evaluate(NoShadowingOrOverridesOnMethodsRule.java:40)
	at com.carrotsearch.randomizedtesting.rules.NoShadowingOrOverridesOnMethodsRule$1.evaluate(NoShadowingOrOverridesOnMethodsRule.java:40)
	at com.carrotsearch.randomizedtesting.rules.StatementAdapter.evaluate(StatementAdapter.java:36)
	at com.carrotsearch.randomizedtesting.rules.StatementAdapter.evaluate(StatementAdapter.java:36)
	at com.carrotsearch.randomizedtesting.rules.StatementAdapter.evaluate(StatementAdapter.java:36)
	at org.apache.lucene.util.TestRuleAssertionsRequired$1.evaluate(TestRuleAssertionsRequired.java:54)
	at org.apache.lucene.util.TestRuleMarkFailure$1.evaluate(TestRuleMarkFailure.java:48)
	at org.apache.lucene.util.TestRuleIgnoreAfterMaxFailures$1.evaluate(TestRuleIgnoreAfterMaxFailures.java:65)
	at org.apache.lucene.util.TestRuleIgnoreTestSuites$1.evaluate(TestRuleIgnoreTestSuites.java:55)
	at com.carrotsearch.randomizedtesting.rules.StatementAdapter.evaluate(StatementAdapter.java:36)
	at com.carrotsearch.randomizedtesting.ThreadLeakControl$StatementRunner.run(ThreadLeakControl.java:367)
	at java.lang.Thread.run(Thread.java:745)


FAILED:  org.apache.lucene.index.TestDuelingCodecs.testEquals

Error Message:
string [80 0 0 0]max value [80 0 1 48]  block fp 0 was not created from BytesRef.toString?

Stack Trace:
java.lang.IllegalArgumentException: string [80 0 0 0]max value [80 0 1 48]  block fp 0 was
not created from BytesRef.toString?
	at org.apache.lucene.codecs.simpletext.SimpleTextUtil.fromBytesRefString(SimpleTextUtil.java:106)
	at org.apache.lucene.codecs.simpletext.SimpleTextDimensionalReader.initReader(SimpleTextDimensionalReader.java:97)
	at org.apache.lucene.codecs.simpletext.SimpleTextDimensionalReader.<init>(SimpleTextDimensionalReader.java:73)
	at org.apache.lucene.codecs.simpletext.SimpleTextDimensionalFormat.fieldsReader(SimpleTextDimensionalFormat.java:45)
	at org.apache.lucene.index.SegmentCoreReaders.<init>(SegmentCoreReaders.java:128)
	at org.apache.lucene.index.SegmentReader.<init>(SegmentReader.java:66)
	at org.apache.lucene.index.ReadersAndUpdates.getReader(ReadersAndUpdates.java:145)
	at org.apache.lucene.index.ReadersAndUpdates.getReadOnlyClone(ReadersAndUpdates.java:197)
	at org.apache.lucene.index.StandardDirectoryReader.open(StandardDirectoryReader.java:99)
	at org.apache.lucene.index.IndexWriter.getReader(IndexWriter.java:434)
	at org.apache.lucene.index.RandomIndexWriter.getReader(RandomIndexWriter.java:368)
	at org.apache.lucene.index.RandomIndexWriter.getReader(RandomIndexWriter.java:305)
	at org.apache.lucene.index.TestDuelingCodecs.testEquals(TestDuelingCodecs.java:154)
	at sun.reflect.NativeMethodAccessorImpl.invoke0(Native Method)
	at sun.reflect.NativeMethodAccessorImpl.invoke(NativeMethodAccessorImpl.java:62)
	at sun.reflect.DelegatingMethodAccessorImpl.invoke(DelegatingMethodAccessorImpl.java:43)
	at java.lang.reflect.Method.invoke(Method.java:497)
	at com.carrotsearch.randomizedtesting.RandomizedRunner.invoke(RandomizedRunner.java:1764)
	at com.carrotsearch.randomizedtesting.RandomizedRunner$8.evaluate(RandomizedRunner.java:871)
	at com.carrotsearch.randomizedtesting.RandomizedRunner$9.evaluate(RandomizedRunner.java:907)
	at com.carrotsearch.randomizedtesting.RandomizedRunner$10.evaluate(RandomizedRunner.java:921)
	at org.apache.lucene.util.TestRuleSetupTeardownChained$1.evaluate(TestRuleSetupTeardownChained.java:50)
	at org.apache.lucene.util.AbstractBeforeAfterRule$1.evaluate(AbstractBeforeAfterRule.java:46)
	at org.apache.lucene.util.TestRuleThreadAndTestName$1.evaluate(TestRuleThreadAndTestName.java:49)
	at org.apache.lucene.util.TestRuleIgnoreAfterMaxFailures$1.evaluate(TestRuleIgnoreAfterMaxFailures.java:65)
	at org.apache.lucene.util.TestRuleMarkFailure$1.evaluate(TestRuleMarkFailure.java:48)
	at com.carrotsearch.randomizedtesting.rules.StatementAdapter.evaluate(StatementAdapter.java:36)
	at com.carrotsearch.randomizedtesting.ThreadLeakControl$StatementRunner.run(ThreadLeakControl.java:367)
	at com.carrotsearch.randomizedtesting.ThreadLeakControl.forkTimeoutingTask(ThreadLeakControl.java:809)
	at com.carrotsearch.randomizedtesting.ThreadLeakControl$3.evaluate(ThreadLeakControl.java:460)
	at com.carrotsearch.randomizedtesting.RandomizedRunner.runSingleTest(RandomizedRunner.java:880)
	at com.carrotsearch.randomizedtesting.RandomizedRunner$5.evaluate(RandomizedRunner.java:781)
	at com.carrotsearch.randomizedtesting.RandomizedRunner$6.evaluate(RandomizedRunner.java:816)
	at com.carrotsearch.randomizedtesting.RandomizedRunner$7.evaluate(RandomizedRunner.java:827)
	at org.apache.lucene.util.AbstractBeforeAfterRule$1.evaluate(AbstractBeforeAfterRule.java:46)
	at com.carrotsearch.randomizedtesting.rules.StatementAdapter.evaluate(StatementAdapter.java:36)
	at org.apache.lucene.util.TestRuleStoreClassName$1.evaluate(TestRuleStoreClassName.java:42)
	at com.carrotsearch.randomizedtesting.rules.NoShadowingOrOverridesOnMethodsRule$1.evaluate(NoShadowingOrOverridesOnMethodsRule.java:40)
	at com.carrotsearch.randomizedtesting.rules.NoShadowingOrOverridesOnMethodsRule$1.evaluate(NoShadowingOrOverridesOnMethodsRule.java:40)
	at com.carrotsearch.randomizedtesting.rules.StatementAdapter.evaluate(StatementAdapter.java:36)
	at com.carrotsearch.randomizedtesting.rules.StatementAdapter.evaluate(StatementAdapter.java:36)
	at com.carrotsearch.randomizedtesting.rules.StatementAdapter.evaluate(StatementAdapter.java:36)
	at org.apache.lucene.util.TestRuleAssertionsRequired$1.evaluate(TestRuleAssertionsRequired.java:54)
	at org.apache.lucene.util.TestRuleMarkFailure$1.evaluate(TestRuleMarkFailure.java:48)
	at org.apache.lucene.util.TestRuleIgnoreAfterMaxFailures$1.evaluate(TestRuleIgnoreAfterMaxFailures.java:65)
	at org.apache.lucene.util.TestRuleIgnoreTestSuites$1.evaluate(TestRuleIgnoreTestSuites.java:55)
	at com.carrotsearch.randomizedtesting.rules.StatementAdapter.evaluate(StatementAdapter.java:36)
	at com.carrotsearch.randomizedtesting.ThreadLeakControl$StatementRunner.run(ThreadLeakControl.java:367)
	at java.lang.Thread.run(Thread.java:745)




Build Log:
[...truncated 311 lines...]
   [junit4] Suite: org.apache.lucene.index.TestDuelingCodecs
   [junit4]   2> NOTE: reproduce with: ant test  -Dtestcase=TestDuelingCodecs -Dtests.method=testCrazyReaderEquals
-Dtests.seed=1FA76715084CEE9F -Dtests.multiplier=3 -Dtests.slow=true -Dtests.locale=et -Dtests.timezone=Etc/GMT-6
-Dtests.asserts=true -Dtests.file.encoding=UTF-8
   [junit4] ERROR   2.37s J1 | TestDuelingCodecs.testCrazyReaderEquals <<<
   [junit4]    > Throwable #1: java.lang.IllegalArgumentException: string [80 0 1 26]max
value [80 0 1 3d]  block fp 0 was not created from BytesRef.toString?
   [junit4]    > 	at org.apache.lucene.codecs.simpletext.SimpleTextUtil.fromBytesRefString(SimpleTextUtil.java:106)
   [junit4]    > 	at org.apache.lucene.codecs.simpletext.SimpleTextDimensionalReader.initReader(SimpleTextDimensionalReader.java:97)
   [junit4]    > 	at org.apache.lucene.codecs.simpletext.SimpleTextDimensionalReader.<init>(SimpleTextDimensionalReader.java:73)
   [junit4]    > 	at org.apache.lucene.codecs.simpletext.SimpleTextDimensionalFormat.fieldsReader(SimpleTextDimensionalFormat.java:45)
   [junit4]    > 	at org.apache.lucene.index.SegmentCoreReaders.<init>(SegmentCoreReaders.java:128)
   [junit4]    > 	at org.apache.lucene.index.SegmentReader.<init>(SegmentReader.java:66)
   [junit4]    > 	at org.apache.lucene.index.StandardDirectoryReader$1.doBody(StandardDirectoryReader.java:58)
   [junit4]    > 	at org.apache.lucene.index.StandardDirectoryReader$1.doBody(StandardDirectoryReader.java:50)
   [junit4]    > 	at org.apache.lucene.index.SegmentInfos$FindSegmentsFile.run(SegmentInfos.java:671)
   [junit4]    > 	at org.apache.lucene.index.StandardDirectoryReader.open(StandardDirectoryReader.java:73)
   [junit4]    > 	at org.apache.lucene.index.DirectoryReader.open(DirectoryReader.java:63)
   [junit4]    > 	at org.apache.lucene.index.RandomIndexWriter.getReader(RandomIndexWriter.java:375)
   [junit4]    > 	at org.apache.lucene.index.RandomIndexWriter.getReader(RandomIndexWriter.java:305)
   [junit4]    > 	at org.apache.lucene.index.TestDuelingCodecs.testCrazyReaderEquals(TestDuelingCodecs.java:165)
   [junit4]    > 	at java.lang.Thread.run(Thread.java:745)Throwable #2: java.lang.IllegalArgumentException:
string [80 0 0 0]max value [80 0 0 8c]  block fp 0 was not created from BytesRef.toString?
   [junit4]    > 	at org.apache.lucene.codecs.simpletext.SimpleTextUtil.fromBytesRefString(SimpleTextUtil.java:106)
   [junit4]    > 	at org.apache.lucene.codecs.simpletext.SimpleTextDimensionalReader.initReader(SimpleTextDimensionalReader.java:97)
   [junit4]    > 	at org.apache.lucene.codecs.simpletext.SimpleTextDimensionalReader.<init>(SimpleTextDimensionalReader.java:73)
   [junit4]    > 	at org.apache.lucene.codecs.simpletext.SimpleTextDimensionalFormat.fieldsReader(SimpleTextDimensionalFormat.java:45)
   [junit4]    > 	at org.apache.lucene.index.SegmentCoreReaders.<init>(SegmentCoreReaders.java:128)
   [junit4]    > 	at org.apache.lucene.index.SegmentReader.<init>(SegmentReader.java:66)
   [junit4]    > 	at org.apache.lucene.index.CheckIndex.checkIndex(CheckIndex.java:667)
   [junit4]    > 	at org.apache.lucene.util.TestUtil.checkIndex(TestUtil.java:276)
   [junit4]    > 	at org.apache.lucene.store.MockDirectoryWrapper.close(MockDirectoryWrapper.java:793)
   [junit4]    > 	at org.apache.lucene.util.IOUtils.close(IOUtils.java:89)
   [junit4]    > 	at org.apache.lucene.util.IOUtils.close(IOUtils.java:76)
   [junit4]    > 	at org.apache.lucene.index.TestDuelingCodecs.tearDown(TestDuelingCodecs.java:98)
   [junit4]    > 	at java.lang.Thread.run(Thread.java:745)
   [junit4]   2> NOTE: reproduce with: ant test  -Dtestcase=TestDuelingCodecs -Dtests.method=testEquals
-Dtests.seed=1FA76715084CEE9F -Dtests.multiplier=3 -Dtests.slow=true -Dtests.locale=et -Dtests.timezone=Etc/GMT-6
-Dtests.asserts=true -Dtests.file.encoding=UTF-8
   [junit4] ERROR   2.07s J1 | TestDuelingCodecs.testEquals <<<
   [junit4]    > Throwable #1: java.lang.IllegalArgumentException: string [80 0 0 0]max
value [80 0 1 48]  block fp 0 was not created from BytesRef.toString?
   [junit4]    > 	at org.apache.lucene.codecs.simpletext.SimpleTextUtil.fromBytesRefString(SimpleTextUtil.java:106)
   [junit4]    > 	at org.apache.lucene.codecs.simpletext.SimpleTextDimensionalReader.initReader(SimpleTextDimensionalReader.java:97)
   [junit4]    > 	at org.apache.lucene.codecs.simpletext.SimpleTextDimensionalReader.<init>(SimpleTextDimensionalReader.java:73)
   [junit4]    > 	at org.apache.lucene.codecs.simpletext.SimpleTextDimensionalFormat.fieldsReader(SimpleTextDimensionalFormat.java:45)
   [junit4]    > 	at org.apache.lucene.index.SegmentCoreReaders.<init>(SegmentCoreReaders.java:128)
   [junit4]    > 	at org.apache.lucene.index.SegmentReader.<init>(SegmentReader.java:66)
   [junit4]    > 	at org.apache.lucene.index.ReadersAndUpdates.getReader(ReadersAndUpdates.java:145)
   [junit4]    > 	at org.apache.lucene.index.ReadersAndUpdates.getReadOnlyClone(ReadersAndUpdates.java:197)
   [junit4]    > 	at org.apache.lucene.index.StandardDirectoryReader.open(StandardDirectoryReader.java:99)
   [junit4]    > 	at org.apache.lucene.index.IndexWriter.getReader(IndexWriter.java:434)
   [junit4]    > 	at org.apache.lucene.index.RandomIndexWriter.getReader(RandomIndexWriter.java:368)
   [junit4]    > 	at org.apache.lucene.index.RandomIndexWriter.getReader(RandomIndexWriter.java:305)
   [junit4]    > 	at org.apache.lucene.index.TestDuelingCodecs.testEquals(TestDuelingCodecs.java:154)
   [junit4]    > 	at java.lang.Thread.run(Thread.java:745)Throwable #2: java.lang.RuntimeException:
MockDirectoryWrapper: cannot close: there are still open files: {_0.dim=1}
   [junit4]    > 	at org.apache.lucene.store.MockDirectoryWrapper.close(MockDirectoryWrapper.java:771)
   [junit4]    > 	at org.apache.lucene.util.IOUtils.close(IOUtils.java:89)
   [junit4]    > 	at org.apache.lucene.util.IOUtils.close(IOUtils.java:76)
   [junit4]    > 	at org.apache.lucene.index.TestDuelingCodecs.tearDown(TestDuelingCodecs.java:98)
   [junit4]    > 	at java.lang.Thread.run(Thread.java:745)
   [junit4]    > Caused by: java.lang.RuntimeException: unclosed IndexInput: _0.dim
   [junit4]    > 	at org.apache.lucene.store.MockDirectoryWrapper.addFileHandle(MockDirectoryWrapper.java:659)
   [junit4]    > 	at org.apache.lucene.store.MockDirectoryWrapper.openInput(MockDirectoryWrapper.java:703)
   [junit4]    > 	at org.apache.lucene.codecs.simpletext.SimpleTextDimensionalReader.<init>(SimpleTextDimensionalReader.java:63)
   [junit4]    > 	at org.apache.lucene.codecs.simpletext.SimpleTextDimensionalFormat.fieldsReader(SimpleTextDimensionalFormat.java:45)
   [junit4]    > 	at org.apache.lucene.index.SegmentCoreReaders.<init>(SegmentCoreReaders.java:128)
   [junit4]    > 	at org.apache.lucene.index.SegmentReader.<init>(SegmentReader.java:66)
   [junit4]    > 	at org.apache.lucene.index.ReadersAndUpdates.getReader(ReadersAndUpdates.java:145)
   [junit4]    > 	at org.apache.lucene.index.ReadersAndUpdates.getReadOnlyClone(ReadersAndUpdates.java:197)
   [junit4]    > 	at org.apache.lucene.index.StandardDirectoryReader.open(StandardDirectoryReader.java:99)
   [junit4]    > 	at org.apache.lucene.index.IndexWriter.getReader(IndexWriter.java:434)
   [junit4]    > 	at org.apache.lucene.index.RandomIndexWriter.getReader(RandomIndexWriter.java:368)
   [junit4]    > 	at org.apache.lucene.index.RandomIndexWriter.getReader(RandomIndexWriter.java:305)
   [junit4]    > 	at org.apache.lucene.index.TestDuelingCodecs.testEquals(TestDuelingCodecs.java:154)
   [junit4]    > 	... 28 more
   [junit4]   2> NOTE: leaving temporary files on disk at: /home/jenkins/workspace/Lucene-Solr-trunk-Linux/lucene/build/core/test/J1/temp/lucene.index.TestDuelingCodecs_1FA76715084CEE9F-001
   [junit4]   2> NOTE: test params are: codec=Asserting(Lucene60), sim=RandomSimilarityProvider(queryNorm=false,coord=no):
{titleTokenized=DFR GL3(800.0), body=DFR I(F)L3(800.0)}, locale=et, timezone=Etc/GMT-6
   [junit4]   2> NOTE: Linux 3.19.0-42-generic amd64/Oracle Corporation 1.8.0_66 (64-bit)/cpus=12,threads=1,free=359516576,total=508887040
   [junit4]   2> NOTE: All tests run in this JVM: [TestRAMDirectory, TestSpanTermQuery,
TestSpanExplanations, TestDocsAndPositions, TestAllFilesHaveCodecHeader, TestLucene50SegmentInfoFormat,
TestReadOnlyIndex, TestSameScoresWithThreads, TestNot, Test2BPostings, TestFilterLeafReader,
TestNoMergeScheduler, TestStringHelper, TestForUtil, TestFileSwitchDirectory, TestBlockPostingsFormat,
TestApproximationSearchEquivalence, TestDuelingCodecs]
   [junit4] Completed [37/404 (1!)] on J1 in 4.45s, 2 tests, 2 errors <<< FAILURES!

[...truncated 1204 lines...]
BUILD FAILED
/home/jenkins/workspace/Lucene-Solr-trunk-Linux/build.xml:784: The following error occurred
while executing this line:
/home/jenkins/workspace/Lucene-Solr-trunk-Linux/build.xml:728: The following error occurred
while executing this line:
/home/jenkins/workspace/Lucene-Solr-trunk-Linux/build.xml:59: The following error occurred
while executing this line:
/home/jenkins/workspace/Lucene-Solr-trunk-Linux/lucene/build.xml:50: The following error occurred
while executing this line:
/home/jenkins/workspace/Lucene-Solr-trunk-Linux/lucene/common-build.xml:1424: The following
error occurred while executing this line:
/home/jenkins/workspace/Lucene-Solr-trunk-Linux/lucene/common-build.xml:981: There were test
failures: 404 suites (1 ignored), 3320 tests, 2 errors, 55 ignored (51 assumptions) [seed:
1FA76715084CEE9F]

Total time: 7 minutes 8 seconds
Build step 'Invoke Ant' marked build as failure
Archiving artifacts
[WARNINGS] Skipping publisher since build result is FAILURE
Recording test results
Email was triggered for: Failure - Any
Sending email for trigger: Failure - Any



Mime
View raw message