lucene-dev mailing list archives

Site index · List index
Message view « Date » · « Thread »
Top « Date » · « Thread »
From Policeman Jenkins Server <jenk...@thetaphi.de>
Subject [JENKINS] Lucene-Solr-trunk-Linux (64bit/jdk1.8.0_66) - Build # 15544 - Still Failing!
Date Wed, 13 Jan 2016 19:16:59 GMT
Build: http://jenkins.thetaphi.de/job/Lucene-Solr-trunk-Linux/15544/
Java: 64bit/jdk1.8.0_66 -XX:+UseCompressedOops -XX:+UseParallelGC

3 tests failed.
FAILED:  junit.framework.TestSuite.org.apache.solr.core.TestLazyCores

Error Message:
ObjectTracker found 4 object(s) that were not released!!! [SolrCore, MockDirectoryWrapper, MDCAwareThreadPoolExecutor, MockDirectoryWrapper]

Stack Trace:
java.lang.AssertionError: ObjectTracker found 4 object(s) that were not released!!! [SolrCore, MockDirectoryWrapper, MDCAwareThreadPoolExecutor, MockDirectoryWrapper]
	at __randomizedtesting.SeedInfo.seed([25CDB97A93D1D5AE]:0)
	at org.junit.Assert.fail(Assert.java:93)
	at org.junit.Assert.assertTrue(Assert.java:43)
	at org.junit.Assert.assertNull(Assert.java:551)
	at org.apache.solr.SolrTestCaseJ4.afterClass(SolrTestCaseJ4.java:229)
	at sun.reflect.GeneratedMethodAccessor21.invoke(Unknown Source)
	at sun.reflect.DelegatingMethodAccessorImpl.invoke(DelegatingMethodAccessorImpl.java:43)
	at java.lang.reflect.Method.invoke(Method.java:497)
	at com.carrotsearch.randomizedtesting.RandomizedRunner.invoke(RandomizedRunner.java:1764)
	at com.carrotsearch.randomizedtesting.RandomizedRunner$7.evaluate(RandomizedRunner.java:834)
	at com.carrotsearch.randomizedtesting.rules.StatementAdapter.evaluate(StatementAdapter.java:36)
	at com.carrotsearch.randomizedtesting.rules.SystemPropertiesRestoreRule$1.evaluate(SystemPropertiesRestoreRule.java:57)
	at org.apache.lucene.util.AbstractBeforeAfterRule$1.evaluate(AbstractBeforeAfterRule.java:46)
	at com.carrotsearch.randomizedtesting.rules.StatementAdapter.evaluate(StatementAdapter.java:36)
	at org.apache.lucene.util.TestRuleStoreClassName$1.evaluate(TestRuleStoreClassName.java:42)
	at com.carrotsearch.randomizedtesting.rules.NoShadowingOrOverridesOnMethodsRule$1.evaluate(NoShadowingOrOverridesOnMethodsRule.java:40)
	at com.carrotsearch.randomizedtesting.rules.NoShadowingOrOverridesOnMethodsRule$1.evaluate(NoShadowingOrOverridesOnMethodsRule.java:40)
	at com.carrotsearch.randomizedtesting.rules.StatementAdapter.evaluate(StatementAdapter.java:36)
	at com.carrotsearch.randomizedtesting.rules.StatementAdapter.evaluate(StatementAdapter.java:36)
	at com.carrotsearch.randomizedtesting.rules.StatementAdapter.evaluate(StatementAdapter.java:36)
	at org.apache.lucene.util.TestRuleAssertionsRequired$1.evaluate(TestRuleAssertionsRequired.java:54)
	at org.apache.lucene.util.TestRuleMarkFailure$1.evaluate(TestRuleMarkFailure.java:48)
	at org.apache.lucene.util.TestRuleIgnoreAfterMaxFailures$1.evaluate(TestRuleIgnoreAfterMaxFailures.java:65)
	at org.apache.lucene.util.TestRuleIgnoreTestSuites$1.evaluate(TestRuleIgnoreTestSuites.java:55)
	at com.carrotsearch.randomizedtesting.rules.StatementAdapter.evaluate(StatementAdapter.java:36)
	at com.carrotsearch.randomizedtesting.ThreadLeakControl$StatementRunner.run(ThreadLeakControl.java:367)
	at java.lang.Thread.run(Thread.java:745)


FAILED:  junit.framework.TestSuite.org.apache.solr.core.TestLazyCores

Error Message:
1 thread leaked from SUITE scope at org.apache.solr.core.TestLazyCores:     1) Thread[id=8480, name=searcherExecutor-4335-thread-1, state=WAITING, group=TGRP-TestLazyCores]         at sun.misc.Unsafe.park(Native Method)         at java.util.concurrent.locks.LockSupport.park(LockSupport.java:175)         at java.util.concurrent.locks.AbstractQueuedSynchronizer$ConditionObject.await(AbstractQueuedSynchronizer.java:2039)         at java.util.concurrent.LinkedBlockingQueue.take(LinkedBlockingQueue.java:442)         at java.util.concurrent.ThreadPoolExecutor.getTask(ThreadPoolExecutor.java:1067)         at java.util.concurrent.ThreadPoolExecutor.runWorker(ThreadPoolExecutor.java:1127)         at java.util.concurrent.ThreadPoolExecutor$Worker.run(ThreadPoolExecutor.java:617)         at java.lang.Thread.run(Thread.java:745)

Stack Trace:
com.carrotsearch.randomizedtesting.ThreadLeakError: 1 thread leaked from SUITE scope at org.apache.solr.core.TestLazyCores: 
   1) Thread[id=8480, name=searcherExecutor-4335-thread-1, state=WAITING, group=TGRP-TestLazyCores]
        at sun.misc.Unsafe.park(Native Method)
        at java.util.concurrent.locks.LockSupport.park(LockSupport.java:175)
        at java.util.concurrent.locks.AbstractQueuedSynchronizer$ConditionObject.await(AbstractQueuedSynchronizer.java:2039)
        at java.util.concurrent.LinkedBlockingQueue.take(LinkedBlockingQueue.java:442)
        at java.util.concurrent.ThreadPoolExecutor.getTask(ThreadPoolExecutor.java:1067)
        at java.util.concurrent.ThreadPoolExecutor.runWorker(ThreadPoolExecutor.java:1127)
        at java.util.concurrent.ThreadPoolExecutor$Worker.run(ThreadPoolExecutor.java:617)
        at java.lang.Thread.run(Thread.java:745)
	at __randomizedtesting.SeedInfo.seed([25CDB97A93D1D5AE]:0)


FAILED:  junit.framework.TestSuite.org.apache.solr.core.TestLazyCores

Error Message:
There are still zombie threads that couldn't be terminated:    1) Thread[id=8480, name=searcherExecutor-4335-thread-1, state=WAITING, group=TGRP-TestLazyCores]         at sun.misc.Unsafe.park(Native Method)         at java.util.concurrent.locks.LockSupport.park(LockSupport.java:175)         at java.util.concurrent.locks.AbstractQueuedSynchronizer$ConditionObject.await(AbstractQueuedSynchronizer.java:2039)         at java.util.concurrent.LinkedBlockingQueue.take(LinkedBlockingQueue.java:442)         at java.util.concurrent.ThreadPoolExecutor.getTask(ThreadPoolExecutor.java:1067)         at java.util.concurrent.ThreadPoolExecutor.runWorker(ThreadPoolExecutor.java:1127)         at java.util.concurrent.ThreadPoolExecutor$Worker.run(ThreadPoolExecutor.java:617)         at java.lang.Thread.run(Thread.java:745)

Stack Trace:
com.carrotsearch.randomizedtesting.ThreadLeakError: There are still zombie threads that couldn't be terminated:
   1) Thread[id=8480, name=searcherExecutor-4335-thread-1, state=WAITING, group=TGRP-TestLazyCores]
        at sun.misc.Unsafe.park(Native Method)
        at java.util.concurrent.locks.LockSupport.park(LockSupport.java:175)
        at java.util.concurrent.locks.AbstractQueuedSynchronizer$ConditionObject.await(AbstractQueuedSynchronizer.java:2039)
        at java.util.concurrent.LinkedBlockingQueue.take(LinkedBlockingQueue.java:442)
        at java.util.concurrent.ThreadPoolExecutor.getTask(ThreadPoolExecutor.java:1067)
        at java.util.concurrent.ThreadPoolExecutor.runWorker(ThreadPoolExecutor.java:1127)
        at java.util.concurrent.ThreadPoolExecutor$Worker.run(ThreadPoolExecutor.java:617)
        at java.lang.Thread.run(Thread.java:745)
	at __randomizedtesting.SeedInfo.seed([25CDB97A93D1D5AE]:0)




Build Log:
[...truncated 10800 lines...]
   [junit4] Suite: org.apache.solr.core.TestLazyCores
   [junit4]   2> Creating dataDir: /home/jenkins/workspace/Lucene-Solr-trunk-Linux/solr/build/solr-core/test/J0/temp/solr.core.TestLazyCores_25CDB97A93D1D5AE-001/init-core-data-001
   [junit4]   2> 937722 INFO  (SUITE-TestLazyCores-seed#[25CDB97A93D1D5AE]-worker) [    ] o.a.s.SolrTestCaseJ4 Randomized ssl (false) and clientAuth (false)
   [junit4]   2> 937723 INFO  (TEST-TestLazyCores.testCreateTransientFromAdmin-seed#[25CDB97A93D1D5AE]) [    ] o.a.s.SolrTestCaseJ4 ###Starting testCreateTransientFromAdmin
   [junit4]   2> 937733 INFO  (TEST-TestLazyCores.testCreateTransientFromAdmin-seed#[25CDB97A93D1D5AE]) [    ] o.a.s.c.SolrResourceLoader new SolrResourceLoader for directory: '/home/jenkins/workspace/Lucene-Solr-trunk-Linux/solr/build/solr-core/test/J0/temp/solr.core.TestLazyCores_25CDB97A93D1D5AE-001/tempDir-001'
   [junit4]   2> 937733 INFO  (TEST-TestLazyCores.testCreateTransientFromAdmin-seed#[25CDB97A93D1D5AE]) [    ] o.a.s.c.SolrResourceLoader JNDI not configured for solr (NoInitialContextEx)
   [junit4]   2> 937733 INFO  (TEST-TestLazyCores.testCreateTransientFromAdmin-seed#[25CDB97A93D1D5AE]) [    ] o.a.s.c.SolrResourceLoader solr home defaulted to 'solr/' (could not find system property or JNDI)
   [junit4]   2> 937733 INFO  (TEST-TestLazyCores.testCreateTransientFromAdmin-seed#[25CDB97A93D1D5AE]) [    ] o.a.s.c.CoreContainer New CoreContainer 1383305635
   [junit4]   2> 937733 INFO  (TEST-TestLazyCores.testCreateTransientFromAdmin-seed#[25CDB97A93D1D5AE]) [    ] o.a.s.c.CoreContainer Loading cores into CoreContainer [instanceDir=/home/jenkins/workspace/Lucene-Solr-trunk-Linux/solr/build/solr-core/test/J0/temp/solr.core.TestLazyCores_25CDB97A93D1D5AE-001/tempDir-001]
   [junit4]   2> 937734 WARN  (TEST-TestLazyCores.testCreateTransientFromAdmin-seed#[25CDB97A93D1D5AE]) [    ] o.a.s.c.CoreContainer Couldn't add files from /home/jenkins/workspace/Lucene-Solr-trunk-Linux/solr/build/solr-core/test/J0/temp/solr.core.TestLazyCores_25CDB97A93D1D5AE-001/tempDir-001/lib to classpath: /home/jenkins/workspace/Lucene-Solr-trunk-Linux/solr/build/solr-core/test/J0/temp/solr.core.TestLazyCores_25CDB97A93D1D5AE-001/tempDir-001/lib
   [junit4]   2> 937734 INFO  (TEST-TestLazyCores.testCreateTransientFromAdmin-seed#[25CDB97A93D1D5AE]) [    ] o.a.s.h.c.HttpShardHandlerFactory created with socketTimeout : 600000,connTimeout : 60000,maxConnectionsPerHost : 20,maxConnections : 10000,corePoolSize : 0,maximumPoolSize : 2147483647,maxThreadIdleTime : 5,sizeOfQueue : -1,fairnessPolicy : false,useRetries : false,
   [junit4]   2> 937735 INFO  (TEST-TestLazyCores.testCreateTransientFromAdmin-seed#[25CDB97A93D1D5AE]) [    ] o.a.s.u.UpdateShardHandler Creating UpdateShardHandler HTTP client with params: socketTimeout=600000&connTimeout=60000&retry=true
   [junit4]   2> 937735 INFO  (TEST-TestLazyCores.testCreateTransientFromAdmin-seed#[25CDB97A93D1D5AE]) [    ] o.a.s.c.SolrCores Allocating transient cache for 4 transient cores
   [junit4]   2> 937736 INFO  (TEST-TestLazyCores.testCreateTransientFromAdmin-seed#[25CDB97A93D1D5AE]) [    ] o.a.s.l.LogWatcher SLF4J impl is org.slf4j.impl.Log4jLoggerFactory
   [junit4]   2> 937737 INFO  (TEST-TestLazyCores.testCreateTransientFromAdmin-seed#[25CDB97A93D1D5AE]) [    ] o.a.s.l.LogWatcher Registering Log Listener [Log4j (org.slf4j.impl.Log4jLoggerFactory)]
   [junit4]   2> 937737 INFO  (TEST-TestLazyCores.testCreateTransientFromAdmin-seed#[25CDB97A93D1D5AE]) [    ] o.a.s.c.CoreContainer Security conf doesn't exist. Skipping setup for authorization module.
   [junit4]   2> 937737 INFO  (TEST-TestLazyCores.testCreateTransientFromAdmin-seed#[25CDB97A93D1D5AE]) [    ] o.a.s.c.CoreContainer No authentication plugin used.
   [junit4]   2> 937737 INFO  (TEST-TestLazyCores.testCreateTransientFromAdmin-seed#[25CDB97A93D1D5AE]) [    ] o.a.s.c.CoreDescriptor Created CoreDescriptor: {name=collection1, config=solrconfig.xml, loadOnStartup=true, schema=schema.xml, configSetProperties=configsetprops.json, transient=false, dataDir=data/}
   [junit4]   2> 937737 INFO  (TEST-TestLazyCores.testCreateTransientFromAdmin-seed#[25CDB97A93D1D5AE]) [    ] o.a.s.c.CoreDescriptor Created CoreDescriptor: {name=collection2, config=solrconfig.xml, loadOnStartup=true, schema=schema.xml, configSetProperties=configsetprops.json, transient=true, dataDir=data/}
   [junit4]   2> 937737 INFO  (TEST-TestLazyCores.testCreateTransientFromAdmin-seed#[25CDB97A93D1D5AE]) [    ] o.a.s.c.CoreDescriptor Created CoreDescriptor: {name=collection3, config=solrconfig.xml, loadOnStartup=false, schema=schema.xml, configSetProperties=configsetprops.json, transient=on, dataDir=data/}
   [junit4]   2> 937738 INFO  (TEST-TestLazyCores.testCreateTransientFromAdmin-seed#[25CDB97A93D1D5AE]) [    ] o.a.s.c.CoreDescriptor Created CoreDescriptor: {name=collection4, config=solrconfig.xml, loadOnStartup=false, schema=schema.xml, configSetProperties=configsetprops.json, transient=false, dataDir=data/}
   [junit4]   2> 937738 INFO  (TEST-TestLazyCores.testCreateTransientFromAdmin-seed#[25CDB97A93D1D5AE]) [    ] o.a.s.c.CoreDescriptor Created CoreDescriptor: {name=collection5, config=solrconfig.xml, loadOnStartup=true, schema=schema.xml, configSetProperties=configsetprops.json, transient=false, dataDir=data/}
   [junit4]   2> 937738 INFO  (TEST-TestLazyCores.testCreateTransientFromAdmin-seed#[25CDB97A93D1D5AE]) [    ] o.a.s.c.CoreDescriptor Created CoreDescriptor: {name=collection6, config=solrconfig.xml, loadOnStartup=false, schema=schema.xml, configSetProperties=configsetprops.json, transient=true, dataDir=data/}
   [junit4]   2> 937738 INFO  (TEST-TestLazyCores.testCreateTransientFromAdmin-seed#[25CDB97A93D1D5AE]) [    ] o.a.s.c.CoreDescriptor Created CoreDescriptor: {name=collection7, config=solrconfig.xml, loadOnStartup=false, schema=schema.xml, configSetProperties=configsetprops.json, transient=true, dataDir=data/}
   [junit4]   2> 937738 INFO  (TEST-TestLazyCores.testCreateTransientFromAdmin-seed#[25CDB97A93D1D5AE]) [    ] o.a.s.c.CoreDescriptor Created CoreDescriptor: {name=collection8, config=solrconfig.xml, loadOnStartup=false, schema=schema.xml, configSetProperties=configsetprops.json, transient=true, dataDir=data/}
   [junit4]   2> 937739 INFO  (TEST-TestLazyCores.testCreateTransientFromAdmin-seed#[25CDB97A93D1D5AE]) [    ] o.a.s.c.CoreDescriptor Created CoreDescriptor: {name=collection9, config=solrconfig.xml, loadOnStartup=false, schema=schema.xml, configSetProperties=configsetprops.json, transient=true, dataDir=data/}
   [junit4]   2> 937739 INFO  (coreLoadExecutor-4297-thread-1) [    ] o.a.s.c.SolrResourceLoader new SolrResourceLoader for directory: '/home/jenkins/workspace/Lucene-Solr-trunk-Linux/solr/build/solr-core/test/J0/temp/solr.core.TestLazyCores_25CDB97A93D1D5AE-001/tempDir-001/collection1'
   [junit4]   2> 937739 INFO  (coreLoadExecutor-4297-thread-2) [    ] o.a.s.c.SolrResourceLoader new SolrResourceLoader for directory: '/home/jenkins/workspace/Lucene-Solr-trunk-Linux/solr/build/solr-core/test/J0/temp/solr.core.TestLazyCores_25CDB97A93D1D5AE-001/tempDir-001/collection2'
   [junit4]   2> 937739 INFO  (coreLoadExecutor-4297-thread-3) [    ] o.a.s.c.SolrResourceLoader new SolrResourceLoader for directory: '/home/jenkins/workspace/Lucene-Solr-trunk-Linux/solr/build/solr-core/test/J0/temp/solr.core.TestLazyCores_25CDB97A93D1D5AE-001/tempDir-001/collection5'
   [junit4]   2> 937739 INFO  (coreLoadExecutor-4297-thread-1) [    ] o.a.s.c.SolrResourceLoader JNDI not configured for solr (NoInitialContextEx)
   [junit4]   2> 937739 INFO  (coreLoadExecutor-4297-thread-1) [    ] o.a.s.c.SolrResourceLoader solr home defaulted to 'solr/' (could not find system property or JNDI)
   [junit4]   2> 937739 INFO  (coreLoadExecutor-4297-thread-3) [    ] o.a.s.c.SolrResourceLoader JNDI not configured for solr (NoInitialContextEx)
   [junit4]   2> 937739 INFO  (coreLoadExecutor-4297-thread-3) [    ] o.a.s.c.SolrResourceLoader solr home defaulted to 'solr/' (could not find system property or JNDI)
   [junit4]   2> 937739 INFO  (coreLoadExecutor-4297-thread-2) [    ] o.a.s.c.SolrResourceLoader JNDI not configured for solr (NoInitialContextEx)
   [junit4]   2> 937740 INFO  (coreLoadExecutor-4297-thread-2) [    ] o.a.s.c.SolrResourceLoader solr home defaulted to 'solr/' (could not find system property or JNDI)
   [junit4]   2> 937746 INFO  (coreLoadExecutor-4297-thread-1) [    ] o.a.s.c.SolrConfig current version of requestparams : -1
   [junit4]   2> 937746 INFO  (coreLoadExecutor-4297-thread-2) [    ] o.a.s.c.SolrConfig current version of requestparams : -1
   [junit4]   2> 937747 INFO  (coreLoadExecutor-4297-thread-2) [    ] o.a.s.c.SolrConfig Using Lucene MatchVersion: 6.0.0
   [junit4]   2> 937748 INFO  (coreLoadExecutor-4297-thread-1) [    ] o.a.s.c.SolrConfig Using Lucene MatchVersion: 6.0.0
   [junit4]   2> 937748 INFO  (coreLoadExecutor-4297-thread-3) [    ] o.a.s.c.SolrConfig current version of requestparams : -1
   [junit4]   2> 937756 INFO  (coreLoadExecutor-4297-thread-3) [    ] o.a.s.c.SolrConfig Using Lucene MatchVersion: 6.0.0
   [junit4]   2> 937758 INFO  (coreLoadExecutor-4297-thread-1) [    ] o.a.s.c.SolrConfig Loaded SolrConfig: solrconfig.xml
   [junit4]   2> 937760 INFO  (coreLoadExecutor-4297-thread-2) [    ] o.a.s.c.SolrConfig Loaded SolrConfig: solrconfig.xml
   [junit4]   2> 937761 INFO  (coreLoadExecutor-4297-thread-3) [    ] o.a.s.c.SolrConfig Loaded SolrConfig: solrconfig.xml
   [junit4]   2> 937761 INFO  (coreLoadExecutor-4297-thread-1) [    ] o.a.s.s.IndexSchema [collection1] Schema name=tiny
   [junit4]   2> 937763 INFO  (coreLoadExecutor-4297-thread-2) [    ] o.a.s.s.IndexSchema [collection2] Schema name=tiny
   [junit4]   2> 937764 INFO  (coreLoadExecutor-4297-thread-3) [    ] o.a.s.s.IndexSchema [collection5] Schema name=tiny
   [junit4]   2> 937764 INFO  (coreLoadExecutor-4297-thread-1) [    ] o.a.s.s.IndexSchema unique key field: id
   [junit4]   2> 937766 INFO  (coreLoadExecutor-4297-thread-2) [    ] o.a.s.s.IndexSchema unique key field: id
   [junit4]   2> 937766 INFO  (coreLoadExecutor-4297-thread-3) [    ] o.a.s.s.IndexSchema unique key field: id
   [junit4]   2> 937766 INFO  (coreLoadExecutor-4297-thread-1) [    ] o.a.s.c.ConfigSetProperties Did not find ConfigSet properties, assuming default properties: Can't find resource 'configsetprops.json' in classpath or '/home/jenkins/workspace/Lucene-Solr-trunk-Linux/solr/build/solr-core/test/J0/temp/solr.core.TestLazyCores_25CDB97A93D1D5AE-001/tempDir-001/collection1'
   [junit4]   2> 937766 INFO  (coreLoadExecutor-4297-thread-1) [    ] o.a.s.c.CoreContainer Creating SolrCore 'collection1' using configuration from instancedir /home/jenkins/workspace/Lucene-Solr-trunk-Linux/solr/build/solr-core/test/J0/temp/solr.core.TestLazyCores_25CDB97A93D1D5AE-001/tempDir-001/collection1
   [junit4]   2> 937766 INFO  (coreLoadExecutor-4297-thread-1) [    x:collection1] o.a.s.c.SolrCore org.apache.solr.core.MockDirectoryFactory
   [junit4]   2> 937767 INFO  (coreLoadExecutor-4297-thread-1) [    x:collection1] o.a.s.c.SolrCore [[collection1] ] Opening new SolrCore at [/home/jenkins/workspace/Lucene-Solr-trunk-Linux/solr/build/solr-core/test/J0/temp/solr.core.TestLazyCores_25CDB97A93D1D5AE-001/tempDir-001/collection1], dataDir=[/home/jenkins/workspace/Lucene-Solr-trunk-Linux/solr/build/solr-core/test/J0/temp/solr.core.TestLazyCores_25CDB97A93D1D5AE-001/tempDir-001/collection1/data/]
   [junit4]   2> 937767 INFO  (coreLoadExecutor-4297-thread-1) [    x:collection1] o.a.s.c.SolrCore JMX monitoring not detected for core: collection1
   [junit4]   2> 937767 INFO  (coreLoadExecutor-4297-thread-2) [    ] o.a.s.c.ConfigSetProperties Did not find ConfigSet properties, assuming default properties: Can't find resource 'configsetprops.json' in classpath or '/home/jenkins/workspace/Lucene-Solr-trunk-Linux/solr/build/solr-core/test/J0/temp/solr.core.TestLazyCores_25CDB97A93D1D5AE-001/tempDir-001/collection2'
   [junit4]   2> 937767 INFO  (coreLoadExecutor-4297-thread-3) [    ] o.a.s.c.ConfigSetProperties Did not find ConfigSet properties, assuming default properties: Can't find resource 'configsetprops.json' in classpath or '/home/jenkins/workspace/Lucene-Solr-trunk-Linux/solr/build/solr-core/test/J0/temp/solr.core.TestLazyCores_25CDB97A93D1D5AE-001/tempDir-001/collection5'
   [junit4]   2> 937767 INFO  (coreLoadExecutor-4297-thread-2) [    ] o.a.s.c.CoreContainer Creating SolrCore 'collection2' using configuration from instancedir /home/jenkins/workspace/Lucene-Solr-trunk-Linux/solr/build/solr-core/test/J0/temp/solr.core.TestLazyCores_25CDB97A93D1D5AE-001/tempDir-001/collection2
   [junit4]   2> 937767 INFO  (coreLoadExecutor-4297-thread-3) [    ] o.a.s.c.CoreContainer Creating SolrCore 'collection5' using configuration from instancedir /home/jenkins/workspace/Lucene-Solr-trunk-Linux/solr/build/solr-core/test/J0/temp/solr.core.TestLazyCores_25CDB97A93D1D5AE-001/tempDir-001/collection5
   [junit4]   2> 937767 INFO  (coreLoadExecutor-4297-thread-1) [    x:collection1] o.a.s.c.CachingDirectoryFactory return new directory for /home/jenkins/workspace/Lucene-Solr-trunk-Linux/solr/build/solr-core/test/J0/temp/solr.core.TestLazyCores_25CDB97A93D1D5AE-001/tempDir-001/collection1/data
   [junit4]   2> 937767 INFO  (coreLoadExecutor-4297-thread-3) [    x:collection5] o.a.s.c.SolrCore org.apache.solr.core.MockDirectoryFactory
   [junit4]   2> 937767 INFO  (coreLoadExecutor-4297-thread-1) [    x:collection1] o.a.s.c.SolrCore New index directory detected: old=null new=/home/jenkins/workspace/Lucene-Solr-trunk-Linux/solr/build/solr-core/test/J0/temp/solr.core.TestLazyCores_25CDB97A93D1D5AE-001/tempDir-001/collection1/data/index/
   [junit4]   2> 937767 INFO  (coreLoadExecutor-4297-thread-2) [    x:collection2] o.a.s.c.SolrCore org.apache.solr.core.MockDirectoryFactory
   [junit4]   2> 937767 WARN  (coreLoadExecutor-4297-thread-1) [    x:collection1] o.a.s.c.SolrCore [collection1] Solr index directory '/home/jenkins/workspace/Lucene-Solr-trunk-Linux/solr/build/solr-core/test/J0/temp/solr.core.TestLazyCores_25CDB97A93D1D5AE-001/tempDir-001/collection1/data/index' doesn't exist. Creating new index...
   [junit4]   2> 937767 INFO  (coreLoadExecutor-4297-thread-2) [    x:collection2] o.a.s.c.SolrCore [[collection2] ] Opening new SolrCore at [/home/jenkins/workspace/Lucene-Solr-trunk-Linux/solr/build/solr-core/test/J0/temp/solr.core.TestLazyCores_25CDB97A93D1D5AE-001/tempDir-001/collection2], dataDir=[/home/jenkins/workspace/Lucene-Solr-trunk-Linux/solr/build/solr-core/test/J0/temp/solr.core.TestLazyCores_25CDB97A93D1D5AE-001/tempDir-001/collection2/data/]
   [junit4]   2> 937767 INFO  (coreLoadExecutor-4297-thread-2) [    x:collection2] o.a.s.c.SolrCore JMX monitoring not detected for core: collection2
   [junit4]   2> 937767 INFO  (coreLoadExecutor-4297-thread-3) [    x:collection5] o.a.s.c.SolrCore [[collection5] ] Opening new SolrCore at [/home/jenkins/workspace/Lucene-Solr-trunk-Linux/solr/build/solr-core/test/J0/temp/solr.core.TestLazyCores_25CDB97A93D1D5AE-001/tempDir-001/collection5], dataDir=[/home/jenkins/workspace/Lucene-Solr-trunk-Linux/solr/build/solr-core/test/J0/temp/solr.core.TestLazyCores_25CDB97A93D1D5AE-001/tempDir-001/collection5/data/]
   [junit4]   2> 937768 INFO  (coreLoadExecutor-4297-thread-3) [    x:collection5] o.a.s.c.SolrCore JMX monitoring not detected for core: collection5
   [junit4]   2> 937768 INFO  (coreLoadExecutor-4297-thread-1) [    x:collection1] o.a.s.c.CachingDirectoryFactory return new directory for /home/jenkins/workspace/Lucene-Solr-trunk-Linux/solr/build/solr-core/test/J0/temp/solr.core.TestLazyCores_25CDB97A93D1D5AE-001/tempDir-001/collection1/data/index
   [junit4]   2> 937768 INFO  (coreLoadExecutor-4297-thread-2) [    x:collection2] o.a.s.c.CachingDirectoryFactory return new directory for /home/jenkins/workspace/Lucene-Solr-trunk-Linux/solr/build/solr-core/test/J0/temp/solr.core.TestLazyCores_25CDB97A93D1D5AE-001/tempDir-001/collection2/data
   [junit4]   2> 937768 INFO  (coreLoadExecutor-4297-thread-3) [    x:collection5] o.a.s.c.CachingDirectoryFactory return new directory for /home/jenkins/workspace/Lucene-Solr-trunk-Linux/solr/build/solr-core/test/J0/temp/solr.core.TestLazyCores_25CDB97A93D1D5AE-001/tempDir-001/collection5/data
   [junit4]   2> 937768 INFO  (coreLoadExecutor-4297-thread-2) [    x:collection2] o.a.s.c.SolrCore New index directory detected: old=null new=/home/jenkins/workspace/Lucene-Solr-trunk-Linux/solr/build/solr-core/test/J0/temp/solr.core.TestLazyCores_25CDB97A93D1D5AE-001/tempDir-001/collection2/data/index/
   [junit4]   2> 937768 INFO  (coreLoadExecutor-4297-thread-3) [    x:collection5] o.a.s.c.SolrCore New index directory detected: old=null new=/home/jenkins/workspace/Lucene-Solr-trunk-Linux/solr/build/solr-core/test/J0/temp/solr.core.TestLazyCores_25CDB97A93D1D5AE-001/tempDir-001/collection5/data/index/
   [junit4]   2> 937768 WARN  (coreLoadExecutor-4297-thread-2) [    x:collection2] o.a.s.c.SolrCore [collection2] Solr index directory '/home/jenkins/workspace/Lucene-Solr-trunk-Linux/solr/build/solr-core/test/J0/temp/solr.core.TestLazyCores_25CDB97A93D1D5AE-001/tempDir-001/collection2/data/index' doesn't exist. Creating new index...
   [junit4]   2> 937768 WARN  (coreLoadExecutor-4297-thread-3) [    x:collection5] o.a.s.c.SolrCore [collection5] Solr index directory '/home/jenkins/workspace/Lucene-Solr-trunk-Linux/solr/build/solr-core/test/J0/temp/solr.core.TestLazyCores_25CDB97A93D1D5AE-001/tempDir-001/collection5/data/index' doesn't exist. Creating new index...
   [junit4]   2> 937768 INFO  (coreLoadExecutor-4297-thread-1) [    x:collection1] o.a.s.u.RandomMergePolicy RandomMergePolicy wrapping class org.apache.lucene.index.TieredMergePolicy: [TieredMergePolicy: maxMergeAtOnce=40, maxMergeAtOnceExplicit=21, maxMergedSegmentMB=15.9873046875, floorSegmentMB=0.279296875, forceMergeDeletesPctAllowed=28.332326434126482, segmentsPerTier=50.0, maxCFSSegmentSizeMB=8.796093022207999E12, noCFSRatio=1.0
   [junit4]   2> 937768 INFO  (coreLoadExecutor-4297-thread-2) [    x:collection2] o.a.s.c.CachingDirectoryFactory return new directory for /home/jenkins/workspace/Lucene-Solr-trunk-Linux/solr/build/solr-core/test/J0/temp/solr.core.TestLazyCores_25CDB97A93D1D5AE-001/tempDir-001/collection2/data/index
   [junit4]   2> 937768 INFO  (coreLoadExecutor-4297-thread-3) [    x:collection5] o.a.s.c.CachingDirectoryFactory return new directory for /home/jenkins/workspace/Lucene-Solr-trunk-Linux/solr/build/solr-core/test/J0/temp/solr.core.TestLazyCores_25CDB97A93D1D5AE-001/tempDir-001/collection5/data/index
   [junit4]   2> 937768 INFO  (coreLoadExecutor-4297-thread-2) [    x:collection2] o.a.s.u.RandomMergePolicy RandomMergePolicy wrapping class org.apache.lucene.index.TieredMergePolicy: [TieredMergePolicy: maxMergeAtOnce=40, maxMergeAtOnceExplicit=21, maxMergedSegmentMB=15.9873046875, floorSegmentMB=0.279296875, forceMergeDeletesPctAllowed=28.332326434126482, segmentsPerTier=50.0, maxCFSSegmentSizeMB=8.796093022207999E12, noCFSRatio=1.0
   [junit4]   2> 937768 INFO  (coreLoadExecutor-4297-thread-3) [    x:collection5] o.a.s.u.RandomMergePolicy RandomMergePolicy wrapping class org.apache.lucene.index.TieredMergePolicy: [TieredMergePolicy: maxMergeAtOnce=40, maxMergeAtOnceExplicit=21, maxMergedSegmentMB=15.9873046875, floorSegmentMB=0.279296875, forceMergeDeletesPctAllowed=28.332326434126482, segmentsPerTier=50.0, maxCFSSegmentSizeMB=8.796093022207999E12, noCFSRatio=1.0
   [junit4]   2> 937768 INFO  (coreLoadExecutor-4297-thread-1) [    x:collection1] o.a.s.c.SolrDeletionPolicy SolrDeletionPolicy.onCommit: commits: num=1
   [junit4]   2> 	commit{dir=MockDirectoryWrapper(RAMDirectory@4301b832 lockFactory=org.apache.lucene.store.SingleInstanceLockFactory@213d5115),segFN=segments_1,generation=1}
   [junit4]   2> 937769 INFO  (coreLoadExecutor-4297-thread-2) [    x:collection2] o.a.s.c.SolrDeletionPolicy SolrDeletionPolicy.onCommit: commits: num=1
   [junit4]   2> 	commit{dir=MockDirectoryWrapper(RAMDirectory@609fdac9 lockFactory=org.apache.lucene.store.SingleInstanceLockFactory@6dcec59),segFN=segments_1,generation=1}
   [junit4]   2> 937769 INFO  (coreLoadExecutor-4297-thread-1) [    x:collection1] o.a.s.c.SolrDeletionPolicy newest commit generation = 1
   [junit4]   2> 937769 INFO  (coreLoadExecutor-4297-thread-2) [    x:collection2] o.a.s.c.SolrDeletionPolicy newest commit generation = 1
   [junit4]   2> 937769 INFO  (coreLoadExecutor-4297-thread-3) [    x:collection5] o.a.s.c.SolrDeletionPolicy SolrDeletionPolicy.onCommit: commits: num=1
   [junit4]   2> 	commit{dir=MockDirectoryWrapper(RAMDirectory@e1c0d75 lockFactory=org.apache.lucene.store.SingleInstanceLockFactory@64d1a003),segFN=segments_1,generation=1}
   [junit4]   2> 937769 INFO  (coreLoadExecutor-4297-thread-3) [    x:collection5] o.a.s.c.SolrDeletionPolicy newest commit generation = 1
   [junit4]   2> 937769 INFO  (OldIndexDirectoryCleanupThreadForCore-collection1) [    x:collection1] o.a.s.c.SolrCore Looking for old index directories to cleanup for core collection1 in /home/jenkins/workspace/Lucene-Solr-trunk-Linux/solr/build/solr-core/test/J0/temp/solr.core.TestLazyCores_25CDB97A93D1D5AE-001/tempDir-001/collection1/data/
   [junit4]   2> 937769 INFO  (OldIndexDirectoryCleanupThreadForCore-collection5) [    x:collection5] o.a.s.c.SolrCore Looking for old index directories to cleanup for core collection5 in /home/jenkins/workspace/Lucene-Solr-trunk-Linux/solr/build/solr-core/test/J0/temp/solr.core.TestLazyCores_25CDB97A93D1D5AE-001/tempDir-001/collection5/data/
   [junit4]   2> 937769 WARN  (OldIndexDirectoryCleanupThreadForCore-collection1) [    x:collection1] o.a.s.c.DirectoryFactory /home/jenkins/workspace/Lucene-Solr-trunk-Linux/solr/build/solr-core/test/J0/temp/solr.core.TestLazyCores_25CDB97A93D1D5AE-001/tempDir-001/collection1/data/ does not point to a valid data directory; skipping clean-up of old index directories.
   [junit4]   2> 937769 WARN  (OldIndexDirectoryCleanupThreadForCore-collection5) [    x:collection5] o.a.s.c.DirectoryFactory /home/jenkins/workspace/Lucene-Solr-trunk-Linux/solr/build/solr-core/test/J0/temp/solr.core.TestLazyCores_25CDB97A93D1D5AE-001/tempDir-001/collection5/data/ does not point to a valid data directory; skipping clean-up of old index directories.
   [junit4]   2> 937770 INFO  (OldIndexDirectoryCleanupThreadForCore-collection2) [    x:collection2] o.a.s.c.SolrCore Looking for old index directories to cleanup for core collection2 in /home/jenkins/workspace/Lucene-Solr-trunk-Linux/solr/build/solr-core/test/J0/temp/solr.core.TestLazyCores_25CDB97A93D1D5AE-001/tempDir-001/collection2/data/
   [junit4]   2> 937770 INFO  (coreLoadExecutor-4297-thread-1) [    x:collection1] o.a.s.c.SolrCore no updateRequestProcessorChain defined as default, creating implicit default
   [junit4]   2> 937770 INFO  (coreLoadExecutor-4297-thread-3) [    x:collection5] o.a.s.c.SolrCore no updateRequestProcessorChain defined as default, creating implicit default
   [junit4]   2> 937770 WARN  (OldIndexDirectoryCleanupThreadForCore-collection2) [    x:collection2] o.a.s.c.DirectoryFactory /home/jenkins/workspace/Lucene-Solr-trunk-Linux/solr/build/solr-core/test/J0/temp/solr.core.TestLazyCores_25CDB97A93D1D5AE-001/tempDir-001/collection2/data/ does not point to a valid data directory; skipping clean-up of old index directories.
   [junit4]   2> 937770 INFO  (coreLoadExecutor-4297-thread-2) [    x:collection2] o.a.s.c.SolrCore no updateRequestProcessorChain defined as default, creating implicit default
   [junit4]   2> 937771 INFO  (coreLoadExecutor-4297-thread-2) [    x:collection2] o.a.s.h.l.XMLLoader xsltCacheLifetimeSeconds=60
   [junit4]   2> 937771 INFO  (coreLoadExecutor-4297-thread-1) [    x:collection1] o.a.s.h.l.XMLLoader xsltCacheLifetimeSeconds=60
   [junit4]   2> 937771 INFO  (coreLoadExecutor-4297-thread-3) [    x:collection5] o.a.s.h.l.XMLLoader xsltCacheLifetimeSeconds=60
   [junit4]   2> 937772 INFO  (coreLoadExecutor-4297-thread-2) [    x:collection2] o.a.s.h.l.XMLLoader xsltCacheLifetimeSeconds=60
   [junit4]   2> 937772 INFO  (coreLoadExecutor-4297-thread-3) [    x:collection5] o.a.s.h.l.XMLLoader xsltCacheLifetimeSeconds=60
   [junit4]   2> 937772 INFO  (coreLoadExecutor-4297-thread-1) [    x:collection1] o.a.s.h.l.XMLLoader xsltCacheLifetimeSeconds=60
   [junit4]   2> 937772 INFO  (coreLoadExecutor-4297-thread-2) [    x:collection2] o.a.s.h.l.XMLLoader xsltCacheLifetimeSeconds=60
   [junit4]   2> 937772 INFO  (coreLoadExecutor-4297-thread-3) [    x:collection5] o.a.s.h.l.XMLLoader xsltCacheLifetimeSeconds=60
   [junit4]   2> 937773 INFO  (coreLoadExecutor-4297-thread-2) [    x:collection2] o.a.s.h.l.XMLLoader xsltCacheLifetimeSeconds=60
   [junit4]   2> 937773 INFO  (coreLoadExecutor-4297-thread-1) [    x:collection1] o.a.s.h.l.XMLLoader xsltCacheLifetimeSeconds=60
   [junit4]   2> 937773 INFO  (coreLoadExecutor-4297-thread-3) [    x:collection5] o.a.s.h.l.XMLLoader xsltCacheLifetimeSeconds=60
   [junit4]   2> 937773 INFO  (coreLoadExecutor-4297-thread-1) [    x:collection1] o.a.s.h.l.XMLLoader xsltCacheLifetimeSeconds=60
   [junit4]   2> 937773 INFO  (coreLoadExecutor-4297-thread-2) [    x:collection2] o.a.s.c.RequestHandlers Registered paths: /admin/mbeans,/update/csv,/sql,/update/json/docs,/admin/luke,/export,/select,/admin/segments,/get,/admin/system,/replication,/admin/properties,/config,/stream,/schema,/admin/plugins,/admin/logging,/update/json,/admin/threads,/admin/ping,/update,/admin/file
   [junit4]   2> 937773 INFO  (coreLoadExecutor-4297-thread-3) [    x:collection5] o.a.s.c.RequestHandlers Registered paths: /admin/mbeans,/update/csv,/sql,/update/json/docs,/admin/luke,/export,/select,/admin/segments,/get,/admin/system,/replication,/admin/properties,/config,/stream,/schema,/admin/plugins,/admin/logging,/update/json,/admin/threads,/admin/ping,/update,/admin/file
   [junit4]   2> 937774 INFO  (coreLoadExecutor-4297-thread-2) [    x:collection2] o.a.s.c.SolrCore Using default statsCache cache: org.apache.solr.search.stats.LocalStatsCache
   [junit4]   2> 937774 INFO  (coreLoadExecutor-4297-thread-3) [    x:collection5] o.a.s.c.SolrCore Using default statsCache cache: org.apache.solr.search.stats.LocalStatsCache
   [junit4]   2> 937774 INFO  (coreLoadExecutor-4297-thread-2) [    x:collection2] o.a.s.u.CommitTracker Hard AutoCommit: disabled
   [junit4]   2> 937774 INFO  (coreLoadExecutor-4297-thread-2) [    x:collection2] o.a.s.u.CommitTracker Soft AutoCommit: disabled
   [junit4]   2> 937774 INFO  (coreLoadExecutor-4297-thread-3) [    x:collection5] o.a.s.u.CommitTracker Hard AutoCommit: disabled
   [junit4]   2> 937774 INFO  (coreLoadExecutor-4297-thread-3) [    x:collection5] o.a.s.u.CommitTracker Soft AutoCommit: disabled
   [junit4]   2> 937774 INFO  (coreLoadExecutor-4297-thread-2) [    x:collection2] o.a.s.u.RandomMergePolicy RandomMergePolicy wrapping class org.apache.lucene.index.LogByteSizeMergePolicy: [LogByteSizeMergePolicy: minMergeSize=1677721, mergeFactor=50, maxMergeSize=2147483648, maxMergeSizeForForcedMerge=9223372036854775807, calibrateSizeByDeletes=false, maxMergeDocs=2147483647, maxCFSSegmentSizeMB=8.796093022207999E12, noCFSRatio=1.0]
   [junit4]   2> 937774 INFO  (coreLoadExecutor-4297-thread-3) [    x:collection5] o.a.s.u.RandomMergePolicy RandomMergePolicy wrapping class org.apache.lucene.index.LogByteSizeMergePolicy: [LogByteSizeMergePolicy: minMergeSize=1677721, mergeFactor=50, maxMergeSize=2147483648, maxMergeSizeForForcedMerge=9223372036854775807, calibrateSizeByDeletes=false, maxMergeDocs=2147483647, maxCFSSegmentSizeMB=8.796093022207999E12, noCFSRatio=1.0]
   [junit4]   2> 937774 INFO  (coreLoadExecutor-4297-thread-1) [    x:collection1] o.a.s.c.RequestHandlers Registered paths: /admin/mbeans,/update/csv,/sql,/update/json/docs,/admin/luke,/export,/select,/admin/segments,/get,/admin/system,/replication,/admin/properties,/config,/stream,/schema,/admin/plugins,/admin/logging,/update/json,/admin/threads,/admin/ping,/update,/admin/file
   [junit4]   2> 937775 INFO  (coreLoadExecutor-4297-thread-3) [    x:collection5] o.a.s.c.SolrDeletionPolicy SolrDeletionPolicy.onInit: commits: num=1
   [junit4]   2> 	commit{dir=MockDirectoryWrapper(RAMDirectory@e1c0d75 lockFactory=org.apache.lucene.store.SingleInstanceLockFactory@64d1a003),segFN=segments_1,generation=1}
   [junit4]   2> 937775 INFO  (coreLoadExecutor-4297-thread-3) [    x:collection5] o.a.s.c.SolrDeletionPolicy newest commit generation = 1
   [junit4]   2> 937775 INFO  (coreLoadExecutor-4297-thread-2) [    x:collection2] o.a.s.c.SolrDeletionPolicy SolrDeletionPolicy.onInit: commits: num=1
   [junit4]   2> 	commit{dir=MockDirectoryWrapper(RAMDirectory@609fdac9 lockFactory=org.apache.lucene.store.SingleInstanceLockFactory@6dcec59),segFN=segments_1,generation=1}
   [junit4]   2> 937775 INFO  (coreLoadExecutor-4297-thread-3) [    x:collection5] o.a.s.s.SolrIndexSearcher Opening [Searcher@2795e559[collection5] main]
   [junit4]   2> 937775 INFO  (coreLoadExecutor-4297-thread-2) [    x:collection2] o.a.s.c.SolrDeletionPolicy newest commit generation = 1
   [junit4]   2> 937775 INFO  (coreLoadExecutor-4297-thread-1) [    x:collection1] o.a.s.c.SolrCore Using default statsCache cache: org.apache.solr.search.stats.LocalStatsCache
   [junit4]   2> 937775 INFO  (coreLoadExecutor-4297-thread-2) [    x:collection2] o.a.s.s.SolrIndexSearcher Opening [Searcher@7aa0bae6[collection2] main]
   [junit4]   2> 937775 INFO  (coreLoadExecutor-4297-thread-3) [    x:collection5] o.a.s.r.ManagedResourceStorage File-based storage initialized to use dir: /home/jenkins/workspace/Lucene-Solr-trunk-Linux/solr/build/solr-core/test/J0/temp/solr.core.TestLazyCores_25CDB97A93D1D5AE-001/tempDir-001/collection5/conf
   [junit4]   2> 937775 INFO  (coreLoadExecutor-4297-thread-1) [    x:collection1] o.a.s.u.CommitTracker Hard AutoCommit: disabled
   [junit4]   2> 937775 INFO  (coreLoadExecutor-4297-thread-2) [    x:collection2] o.a.s.r.ManagedResourceStorage File-based storage initialized to use dir: /home/jenkins/workspace/Lucene-Solr-trunk-Linux/solr/build/solr-core/test/J0/temp/solr.core.TestLazyCores_25CDB97A93D1D5AE-001/tempDir-001/collection2/conf
   [junit4]   2> 937775 INFO  (coreLoadExecutor-4297-thread-1) [    x:collection1] o.a.s.u.CommitTracker Soft AutoCommit: disabled
   [junit4]   2> 937775 INFO  (coreLoadExecutor-4297-thread-2) [    x:collection2] o.a.s.r.RestManager Initializing RestManager with initArgs: {storageDir=/home/jenkins/workspace/Lucene-Solr-trunk-Linux/solr/build/solr-core/test/J0/temp/solr.core.TestLazyCores_25CDB97A93D1D5AE-001/tempDir-001/collection2/conf}
   [junit4]   2> 937775 INFO  (coreLoadExecutor-4297-thread-3) [    x:collection5] o.a.s.r.RestManager Initializing RestManager with initArgs: {storageDir=/home/jenkins/workspace/Lucene-Solr-trunk-Linux/solr/build/solr-core/test/J0/temp/solr.core.TestLazyCores_25CDB97A93D1D5AE-001/tempDir-001/collection5/conf}
   [junit4]   2> 937775 INFO  (coreLoadExecutor-4297-thread-1) [    x:collection1] o.a.s.u.RandomMergePolicy RandomMergePolicy wrapping class org.apache.lucene.index.LogByteSizeMergePolicy: [LogByteSizeMergePolicy: minMergeSize=1677721, mergeFactor=50, maxMergeSize=2147483648, maxMergeSizeForForcedMerge=9223372036854775807, calibrateSizeByDeletes=false, maxMergeDocs=2147483647, maxCFSSegmentSizeMB=8.796093022207999E12, noCFSRatio=1.0]
   [junit4]   2> 937775 INFO  (coreLoadExecutor-4297-thread-3) [    x:collection5] o.a.s.r.ManagedResourceStorage Reading _rest_managed.json using file:dir=/home/jenkins/workspace/Lucene-Solr-trunk-Linux/solr/build/solr-core/test/J0/temp/solr.core.TestLazyCores_25CDB97A93D1D5AE-001/tempDir-001/collection5/conf
   [junit4]   2> 937775 INFO  (coreLoadExecutor-4297-thread-2) [    x:collection2] o.a.s.r.ManagedResourceStorage Reading _rest_managed.json using file:dir=/home/jenkins/workspace/Lucene-Solr-trunk-Linux/solr/build/solr-core/test/J0/temp/solr.core.TestLazyCores_25CDB97A93D1D5AE-001/tempDir-001/collection2/conf
   [junit4]   2> 937775 INFO  (coreLoadExecutor-4297-thread-1) [    x:collection1] o.a.s.c.SolrDeletionPolicy SolrDeletionPolicy.onInit: commits: num=1
   [junit4]   2> 	commit{dir=MockDirectoryWrapper(RAMDirectory@4301b832 lockFactory=org.apache.lucene.store.SingleInstanceLockFactory@213d5115),segFN=segments_1,generation=1}
   [junit4]   2> 937775 INFO  (coreLoadExecutor-4297-thread-1) [    x:collection1] o.a.s.c.SolrDeletionPolicy newest commit generation = 1
   [junit4]   2> 937775 INFO  (coreLoadExecutor-4297-thread-3) [    x:collection5] o.a.s.r.RestManager Initializing 0 registered ManagedResources
   [junit4]   2> 937776 INFO  (coreLoadExecutor-4297-thread-1) [    x:collection1] o.a.s.s.SolrIndexSearcher Opening [Searcher@1f4e0a91[collection1] main]
   [junit4]   2> 937776 INFO  (coreLoadExecutor-4297-thread-3) [    x:collection5] o.a.s.h.ReplicationHandler Commits will be reserved for  10000
   [junit4]   2> 937776 INFO  (coreLoadExecutor-4297-thread-2) [    x:collection2] o.a.s.r.RestManager Initializing 0 registered ManagedResources
   [junit4]   2> 937776 INFO  (coreLoadExecutor-4297-thread-2) [    x:collection2] o.a.s.h.ReplicationHandler Commits will be reserved for  10000
   [junit4]   2> 937776 INFO  (searcherExecutor-4300-thread-1-processing-x:collection5) [    x:collection5] o.a.s.c.SolrCore [collection5] Registered new searcher Searcher@2795e559[collection5] main{ExitableDirectoryReader(UninvertingDirectoryReader())}
   [junit4]   2> 937776 INFO  (searcherExecutor-4299-thread-1-processing-x:collection2) [    x:collection2] o.a.s.c.SolrCore [collection2] Registered new searcher Searcher@7aa0bae6[collection2] main{ExitableDirectoryReader(UninvertingDirectoryReader())}
   [junit4]   2> 937776 INFO  (coreLoadExecutor-4297-thread-2) [    x:collection2] o.a.s.c.SolrCores Opening transient core collection2
   [junit4]   2> 937776 INFO  (coreLoadExecutor-4297-thread-3) [    x:collection5] o.a.s.c.CoreContainer registering core: collection5
   [junit4]   2> 937776 INFO  (coreLoadExecutor-4297-thread-2) [    x:collection2] o.a.s.c.CoreContainer registering core: collection2
   [junit4]   2> 937776 INFO  (coreLoadExecutor-4297-thread-1) [    x:collection1] o.a.s.r.ManagedResourceStorage File-based storage initialized to use dir: /home/jenkins/workspace/Lucene-Solr-trunk-Linux/solr/build/solr-core/test/J0/temp/solr.core.TestLazyCores_25CDB97A93D1D5AE-001/tempDir-001/collection1/conf
   [junit4]   2> 937776 INFO  (coreLoadExecutor-4297-thread-1) [    x:collection1] o.a.s.r.RestManager Initializing RestManager with initArgs: {storageDir=/home/jenkins/workspace/Lucene-Solr-trunk-Linux/solr/build/solr-core/test/J0/temp/solr.core.TestLazyCores_25CDB97A93D1D5AE-001/tempDir-001/collection1/conf}
   [junit4]   2> 937776 INFO  (coreLoadExecutor-4297-thread-1) [    x:collection1] o.a.s.r.ManagedResourceStorage Reading _rest_managed.json using file:dir=/home/jenkins/workspace/Lucene-Solr-trunk-Linux/solr/build/solr-core/test/J0/temp/solr.core.TestLazyCores_25CDB97A93D1D5AE-001/tempDir-001/collection1/conf
   [junit4]   2> 937776 INFO  (coreLoadExecutor-4297-thread-1) [    x:collection1] o.a.s.r.RestManager Initializing 0 registered ManagedResources
   [junit4]   2> 937776 INFO  (coreLoadExecutor-4297-thread-1) [    x:collection1] o.a.s.h.ReplicationHandler Commits will be reserved for  10000
   [junit4]   2> 937776 INFO  (searcherExecutor-4298-thread-1-processing-x:collection1) [    x:collection1] o.a.s.c.SolrCore [collection1] Registered new searcher Searcher@1f4e0a91[collection1] main{ExitableDirectoryReader(UninvertingDirectoryReader())}
   [junit4]   2> 937776 INFO  (coreLoadExecutor-4297-thread-1) [    x:collection1] o.a.s.c.CoreContainer registering core: collection1
   [junit4]   2> 937782 INFO  (TEST-TestLazyCores.testCreateTransientFromAdmin-seed#[25CDB97A93D1D5AE]) [    ] o.a.s.h.a.CoreAdminOperation core create command loadOnStartup=true&transient=true&name=core1&action=CREATE&wt=xml
   [junit4]   2> 937782 INFO  (TEST-TestLazyCores.testCreateTransientFromAdmin-seed#[25CDB97A93D1D5AE]) [    ] o.a.s.c.CoreDescriptor Created CoreDescriptor: {name=core1, config=solrconfig.xml, loadOnStartup=true, schema=schema.xml, configSetProperties=configsetprops.json, transient=true, dataDir=data/}
   [junit4]   2> 937782 INFO  (TEST-TestLazyCores.testCreateTransientFromAdmin-seed#[25CDB97A93D1D5AE]) [    ] o.a.s.c.SolrResourceLoader new SolrResourceLoader for directory: '/home/jenkins/workspace/Lucene-Solr-trunk-Linux/solr/build/solr-core/test/J0/temp/solr.core.TestLazyCores_25CDB97A93D1D5AE-001/tempDir-001/core1'
   [junit4]   2> 937782 INFO  (TEST-TestLazyCores.testCreateTransientFromAdmin-seed#[25CDB97A93D1D5AE]) [    ] o.a.s.c.SolrResourceLoader JNDI not configured for solr (NoInitialContextEx)
   [junit4]   2> 937783 INFO  (TEST-TestLazyCores.testCreateTransientFromAdmin-seed#[25CDB97A93D1D5AE]) [    ] o.a.s.c.SolrResourceLoader solr home defaulted to 'solr/' (could not find system property or JNDI)
   [junit4]   2> 937787 INFO  (TEST-TestLazyCores.testCreateTransientFromAdmin-seed#[25CDB97A93D1D5AE]) [    ] o.a.s.c.SolrConfig current version of requestparams : -1
   [junit4]   2> 937788 INFO  (TEST-TestLazyCores.testCreateTransientFromAdmin-seed#[25CDB97A93D1D5AE]) [    ] o.a.s.c.SolrConfig Using Lucene MatchVersion: 6.0.0
   [junit4]   2> 937797 INFO  (TEST-TestLazyCores.testCreateTransientFromAdmin-seed#[25CDB97A93D1D5AE]) [    ] o.a.s.c.SolrConfig Loaded SolrConfig: solrconfig.xml
   [junit4]   2> 937800 INFO  (TEST-TestLazyCores.testCreateTransientFromAdmin-seed#[25CDB97A93D1D5AE]) [    ] o.a.s.s.IndexSchema [core1] Schema name=tiny
   [junit4]   2> 937803 INFO  (TEST-TestLazyCores.testCreateTransientFromAdmin-seed#[25CDB97A93D1D5AE]) [    ] o.a.s.s.IndexSchema unique key field: id
   [junit4]   2> 937804 INFO  (TEST-TestLazyCores.testCreateTransientFromAdmin-seed#[25CDB97A93D1D5AE]) [    ] o.a.s.c.ConfigSetProperties Did not find ConfigSet properties, assuming default properties: Can't find resource 'configsetprops.json' in classpath or '/home/jenkins/workspace/Lucene-Solr-trunk-Linux/solr/build/solr-core/test/J0/temp/solr.core.TestLazyCores_25CDB97A93D1D5AE-001/tempDir-001/core1'
   [junit4]   2> 937805 INFO  (TEST-TestLazyCores.testCreateTransientFromAdmin-seed#[25CDB97A93D1D5AE]) [    ] o.a.s.c.CoreContainer Creating SolrCore 'core1' using configuration from instancedir /home/jenkins/workspace/Lucene-Solr-trunk-Linux/solr/build/solr-core/test/J0/temp/solr.core.TestLazyCores_25CDB97A93D1D5AE-001/tempDir-001/core1
   [junit4]   2> 937805 INFO  (TEST-TestLazyCores.testCreateTransientFromAdmin-seed#[25CDB97A93D1D5AE]) [    x:core1] o.a.s.c.SolrCore org.apache.solr.core.MockDirectoryFactory
   [junit4]   2> 937805 INFO  (TEST-TestLazyCores.testCreateTransientFromAdmin-seed#[25CDB97A93D1D5AE]) [    x:core1] o.a.s.c.SolrCore [[core1] ] Opening new SolrCore at [/home/jenkins/workspace/Lucene-Solr-trunk-Linux/solr/build/solr-core/test/J0/temp/solr.core.TestLazyCores_25CDB97A93D1D5AE-001/tempDir-001/core1], dataDir=[/home/jenkins/workspace/Lucene-Solr-trunk-Linux/solr/build/solr-core/test/J0/temp/solr.core.TestLazyCores_25CDB97A93D1D5AE-001/tempDir-001/core1/data/]
   [junit4]   2> 937805 INFO  (TEST-TestLazyCores.testCreateTransientFromAdmin-seed#[25CDB97A93D1D5AE]) [    x:core1] o.a.s.c.SolrCore JMX monitoring not detected for core: core1
   [junit4]   2> 937806 INFO  (TEST-TestLazyCores.testCreateTransientFromAdmin-seed#[25CDB97A93D1D5AE]) [    x:core1] o.a.s.c.CachingDirectoryFactory return new directory for /home/jenkins/workspace/Lucene-Solr-trunk-Linux/solr/build/solr-core/test/J0/temp/solr.core.TestLazyCores_25CDB97A93D1D5AE-001/tempDir-001/core1/data
   [junit4]   2> 937806 INFO  (TEST-TestLazyCores.testCreateTransientFromAdmin-seed#[25CDB97A93D1D5AE]) [    x:core1] o.a.s.c.SolrCore New index directory detected: old=null new=/home/jenkins/workspace/Lucene-Solr-trunk-Linux/solr/build/solr-core/test/J0/temp/solr.core.TestLazyCores_25CDB97A93D1D5AE-001/tempDir-001/core1/data/index/
   [junit4]   2> 937806 WARN  (TEST-TestLazyCores.testCreateTransientFromAdmin-seed#[25CDB97A93D1D5AE]) [    x:core1] o.a.s.c.SolrCore [core1] Solr index directory '/home/jenkins/workspace/Lucene-Solr-trunk-Linux/solr/build/solr-core/test/J0/temp/solr.core.TestLazyCores_25CDB97A93D1D5AE-001/tempDir-001/core1/data/index' doesn't exist. Creating new index...
   [junit4]   2> 937806 INFO  (TEST-TestLazyCores.testCreateTransientFromAdmin-seed#[25CDB97A93D1D5AE]) [    x:core1] o.a.s.c.CachingDirectoryFactory return new directory for /home/jenkins/workspace/Lucene-Solr-trunk-Linux/solr/build/solr-core/test/J0/temp/solr.core.TestLazyCores_25CDB97A93D1D5AE-001/tempDir-001/core1/data/index
   [junit4]   2> 937807 INFO  (TEST-TestLazyCores.testCreateTransientFromAdmin-seed#[25CDB97A93D1D5AE]) [    x:core1] o.a.s.u.RandomMergePolicy RandomMergePolicy wrapping class org.apache.lucene.index.LogByteSizeMergePolicy: [LogByteSizeMergePolicy: minMergeSize=1677721, mergeFactor=13, maxMergeSize=2147483648, maxMergeSizeForForcedMerge=9223372036854775807, calibrateSizeByDeletes=true, maxMergeDocs=2147483647, maxCFSSegmentSizeMB=8.796093022207999E12, noCFSRatio=0.21667454640330927]
   [junit4]   2> 937808 INFO  (TEST-TestLazyCores.testCreateTransientFromAdmin-seed#[25CDB97A93D1D5AE]) [    x:core1] o.a.s.c.SolrDeletionPolicy SolrDeletionPolicy.onCommit: commits: num=1
   [junit4]   2> 	commit{dir=MockDirectoryWrapper(RAMDirectory@456a2a6a lockFactory=org.apache.lucene.store.SingleInstanceLockFactory@57da31ae),segFN=segments_1,generation=1}
   [junit4]   2> 937808 INFO  (TEST-TestLazyCores.testCreateTransientFromAdmin-seed#[25CDB97A93D1D5AE]) [    x:core1] o.a.s.c.SolrDeletionPolicy newest commit generation = 1
   [junit4]   2> 937808 INFO  (OldIndexDirectoryCleanupThreadForCore-core1) [    x:core1] o.a.s.c.SolrCore Looking for old index directories to cleanup for core core1 in /home/jenkins/workspace/Lucene-Solr-trunk-Linux/solr/build/solr-core/test/J0/temp/solr.core.TestLazyCores_25CDB97A93D1D5AE-001/tempDir-001/core1/data/
   [junit4]   2> 937808 WARN  (OldIndexDirectoryCleanupThreadForCore-core1) [    x:core1] o.a.s.c.DirectoryFactory /home/jenkins/workspace/Lucene-Solr-trunk-Linux/solr/build/solr-core/test/J0/temp/solr.core.TestLazyCores_25CDB97A93D1D5AE-001/tempDir-001/core1/data/ does not point to a valid data directory; skipping clean-up of old index directories.
   [junit4]   2> 937809 INFO  (TEST-TestLazyCores.testCreateTransientFromAdmin-seed#[25CDB97A93D1D5AE]) [    x:core1] o.a.s.c.SolrCore no updateRequestProcessorChain defined as default, creating implicit default
   [junit4]   2> 937811 INFO  (TEST-TestLazyCores.testCreateTransientFromAdmin-seed#[25CDB97A93D1D5AE]) [    x:core1] o.a.s.h.l.XMLLoader xsltCacheLifetimeSeconds=60
   [junit4]   2> 937811 INFO  (TEST-TestLazyCores.testCreateTransientFromAdmin-seed#[25CDB97A93D1D5AE]) [    x:core1] o.a.s.h.l.XMLLoader xsltCacheLifetimeSeconds=60
   [junit4]   2> 937812 INFO  (TEST-TestLazyCores.testCreateTransientFromAdmin-seed#[25CDB97A93D1D5AE]) [    x:core1] o.a.s.h.l.XMLLoader xsltCacheLifetimeSeconds=60
   [junit4]   2> 937813 INFO  (TEST-TestLazyCores.testCreateTransientFromAdmin-seed#[25CDB97A93D1D5AE]) [    x:core1] o.a.s.h.l.XMLLoader xsltCacheLifetimeSeconds=60
   [junit4]   2> 937814 INFO  (TEST-TestLazyCores.testCreateTransientFromAdmin-seed#[25CDB97A93D1D5AE]) [    x:core1] o.a.s.c.RequestHandlers Registered paths: /admin/mbeans,/update/csv,/sql,/update/json/docs,/admin/luke,/export,/select,/admin/segments,/get,/admin/system,/replication,/admin/properties,/config,/stream,/schema,/admin/plugins,/admin/logging,/update/json,/admin/threads,/admin/ping,/update,/admin/file
   [junit4]   2> 937814 INFO  (TEST-TestLazyCores.testCreateTransientFromAdmin-seed#[25CDB97A93D1D5AE]) [    x:core1] o.a.s.c.SolrCore Using default statsCache cache: org.apache.solr.search.stats.LocalStatsCache
   [junit4]   2> 937815 INFO  (TEST-TestLazyCores.testCreateTransientFromAdmin-seed#[25CDB97A93D1D5AE]) [    x:core1] o.a.s.u.CommitTracker Hard AutoCommit: disabled
   [junit4]   2> 937815 INFO  (TEST-TestLazyCores.testCreateTransientFromAdmin-seed#[25CDB97A93D1D5AE]) [    x:core1] o.a.s.u.CommitTracker Soft AutoCommit: disabled
   [junit4]   2> 937815 INFO  (TEST-TestLazyCores.testCreateTransientFromAdmin-seed#[25CDB97A93D1D5AE]) [    x:core1] o.a.s.u.RandomMergePolicy RandomMergePolicy wrapping class org.apache.lucene.index.TieredMergePolicy: [TieredMergePolicy: maxMergeAtOnce=32, maxMergeAtOnceExplicit=31, maxMergedSegmentMB=11.259765625, floorSegmentMB=1.115234375, forceMergeDeletesPctAllowed=15.80338184066581, segmentsPerTier=49.0, maxCFSSegmentSizeMB=8.796093022207999E12, noCFSRatio=0.11496697805452759
   [junit4]   2> 937815 INFO  (TEST-TestLazyCores.testCreateTransientFromAdmin-seed#[25CDB97A93D1D5AE]) [    x:core1] o.a.s.c.SolrDeletionPolicy SolrDeletionPolicy.onInit: commits: num=1
   [junit4]   2> 	commit{dir=MockDirectoryWrapper(RAMDirectory@456a2a6a lockFactory=org.apache.lucene.store.SingleInstanceLockFactory@57da31ae),segFN=segments_1,generation=1}
   [junit4]   2> 937815 INFO  (TEST-TestLazyCores.testCreateTransientFromAdmin-seed#[25CDB97A93D1D5AE]) [    x:core1] o.a.s.c.SolrDeletionPolicy newest commit generation = 1
   [junit4]   2> 937815 INFO  (TEST-TestLazyCores.testCreateTransientFromAdmin-seed#[25CDB97A93D1D5AE]) [    x:core1] o.a.s.s.SolrIndexSearcher Opening [Searcher@aecea41[core1] main]
   [junit4]   2> 937816 INFO  (TEST-TestLazyCores.testCreateTransientFromAdmin-seed#[25CDB97A93D1D5AE]) [    x:core1] o.a.s.r.ManagedResourceStorage File-based storage initialized to use dir: /home/jenkins/workspace/Lucene-Solr-trunk-Linux/solr/build/solr-core/test/J0/temp/solr.core.TestLazyCores_25CDB97A93D1D5AE-001/tempDir-001/core1/conf
   [junit4]   2> 937816 INFO  (TEST-TestLazyCores.testCreateTransientFromAdmin-seed#[25CDB97A93D1D5AE]) [    x:core1] o.a.s.r.RestManager Initializing RestManager with initArgs: {storageDir=/home/jenkins/workspace/Lucene-Solr-trunk-Linux/solr/build/solr-core/test/J0/temp/solr.core.TestLazyCores_25CDB97A93D1D5AE-001/tempDir-001/core1/conf}
   [junit4]   2> 937816 INFO  (TEST-TestLazyCores.testCreateTransientFromAdmin-seed#[25CDB97A93D1D5AE]) [    x:core1] o.a.s.r.ManagedResourceStorage Reading _rest_managed.json using file:dir=/home/jenkins/workspace/Lucene-Solr-trunk-Linux/solr/build/solr-core/test/J0/temp/solr.core.TestLazyCores_25CDB97A93D1D5AE-001/tempDir-001/core1/conf
   [junit4]   2> 937816 INFO  (TEST-TestLazyCores.testCreateTransientFromAdmin-seed#[25CDB97A93D1D5AE]) [    x:core1] o.a.s.r.RestManager Initializing 0 registered ManagedResources
   [junit4]   2> 937816 INFO  (TEST-TestLazyCores.testCreateTransientFromAdmin-seed#[25CDB97A93D1D5AE]) [    x:core1] o.a.s.h.ReplicationHandler Commits will be reserved for  10000
   [junit4]   2> 937816 INFO  (searcherExecutor-4311-thread-1-processing-x:core1) [    x:core1] o.a.s.c.SolrCore [core1] Registered new searcher Searcher@aecea41[core1] main{ExitableDirectoryReader(UninvertingDirectoryReader())}
   [junit4]   2> 937816 INFO  (TEST-TestLazyCores.testCreateTransientFromAdmin-seed#[25CDB97A93D1D5AE]) [    x:core1] o.a.s.c.SolrCores Opening transient core core1
   [junit4]   2> 937816 INFO  (TEST-TestLazyCores.testCreateTransientFromAdmin-seed#[25CDB97A93D1D5AE]) [    x:core1] o.a.s.c.CoreContainer registering core: core1
   [junit4]   2> 937817 INFO  (TEST-TestLazyCores.testCreateTransientFromAdmin-seed#[25CDB97A93D1D5AE]) [    x:core1] o.a.s.h.a.CoreAdminOperation core create command loadOnStartup=false&transient=true&name=core2&action=CREATE&wt=xml
   [junit4]   2> 937817 INFO  (TEST-TestLazyCores.testCreateTransientFromAdmin-seed#[25CDB97A93D1D5AE]) [    x:core1] o.a.s.c.CoreDescriptor Created CoreDescriptor: {name=core2, config=solrconfig.xml, loadOnStartup=false, schema=schema.xml, configSetProperties=configsetprops.json, transient=true, dataDir=data/}
   [junit4]   2> 937817 INFO  (TEST-TestLazyCores.testCreateTransientFromAdmin-seed#[25CDB97A93D1D5AE]) [    x:core1] o.a.s.c.SolrResourceLoader new SolrResourceLoader for directory: '/home/jenkins/workspace/Lucene-Solr-trunk-Linux/solr/build/solr-core/test/J0/temp/solr.core.TestLazyCores_25CDB97A93D1D5AE-001/tempDir-001/core2'
   [junit4]   2> 937817 INFO  (TEST-TestLazyCores.testCreateTransientFromAdmin-seed#[25CDB97A93D1D5AE]) [    x:core1] o.a.s.c.SolrResourceLoader JNDI not configured for solr (NoInitialContextEx)
   [junit4]   2> 937817 INFO  (TEST-TestLazyCores.testCreateTransientFromAdmin-seed#[25CDB97A93D1D5AE]) [    x:core1] o.a.s.c.SolrResourceLoader solr home defaulted to 'solr/' (could not find system property or JNDI)
   [junit4]   2> 937824 INFO  (TEST-TestLazyCores.testCreateTransientFromAdmin-seed#[25CDB97A93D1D5AE]) [    x:core1] o.a.s.c.SolrConfig current version of requestparams : -1
   [junit4]   2> 937825 INFO  (TEST-TestLazyCores.testCreateTransientFromAdmin-seed#[25CDB97A93D1D5AE]) [    x:core1] o.a.s.c.SolrConfig Using Lucene MatchVersion: 6.0.0
   [junit4]   2> 937829 INFO  (TEST-TestLazyCores.testCreateTransientFromAdmin-seed#[25CDB97A93D1D5AE]) [    x:core1] o.a.s.c.SolrConfig Loaded SolrConfig: solrconfig.xml
   [junit4]   2> 937831 INFO  (TEST-TestLazyCores.testCreateTransientFromAdmin-seed#[25CDB97A93D1D5AE]) [    x:core1] o.a.s.s.IndexSchema [core2] Schema name=tiny
   [junit4]   2> 937833 INFO  (TEST-TestLazyCores.testCreateTransientFromAdmin-seed#[25CDB97A93D1D5AE]) [    x:core1] o.a.s.s.IndexSchema unique key field: id
   [junit4]   2> 937834 INFO  (TEST-TestLazyCores.testCreateTransientFromAdmin-seed#[25CDB97A93D1D5AE]) [    x:core1] o.a.s.c.ConfigSetProperties Did not find ConfigSet properties, assuming default properties: Can't find resource 'configsetprops.json' in classpath or '/home/jenkins/workspace/Lucene-Solr-trunk-Linux/solr/build/solr-core/test/J0/temp/solr.core.TestLazyCores_25CDB97A93D1D5AE-001/tempDir-001/core2'
   [junit4]   2> 937834 INFO  (TEST-TestLazyCores.testCreateTransientFromAdmin-seed#[25CDB97A93D1D5AE]) [    x:core1] o.a.s.c.CoreContainer Creating SolrCore 'core2' using configuration from instancedir /home/jenkins/workspace/Lucene-Solr-trunk-Linux/solr/build/solr-core/test/J0/temp/solr.core.TestLazyCores_25CDB97A93D1D5AE-001/tempDir-001/core2
   [junit4]   2> 937834 INFO  (TEST-TestLazyCores.testCreateTransientFromAdmin-seed#[25CDB97A93D1D5AE]) [    x:core2] o.a.s.c.SolrCore org.apache.solr.core.MockDirectoryFactory
   [junit4]   2> 937834 INFO  (TEST-TestLazyCores.testCreateTransientFromAdmin-seed#[25CDB97A93D1D5AE]) [    x:core2] o.a.s.c.SolrCore [[core2] ] Opening new SolrCore at [/home/jenkins/workspace/Lucene-Solr-trunk-Linux/solr/build/solr-core/test/J0/temp/solr.core.TestLazyCores_25CDB97A93D1D5AE-001/tempDir-001/core2], dataDir=[/home/jenkins/workspace/Lucene-Solr-trunk-Linux/solr/build/solr-core/test/J0/temp/solr.core.TestLazyCores_25CDB97A93D1D5AE-001/tempDir-001/core2/data/]
   [junit4]   2> 937834 INFO  (TEST-TestLazyCores.testCreateTransientFromAdmin-seed#[25CDB97A93D1D5AE]) [    x:core2] o.a.s.c.SolrCore JMX monitoring not detected for core: core2
   [junit4]   2> 937835 INFO  (TEST-TestLazyCores.testCreateTransientFromAdmin-seed#[25CDB97A93D1D5AE]) [    x:core2] o.a.s.c.CachingDirectoryFactory return new directory for /home/jenkins/workspace/Lucene-Solr-trunk-Linux/solr/build/solr-core/test/J0/temp/solr.core.TestLazyCores_25CDB97A93D1D5AE-001/tempDir-001/core2/data
   [junit4]   2> 937835 INFO  (TEST-TestLazyCores.testCreateTransientFromAdmin-seed#[25CDB97A93D1D5AE]) [    x:core2] o.a.s.c.SolrCore New index directory detected: old=null new=/home/jenkins/workspace/Lucene-Solr-trunk-Linux/solr/build/solr-core/test/J0/temp/solr.core.TestLazyCores_25CDB97A93D1D5AE-001/tempDir-001/core2/data/index/
   [junit4]   2> 937835 WARN  (TEST-TestLazyCores.testCreateTransientFromAdmin-seed#[25CDB97A93D1D5AE]) [    x:core2] o.a.s.c.SolrCore [core2] Solr index directory '/home/jenkins/workspace/Lucene-Solr-trunk-Linux/solr/build/solr-core/test/J0/temp/solr.core.TestLazyCores_25CDB97A93D1D5AE-001/tempDir-001/core2/data/index' doesn't exist. Creating new index...
   [junit4]   2> 937835 INFO  (TEST-TestLazyCores.testCreateTransientFromAdmin-seed#[25CDB97A93D1D5AE]) [    x:core2] o.a.s.c.CachingDirectoryFactory return new directory for /home/jenkins/workspace/Lucene-Solr-trunk-Linux/solr/build/solr-core/test/J0/temp/solr.core.TestLazyCores_25CDB97A93D1D5AE-001/tempDir-001/core2/data/index
   [junit4]   2> 937835 INFO  (TEST-TestLazyCores.testCreateTransientFromAdmin-seed#[25CDB97A93D1D5AE]) [    x:core2] o.a.s.u.RandomMergePolicy RandomMergePolicy wrapping class org.apache.lucene.index.TieredMergePolicy: [TieredMergePolicy: maxMergeAtOnce=50, maxMergeAtOnceExplicit=29, maxMergedSegmentMB=59.5703125, floorSegmentMB=0.6962890625, forceMergeDeletesPctAllowed=23.0222500010402, segmentsPerTier=28.0, maxCFSSegmentSizeMB=8.796093022207999E12, noCFSRatio=1.0
   [junit4]   2> 937836 INFO  (TEST-TestLazyCores.testCreateTransientFromAdmin-seed#[25CDB97A93D1D5AE]) [    x:core2] o.a.s.c.SolrDeletionPolicy SolrDeletionPolicy.onCommit: commits: num=1
   [junit4]   2> 	commit{dir=MockDirectoryWrapper(RAMDirectory@1cd50bf6 lockFactory=org.apache.lucene.store.SingleInstanceLockFactory@681d0368),segFN=segments_1,generation=1}
   [junit4]   2> 937836 INFO  (TEST-TestLazyCores.testCreateTransientFromAdmin-seed#[25CDB97A93D1D5AE]) [    x:core2] o.a.s.c.SolrDeletionPolicy newest commit generation = 1
   [junit4]   2> 937836 INFO  (OldIndexDirectoryCleanupThreadForCore-core2) [    x:core2] o.a.s.c.SolrCore Looking for old index directories to cleanup for core core2 in /home/jenkins/workspace/Lucene-Solr-trunk-Linux/solr/build/solr-core/test/J0/temp/solr.core.TestLazyCores_25CDB97A93D1D5AE-001/tempDir-001/core2/data/
   [junit4]   2> 937837 WARN  (OldIndexDirectoryCleanupThreadForCore-core2) [    x:core2] o.a.s.c.DirectoryFactory /home/jenkins/workspace/Lucene-Solr-trunk-Linux/solr/build/solr-core/test/J0/temp/solr.core.TestLazyCores_25CDB97A93D1D5AE-001/tempDir-001/core2/data/ does not point to a valid data directory; skipping clean-up of old index directories.
   [junit4]   2> 937837 INFO  (TEST-TestLazyCores.testCreateTransientFromAdmin-seed#[25CDB97A93D1D5AE]) [    x:core2] o.a.s.c.SolrCore no updateRequestProcessorChain defined as default, creating implicit default
   [junit4]   2> 937838 INFO  (TEST-TestLazyCores.testCreateTransientFromAdmin-seed#[25CDB97A93D1D5AE]) [    x:core2] o.a.s.h.l.XMLLoader xsltCacheLifetimeSeconds=60
   [junit4]   2> 937839 INFO  (TEST-TestLazyCores.testCreateTransientFromAdmin-seed#[25CDB97A93D1D5AE]) [    x:core2] o.a.s.h.l.XMLLoader xsltCacheLifetimeSeconds=60
   [junit4]   2> 937839 INFO  (TEST-TestLazyCores.testCreateTransientFromAdmin-seed#[25CDB97A93D1D5AE]) [    x:core2] o.a.s.h.l.XMLLoader xsltCacheLifetimeSeconds=60
   [junit4]   2> 937840 INFO  (TEST-TestLazyCores.testCreateTransientFromAdmin-seed#[25CDB97A93D1D5AE]) [    x:core2] o.a.s.h.l.XMLLoader xsltCacheLifetimeSeconds=60
   [junit4]   2> 937840 INFO  (TEST-TestLazyCores.testCreateTransientFromAdmin-seed#[25CDB97A93D1D5AE]) [    x:core2] o.a.s.c.RequestHandlers Registered paths: /admin/mbeans,/update/csv,/sql,/update/json/docs,/admin/luke,/export,/select,/admin/segments,/get,/admin/system,/replication,/admin/properties,/config,/stream,/schema,/admin/plugins,/admin/logging,/update/json,/admin/threads,/admin/ping,/update,/admin/file
   [junit4]   2> 937840 INFO  (TEST-TestLazyCores.testCreateTransientFromAdmin-seed#[25CDB97A93D1D5AE]) [    x:core2] o.a.s.c.SolrCore Using default statsCache cache: org.apache.solr.search.stats.LocalStatsCache
   [junit4]   2> 937841 INFO  (TEST-TestLazyCores.testCreateTransientFromAdmin-seed#[25CDB97A93D1D5AE]) [    x:core2] o.a.s.u.CommitTracker Hard AutoCommit: disabled
   [junit4]   2> 937841 INFO  (TEST-TestLazyCores.testCreateTransientFromAdmin-seed#[25CDB97A93D1D5AE]) [    x:core2] o.a.s.u.CommitTracker Soft AutoCommit: disabled
   [junit4]   2> 937841 INFO  (TEST-TestLazyCores.testCreateTransientFromAdmin-seed#[25CDB97A93D1D5AE]) [    x:core2] o.a.s.u.RandomMergePolicy RandomMergePolicy wrapping class org.apache.lucene.index.LogByteSizeMergePolicy: [LogByteSizeMergePolicy: minMergeSize=1677721, mergeFactor=42, maxMergeSize=2147483648, maxMergeSizeForForcedMerge=9223372036854775807, calibrateSizeByDeletes=false, maxMergeDocs=2147483647, maxCFSSegmentSizeMB=8.796093022207999E12, noCFSRatio=1.0]
   [junit4]   2> 937841 INFO  (TEST-TestLazyCores.testCreateTransientFromAdmin-seed#[25CDB97A93D1D5AE]) [    x:core2] o.a.s.c.SolrDeletionPolicy SolrDeletionPolicy.onInit: commits: num=1
   [junit4]   2> 	commit{dir=MockDirectoryWrapper(RAMDirectory@1cd50bf6 lockFactory=org.apache.lucene.store.SingleInstanceLockFactory@681d0368),segFN=segments_1,generation=1}
   [junit4]   2> 937841 INFO  (TEST-TestLazyCores.testCreateTransientFromAdmin-seed#[25CDB97A93D1D5AE]) [    x:core2] o.a.s.c.SolrDeletionPolicy newest commit generation = 1
   [junit4]   2> 937841 INFO  (TEST-TestLazyCores.testCreateTransientFromAdmin-seed#[25CDB97A93D1D5AE]) [    x:core2] o.a.s.s.SolrIndexSearcher Opening [Searcher@5e285be9[core2] main]
   [junit4]   2> 937841 INFO  (TEST-TestLazyCores.testCreateTransientFromAdmin-seed#[25CDB97A93D1D5AE]) [    x:core2] o.a.s.r.ManagedResourceStorage File-based storage initialized to use dir: /home/jenkins/workspace/Lucene-Solr-trunk-Linux/solr/build/solr-core/test/J0/temp/solr.core.TestLazyCores_25CDB97A93D1D5AE-001/tempDir-001/core2/conf
   [junit4]   2> 937841 INFO  (TEST-TestLazyCores.testCreateTransientFromAdmin-seed#[25CDB97A93D1D5AE]) [    x:core2] o.a.s.r.RestManager Initializing RestManager with initArgs: {storageDir=/home/jenkins/workspace/Lucene-Solr-trunk-Linux/solr/build/solr-core/test/J0/temp/solr.core.TestLazyCores_25CDB97A93D1D5AE-001/tempDir-001/core2/conf}
   [junit4]   2> 937841 INFO  (TEST-TestLazyCores.testCreateTransientFromAdmin-seed#[25CDB97A93D1D5AE]) [    x:core2] o.a.s.r.ManagedResourceStorage Reading _rest_managed.json using file:dir=/home/jenkins/workspace/Lucene-Solr-trunk-Linux/solr/build/solr-core/test/J0/temp/solr.core.TestLazyCores_25CDB97A93D1D5AE-001/tempDir-001/core2/conf
   [junit4]   2> 937841 INFO  (TEST-TestLazyCores.testCreateTransientFromAdmin-seed#[25CDB97A93D1D5AE]) [    x:core2] o.a.s.r.RestManager Initializing 0 registered ManagedResources
   [junit4]   2> 937841 INFO  (TEST-TestLazyCores.testCreateTransientFromAdmin-seed#[25CDB97A93D1D5AE]) [    x:core2] o.a.s.h.ReplicationHandler Commits will be reserved for  10000
   [junit4]   2> 937842 INFO  (searcherExecutor-4316-thread-1-processing-x:core2) [    x:core2] o.a.s.c.SolrCore [core2] Registered new searcher Searcher@5e285be9[core2] main{ExitableDirectoryReader(UninvertingDirectoryReader())}
   [junit4]   2> 937842 INFO  (TEST-TestLazyCores.testCreateTransientFromAdmin-seed#[25CDB97A93D1D5AE]) [    x:core2] o.a.s.c.SolrCores Opening transient core core2
   [junit4]   2> 937842 INFO  (TEST-TestLazyCores.testCreateTransientFromAdmin-seed#[25CDB97A93D1D5AE]) [    x:core2] o.a.s.c.CoreContainer registering core: core2
   [junit4]   2> 937842 INFO  (TEST-TestLazyCores.testCreateTransientFromAdmin-seed#[25CDB97A93D1D5AE]) [    x:core2] o.a.s.h.a.CoreAdminOperation core create command loadOnStartup=true&transient=true&name=core3&action=CREATE&wt=xml
   [junit4]   2> 937842 INFO  (TEST-TestLazyCores.testCreateTransientFromAdmin-seed#[25CDB97A93D1D5AE]) [    x:core2] o.a.s.c.CoreDescriptor Created CoreDescriptor: {name=core3, config=solrconfig.xml, loadOnStartup=true, schema=schema.xml, configSetProperties=configsetprops.json, transient=true, dataDir=data/}
   [junit4]   2> 937842 INFO  (TEST-TestLazyCores.testCreateTransientFromAdmin-seed#[25CDB97A93D1D5AE]) [    x:core2] o.a.s.c.SolrResourceLoader new SolrResourceLoader for directory: '/home/jenkins/workspace/Lucene-Solr-trunk-Linux/solr/build/solr-core/test/J0/temp/solr.core.TestLazyCores_25CDB97A93D1D5AE-001/tempDir-001/core3'
   [junit4]   2> 937842 INFO  (TEST-TestLazyCores.testCreateTransientFromAdmin-seed#[25CDB97A93D1D5AE]) [    x:core2] o.a.s.c.SolrResourceLoader JNDI not configured for solr (NoInitialContextEx)
   [junit4]   2> 937842 INFO  (TEST-TestLazyCores.testCreateTransientFromAdmin-seed#[25CDB97A93D1D5AE]) [    x:core2] o.a.s.c.SolrResourceLoader solr home defaulted to 'solr/' (could not find system property or JNDI)
   [junit4]   2> 937846 INFO  (TEST-TestLazyCores.testCreateTransientFromAdmin-seed#[25CDB97A93D1D5AE]) [    x:core2] o.a.s.c.SolrConfig current version of requestparams : -1
   [junit4]   2> 937855 INFO  (TEST-TestLazyCores.testCreateTransientFromAdmin-seed#[25CDB97A93D1D5AE]) [    x:core2] o.a.s.c.SolrConfig Using Lucene MatchVersion: 6.0.0
   [junit4]   2> 937859 INFO  (TEST-TestLazyCores.testCreateTransientFromAdmin-seed#[25CDB97A93D1D5AE]) [    x:core2] o.a.s.c.SolrConfig Loaded SolrConfig: solrconfig.xml
   [junit4]   2> 937861 INFO  (TEST-TestLazyCores.testCreateTransientFromAdmin-seed#[25CDB97A93D1D5AE]) [    x:core2] o.a.s.s.IndexSchema [core3] Schema name=tiny
   [junit4]   2> 937863 INFO  (TEST-TestLazyCores.testCreateTransientFromAdmin-seed#[25CDB97A93D1D5AE]) [    x:core2] o.a.s.s.IndexSchema unique key field: id
   [junit4]   2> 937864 INFO  (TEST-TestLazyCores.testCreateTransientFromAdmin-seed#[25CDB97A93D1D5AE]) [    x:core2] o.a.s.c.ConfigSetProperties Did not find ConfigSet properties, assuming default properties: Can't find resource 'configsetprops.json' in classpath or '/home/jenkins/workspace/Lucene-Solr-trunk-Linux/solr/build/solr-core/test/J0/temp/solr.core.TestLazyCores_25CDB97A93D1D5AE-001/tempDir-001/core3'
   [junit4]   2> 937864 INFO  (TEST-TestLazyCores.testCreateTransientFromAdmin-seed#[25CDB97A93D1D5AE]) [    x:core2] o.a.s.c.CoreContainer Creating SolrCore 'core3' using configuration from instancedir /home/jenkins/workspace/Lucene-Solr-trunk-Linux/solr/build/solr-core/test/J0/temp/solr.core.TestLazyCores_25CDB97A93D1D5AE-001/tempDir-001/core3
   [junit4]   2> 937865 INFO  (TEST-TestLazyCores.testCreateTransientFromAdmin-seed#[25CDB97A93D1D5AE]) [    x:core3] o.a.s.c.SolrCore org.apache.solr.core.MockDirectoryFactory
   [junit4]   2> 937865 INFO  (TEST-TestLazyCores.testCreateTransientFromAdmin-seed#[25CDB97A93D1D5AE]) [    x:core3] o.a.s.c.SolrCore [[core3] ] Opening new SolrCore at [/home/jenkins/workspace/Lucene-Solr-trunk-Linux/solr/build/solr-core/test/J0/temp/solr.core.TestLazyCores_25CDB97A93D1D5AE-001/tempDir-001/core3], dataDir=[/home/jenkins/workspace/Lucene-Solr-trunk-Linux/solr/build/solr-core/test/J0/temp/solr.core.TestLazyCores_25CDB97A93D1D5AE-001/tempDir-001/core3/data/]
   [junit4]   2> 937865 INFO  (TEST-TestLazyCores.testCreateTransientFromAdmin-seed#[25CDB97A93D1D5AE]) [    x:core3] o.a.s.c.SolrCore JMX monitoring not detected for core: core3
   [junit4]   2> 937865 INFO  (TEST-TestLazyCores.testCreateTransientFromAdmin-seed#[25CDB97A93D1D5AE]) [    x:core3] o.a.s.c.CachingDirectoryFactory return new directory for /home/jenkins/workspace/Lucene-Solr-trunk-Linux/solr/build/solr-core/test/J0/temp/solr.core.TestLazyCores_25CDB97A93D1D5AE-001/tempDir-001/core3/data
   [junit4]   2> 937866 INFO  (TEST-TestLazyCores.testCreateTransientFromAdmin-seed#[25CDB97A93D1D5AE]) [    x:core3] o.a.s.c.SolrCore New index directory detected: old=null new=/home/jenkins/workspace/Lucene-Solr-trunk-Linux/solr/build/solr-core/test/J0/temp/solr.core.TestLazyCores_25CDB97A93D1D5AE-001/tempDir-001/core3/data/index/
   [junit4]   2> 937866 WARN  (TEST-TestLazyCores.testCreateTransientFromAdmin-seed#[25CDB97A93D1D5AE]) [    x:core3] o.a.s.c.SolrCore [core3] Solr index directory '/home/jenkins/workspace/Lucene-Solr-trunk-Linux/solr/build/solr-core/test/J0/temp/solr.core.TestLazyCores_25CDB97A93D1D5AE-001/tempDir-001/core3/data/index' doesn't exist. Creating new index...
   [junit4]   2> 937866 INFO  (TEST-TestLazyCores.testCreateTransientFromAdmin-seed#[25CDB97A93D1D5AE]) [    x:core3] o.a.s.c.CachingDirectoryFactory return new directory for /home/jenkins/workspace/Lucene-Solr-trunk-Linux/solr/build/solr-core/test/J0/temp/solr.core.TestLazyCores_25CDB97A93D1D5AE-001/tempDir-001/core3/data/index
   [junit4]   2> 937866 INFO  (TEST-TestLazyCores.testCreateTransientFromAdmin-seed#[25CDB97A93D1D5AE]) [    x:core3] o.a.s.u.RandomMergePolicy RandomMergePolicy wrapping class org.apache.lucene.index.TieredMergePolicy: [TieredMergePolicy: maxMergeAtOnce=13, maxMergeAtOnceExplicit=16, maxMergedSegmentMB=58.0146484375, floorSegmentMB=1.26171875, forceMergeDeletesPctAllowed=1.3933538628539188, segmentsPerTier=11.0, maxCFSSegmentSizeMB=8.796093022207999E12, noCFSRatio=1.0
   [junit4]   2> 937867 INFO  (TEST-TestLazyCores.testCreateTransientFromAdmin-seed#[25CDB97A93D1D5AE]) [    x:core3] o.a.s.c.SolrDeletionPolicy SolrDeletionPolicy.onCommit: commits: num=1
   [junit4]   2> 	commit{dir=MockDirectoryWrapper(RAMDirectory@5e490f2f lockFactory=org.apache.lucene.store.SingleInstanceLockFactory@42adb68f),segFN=segments_1,generation=1}
   [junit4]   2> 937867 INFO  (TEST-TestLazyCores.testCreateTransientFromAdmin-seed#[25CDB97A93D1D5AE]) [    x:core3] o.a.s.c.SolrDeletionPolicy newest commit generation = 1
   [junit4]   2> 937867 INFO  (OldIndexDirectoryCleanupThreadForCore-core3) [    x:core3] o.a.s.c.SolrCore Looking for old index directories to cleanup for core core3 in /home/jenkins/workspace/Lucene-Solr-trunk-Linux/solr/build/solr-core/test/J0/temp/solr.core.TestLazyCores_25CDB97A93D1D5AE-001/tempDir-001/core3/data/
   [junit4]   2> 937867 WARN  (OldIndexDirectoryCleanupThreadForCore-core3) [    x:core3] o.a.s.c.DirectoryFactory /home/jenkins/workspace/Lucene-Solr-trunk-Linux/solr/build/solr-core/test/J0/temp/solr.core.TestLazyCores_25CDB97A93D1D5AE-001/tempDir-001/core3/data/ does not point to a valid data directory; skipping clean-up of old index directories.
   [junit4]   2> 937868 INFO  (TEST-TestLazyCores.testCreateTransientFromAdmin-seed#[25CDB97A93D1D5AE]) [    x:core3] o.a.s.c.SolrCore no updateRequestProcessorChain defined as default, creating implicit default
   [junit4]   2> 937869 INFO  (TEST-TestLazyCores.testCreateTransientFromAdmin-seed#[25CDB97A93D1D5AE]) [    x:core3] o.a.s.h.l.XMLLoader xsltCacheLifetimeSeconds=60
   [junit4]   2> 937870 INFO  (TEST-TestLazyCores.testCreateTransientFromAdmin-seed#[25CDB97A93D1D5AE]) [    x:core3] o.a.s.h.l.XMLLoader xsltCacheLifetimeSeconds=60
   [junit4]   2> 937871 INFO  (TEST-TestLazyCores.testCreateTransientFromAdmin-seed#[25CDB97A93D1D5AE]) [    x:core3] o.a.s.h.l.XMLLoader xsltCacheLifetimeSeconds=60
   [junit4]   2> 937871 INFO  (TEST-TestLazyCores.testCreateTransientFromAdmin-seed#[25CDB97A93D1D5AE]) [    x:core3] o.a.s.h.l.XMLLoader xsltCacheLifetimeSeconds=60
   [junit4]   2> 937872 INFO  (TEST-TestLazyCores.testCreateTransientFromAdmin-seed#[25CDB97A93D1D5AE]) [    x:core3] o.a.s.c.RequestHandlers Registered paths: /admin/mbeans,/update/csv,/sql,/update/json/docs,/admin/luke,/export,/select,/admin/segments,/get,/admin/system,/replication,/admin/properties,/config,/stream,/schema,/admin/plugins,/admin/logging,/update/json,/admin/threads,/admin/ping,/update,/admin/file
   [junit4]   2> 937872 INFO  (TEST-TestLazyCores.testCreateTransientFromAdmin-seed#[25CDB97A93D1D5AE]) [    x:core3] o.a.s.c.SolrCore Using default statsCache cache: org.apache.solr.search.stats.LocalStatsCache
   [junit4]   2> 937873 INFO  (TEST-TestLazyCores.testCreateTransientFromAdmin-seed#[25CDB97A93D1D5AE]) [    x:core3] o.a.s.u.CommitTracker Hard AutoCommit: disabled
   [junit4]   2> 937873 INFO  (TEST-TestLazyCores.testCreateTransientFromAdmin-seed#[25CDB97A93D1D5AE]) [    x:core3] o.a.s.u.CommitTracker Soft AutoCommit: disabled
   [junit4]   2> 937873 INFO  (TEST-TestLazyCores.testCreateTransientFromAdmin-seed#[25CDB97A93D1D5AE]) [    x:core3] o.a.s.u.RandomMergePolicy RandomMergePolicy wrapping class org.apache.lucene.index.AlcoholicMergePolicy: [AlcoholicMergePolicy: minMergeSize=0, mergeFactor=10, maxMergeSize=317048090, maxMergeSizeForForcedMerge=9223372036854775807, calibrateSizeByDeletes=true, maxMergeDocs=2147483647, maxCFSSegmentSizeMB=8.796093022207999E12, noCFSRatio=0.1]
   [junit4]   2> 937873 INFO  (TEST-TestLazyCores.testCreateTransientFromAdmin-seed#[25CDB97A93D1D5AE]) [    x:core3] o.a.s.c.SolrDeletionPolicy SolrDeletionPolicy.onInit: commits: num=1
   [junit4]   2> 	commit{dir=MockDirectoryWrapper(RAMDirectory@5e490f2f lockFactory=org.apache.lucene.store.SingleInstanceLockFactory@42adb68f),segFN=segments_1,generation=1}
   [junit4]   2> 937873 INFO  (TEST-TestLazyCores.testCreateTransientFromAdmin-seed#[25CDB97A93D1D5AE]) [    x:core3] o.a.s.c.SolrDeletionPolicy newest commit generation = 1
   [junit4]   2> 937873 INFO  (TEST-TestLazyCores.testCreateTransientFromAdmin-seed#[25CDB97A93D1D5AE]) [    x:core3] o.a.s.s.SolrIndexSearcher Opening [Searcher@373b733c[core3] main]
   [junit4]   2> 937874 INFO  (TEST-TestLazyCores.testCreateTransientFromAdmin-seed#[25CDB97A93D1D5AE]) [    x:core3] o.a.s.r.ManagedResourceStorage File-based storage initialized to use dir: /home/jenkins/workspace/Lucene-Solr-trunk-Linux/solr/build/solr-core/test/J0/temp/solr.core.TestLazyCores_25CDB97A93D1D5AE-001/tempDir-001/core3/conf
   [junit4]   2> 937874 INFO  (TEST-TestLazyCores.testCreateTransientFromAdmin-seed#[25CDB97A93D1D5AE]) [    x:core3] o.a.s.r.RestManager Initializing RestManager with initArgs: {storageDir=/home/jenkins/workspace/Lucene-Solr-trunk-Linux/solr/build/solr-core/test/J0/temp/solr.core.TestLazyCores_25CDB97A93D1D5AE-001/tempDir-001/core3/conf}
   [junit4]   2> 937874 INFO  (TEST-TestLazyCores.testCreateTransientFromAdmin-seed#[25CDB97A93D1D5AE]) [    x:core3] o.a.s.r.ManagedResourceStorage Reading _rest_managed.json using file:dir=/home/jenkins/workspace/Lucene-Solr-trunk-Linux/solr/build/solr-core/test/J0/temp/solr.core.TestLazyCores_25CDB97A93D1D5AE-001/tempDir-001/core3/conf
   [junit4]   2> 937874 INFO  (TEST-TestLazyCores.testCreateTransientFromAdmin-seed#[25CDB97A93D1D5AE]) [    x:core3] o.a.s.r.RestManager Initializing 0 registered ManagedResources
   [junit4]   2> 937874 INFO  (TEST-TestLazyCores.testCreateTransientFromAdmin-seed#[25CDB97A93D1D5AE]) [    x:core3] o.a.s.h.ReplicationHandler Commits will be reserved for  10000
   [junit4]   2> 937874 INFO  (searcherExecutor-4321-thread-1-processing-x:core3) [    x:core3] o.a.s.c.SolrCore [core3] Registered new searcher Searcher@373b733c[core3] main{ExitableDirectoryReader(UninvertingDirectoryReader())}
   [junit4]   2> 937874 INFO  (TEST-TestLazyCores.testCreateTransientFromAdmin-seed#[25CDB97A93D1D5AE]) [    x:core3] o.a.s.c.SolrCores Opening transient core core3
   [junit4]   2> 937874 INFO  (TEST-TestLazyCores.testCreateTransientFromAdmin-seed#[25CDB97A93D1D5AE]) [    x:core3] o.a.s.c.CoreContainer registering core: core3
   [junit4]   2> 937875 INFO  (TEST-TestLazyCores.testCreateTransientFromAdmin-seed#[25CDB97A93D1D5AE]) [    x:core3] o.a.s.h.a.CoreAdminOperation core create command loadOnStartup=false&transient=true&name=core4&action=CREATE&wt=xml
   [junit4]   2> 937875 INFO  (TEST-TestLazyCores.testCreateTransientFromAdmin-seed#[25CDB97A93D1D5AE]) [    x:core3] o.a.s.c.CoreDescriptor Created CoreDescriptor: {name=core4, config=solrconfig.xml, loadOnStartup=false, schema=schema.xml, configSetProperties=configsetprops.json, transient=true, dataDir=data/}
   [junit4]   2> 937875 INFO  (TEST-TestLazyCores.testCreateTransientFromAdmin-seed#[25CDB97A93D1D5AE]) [    x:core3] o.a.s.c.SolrResourceLoader new SolrResourceLoader for directory: '/home/jenkins/workspace/Lucene-Solr-trunk-Linux/solr/build/solr-core/test/J0/temp/solr.core.TestLazyCores_25CDB97A93D1D5AE-001/tempDir-001/core4'
   [junit4]   2> 937875 INFO  (TEST-TestLazyCores.testCreateTransientFromAdmin-seed#[25CDB97A93D1D5AE]) [    x:core3] o.a.s.c.SolrResourceLoader JNDI not configured for solr (NoInitialContextEx)
   [junit4]   2> 937875 INFO  (TEST-TestLazyCores.testCreateTransientFromAdmin-seed#[25CDB97A93D1D5AE]) [    x:core3] o.a.s.c.SolrResourceLoader solr home defaulted to 'solr/' (could not find system property or JNDI)
   [junit4]   2> 937881 INFO  (TEST-TestLazyCores.testCreateTransientFromAdmin-seed#[25CDB97A93D1D5AE]) [    x:core3] o.a.s.c.SolrConfig current version of requestparams : -1
   [junit4]   2> 937883 INFO  (TEST-TestLazyCores.testCreateTransientFromAdmin-seed#[25CDB97A93D1D5AE]) [    x:core3] o.a.s.c.SolrConfig Using Lucene MatchVersion: 6.0.0
   [junit4]   2> 937887 INFO  (TEST-TestLazyCores.testCreateTransientFromAdmin-seed#[25CDB97A93D1D5AE]) [    x:core3] o.a.s.c.SolrConfig Loaded SolrConfig: solrconfig.xml
   [junit4]   2> 937889 INFO  (TEST-TestLazyCores.testCreateTransientFromAdmin-seed#[25CDB97A93D1D5AE]) [    x:core3] o.a.s.s.IndexSchema [core4] Schema name=tiny
   [junit4]   2> 937891 INFO  (TEST-TestLazyCores.testCreateTransientFromAdmin-seed#[25CDB97A93D1D5AE]) [    x:core3] o.a.s.s.IndexSchema unique key field: id
   [junit4]   2> 937892 INFO  (TEST-TestLazyCores.testCreateTransientFromAdmin-seed#[25CDB97A93D1D5AE]) [    x:core3] o.a.s.c.ConfigSetProperties Did not find ConfigSet properties, assuming default properties: Can't find resource 'configsetprops.json' in classpath or '/home/jenkins/workspace/Lucene-Solr-trunk-Linux/solr/build/solr-core/test/J0/temp/solr.core.TestLazyCores_25CDB97A93D1D5AE-001/tempDir-001/core4'
   [junit4]   2> 937892 INFO  (TEST-TestLazyCores.testCreateTransientFromAdmin-seed#[25CDB97A93D1D5AE]) [    x:core3] o.a.s.c.CoreContainer Creating SolrCore 'core4' using configuration from instancedir /home/jenkins/workspace/Lucene-Solr-trunk-Linux/solr/build/solr-core/test/J0/temp/solr.core.TestLazyCores_25CDB97A93D1D5AE-001/tempDir-001/core4
   [junit4]   2> 937893 INFO  (TEST-TestLazyCores.testCreateTransientFromAdmin-seed#[25CDB97A93D1D5AE]) [    x:core4] o.a.s.c.SolrCore org.apache.solr.core.MockDirectoryFactory
   [junit4]   2> 937893 INFO  (TEST-TestLazyCores.testCreateTransientFromAdmin-seed#[25CDB97A93D1D5AE]) [    x:core4] o.a.s.c.SolrCore [[core4] ] Opening new SolrCore at [/home/jenkins/workspace/Lucene-Solr-trunk-Linux/solr/build/solr-core/test/J0/temp/solr.core.TestLazyCores_25CDB97A93D1D5AE-001/tempDir-001/core4], dataDir=[/home/jenkins/workspace/Lucene-Solr-trunk-Linux/solr/build/solr-core/test/J0/temp/solr.core.TestLazyCores_25CDB97A93D1D5AE-001/tempDir-001/core4/data/]
   [junit4]   2> 937893 INFO  (TEST-TestLazyCores.testCreateTransientFromAdmin-seed#[25CDB97A93D1D5AE]) [    x:core4] o.a.s.c.SolrCore JMX monitoring not detected for core: core4
   [junit4]   2> 937893 INFO  (TEST-TestLazyCores.testCreateTransientFromAdmin-seed#[25CDB97A93D1D5AE]) [    x:core4] o.a.s.c.CachingDirectoryFactory return new directory for /home/jenkins/workspace/Lucene-Solr-trunk-Linux/solr/build/solr-core/test/J0/temp/solr.core.TestLazyCores_25CDB97A93D1D5AE-001/tempDir-001/core4/data
   [junit4]   2> 937894 INFO  (TEST-TestLazyCores.testCreateTransientFromAdmin-seed#[25CDB97A93D1D5AE]) [    x:core4] o.a.s.c.SolrCore New index directory detected: old=null new=/home/jenkins/workspace/Lucene-Solr-trunk-Linux/solr/build/solr-core/test/J0/temp/solr.core.TestLazyCores_25CDB97A93D1D5AE-001/tempDir-001/core4/data/index/
   [junit4]   2> 937894 WARN  (TEST-TestLazyCores.testCreateTransientFromAdmin-seed#[25CDB97A93D1D5AE]) [    x:core4] o.a.s.c.SolrCore [core4] Solr index directory '/home/jenkins/workspace/Lucene-Solr-trunk-Linux/solr/build/solr-core/test/J0/temp/solr.core.TestLazyCores_25CDB97A93D1D5AE-001/tempDir-001/core4/data/index' doesn't exist. Creating new index...
   [junit4]   2> 937894 INFO  (TEST-TestLazyCores.testCreateTransientFromAdmin-seed#[25CDB97A93D1D5AE]) [    x:core4] o.a.s.c.CachingDirectoryFactory return new directory for /home/jenkins/workspace/Lucene-Solr-trunk-Linux/solr/build/solr-core/test/J0/temp/solr.core.TestLazyCores_25CDB97A93D1D5AE-001/tempDir-001/core4/data/index
   [junit4]   2> 937894 INFO  (TEST-TestLazyCores.testCreateTransientFromAdmin-seed#[25CDB97A93D1D5AE]) [    x:core4] o.a.s.u.RandomMergePolicy RandomMergePolicy wrapping class org.apache.lucene.index.TieredMergePolicy: [TieredMergePolicy: maxMergeAtOnce=40, maxMergeAtOnceExplicit=44, maxMergedSegmentMB=50.029296875, floorSegmentMB=1.5556640625, forceMergeDeletesPctAllowed=13.196665787669339, segmentsPerTier=26.0, maxCFSSegmentSizeMB=8.796093022207999E12, noCFSRatio=0.5073661065839413
   [junit4]   2> 937895 INFO  (TEST-TestLazyCores.testCreateTransientFromAdmin-seed#[25CDB97A93D1D5AE]) [    x:core4] o.a.s.c.SolrDeletionPolicy SolrDeletionPolicy.onCommit: commits: num=1
   [junit4]   2> 	commit{dir=MockDirectoryWrapper(RAMDirectory@7b2762b4 lockFactory=org.apache.lucene.store.SingleInstanceLockFactory@439db5c2),segFN=segments_1,generation=1}
   [junit4]   2> 937895 INFO  (TEST-TestLazyCores.testCreateTransientFromAdmin-seed#[25CDB97A93D1D5AE]) [    x:core4] o.a.s.c.SolrDeletionPolicy newest commit generation = 1
   [junit4]   2> 937895 INFO  (OldIndexDirectoryCleanupThreadForCore-core4) [    x:core4] o.a.s.c.SolrCore Looking for old index directories to cleanup for core core4 in /home/jenkins/workspace/Lucene-Solr-trunk-Linux/solr/build/solr-core/test/J0/temp/solr.core.TestLazyCores_25CDB97A93D1D5AE-001/tempDir-001/core4/data/
   [junit4]   2> 937895 WARN  (OldIndexDirectoryCleanupThreadForCore-core4) [    x:core4] o.a.s.c.DirectoryFactory /home/jenkins/workspace/Lucene-Solr-trunk-Linux/solr/build/solr-core/test/J0/temp/solr.core.TestLazyCores_25CDB97A93D1D5AE-001/tempDir-001/core4/data/ does not point to a valid data directory; skipping clean-up of old index directories.
   [junit4]   2> 937896 INFO  (TEST-TestLazyCores.testCreateTransientFromAdmin-seed#[25CDB97A93D1D5AE]) [    x:core4] o.a.s.c.SolrCore no updateRequestProcessorChain defined as default, creating implicit default
   [junit4]   2> 937897 INFO  (TEST-TestLazyCores.testCreateTransientFromAdmin-seed#[25CDB97A93D1D5AE]) [    x:core4] o.a.s.h.l.XMLLoader xsltCacheLifetimeSeconds=60
   [junit4]   2> 937898 INFO  (TEST-TestLazyCores.testCreateTransientFromAdmin-seed#[25CDB97A93D1D5AE]) [    x:core4] o.a.s.h.l.XMLLoader xsltCacheLifetimeSeconds=60
   [junit4]   2> 937899 INFO  (TEST-TestLazyCores.testCreateTransientFromAdmin-seed#[25CDB97A93D1D5AE]) [    x:core4] o.a.s.h.l.XMLLoader xsltCacheLifetimeSeconds=60
   [junit4]   2> 937899 INFO  (TEST-TestLazyCores.testCreateTransientFromAdmin-seed#[25CDB97A93D1D5AE]) [    x:core4] o.a.s.h.l.XMLLoader xsltCacheLifetimeSeconds=60
   [junit4]   2> 937900 INFO  (TEST-TestLazyCores.testCreateTransientFromAdmin-seed#[25CDB97A93D1D5AE]) [    x:core4] o.a.s.c.RequestHandlers Registered paths: /admin/mbeans,/update/csv,/sql,/update/json/docs,/admin/luke,/export,/select,/admin/segments,/get,/admin/system,/replication,/admin/properties,/config,/stream,/schema,/admin/plugins,/admin/logging,/update/json,/admin/threads,/admin/ping,/update,/admin/file
   [junit4]   2> 937901 INFO  (TEST-TestLazyCores.testCreateTransientFromAdmin-seed#[25CDB97A93D1D5AE]) [    x:core4] o.a.s.c.SolrCore Using default statsCache cache: org.apache.solr.search.stats.LocalStatsCache
   [junit4]   2> 937901 INFO  (TEST-TestLazyCores.testCreateTransientFromAdmin-seed#[25CDB97A93D1D5AE]) [    x:core4] o.a.s.u.CommitTracker Hard AutoCommit: disabled
   [junit4]   2> 937901 INFO  (TEST-TestLazyCores.testCreateTransientFromAdmin-seed#[25CDB97A93D1D5AE]) [    x:core4] o.a.s.u.CommitTracker Soft AutoCommit: disabled
   [junit4]   2> 937901 INFO  (TEST-TestLazyCores.testCreateTransientFromAdmin-seed#[25CDB97A93D1D5AE]) [    x:core4] o.a.s.u.RandomMergePolicy RandomMergePolicy wrapping class org.apache.lucene.index.LogDocMergePolicy: [LogDocMergePolicy: minMergeSize=1000, mergeFactor=15, maxMergeSize=9223372036854775807, maxMergeSizeForForcedMerge=9223372036854775807, calibrateSizeByDeletes=false, maxMergeDocs=2147483647, maxCFSSegmentSizeMB=8.796093022207999E12, noCFSRatio=0.45694022372567156]
   [junit4]   2> 937901 INFO  (TEST-TestLazyCores.testCreateTransientFromAdmin-seed#[25CDB97A93D1D5AE]) [    x:core4] o.a.s.c.SolrDeletionPolicy SolrDeletionPolicy.onInit: commits: num=1
   [junit4]   2> 	commit{dir=MockDirectoryWrapper(RAMDirectory@7b2762b4 lockFactory=org.apache.lucene.store.SingleInstanceLockFactory@439db5c2),segFN=segments_1,generation=1}
   [junit4]   2> 937901 INFO  (TEST-TestLazyCores.testCreateTransientFromAdmin-seed#[25CDB97A93D1D5AE]) [    x:core4] o.a.s.c.SolrDeletionPolicy newest commit generation = 1
   [junit4]   2> 937902 INFO  (TEST-TestLazyCores.testCreateTransientFromAdmin-seed#[25CDB97A93D1D5AE]) [    x:core4] o.a.s.s.SolrIndexSearcher Opening [Searcher@45349d75[core4] main]
   [junit4]   2> 937902 INFO  (TEST-TestLazyCores.testCreateTransientFromAdmin-seed#[25CDB97A93D1D5AE]) [    x:core4] o.a.s.r.ManagedResourceStorage File-based storage initialized to use dir: /home/jenkins/workspace/Lucene-Solr-trunk-Linux/solr/build/solr-core/test/J0/temp/solr.core.TestLazyCores_25CDB97A93D1D5AE-001/tempDir-001/core4/conf
   [junit4]   2> 937902 INFO  (TEST-TestLazyCores.testCreateTransientFromAdmin-seed#[25CDB97A93D1D5AE]) [    x:core4] o.a.s.r.RestManager Initializing RestManager with initArgs: {storageDir=/home/jenkins/workspace/Lucene-Solr-trunk-Linux/solr/build/solr-core/test/J0/temp/solr.core.TestLazyCores_25CDB97A93D1D5AE-001/tempDir-001/core4/conf}
   [junit4]   2> 937902 INFO  (TEST-TestLazyCores.testCreateTransientFromAdmin-seed#[25CDB97A93D1D5AE]) [    x:core4] o.a.s.r.ManagedResourceStorage Reading _rest_managed.json using file:dir=/home/jenkins/workspace/Lucene-Solr-trunk-Linux/solr/build/solr-core/test/J0/temp/solr.core.TestLazyCores_25CDB97A93D1D5AE-001/tempDir-001/core4/conf
   [junit4]   2> 937902 INFO  (TEST-TestLazyCores.testCreateTransientFromAdmin-seed#[25CDB97A93D1D5AE]) [    x:core4] o.a.s.r.RestManager Initializing 0 registered ManagedResources
   [junit4]   2> 937902 INFO  (TEST-TestLazyCores.testCreateTransientFromAdmin-seed#[25CDB97A93D1D5AE]) [    x:core4] o.a.s.h.ReplicationHandler Commits will be reserved for  10000
   [junit4]   2> 937902 INFO  (searcherExecutor-4326-thread-1-processing-x:core4) [    x:core4] o.a.s.c.SolrCore [core4] Registered new searcher Searcher@45349d75[core4] main{ExitableDirectoryReader(UninvertingDirectoryReader())}
   [junit4]   2> 937903 INFO  (TEST-TestLazyCores.testCreateTransientFromAdmin-seed#[25CDB97A93D1D5AE]) [    x:core4] o.a.s.c.SolrCores Opening transient core core4
   [junit4]   2> 937903 INFO  (TEST-TestLazyCores.testCreateTransientFromAdmin-seed#[25CDB97A93D1D5AE]) [    x:core4] o.a.s.c.SolrCores Closing transient core [collection2]
   [junit4]   2> 937903 INFO  (TEST-TestLazyCores.testCreateTransientFromAdmin-seed#[25CDB97A93D1D5AE]) [    x:core4] o.a.s.c.CoreContainer registering core: core4
   [junit4]   2> 937903 INFO  (Thread-3578) [    ] o.a.s.c.SolrCore [collection2]  CLOSING SolrCore org.apache.solr.core.SolrCore@16b2b03f
   [junit4]   2> 937903 INFO  (TEST-TestLazyCores.testCreateTransientFromAdmin-seed#[25CDB97A93D1D5AE]) [    x:core4] o.a.s.h.a.CoreAdminOperation core create command loadOnStartup=false&transient=true&name=core5&action=CREATE&wt=xml
   [junit4]   2> 937903 INFO  (

[...truncated too long message...]

.Thread.run(Thread.java:745)
   [junit4]   2> 
   [junit4]   2> Jan 13, 2016 7:15:46 PM com.carrotsearch.randomizedtesting.ThreadLeakControl checkThreadLeaks
   [junit4]   2> WARNING: Will linger awaiting termination of 1 leaked thread(s).
   [junit4]   2> Jan 13, 2016 7:16:06 PM com.carrotsearch.randomizedtesting.ThreadLeakControl checkThreadLeaks
   [junit4]   2> SEVERE: 1 thread leaked from SUITE scope at org.apache.solr.core.TestLazyCores: 
   [junit4]   2>    1) Thread[id=8480, name=searcherExecutor-4335-thread-1, state=WAITING, group=TGRP-TestLazyCores]
   [junit4]   2>         at sun.misc.Unsafe.park(Native Method)
   [junit4]   2>         at java.util.concurrent.locks.LockSupport.park(LockSupport.java:175)
   [junit4]   2>         at java.util.concurrent.locks.AbstractQueuedSynchronizer$ConditionObject.await(AbstractQueuedSynchronizer.java:2039)
   [junit4]   2>         at java.util.concurrent.LinkedBlockingQueue.take(LinkedBlockingQueue.java:442)
   [junit4]   2>         at java.util.concurrent.ThreadPoolExecutor.getTask(ThreadPoolExecutor.java:1067)
   [junit4]   2>         at java.util.concurrent.ThreadPoolExecutor.runWorker(ThreadPoolExecutor.java:1127)
   [junit4]   2>         at java.util.concurrent.ThreadPoolExecutor$Worker.run(ThreadPoolExecutor.java:617)
   [junit4]   2>         at java.lang.Thread.run(Thread.java:745)
   [junit4]   2> Jan 13, 2016 7:16:06 PM com.carrotsearch.randomizedtesting.ThreadLeakControl tryToInterruptAll
   [junit4]   2> INFO: Starting to interrupt leaked threads:
   [junit4]   2>    1) Thread[id=8480, name=searcherExecutor-4335-thread-1, state=WAITING, group=TGRP-TestLazyCores]
   [junit4]   2> Jan 13, 2016 7:16:09 PM com.carrotsearch.randomizedtesting.ThreadLeakControl tryToInterruptAll
   [junit4]   2> SEVERE: There are still zombie threads that couldn't be terminated:
   [junit4]   2>    1) Thread[id=8480, name=searcherExecutor-4335-thread-1, state=WAITING, group=TGRP-TestLazyCores]
   [junit4]   2>         at sun.misc.Unsafe.park(Native Method)
   [junit4]   2>         at java.util.concurrent.locks.LockSupport.park(LockSupport.java:175)
   [junit4]   2>         at java.util.concurrent.locks.AbstractQueuedSynchronizer$ConditionObject.await(AbstractQueuedSynchronizer.java:2039)
   [junit4]   2>         at java.util.concurrent.LinkedBlockingQueue.take(LinkedBlockingQueue.java:442)
   [junit4]   2>         at java.util.concurrent.ThreadPoolExecutor.getTask(ThreadPoolExecutor.java:1067)
   [junit4]   2>         at java.util.concurrent.ThreadPoolExecutor.runWorker(ThreadPoolExecutor.java:1127)
   [junit4]   2>         at java.util.concurrent.ThreadPoolExecutor$Worker.run(ThreadPoolExecutor.java:617)
   [junit4]   2>         at java.lang.Thread.run(Thread.java:745)
   [junit4]   2> NOTE: test params are: codec=Asserting(Lucene60): {v_t=PostingsFormat(name=Direct), id=PostingsFormat(name=Direct), v_s=FSTOrd50, v_f=PostingsFormat(name=LuceneVarGapFixedInterval)}, docValues:{}, sim=ClassicSimilarity, locale=ar_SD, timezone=Asia/Katmandu
   [junit4]   2> NOTE: Linux 3.19.0-42-generic amd64/Oracle Corporation 1.8.0_66 (64-bit)/cpus=12,threads=2,free=133923840,total=532152320
   [junit4]   2> NOTE: All tests run in this JVM: [TestManagedSchemaFieldResource, CurrencyFieldOpenExchangeTest, PolyFieldTest, ResponseLogComponentTest, TestShortCircuitedRequests, SignatureUpdateProcessorFactoryTest, SolrCoreTest, DistanceUnitsTest, SpatialRPTFieldTypeTest, TestAtomicUpdateErrorCases, TestRestManager, XsltUpdateRequestHandlerTest, TestFieldTypeCollectionResource, TestMergePolicyConfig, DistributedFacetPivotLongTailTest, CoreAdminCreateDiscoverTest, TestReplicaProperties, TestImplicitCoreProperties, CdcrReplicationDistributedZkTest, SOLR749Test, TestRawResponseWriter, GraphQueryTest, TestFreeTextSuggestions, DistributedSpellCheckComponentTest, InfoHandlerTest, TestFaceting, TestFunctionQuery, TestSQLHandler, HdfsLockFactoryTest, TestOrdValues, AlternateDirectoryTest, ZkNodePropsTest, ExternalFileFieldSortTest, TestBadConfig, TestCrossCoreJoin, TestPhraseSuggestions, LeaderInitiatedRecoveryOnCommitTest, TestAnalyzeInfixSuggestions, RuleEngineTest, TestDocSet, TestExclusionRuleCollectionAccess, TestHighlightDedupGrouping, TestComponentsName, DateFieldTest, TestFoldingMultitermQuery, PreAnalyzedFieldTest, PathHierarchyTokenizerFactoryTest, ReplicationFactorTest, TestRecoveryHdfs, BasicZkTest, CopyFieldTest, TestLMDirichletSimilarityFactory, QueryElevationComponentTest, TestManagedSynonymFilterFactory, TestSchemaNameResource, DateRangeFieldTest, HdfsNNFailoverTest, CdcrVersionReplicationTest, HdfsRestartWhileUpdatingTest, TestRTGBase, QueryResultKeyTest, TestRandomForceMergePolicy, DeleteShardTest, DeleteInactiveReplicaTest, TestCryptoKeys, TestLRUCache, TestExpandComponent, TestFieldSortValues, TestManagedSchema, TestSortingResponseWriter, TestExceedMaxTermLength, TestSchemaVersionResource, TestConfigSetsAPI, TestCloudInspectUtil, TestCopyFieldCollectionResource, TestOmitPositions, TestRandomDVFaceting, TestValueSourceCache, SortSpecParsingTest, TestJsonRequest, DistributedSuggestComponentTest, CursorMarkTest, TestBinaryField, SyncSliceTest, RAMDirectoryFactoryTest, QueryEqualityTest, TestSolr4Spatial, CursorPagingTest, JavabinLoaderTest, PrimUtilsTest, TestSolrConfigHandler, TestRemoteStreaming, TestDistribIDF, BitVectorTest, ConnectionReuseTest, BasicDistributedZkTest, BasicDistributedZk2Test, LeaderElectionIntegrationTest, ShardRoutingTest, TestReplicationHandler, TestHashPartitioner, TestJoin, TestRangeQuery, TestCoreContainer, StatsComponentTest, TestGroupingSearch, SolrCmdDistributorTest, TestSort, BasicFunctionalityTest, TestLazyCores]
   [junit4]   2> NOTE: reproduce with: ant test  -Dtestcase=TestLazyCores -Dtests.seed=25CDB97A93D1D5AE -Dtests.multiplier=3 -Dtests.slow=true -Dtests.locale=ar_SD -Dtests.timezone=Asia/Katmandu -Dtests.asserts=true -Dtests.file.encoding=ISO-8859-1
   [junit4] ERROR   0.00s J0 | TestLazyCores (suite) <<<
   [junit4]    > Throwable #1: java.lang.AssertionError: ObjectTracker found 4 object(s) that were not released!!! [SolrCore, MockDirectoryWrapper, MDCAwareThreadPoolExecutor, MockDirectoryWrapper]
   [junit4]    > 	at __randomizedtesting.SeedInfo.seed([25CDB97A93D1D5AE]:0)
   [junit4]    > 	at org.apache.solr.SolrTestCaseJ4.afterClass(SolrTestCaseJ4.java:229)
   [junit4]    > 	at java.lang.Thread.run(Thread.java:745)Throwable #2: com.carrotsearch.randomizedtesting.ThreadLeakError: 1 thread leaked from SUITE scope at org.apache.solr.core.TestLazyCores: 
   [junit4]    >    1) Thread[id=8480, name=searcherExecutor-4335-thread-1, state=WAITING, group=TGRP-TestLazyCores]
   [junit4]    >         at sun.misc.Unsafe.park(Native Method)
   [junit4]    >         at java.util.concurrent.locks.LockSupport.park(LockSupport.java:175)
   [junit4]    >         at java.util.concurrent.locks.AbstractQueuedSynchronizer$ConditionObject.await(AbstractQueuedSynchronizer.java:2039)
   [junit4]    >         at java.util.concurrent.LinkedBlockingQueue.take(LinkedBlockingQueue.java:442)
   [junit4]    >         at java.util.concurrent.ThreadPoolExecutor.getTask(ThreadPoolExecutor.java:1067)
   [junit4]    >         at java.util.concurrent.ThreadPoolExecutor.runWorker(ThreadPoolExecutor.java:1127)
   [junit4]    >         at java.util.concurrent.ThreadPoolExecutor$Worker.run(ThreadPoolExecutor.java:617)
   [junit4]    >         at java.lang.Thread.run(Thread.java:745)
   [junit4]    > 	at __randomizedtesting.SeedInfo.seed([25CDB97A93D1D5AE]:0)Throwable #3: com.carrotsearch.randomizedtesting.ThreadLeakError: There are still zombie threads that couldn't be terminated:
   [junit4]    >    1) Thread[id=8480, name=searcherExecutor-4335-thread-1, state=WAITING, group=TGRP-TestLazyCores]
   [junit4]    >         at sun.misc.Unsafe.park(Native Method)
   [junit4]    >         at java.util.concurrent.locks.LockSupport.park(LockSupport.java:175)
   [junit4]    >         at java.util.concurrent.locks.AbstractQueuedSynchronizer$ConditionObject.await(AbstractQueuedSynchronizer.java:2039)
   [junit4]    >         at java.util.concurrent.LinkedBlockingQueue.take(LinkedBlockingQueue.java:442)
   [junit4]    >         at java.util.concurrent.ThreadPoolExecutor.getTask(ThreadPoolExecutor.java:1067)
   [junit4]    >         at java.util.concurrent.ThreadPoolExecutor.runWorker(ThreadPoolExecutor.java:1127)
   [junit4]    >         at java.util.concurrent.ThreadPoolExecutor$Worker.run(ThreadPoolExecutor.java:617)
   [junit4]    >         at java.lang.Thread.run(Thread.java:745)
   [junit4]    > 	at __randomizedtesting.SeedInfo.seed([25CDB97A93D1D5AE]:0)
   [junit4] Completed [428/576 (1!)] on J0 in 145.30s, 7 tests, 1 failure, 2 errors <<< FAILURES!

[...truncated 508 lines...]
BUILD FAILED
/home/jenkins/workspace/Lucene-Solr-trunk-Linux/build.xml:784: The following error occurred while executing this line:
/home/jenkins/workspace/Lucene-Solr-trunk-Linux/build.xml:728: The following error occurred while executing this line:
/home/jenkins/workspace/Lucene-Solr-trunk-Linux/build.xml:59: The following error occurred while executing this line:
/home/jenkins/workspace/Lucene-Solr-trunk-Linux/solr/build.xml:233: The following error occurred while executing this line:
/home/jenkins/workspace/Lucene-Solr-trunk-Linux/solr/common-build.xml:522: The following error occurred while executing this line:
/home/jenkins/workspace/Lucene-Solr-trunk-Linux/lucene/common-build.xml:1424: The following error occurred while executing this line:
/home/jenkins/workspace/Lucene-Solr-trunk-Linux/lucene/common-build.xml:981: There were test failures: 576 suites (8 ignored), 2305 tests, 3 suite-level errors, 481 ignored (66 assumptions) [seed: 25CDB97A93D1D5AE]

Total time: 38 minutes 13 seconds
Build step 'Invoke Ant' marked build as failure
Archiving artifacts
[WARNINGS] Skipping publisher since build result is FAILURE
Recording test results
Email was triggered for: Failure - Any
Sending email for trigger: Failure - Any



Mime
View raw message