lucene-dev mailing list archives

Site index · List index
Message view « Date » · « Thread »
Top « Date » · « Thread »
From Policeman Jenkins Server <jenk...@thetaphi.de>
Subject [JENKINS-EA] Lucene-Solr-trunk-Linux (32bit/jdk-9-ea+95) - Build # 15484 - Still Failing!
Date Fri, 08 Jan 2016 16:29:31 GMT
Build: http://jenkins.thetaphi.de/job/Lucene-Solr-trunk-Linux/15484/
Java: 32bit/jdk-9-ea+95 -server -XX:+UseG1GC -XX:-CompactStrings

1 tests failed.
FAILED:  org.apache.solr.cloud.HttpPartitionTest.test

Error Message:
Didn't see all replicas for shard shard1 in c8n_1x2 come up within 30000 ms! ClusterState: {   "collection1":{     "replicationFactor":"1",     "shards":{       "shard1":{         "range":"80000000-ffffffff",         "state":"active",         "replicas":{"core_node2":{             "core":"collection1",             "base_url":"http://127.0.0.1:37914",             "node_name":"127.0.0.1:37914_",             "state":"active",             "leader":"true"}}},       "shard2":{         "range":"0-7fffffff",         "state":"active",         "replicas":{           "core_node1":{             "core":"collection1",             "base_url":"http://127.0.0.1:42728",             "node_name":"127.0.0.1:42728_",             "state":"active",             "leader":"true"},           "core_node3":{             "core":"collection1",             "base_url":"http://127.0.0.1:33470",             "node_name":"127.0.0.1:33470_",             "state":"active"}}}},     "router":{"name":"compositeId"},     "maxShardsPerNode":"1",     "autoAddReplicas":"false",     "autoCreated":"true"},   "control_collection":{     "replicationFactor":"1",     "shards":{"shard1":{         "range":"80000000-7fffffff",         "state":"active",         "replicas":{"core_node1":{             "core":"collection1",             "base_url":"http://127.0.0.1:54641",             "node_name":"127.0.0.1:54641_",             "state":"active",             "leader":"true"}}}},     "router":{"name":"compositeId"},     "maxShardsPerNode":"1",     "autoAddReplicas":"false",     "autoCreated":"true"},   "c8n_1x2":{     "replicationFactor":"2",     "shards":{"shard1":{         "range":"80000000-7fffffff",         "state":"active",         "replicas":{           "core_node1":{             "core":"c8n_1x2_shard1_replica2",             "base_url":"http://127.0.0.1:37914",             "node_name":"127.0.0.1:37914_",             "state":"recovering"},           "core_node2":{             "core":"c8n_1x2_shard1_replica1",             "base_url":"http://127.0.0.1:54641",             "node_name":"127.0.0.1:54641_",             "state":"active",             "leader":"true"}}}},     "router":{"name":"compositeId"},     "maxShardsPerNode":"1",     "autoAddReplicas":"false"},   "collMinRf_1x3":{     "replicationFactor":"3",     "shards":{"shard1":{         "range":"80000000-7fffffff",         "state":"active",         "replicas":{           "core_node1":{             "core":"collMinRf_1x3_shard1_replica3",             "base_url":"http://127.0.0.1:54641",             "node_name":"127.0.0.1:54641_",             "state":"active"},           "core_node2":{             "core":"collMinRf_1x3_shard1_replica2",             "base_url":"http://127.0.0.1:33470",             "node_name":"127.0.0.1:33470_",             "state":"active"},           "core_node3":{             "core":"collMinRf_1x3_shard1_replica1",             "base_url":"http://127.0.0.1:42728",             "node_name":"127.0.0.1:42728_",             "state":"active",             "leader":"true"}}}},     "router":{"name":"compositeId"},     "maxShardsPerNode":"1",     "autoAddReplicas":"false"}}

Stack Trace:
java.lang.AssertionError: Didn't see all replicas for shard shard1 in c8n_1x2 come up within 30000 ms! ClusterState: {
  "collection1":{
    "replicationFactor":"1",
    "shards":{
      "shard1":{
        "range":"80000000-ffffffff",
        "state":"active",
        "replicas":{"core_node2":{
            "core":"collection1",
            "base_url":"http://127.0.0.1:37914",
            "node_name":"127.0.0.1:37914_",
            "state":"active",
            "leader":"true"}}},
      "shard2":{
        "range":"0-7fffffff",
        "state":"active",
        "replicas":{
          "core_node1":{
            "core":"collection1",
            "base_url":"http://127.0.0.1:42728",
            "node_name":"127.0.0.1:42728_",
            "state":"active",
            "leader":"true"},
          "core_node3":{
            "core":"collection1",
            "base_url":"http://127.0.0.1:33470",
            "node_name":"127.0.0.1:33470_",
            "state":"active"}}}},
    "router":{"name":"compositeId"},
    "maxShardsPerNode":"1",
    "autoAddReplicas":"false",
    "autoCreated":"true"},
  "control_collection":{
    "replicationFactor":"1",
    "shards":{"shard1":{
        "range":"80000000-7fffffff",
        "state":"active",
        "replicas":{"core_node1":{
            "core":"collection1",
            "base_url":"http://127.0.0.1:54641",
            "node_name":"127.0.0.1:54641_",
            "state":"active",
            "leader":"true"}}}},
    "router":{"name":"compositeId"},
    "maxShardsPerNode":"1",
    "autoAddReplicas":"false",
    "autoCreated":"true"},
  "c8n_1x2":{
    "replicationFactor":"2",
    "shards":{"shard1":{
        "range":"80000000-7fffffff",
        "state":"active",
        "replicas":{
          "core_node1":{
            "core":"c8n_1x2_shard1_replica2",
            "base_url":"http://127.0.0.1:37914",
            "node_name":"127.0.0.1:37914_",
            "state":"recovering"},
          "core_node2":{
            "core":"c8n_1x2_shard1_replica1",
            "base_url":"http://127.0.0.1:54641",
            "node_name":"127.0.0.1:54641_",
            "state":"active",
            "leader":"true"}}}},
    "router":{"name":"compositeId"},
    "maxShardsPerNode":"1",
    "autoAddReplicas":"false"},
  "collMinRf_1x3":{
    "replicationFactor":"3",
    "shards":{"shard1":{
        "range":"80000000-7fffffff",
        "state":"active",
        "replicas":{
          "core_node1":{
            "core":"collMinRf_1x3_shard1_replica3",
            "base_url":"http://127.0.0.1:54641",
            "node_name":"127.0.0.1:54641_",
            "state":"active"},
          "core_node2":{
            "core":"collMinRf_1x3_shard1_replica2",
            "base_url":"http://127.0.0.1:33470",
            "node_name":"127.0.0.1:33470_",
            "state":"active"},
          "core_node3":{
            "core":"collMinRf_1x3_shard1_replica1",
            "base_url":"http://127.0.0.1:42728",
            "node_name":"127.0.0.1:42728_",
            "state":"active",
            "leader":"true"}}}},
    "router":{"name":"compositeId"},
    "maxShardsPerNode":"1",
    "autoAddReplicas":"false"}}
	at __randomizedtesting.SeedInfo.seed([BEB7D27458D91100:36E3EDAEF6257CF8]:0)
	at org.junit.Assert.fail(Assert.java:93)
	at org.apache.solr.cloud.AbstractFullDistribZkTestBase.ensureAllReplicasAreActive(AbstractFullDistribZkTestBase.java:1844)
	at org.apache.solr.cloud.HttpPartitionTest.testRf2(HttpPartitionTest.java:349)
	at org.apache.solr.cloud.HttpPartitionTest.test(HttpPartitionTest.java:109)
	at sun.reflect.NativeMethodAccessorImpl.invoke0(Native Method)
	at sun.reflect.NativeMethodAccessorImpl.invoke(NativeMethodAccessorImpl.java:62)
	at sun.reflect.DelegatingMethodAccessorImpl.invoke(DelegatingMethodAccessorImpl.java:43)
	at java.lang.reflect.Method.invoke(Method.java:520)
	at com.carrotsearch.randomizedtesting.RandomizedRunner.invoke(RandomizedRunner.java:1764)
	at com.carrotsearch.randomizedtesting.RandomizedRunner$8.evaluate(RandomizedRunner.java:871)
	at com.carrotsearch.randomizedtesting.RandomizedRunner$9.evaluate(RandomizedRunner.java:907)
	at com.carrotsearch.randomizedtesting.RandomizedRunner$10.evaluate(RandomizedRunner.java:921)
	at org.apache.solr.BaseDistributedSearchTestCase$ShardsRepeatRule$ShardsFixedStatement.callStatement(BaseDistributedSearchTestCase.java:965)
	at org.apache.solr.BaseDistributedSearchTestCase$ShardsRepeatRule$ShardsStatement.evaluate(BaseDistributedSearchTestCase.java:940)
	at com.carrotsearch.randomizedtesting.rules.SystemPropertiesRestoreRule$1.evaluate(SystemPropertiesRestoreRule.java:57)
	at org.apache.lucene.util.TestRuleSetupTeardownChained$1.evaluate(TestRuleSetupTeardownChained.java:50)
	at org.apache.lucene.util.AbstractBeforeAfterRule$1.evaluate(AbstractBeforeAfterRule.java:46)
	at org.apache.lucene.util.TestRuleThreadAndTestName$1.evaluate(TestRuleThreadAndTestName.java:49)
	at org.apache.lucene.util.TestRuleIgnoreAfterMaxFailures$1.evaluate(TestRuleIgnoreAfterMaxFailures.java:65)
	at org.apache.lucene.util.TestRuleMarkFailure$1.evaluate(TestRuleMarkFailure.java:48)
	at com.carrotsearch.randomizedtesting.rules.StatementAdapter.evaluate(StatementAdapter.java:36)
	at com.carrotsearch.randomizedtesting.ThreadLeakControl$StatementRunner.run(ThreadLeakControl.java:367)
	at com.carrotsearch.randomizedtesting.ThreadLeakControl.forkTimeoutingTask(ThreadLeakControl.java:809)
	at com.carrotsearch.randomizedtesting.ThreadLeakControl$3.evaluate(ThreadLeakControl.java:460)
	at com.carrotsearch.randomizedtesting.RandomizedRunner.runSingleTest(RandomizedRunner.java:880)
	at com.carrotsearch.randomizedtesting.RandomizedRunner$5.evaluate(RandomizedRunner.java:781)
	at com.carrotsearch.randomizedtesting.RandomizedRunner$6.evaluate(RandomizedRunner.java:816)
	at com.carrotsearch.randomizedtesting.RandomizedRunner$7.evaluate(RandomizedRunner.java:827)
	at com.carrotsearch.randomizedtesting.rules.StatementAdapter.evaluate(StatementAdapter.java:36)
	at com.carrotsearch.randomizedtesting.rules.SystemPropertiesRestoreRule$1.evaluate(SystemPropertiesRestoreRule.java:57)
	at org.apache.lucene.util.AbstractBeforeAfterRule$1.evaluate(AbstractBeforeAfterRule.java:46)
	at com.carrotsearch.randomizedtesting.rules.StatementAdapter.evaluate(StatementAdapter.java:36)
	at org.apache.lucene.util.TestRuleStoreClassName$1.evaluate(TestRuleStoreClassName.java:42)
	at com.carrotsearch.randomizedtesting.rules.NoShadowingOrOverridesOnMethodsRule$1.evaluate(NoShadowingOrOverridesOnMethodsRule.java:40)
	at com.carrotsearch.randomizedtesting.rules.NoShadowingOrOverridesOnMethodsRule$1.evaluate(NoShadowingOrOverridesOnMethodsRule.java:40)
	at com.carrotsearch.randomizedtesting.rules.StatementAdapter.evaluate(StatementAdapter.java:36)
	at com.carrotsearch.randomizedtesting.rules.StatementAdapter.evaluate(StatementAdapter.java:36)
	at com.carrotsearch.randomizedtesting.rules.StatementAdapter.evaluate(StatementAdapter.java:36)
	at org.apache.lucene.util.TestRuleAssertionsRequired$1.evaluate(TestRuleAssertionsRequired.java:54)
	at org.apache.lucene.util.TestRuleMarkFailure$1.evaluate(TestRuleMarkFailure.java:48)
	at org.apache.lucene.util.TestRuleIgnoreAfterMaxFailures$1.evaluate(TestRuleIgnoreAfterMaxFailures.java:65)
	at org.apache.lucene.util.TestRuleIgnoreTestSuites$1.evaluate(TestRuleIgnoreTestSuites.java:55)
	at com.carrotsearch.randomizedtesting.rules.StatementAdapter.evaluate(StatementAdapter.java:36)
	at com.carrotsearch.randomizedtesting.ThreadLeakControl$StatementRunner.run(ThreadLeakControl.java:367)
	at java.lang.Thread.run(Thread.java:747)




Build Log:
[...truncated 10639 lines...]
   [junit4] Suite: org.apache.solr.cloud.HttpPartitionTest
   [junit4]   2> Creating dataDir: /home/jenkins/workspace/Lucene-Solr-trunk-Linux/solr/build/solr-core/test/J2/temp/solr.cloud.HttpPartitionTest_BEB7D27458D91100-001/init-core-data-001
   [junit4]   2> 1215201 INFO  (SUITE-HttpPartitionTest-seed#[BEB7D27458D91100]-worker) [    ] o.a.s.BaseDistributedSearchTestCase Setting hostContext system property: /
   [junit4]   2> 1215202 INFO  (TEST-HttpPartitionTest.test-seed#[BEB7D27458D91100]) [    ] o.a.s.c.ZkTestServer STARTING ZK TEST SERVER
   [junit4]   2> 1215202 INFO  (Thread-3327) [    ] o.a.s.c.ZkTestServer client port:0.0.0.0/0.0.0.0:0
   [junit4]   2> 1215202 INFO  (Thread-3327) [    ] o.a.s.c.ZkTestServer Starting server
   [junit4]   2> 1215302 INFO  (TEST-HttpPartitionTest.test-seed#[BEB7D27458D91100]) [    ] o.a.s.c.ZkTestServer start zk server on port:37487
   [junit4]   2> 1215303 INFO  (TEST-HttpPartitionTest.test-seed#[BEB7D27458D91100]) [    ] o.a.s.c.c.SolrZkClient Using default ZkCredentialsProvider
   [junit4]   2> 1215303 INFO  (TEST-HttpPartitionTest.test-seed#[BEB7D27458D91100]) [    ] o.a.s.c.c.ConnectionManager Waiting for client to connect to ZooKeeper
   [junit4]   2> 1215305 INFO  (zkCallback-1230-thread-1) [    ] o.a.s.c.c.ConnectionManager Watcher org.apache.solr.common.cloud.ConnectionManager@836646 name:ZooKeeperConnection Watcher:127.0.0.1:37487 got event WatchedEvent state:SyncConnected type:None path:null path:null type:None
   [junit4]   2> 1215305 INFO  (TEST-HttpPartitionTest.test-seed#[BEB7D27458D91100]) [    ] o.a.s.c.c.ConnectionManager Client is connected to ZooKeeper
   [junit4]   2> 1215305 INFO  (TEST-HttpPartitionTest.test-seed#[BEB7D27458D91100]) [    ] o.a.s.c.c.SolrZkClient Using default ZkACLProvider
   [junit4]   2> 1215305 INFO  (TEST-HttpPartitionTest.test-seed#[BEB7D27458D91100]) [    ] o.a.s.c.c.SolrZkClient makePath: /solr
   [junit4]   2> 1215307 INFO  (TEST-HttpPartitionTest.test-seed#[BEB7D27458D91100]) [    ] o.a.s.c.c.SolrZkClient Using default ZkCredentialsProvider
   [junit4]   2> 1215307 INFO  (TEST-HttpPartitionTest.test-seed#[BEB7D27458D91100]) [    ] o.a.s.c.c.ConnectionManager Waiting for client to connect to ZooKeeper
   [junit4]   2> 1215308 INFO  (zkCallback-1231-thread-1) [    ] o.a.s.c.c.ConnectionManager Watcher org.apache.solr.common.cloud.ConnectionManager@1872ecd name:ZooKeeperConnection Watcher:127.0.0.1:37487/solr got event WatchedEvent state:SyncConnected type:None path:null path:null type:None
   [junit4]   2> 1215308 INFO  (TEST-HttpPartitionTest.test-seed#[BEB7D27458D91100]) [    ] o.a.s.c.c.ConnectionManager Client is connected to ZooKeeper
   [junit4]   2> 1215308 INFO  (TEST-HttpPartitionTest.test-seed#[BEB7D27458D91100]) [    ] o.a.s.c.c.SolrZkClient Using default ZkACLProvider
   [junit4]   2> 1215308 INFO  (TEST-HttpPartitionTest.test-seed#[BEB7D27458D91100]) [    ] o.a.s.c.c.SolrZkClient makePath: /collections/collection1
   [junit4]   2> 1215309 INFO  (TEST-HttpPartitionTest.test-seed#[BEB7D27458D91100]) [    ] o.a.s.c.c.SolrZkClient makePath: /collections/collection1/shards
   [junit4]   2> 1215309 INFO  (TEST-HttpPartitionTest.test-seed#[BEB7D27458D91100]) [    ] o.a.s.c.c.SolrZkClient makePath: /collections/control_collection
   [junit4]   2> 1215310 INFO  (TEST-HttpPartitionTest.test-seed#[BEB7D27458D91100]) [    ] o.a.s.c.c.SolrZkClient makePath: /collections/control_collection/shards
   [junit4]   2> 1215310 INFO  (TEST-HttpPartitionTest.test-seed#[BEB7D27458D91100]) [    ] o.a.s.c.AbstractZkTestCase put /home/jenkins/workspace/Lucene-Solr-trunk-Linux/solr/core/src/test-files/solr/collection1/conf/solrconfig-tlog.xml to /configs/conf1/solrconfig.xml
   [junit4]   2> 1215311 INFO  (TEST-HttpPartitionTest.test-seed#[BEB7D27458D91100]) [    ] o.a.s.c.c.SolrZkClient makePath: /configs/conf1/solrconfig.xml
   [junit4]   2> 1215311 INFO  (TEST-HttpPartitionTest.test-seed#[BEB7D27458D91100]) [    ] o.a.s.c.AbstractZkTestCase put /home/jenkins/workspace/Lucene-Solr-trunk-Linux/solr/core/src/test-files/solr/collection1/conf/schema.xml to /configs/conf1/schema.xml
   [junit4]   2> 1215312 INFO  (TEST-HttpPartitionTest.test-seed#[BEB7D27458D91100]) [    ] o.a.s.c.c.SolrZkClient makePath: /configs/conf1/schema.xml
   [junit4]   2> 1215312 INFO  (TEST-HttpPartitionTest.test-seed#[BEB7D27458D91100]) [    ] o.a.s.c.AbstractZkTestCase put /home/jenkins/workspace/Lucene-Solr-trunk-Linux/solr/core/src/test-files/solr/collection1/conf/solrconfig.snippet.randomindexconfig.xml to /configs/conf1/solrconfig.snippet.randomindexconfig.xml
   [junit4]   2> 1215313 INFO  (TEST-HttpPartitionTest.test-seed#[BEB7D27458D91100]) [    ] o.a.s.c.c.SolrZkClient makePath: /configs/conf1/solrconfig.snippet.randomindexconfig.xml
   [junit4]   2> 1215313 INFO  (TEST-HttpPartitionTest.test-seed#[BEB7D27458D91100]) [    ] o.a.s.c.AbstractZkTestCase put /home/jenkins/workspace/Lucene-Solr-trunk-Linux/solr/core/src/test-files/solr/collection1/conf/stopwords.txt to /configs/conf1/stopwords.txt
   [junit4]   2> 1215313 INFO  (TEST-HttpPartitionTest.test-seed#[BEB7D27458D91100]) [    ] o.a.s.c.c.SolrZkClient makePath: /configs/conf1/stopwords.txt
   [junit4]   2> 1215314 INFO  (TEST-HttpPartitionTest.test-seed#[BEB7D27458D91100]) [    ] o.a.s.c.AbstractZkTestCase put /home/jenkins/workspace/Lucene-Solr-trunk-Linux/solr/core/src/test-files/solr/collection1/conf/protwords.txt to /configs/conf1/protwords.txt
   [junit4]   2> 1215314 INFO  (TEST-HttpPartitionTest.test-seed#[BEB7D27458D91100]) [    ] o.a.s.c.c.SolrZkClient makePath: /configs/conf1/protwords.txt
   [junit4]   2> 1215315 INFO  (TEST-HttpPartitionTest.test-seed#[BEB7D27458D91100]) [    ] o.a.s.c.AbstractZkTestCase put /home/jenkins/workspace/Lucene-Solr-trunk-Linux/solr/core/src/test-files/solr/collection1/conf/currency.xml to /configs/conf1/currency.xml
   [junit4]   2> 1215315 INFO  (TEST-HttpPartitionTest.test-seed#[BEB7D27458D91100]) [    ] o.a.s.c.c.SolrZkClient makePath: /configs/conf1/currency.xml
   [junit4]   2> 1215315 INFO  (TEST-HttpPartitionTest.test-seed#[BEB7D27458D91100]) [    ] o.a.s.c.AbstractZkTestCase put /home/jenkins/workspace/Lucene-Solr-trunk-Linux/solr/core/src/test-files/solr/collection1/conf/enumsConfig.xml to /configs/conf1/enumsConfig.xml
   [junit4]   2> 1215316 INFO  (TEST-HttpPartitionTest.test-seed#[BEB7D27458D91100]) [    ] o.a.s.c.c.SolrZkClient makePath: /configs/conf1/enumsConfig.xml
   [junit4]   2> 1215316 INFO  (TEST-HttpPartitionTest.test-seed#[BEB7D27458D91100]) [    ] o.a.s.c.AbstractZkTestCase put /home/jenkins/workspace/Lucene-Solr-trunk-Linux/solr/core/src/test-files/solr/collection1/conf/open-exchange-rates.json to /configs/conf1/open-exchange-rates.json
   [junit4]   2> 1215316 INFO  (TEST-HttpPartitionTest.test-seed#[BEB7D27458D91100]) [    ] o.a.s.c.c.SolrZkClient makePath: /configs/conf1/open-exchange-rates.json
   [junit4]   2> 1215317 INFO  (TEST-HttpPartitionTest.test-seed#[BEB7D27458D91100]) [    ] o.a.s.c.AbstractZkTestCase put /home/jenkins/workspace/Lucene-Solr-trunk-Linux/solr/core/src/test-files/solr/collection1/conf/mapping-ISOLatin1Accent.txt to /configs/conf1/mapping-ISOLatin1Accent.txt
   [junit4]   2> 1215317 INFO  (TEST-HttpPartitionTest.test-seed#[BEB7D27458D91100]) [    ] o.a.s.c.c.SolrZkClient makePath: /configs/conf1/mapping-ISOLatin1Accent.txt
   [junit4]   2> 1215318 INFO  (TEST-HttpPartitionTest.test-seed#[BEB7D27458D91100]) [    ] o.a.s.c.AbstractZkTestCase put /home/jenkins/workspace/Lucene-Solr-trunk-Linux/solr/core/src/test-files/solr/collection1/conf/old_synonyms.txt to /configs/conf1/old_synonyms.txt
   [junit4]   2> 1215318 INFO  (TEST-HttpPartitionTest.test-seed#[BEB7D27458D91100]) [    ] o.a.s.c.c.SolrZkClient makePath: /configs/conf1/old_synonyms.txt
   [junit4]   2> 1215318 INFO  (TEST-HttpPartitionTest.test-seed#[BEB7D27458D91100]) [    ] o.a.s.c.AbstractZkTestCase put /home/jenkins/workspace/Lucene-Solr-trunk-Linux/solr/core/src/test-files/solr/collection1/conf/synonyms.txt to /configs/conf1/synonyms.txt
   [junit4]   2> 1215318 INFO  (TEST-HttpPartitionTest.test-seed#[BEB7D27458D91100]) [    ] o.a.s.c.c.SolrZkClient makePath: /configs/conf1/synonyms.txt
   [junit4]   2> 1215383 INFO  (TEST-HttpPartitionTest.test-seed#[BEB7D27458D91100]) [    ] o.a.s.SolrTestCaseJ4 Writing core.properties file to /home/jenkins/workspace/Lucene-Solr-trunk-Linux/solr/build/solr-core/test/J2/temp/solr.cloud.HttpPartitionTest_BEB7D27458D91100-001/control-001/cores/collection1
   [junit4]   2> 1215385 INFO  (TEST-HttpPartitionTest.test-seed#[BEB7D27458D91100]) [    ] o.e.j.s.Server jetty-9.2.13.v20150730
   [junit4]   2> 1215386 INFO  (TEST-HttpPartitionTest.test-seed#[BEB7D27458D91100]) [    ] o.e.j.s.h.ContextHandler Started o.e.j.s.ServletContextHandler@1b9db22{/,null,AVAILABLE}
   [junit4]   2> 1215388 INFO  (TEST-HttpPartitionTest.test-seed#[BEB7D27458D91100]) [    ] o.e.j.s.ServerConnector Started ServerConnector@1b9a2aa{HTTP/1.1}{127.0.0.1:38453}
   [junit4]   2> 1215388 INFO  (TEST-HttpPartitionTest.test-seed#[BEB7D27458D91100]) [    ] o.e.j.s.Server Started @1217138ms
   [junit4]   2> 1215388 INFO  (TEST-HttpPartitionTest.test-seed#[BEB7D27458D91100]) [    ] o.a.s.c.s.e.JettySolrRunner Jetty properties: {solr.data.dir=/home/jenkins/workspace/Lucene-Solr-trunk-Linux/solr/build/solr-core/test/J2/temp/solr.cloud.HttpPartitionTest_BEB7D27458D91100-001/tempDir-001/control/data, hostContext=/, hostPort=54641, coreRootDirectory=/home/jenkins/workspace/Lucene-Solr-trunk-Linux/solr/build/solr-core/test/J2/temp/solr.cloud.HttpPartitionTest_BEB7D27458D91100-001/control-001/cores}
   [junit4]   2> 1215388 INFO  (TEST-HttpPartitionTest.test-seed#[BEB7D27458D91100]) [    ] o.a.s.s.SolrDispatchFilter SolrDispatchFilter.init(): sun.misc.Launcher$AppClassLoader@1eb6432
   [junit4]   2> 1215388 INFO  (TEST-HttpPartitionTest.test-seed#[BEB7D27458D91100]) [    ] o.a.s.c.SolrResourceLoader new SolrResourceLoader for directory: '/home/jenkins/workspace/Lucene-Solr-trunk-Linux/solr/build/solr-core/test/J2/temp/solr.cloud.HttpPartitionTest_BEB7D27458D91100-001/control-001'
   [junit4]   2> 1215388 INFO  (TEST-HttpPartitionTest.test-seed#[BEB7D27458D91100]) [    ] o.a.s.c.SolrResourceLoader JNDI not configured for solr (NoInitialContextEx)
   [junit4]   2> 1215388 INFO  (TEST-HttpPartitionTest.test-seed#[BEB7D27458D91100]) [    ] o.a.s.c.SolrResourceLoader solr home defaulted to 'solr/' (could not find system property or JNDI)
   [junit4]   2> 1215389 INFO  (TEST-HttpPartitionTest.test-seed#[BEB7D27458D91100]) [    ] o.a.s.c.c.SolrZkClient Using default ZkCredentialsProvider
   [junit4]   2> 1215389 INFO  (TEST-HttpPartitionTest.test-seed#[BEB7D27458D91100]) [    ] o.a.s.c.c.ConnectionManager Waiting for client to connect to ZooKeeper
   [junit4]   2> 1215390 INFO  (zkCallback-1232-thread-1) [    ] o.a.s.c.c.ConnectionManager Watcher org.apache.solr.common.cloud.ConnectionManager@36a2e9 name:ZooKeeperConnection Watcher:127.0.0.1:37487/solr got event WatchedEvent state:SyncConnected type:None path:null path:null type:None
   [junit4]   2> 1215390 INFO  (TEST-HttpPartitionTest.test-seed#[BEB7D27458D91100]) [    ] o.a.s.c.c.ConnectionManager Client is connected to ZooKeeper
   [junit4]   2> 1215390 INFO  (TEST-HttpPartitionTest.test-seed#[BEB7D27458D91100]) [    ] o.a.s.c.c.SolrZkClient Using default ZkACLProvider
   [junit4]   2> 1215390 INFO  (TEST-HttpPartitionTest.test-seed#[BEB7D27458D91100]) [    ] o.a.s.s.SolrDispatchFilter Loading solr.xml from SolrHome (not found in ZooKeeper)
   [junit4]   2> 1215390 INFO  (TEST-HttpPartitionTest.test-seed#[BEB7D27458D91100]) [    ] o.a.s.c.SolrXmlConfig Loading container configuration from /home/jenkins/workspace/Lucene-Solr-trunk-Linux/solr/build/solr-core/test/J2/temp/solr.cloud.HttpPartitionTest_BEB7D27458D91100-001/control-001/solr.xml
   [junit4]   2> 1215394 INFO  (TEST-HttpPartitionTest.test-seed#[BEB7D27458D91100]) [    ] o.a.s.c.CorePropertiesLocator Config-defined core root directory: /home/jenkins/workspace/Lucene-Solr-trunk-Linux/solr/build/solr-core/test/J2/temp/solr.cloud.HttpPartitionTest_BEB7D27458D91100-001/control-001/cores
   [junit4]   2> 1215394 INFO  (TEST-HttpPartitionTest.test-seed#[BEB7D27458D91100]) [    ] o.a.s.c.CoreContainer New CoreContainer 107963
   [junit4]   2> 1215394 INFO  (TEST-HttpPartitionTest.test-seed#[BEB7D27458D91100]) [    ] o.a.s.c.CoreContainer Loading cores into CoreContainer [instanceDir=/home/jenkins/workspace/Lucene-Solr-trunk-Linux/solr/build/solr-core/test/J2/temp/solr.cloud.HttpPartitionTest_BEB7D27458D91100-001/control-001]
   [junit4]   2> 1215394 WARN  (TEST-HttpPartitionTest.test-seed#[BEB7D27458D91100]) [    ] o.a.s.c.CoreContainer Couldn't add files from /home/jenkins/workspace/Lucene-Solr-trunk-Linux/solr/build/solr-core/test/J2/temp/solr.cloud.HttpPartitionTest_BEB7D27458D91100-001/control-001/lib to classpath: /home/jenkins/workspace/Lucene-Solr-trunk-Linux/solr/build/solr-core/test/J2/temp/solr.cloud.HttpPartitionTest_BEB7D27458D91100-001/control-001/lib
   [junit4]   2> 1215395 INFO  (TEST-HttpPartitionTest.test-seed#[BEB7D27458D91100]) [    ] o.a.s.h.c.HttpShardHandlerFactory created with socketTimeout : 90000,urlScheme : ,connTimeout : 15000,maxConnectionsPerHost : 20,maxConnections : 10000,corePoolSize : 0,maximumPoolSize : 2147483647,maxThreadIdleTime : 5,sizeOfQueue : -1,fairnessPolicy : false,useRetries : false,
   [junit4]   2> 1215395 INFO  (TEST-HttpPartitionTest.test-seed#[BEB7D27458D91100]) [    ] o.a.s.u.UpdateShardHandler Creating UpdateShardHandler HTTP client with params: socketTimeout=340000&connTimeout=45000&retry=true
   [junit4]   2> 1215396 INFO  (TEST-HttpPartitionTest.test-seed#[BEB7D27458D91100]) [    ] o.a.s.l.LogWatcher SLF4J impl is org.slf4j.impl.Log4jLoggerFactory
   [junit4]   2> 1215396 INFO  (TEST-HttpPartitionTest.test-seed#[BEB7D27458D91100]) [    ] o.a.s.l.LogWatcher Registering Log Listener [Log4j (org.slf4j.impl.Log4jLoggerFactory)]
   [junit4]   2> 1215396 INFO  (TEST-HttpPartitionTest.test-seed#[BEB7D27458D91100]) [    ] o.a.s.c.ZkContainer Zookeeper client=127.0.0.1:37487/solr
   [junit4]   2> 1215396 INFO  (TEST-HttpPartitionTest.test-seed#[BEB7D27458D91100]) [    ] o.a.s.c.ZkController zkHost includes chroot
   [junit4]   2> 1215396 INFO  (TEST-HttpPartitionTest.test-seed#[BEB7D27458D91100]) [    ] o.a.s.c.c.SolrZkClient Using default ZkCredentialsProvider
   [junit4]   2> 1215396 INFO  (TEST-HttpPartitionTest.test-seed#[BEB7D27458D91100]) [    ] o.a.s.c.c.ConnectionManager Waiting for client to connect to ZooKeeper
   [junit4]   2> 1215397 INFO  (zkCallback-1235-thread-1) [    ] o.a.s.c.c.ConnectionManager Watcher org.apache.solr.common.cloud.ConnectionManager@115e4cd name:ZooKeeperConnection Watcher:127.0.0.1:37487 got event WatchedEvent state:SyncConnected type:None path:null path:null type:None
   [junit4]   2> 1215398 INFO  (TEST-HttpPartitionTest.test-seed#[BEB7D27458D91100]) [    ] o.a.s.c.c.ConnectionManager Client is connected to ZooKeeper
   [junit4]   2> 1215398 INFO  (TEST-HttpPartitionTest.test-seed#[BEB7D27458D91100]) [    ] o.a.s.c.c.SolrZkClient Using default ZkACLProvider
   [junit4]   2> 1215399 INFO  (TEST-HttpPartitionTest.test-seed#[BEB7D27458D91100]) [    ] o.a.s.c.c.ConnectionManager Waiting for client to connect to ZooKeeper
   [junit4]   2> 1215399 INFO  (zkCallback-1236-thread-1) [    ] o.a.s.c.c.ConnectionManager Watcher org.apache.solr.common.cloud.ConnectionManager@99cf93 name:ZooKeeperConnection Watcher:127.0.0.1:37487/solr got event WatchedEvent state:SyncConnected type:None path:null path:null type:None
   [junit4]   2> 1215399 INFO  (TEST-HttpPartitionTest.test-seed#[BEB7D27458D91100]) [    ] o.a.s.c.c.ConnectionManager Client is connected to ZooKeeper
   [junit4]   2> 1215400 INFO  (TEST-HttpPartitionTest.test-seed#[BEB7D27458D91100]) [    ] o.a.s.c.c.SolrZkClient makePath: /overseer/queue
   [junit4]   2> 1215401 INFO  (TEST-HttpPartitionTest.test-seed#[BEB7D27458D91100]) [    ] o.a.s.c.c.SolrZkClient makePath: /overseer/collection-queue-work
   [junit4]   2> 1215402 INFO  (TEST-HttpPartitionTest.test-seed#[BEB7D27458D91100]) [    ] o.a.s.c.c.SolrZkClient makePath: /overseer/collection-map-running
   [junit4]   2> 1215403 INFO  (TEST-HttpPartitionTest.test-seed#[BEB7D27458D91100]) [    ] o.a.s.c.c.SolrZkClient makePath: /overseer/collection-map-completed
   [junit4]   2> 1215403 INFO  (TEST-HttpPartitionTest.test-seed#[BEB7D27458D91100]) [    ] o.a.s.c.c.SolrZkClient makePath: /overseer/collection-map-failure
   [junit4]   2> 1215404 INFO  (TEST-HttpPartitionTest.test-seed#[BEB7D27458D91100]) [    ] o.a.s.c.c.SolrZkClient makePath: /live_nodes
   [junit4]   2> 1215405 INFO  (TEST-HttpPartitionTest.test-seed#[BEB7D27458D91100]) [    ] o.a.s.c.c.SolrZkClient makePath: /aliases.json
   [junit4]   2> 1215405 INFO  (TEST-HttpPartitionTest.test-seed#[BEB7D27458D91100]) [    ] o.a.s.c.c.SolrZkClient makePath: /clusterstate.json
   [junit4]   2> 1215406 INFO  (TEST-HttpPartitionTest.test-seed#[BEB7D27458D91100]) [    ] o.a.s.c.c.SolrZkClient makePath: /security.json
   [junit4]   2> 1215406 INFO  (TEST-HttpPartitionTest.test-seed#[BEB7D27458D91100]) [    ] o.a.s.c.ZkController Register node as live in ZooKeeper:/live_nodes/127.0.0.1:54641_
   [junit4]   2> 1215407 INFO  (TEST-HttpPartitionTest.test-seed#[BEB7D27458D91100]) [    ] o.a.s.c.c.SolrZkClient makePath: /live_nodes/127.0.0.1:54641_
   [junit4]   2> 1215407 INFO  (TEST-HttpPartitionTest.test-seed#[BEB7D27458D91100]) [    ] o.a.s.c.c.SolrZkClient makePath: /overseer_elect
   [junit4]   2> 1215408 INFO  (TEST-HttpPartitionTest.test-seed#[BEB7D27458D91100]) [    ] o.a.s.c.c.SolrZkClient makePath: /overseer_elect/election
   [junit4]   2> 1215408 INFO  (TEST-HttpPartitionTest.test-seed#[BEB7D27458D91100]) [    ] o.a.s.c.Overseer Overseer (id=null) closing
   [junit4]   2> 1215408 INFO  (TEST-HttpPartitionTest.test-seed#[BEB7D27458D91100]) [    ] o.a.s.c.LeaderElector Joined leadership election with path: /overseer_elect/election/95175969530904580-127.0.0.1:54641_-n_0000000000
   [junit4]   2> 1215409 INFO  (TEST-HttpPartitionTest.test-seed#[BEB7D27458D91100]) [    ] o.a.s.c.OverseerElectionContext I am going to be the leader 127.0.0.1:54641_
   [junit4]   2> 1215409 INFO  (TEST-HttpPartitionTest.test-seed#[BEB7D27458D91100]) [    ] o.a.s.c.c.SolrZkClient makePath: /overseer_elect/leader
   [junit4]   2> 1215409 INFO  (TEST-HttpPartitionTest.test-seed#[BEB7D27458D91100]) [    ] o.a.s.c.Overseer Overseer (id=95175969530904580-127.0.0.1:54641_-n_0000000000) starting
   [junit4]   2> 1215410 INFO  (TEST-HttpPartitionTest.test-seed#[BEB7D27458D91100]) [    ] o.a.s.c.c.SolrZkClient makePath: /overseer/queue-work
   [junit4]   2> 1215412 INFO  (TEST-HttpPartitionTest.test-seed#[BEB7D27458D91100]) [    ] o.a.s.c.OverseerAutoReplicaFailoverThread Starting OverseerAutoReplicaFailoverThread autoReplicaFailoverWorkLoopDelay=10000 autoReplicaFailoverWaitAfterExpiration=30000 autoReplicaFailoverBadNodeExpiration=60000
   [junit4]   2> 1215412 INFO  (OverseerCollectionConfigSetProcessor-95175969530904580-127.0.0.1:54641_-n_0000000000) [    ] o.a.s.c.OverseerTaskProcessor Process current queue of overseer operations
   [junit4]   2> 1215412 INFO  (TEST-HttpPartitionTest.test-seed#[BEB7D27458D91100]) [    ] o.a.s.c.c.ZkStateReader Updating cluster state from ZooKeeper... 
   [junit4]   2> 1215412 INFO  (OverseerStateUpdate-95175969530904580-127.0.0.1:54641_-n_0000000000) [    ] o.a.s.c.Overseer Starting to work on the main queue
   [junit4]   2> 1215424 INFO  (TEST-HttpPartitionTest.test-seed#[BEB7D27458D91100]) [    ] o.a.s.c.CoreContainer Security conf doesn't exist. Skipping setup for authorization module.
   [junit4]   2> 1215424 INFO  (TEST-HttpPartitionTest.test-seed#[BEB7D27458D91100]) [    ] o.a.s.c.CoreContainer No authentication plugin used.
   [junit4]   2> 1215424 INFO  (TEST-HttpPartitionTest.test-seed#[BEB7D27458D91100]) [    ] o.a.s.c.CorePropertiesLocator Looking for core definitions underneath /home/jenkins/workspace/Lucene-Solr-trunk-Linux/solr/build/solr-core/test/J2/temp/solr.cloud.HttpPartitionTest_BEB7D27458D91100-001/control-001/cores
   [junit4]   2> 1215425 INFO  (TEST-HttpPartitionTest.test-seed#[BEB7D27458D91100]) [    ] o.a.s.c.CoreDescriptor Created CoreDescriptor: {name=collection1, config=solrconfig.xml, transient=false, schema=schema.xml, loadOnStartup=true, configSetProperties=configsetprops.json, collection=control_collection, coreNodeName=, dataDir=data/, shard=}
   [junit4]   2> 1215425 INFO  (TEST-HttpPartitionTest.test-seed#[BEB7D27458D91100]) [    ] o.a.s.c.CorePropertiesLocator Found core collection1 in /home/jenkins/workspace/Lucene-Solr-trunk-Linux/solr/build/solr-core/test/J2/temp/solr.cloud.HttpPartitionTest_BEB7D27458D91100-001/control-001/cores/collection1
   [junit4]   2> 1215425 INFO  (TEST-HttpPartitionTest.test-seed#[BEB7D27458D91100]) [    ] o.a.s.c.CorePropertiesLocator Found 1 core definitions
   [junit4]   2> 1215425 INFO  (coreLoadExecutor-3192-thread-1) [    ] o.a.s.c.ZkController publishing state=down
   [junit4]   2> 1215425 INFO  (coreLoadExecutor-3192-thread-1) [    ] o.a.s.c.ZkController numShards not found on descriptor - reading it from system property
   [junit4]   2> 1215425 INFO  (TEST-HttpPartitionTest.test-seed#[BEB7D27458D91100]) [    ] o.a.s.s.SolrDispatchFilter user.dir=/home/jenkins/workspace/Lucene-Solr-trunk-Linux/solr/build/solr-core/test/J2
   [junit4]   2> 1215426 INFO  (TEST-HttpPartitionTest.test-seed#[BEB7D27458D91100]) [    ] o.a.s.s.SolrDispatchFilter SolrDispatchFilter.init() done
   [junit4]   2> 1215426 INFO  (OverseerStateUpdate-95175969530904580-127.0.0.1:54641_-n_0000000000) [    ] o.a.s.c.Overseer processMessage: queueSize: 1, message = {
   [junit4]   2>   "core":"collection1",
   [junit4]   2>   "roles":null,
   [junit4]   2>   "base_url":"http://127.0.0.1:54641",
   [junit4]   2>   "node_name":"127.0.0.1:54641_",
   [junit4]   2>   "numShards":"1",
   [junit4]   2>   "state":"down",
   [junit4]   2>   "shard":null,
   [junit4]   2>   "collection":"control_collection",
   [junit4]   2>   "operation":"state"} current state version: 0
   [junit4]   2> 1215426 INFO  (coreLoadExecutor-3192-thread-1) [    ] o.a.s.c.ZkController look for our core node name
   [junit4]   2> 1215427 INFO  (OverseerStateUpdate-95175969530904580-127.0.0.1:54641_-n_0000000000) [    ] o.a.s.c.o.ReplicaMutator Update state numShards=1 message={
   [junit4]   2>   "core":"collection1",
   [junit4]   2>   "roles":null,
   [junit4]   2>   "base_url":"http://127.0.0.1:54641",
   [junit4]   2>   "node_name":"127.0.0.1:54641_",
   [junit4]   2>   "numShards":"1",
   [junit4]   2>   "state":"down",
   [junit4]   2>   "shard":null,
   [junit4]   2>   "collection":"control_collection",
   [junit4]   2>   "operation":"state"}
   [junit4]   2> 1215427 INFO  (OverseerStateUpdate-95175969530904580-127.0.0.1:54641_-n_0000000000) [    ] o.a.s.c.o.ClusterStateMutator building a new cName: control_collection
   [junit4]   2> 1215427 INFO  (OverseerStateUpdate-95175969530904580-127.0.0.1:54641_-n_0000000000) [    ] o.a.s.c.o.ReplicaMutator Assigning new node to shard shard=shard1
   [junit4]   2> 1215428 INFO  (zkCallback-1236-thread-1) [    ] o.a.s.c.c.ZkStateReader A cluster state change: [WatchedEvent state:SyncConnected type:NodeDataChanged path:/clusterstate.json], has occurred - updating... (live nodes size: [1])
   [junit4]   2> 1216427 INFO  (coreLoadExecutor-3192-thread-1) [    ] o.a.s.c.ZkController waiting to find shard id in clusterstate for collection1
   [junit4]   2> 1216427 INFO  (coreLoadExecutor-3192-thread-1) [    ] o.a.s.c.ZkController Check for collection zkNode:control_collection
   [junit4]   2> 1216427 INFO  (coreLoadExecutor-3192-thread-1) [    ] o.a.s.c.ZkController Collection zkNode exists
   [junit4]   2> 1216427 INFO  (coreLoadExecutor-3192-thread-1) [    ] o.a.s.c.c.ZkStateReader Load collection config from: [/collections/control_collection]
   [junit4]   2> 1216427 INFO  (coreLoadExecutor-3192-thread-1) [    ] o.a.s.c.c.ZkStateReader path=[/collections/control_collection] [configName]=[conf1] specified config exists in ZooKeeper
   [junit4]   2> 1216427 INFO  (coreLoadExecutor-3192-thread-1) [    ] o.a.s.c.SolrResourceLoader new SolrResourceLoader for directory: '/home/jenkins/workspace/Lucene-Solr-trunk-Linux/solr/build/solr-core/test/J2/temp/solr.cloud.HttpPartitionTest_BEB7D27458D91100-001/control-001/cores/collection1'
   [junit4]   2> 1216428 INFO  (coreLoadExecutor-3192-thread-1) [    ] o.a.s.c.SolrResourceLoader JNDI not configured for solr (NoInitialContextEx)
   [junit4]   2> 1216428 INFO  (coreLoadExecutor-3192-thread-1) [    ] o.a.s.c.SolrResourceLoader solr home defaulted to 'solr/' (could not find system property or JNDI)
   [junit4]   2> 1216429 INFO  (coreLoadExecutor-3192-thread-1) [    ] o.a.s.c.Config loaded config solrconfig.xml with version 0 
   [junit4]   2> 1216432 INFO  (coreLoadExecutor-3192-thread-1) [    ] o.a.s.c.SolrConfig current version of requestparams : -1
   [junit4]   2> 1216434 INFO  (coreLoadExecutor-3192-thread-1) [    ] o.a.s.c.SolrConfig Using Lucene MatchVersion: 6.0.0
   [junit4]   2> 1216440 INFO  (coreLoadExecutor-3192-thread-1) [    ] o.a.s.c.SolrConfig Loaded SolrConfig: solrconfig.xml
   [junit4]   2> 1216444 INFO  (coreLoadExecutor-3192-thread-1) [    ] o.a.s.s.IndexSchema [collection1] Schema name=test
   [junit4]   2> 1216504 INFO  (coreLoadExecutor-3192-thread-1) [    ] o.a.s.s.OpenExchangeRatesOrgProvider Initialized with rates=open-exchange-rates.json, refreshInterval=1440.
   [junit4]   2> 1216508 INFO  (coreLoadExecutor-3192-thread-1) [    ] o.a.s.s.IndexSchema default search field in schema is text
   [junit4]   2> 1216509 INFO  (coreLoadExecutor-3192-thread-1) [    ] o.a.s.s.IndexSchema unique key field: id
   [junit4]   2> 1216513 INFO  (coreLoadExecutor-3192-thread-1) [    ] o.a.s.s.FileExchangeRateProvider Reloading exchange rates from file currency.xml
   [junit4]   2> 1216514 INFO  (coreLoadExecutor-3192-thread-1) [    ] o.a.s.s.FileExchangeRateProvider Reloading exchange rates from file currency.xml
   [junit4]   2> 1216515 INFO  (coreLoadExecutor-3192-thread-1) [    ] o.a.s.s.OpenExchangeRatesOrgProvider Reloading exchange rates from open-exchange-rates.json
   [junit4]   2> 1216516 INFO  (coreLoadExecutor-3192-thread-1) [    ] o.a.s.s.OpenExchangeRatesOrgProvider Reloading exchange rates from open-exchange-rates.json
   [junit4]   2> 1216517 INFO  (coreLoadExecutor-3192-thread-1) [    ] o.a.s.c.ConfigSetProperties Did not find ConfigSet properties, assuming default properties: Can't find resource 'configsetprops.json' in classpath or '/configs/conf1', cwd=/home/jenkins/workspace/Lucene-Solr-trunk-Linux/solr/build/solr-core/test/J2
   [junit4]   2> 1216517 INFO  (coreLoadExecutor-3192-thread-1) [    ] o.a.s.c.CoreContainer Creating SolrCore 'collection1' using configuration from collection control_collection
   [junit4]   2> 1216517 INFO  (coreLoadExecutor-3192-thread-1) [    ] o.a.s.c.SolrCore org.apache.solr.core.MockDirectoryFactory
   [junit4]   2> 1216517 INFO  (coreLoadExecutor-3192-thread-1) [    ] o.a.s.c.SolrCore [[collection1] ] Opening new SolrCore at [/home/jenkins/workspace/Lucene-Solr-trunk-Linux/solr/build/solr-core/test/J2/temp/solr.cloud.HttpPartitionTest_BEB7D27458D91100-001/control-001/cores/collection1], dataDir=[/home/jenkins/workspace/Lucene-Solr-trunk-Linux/solr/build/solr-core/test/J2/temp/solr.cloud.HttpPartitionTest_BEB7D27458D91100-001/control-001/cores/collection1/data/]
   [junit4]   2> 1216517 INFO  (coreLoadExecutor-3192-thread-1) [    ] o.a.s.c.JmxMonitoredMap JMX monitoring is enabled. Adding Solr mbeans to JMX Server: com.sun.jmx.mbeanserver.JmxMBeanServer@792597
   [junit4]   2> 1216517 INFO  (coreLoadExecutor-3192-thread-1) [    ] o.a.s.c.CachingDirectoryFactory return new directory for /home/jenkins/workspace/Lucene-Solr-trunk-Linux/solr/build/solr-core/test/J2/temp/solr.cloud.HttpPartitionTest_BEB7D27458D91100-001/control-001/cores/collection1/data
   [junit4]   2> 1216518 INFO  (coreLoadExecutor-3192-thread-1) [    ] o.a.s.c.SolrCore New index directory detected: old=null new=/home/jenkins/workspace/Lucene-Solr-trunk-Linux/solr/build/solr-core/test/J2/temp/solr.cloud.HttpPartitionTest_BEB7D27458D91100-001/control-001/cores/collection1/data/index/
   [junit4]   2> 1216518 WARN  (coreLoadExecutor-3192-thread-1) [    ] o.a.s.c.SolrCore [collection1] Solr index directory '/home/jenkins/workspace/Lucene-Solr-trunk-Linux/solr/build/solr-core/test/J2/temp/solr.cloud.HttpPartitionTest_BEB7D27458D91100-001/control-001/cores/collection1/data/index' doesn't exist. Creating new index...
   [junit4]   2> 1216518 INFO  (coreLoadExecutor-3192-thread-1) [    ] o.a.s.c.CachingDirectoryFactory return new directory for /home/jenkins/workspace/Lucene-Solr-trunk-Linux/solr/build/solr-core/test/J2/temp/solr.cloud.HttpPartitionTest_BEB7D27458D91100-001/control-001/cores/collection1/data/index
   [junit4]   2> 1216518 INFO  (coreLoadExecutor-3192-thread-1) [    ] o.a.s.u.RandomMergePolicy RandomMergePolicy wrapping class org.apache.lucene.index.LogDocMergePolicy: [LogDocMergePolicy: minMergeSize=1000, mergeFactor=44, maxMergeSize=9223372036854775807, maxMergeSizeForForcedMerge=9223372036854775807, calibrateSizeByDeletes=true, maxMergeDocs=2147483647, maxCFSSegmentSizeMB=8.796093022207999E12, noCFSRatio=0.642692310846994]
   [junit4]   2> 1216529 INFO  (coreLoadExecutor-3192-thread-1) [    ] o.a.s.c.SolrDeletionPolicy SolrDeletionPolicy.onCommit: commits: num=1
   [junit4]   2> 	commit{dir=MockDirectoryWrapper(SimpleFSDirectory@/home/jenkins/workspace/Lucene-Solr-trunk-Linux/solr/build/solr-core/test/J2/temp/solr.cloud.HttpPartitionTest_BEB7D27458D91100-001/index-SimpleFSDirectory-001 lockFactory=org.apache.lucene.store.NativeFSLockFactory@10523de),segFN=segments_1,generation=1}
   [junit4]   2> 1216529 INFO  (coreLoadExecutor-3192-thread-1) [    ] o.a.s.c.SolrDeletionPolicy newest commit generation = 1
   [junit4]   2> 1216529 INFO  (OldIndexDirectoryCleanupThreadForCore-collection1) [    ] o.a.s.c.SolrCore Looking for old index directories to cleanup for core collection1 in /home/jenkins/workspace/Lucene-Solr-trunk-Linux/solr/build/solr-core/test/J2/temp/solr.cloud.HttpPartitionTest_BEB7D27458D91100-001/control-001/cores/collection1/data/
   [junit4]   2> 1216529 WARN  (OldIndexDirectoryCleanupThreadForCore-collection1) [    ] o.a.s.c.DirectoryFactory /home/jenkins/workspace/Lucene-Solr-trunk-Linux/solr/build/solr-core/test/J2/temp/solr.cloud.HttpPartitionTest_BEB7D27458D91100-001/control-001/cores/collection1/data/ does not point to a valid data directory; skipping clean-up of old index directories.
   [junit4]   2> 1216533 INFO  (coreLoadExecutor-3192-thread-1) [    ] o.a.s.u.p.UpdateRequestProcessorChain creating updateRequestProcessorChain "nodistrib"
   [junit4]   2> 1216533 INFO  (coreLoadExecutor-3192-thread-1) [    ] o.a.s.u.p.UpdateRequestProcessorChain creating updateRequestProcessorChain "dedupe"
   [junit4]   2> 1216533 INFO  (coreLoadExecutor-3192-thread-1) [    ] o.a.s.u.p.UpdateRequestProcessorChain inserting DistributedUpdateProcessorFactory into updateRequestProcessorChain "dedupe"
   [junit4]   2> 1216533 INFO  (coreLoadExecutor-3192-thread-1) [    ] o.a.s.u.p.UpdateRequestProcessorChain creating updateRequestProcessorChain "stored_sig"
   [junit4]   2> 1216533 INFO  (coreLoadExecutor-3192-thread-1) [    ] o.a.s.u.p.UpdateRequestProcessorChain inserting DistributedUpdateProcessorFactory into updateRequestProcessorChain "stored_sig"
   [junit4]   2> 1216533 INFO  (coreLoadExecutor-3192-thread-1) [    ] o.a.s.u.p.UpdateRequestProcessorChain creating updateRequestProcessorChain "distrib-dup-test-chain-explicit"
   [junit4]   2> 1216533 INFO  (coreLoadExecutor-3192-thread-1) [    ] o.a.s.u.p.UpdateRequestProcessorChain creating updateRequestProcessorChain "distrib-dup-test-chain-implicit"
   [junit4]   2> 1216533 INFO  (coreLoadExecutor-3192-thread-1) [    ] o.a.s.u.p.UpdateRequestProcessorChain inserting DistributedUpdateProcessorFactory into updateRequestProcessorChain "distrib-dup-test-chain-implicit"
   [junit4]   2> 1216533 INFO  (coreLoadExecutor-3192-thread-1) [    ] o.a.s.c.SolrCore no updateRequestProcessorChain defined as default, creating implicit default
   [junit4]   2> 1216533 WARN  (coreLoadExecutor-3192-thread-1) [    ] o.a.s.c.RequestHandlers INVALID paramSet a in requestHandler {type = requestHandler,name = /dump,class = DumpRequestHandler,args = {defaults={a=A,b=B}}}
   [junit4]   2> 1216534 INFO  (coreLoadExecutor-3192-thread-1) [    ] o.a.s.h.l.XMLLoader xsltCacheLifetimeSeconds=60
   [junit4]   2> 1216535 INFO  (coreLoadExecutor-3192-thread-1) [    ] o.a.s.h.l.XMLLoader xsltCacheLifetimeSeconds=60
   [junit4]   2> 1216536 INFO  (coreLoadExecutor-3192-thread-1) [    ] o.a.s.h.l.XMLLoader xsltCacheLifetimeSeconds=60
   [junit4]   2> 1216536 INFO  (coreLoadExecutor-3192-thread-1) [    ] o.a.s.h.l.XMLLoader xsltCacheLifetimeSeconds=60
   [junit4]   2> 1216538 INFO  (coreLoadExecutor-3192-thread-1) [    ] o.a.s.c.RequestHandlers Registered paths: /admin/mbeans,standard,/dump,/update/csv,/sql,/update/json/docs,/admin/luke,/export,/admin/segments,/get,/admin/system,/replication,/admin/properties,/config,/stream,/schema,/admin/plugins,/admin/logging,/update/json,/admin/threads,/admin/ping,/update,/admin/file
   [junit4]   2> 1216538 INFO  (coreLoadExecutor-3192-thread-1) [    ] o.a.s.c.SolrCore Using default statsCache cache: org.apache.solr.search.stats.LocalStatsCache
   [junit4]   2> 1216538 INFO  (coreLoadExecutor-3192-thread-1) [    ] o.a.s.u.UpdateHandler Using UpdateLog implementation: org.apache.solr.update.UpdateLog
   [junit4]   2> 1216539 INFO  (coreLoadExecutor-3192-thread-1) [    ] o.a.s.u.UpdateLog Initializing UpdateLog: dataDir= defaultSyncLevel=FLUSH numRecordsToKeep=100 maxNumLogsToKeep=10 numVersionBuckets=65536
   [junit4]   2> 1216539 INFO  (coreLoadExecutor-3192-thread-1) [    ] o.a.s.u.CommitTracker Hard AutoCommit: disabled
   [junit4]   2> 1216539 INFO  (coreLoadExecutor-3192-thread-1) [    ] o.a.s.u.CommitTracker Soft AutoCommit: disabled
   [junit4]   2> 1216539 INFO  (coreLoadExecutor-3192-thread-1) [    ] o.a.s.u.RandomMergePolicy RandomMergePolicy wrapping class org.apache.lucene.index.TieredMergePolicy: [TieredMergePolicy: maxMergeAtOnce=20, maxMergeAtOnceExplicit=24, maxMergedSegmentMB=45.8173828125, floorSegmentMB=1.966796875, forceMergeDeletesPctAllowed=26.882391766014806, segmentsPerTier=17.0, maxCFSSegmentSizeMB=8.796093022207999E12, noCFSRatio=0.0
   [junit4]   2> 1216540 INFO  (coreLoadExecutor-3192-thread-1) [    ] o.a.s.c.SolrDeletionPolicy SolrDeletionPolicy.onInit: commits: num=1
   [junit4]   2> 	commit{dir=MockDirectoryWrapper(SimpleFSDirectory@/home/jenkins/workspace/Lucene-Solr-trunk-Linux/solr/build/solr-core/test/J2/temp/solr.cloud.HttpPartitionTest_BEB7D27458D91100-001/index-SimpleFSDirectory-001 lockFactory=org.apache.lucene.store.NativeFSLockFactory@10523de),segFN=segments_1,generation=1}
   [junit4]   2> 1216540 INFO  (coreLoadExecutor-3192-thread-1) [    ] o.a.s.c.SolrDeletionPolicy newest commit generation = 1
   [junit4]   2> 1216540 INFO  (coreLoadExecutor-3192-thread-1) [    ] o.a.s.s.SolrIndexSearcher Opening Searcher@566d02[collection1] main
   [junit4]   2> 1216540 INFO  (coreLoadExecutor-3192-thread-1) [    ] o.a.s.c.c.ZkStateReader Load collection config from: [/collections/control_collection]
   [junit4]   2> 1216541 INFO  (coreLoadExecutor-3192-thread-1) [    ] o.a.s.c.c.ZkStateReader path=[/collections/control_collection] [configName]=[conf1] specified config exists in ZooKeeper
   [junit4]   2> 1216541 INFO  (coreLoadExecutor-3192-thread-1) [    ] o.a.s.r.ManagedResourceStorage Setting up ZooKeeper-based storage for the RestManager with znodeBase: /configs/conf1
   [junit4]   2> 1216541 INFO  (coreLoadExecutor-3192-thread-1) [    ] o.a.s.r.ManagedResourceStorage Configured ZooKeeperStorageIO with znodeBase: /configs/conf1
   [junit4]   2> 1216541 INFO  (coreLoadExecutor-3192-thread-1) [    ] o.a.s.r.RestManager Initializing RestManager with initArgs: {}
   [junit4]   2> 1216541 INFO  (coreLoadExecutor-3192-thread-1) [    ] o.a.s.r.ManagedResourceStorage Reading _rest_managed.json using ZooKeeperStorageIO:path=/configs/conf1
   [junit4]   2> 1216542 INFO  (coreLoadExecutor-3192-thread-1) [    ] o.a.s.r.ManagedResourceStorage No data found for znode /configs/conf1/_rest_managed.json
   [junit4]   2> 1216542 INFO  (coreLoadExecutor-3192-thread-1) [    ] o.a.s.r.ManagedResourceStorage Loaded null at path _rest_managed.json using ZooKeeperStorageIO:path=/configs/conf1
   [junit4]   2> 1216542 INFO  (coreLoadExecutor-3192-thread-1) [    ] o.a.s.r.RestManager Initializing 0 registered ManagedResources
   [junit4]   2> 1216542 INFO  (coreLoadExecutor-3192-thread-1) [    ] o.a.s.h.ReplicationHandler Commits will be reserved for  10000
   [junit4]   2> 1216542 INFO  (searcherExecutor-3193-thread-1) [    ] o.a.s.c.SolrCore [collection1] Registered new searcher Searcher@566d02[collection1] main{ExitableDirectoryReader(UninvertingDirectoryReader())}
   [junit4]   2> 1216542 INFO  (coreLoadExecutor-3192-thread-1) [    ] o.a.s.u.UpdateLog Looking up max value of version field to seed version buckets
   [junit4]   2> 1216542 INFO  (coreLoadExecutor-3192-thread-1) [    ] o.a.s.u.VersionInfo Refreshing highest value of _version_ for 65536 version buckets from index
   [junit4]   2> 1216542 INFO  (coreLoadExecutor-3192-thread-1) [    ] o.a.s.u.VersionInfo No terms found for _version_, cannot seed version bucket highest value from index
   [junit4]   2> 1216542 INFO  (coreLoadExecutor-3192-thread-1) [    ] o.a.s.u.UpdateLog Could not find max version in index or recent updates, using new clock 1522815513897467904
   [junit4]   2> 1216544 INFO  (coreLoadExecutor-3192-thread-1) [    ] o.a.s.u.UpdateLog Took 1.0ms to seed version buckets with highest version 1522815513897467904
   [junit4]   2> 1216544 INFO  (coreLoadExecutor-3192-thread-1) [    ] o.a.s.c.ZkController watch zkdir /configs/conf1
   [junit4]   2> 1216545 INFO  (coreLoadExecutor-3192-thread-1) [    ] o.a.s.c.CoreContainer registering core: collection1
   [junit4]   2> 1216545 INFO  (coreZkRegister-3186-thread-1) [    ] o.a.s.c.ZkController Register replica - core:collection1 address:http://127.0.0.1:54641 collection:control_collection shard:shard1
   [junit4]   2> 1216545 INFO  (coreZkRegister-3186-thread-1) [    ] o.a.s.c.c.SolrZkClient makePath: /collections/control_collection/leader_elect/shard1/election
   [junit4]   2> 1216546 INFO  (coreZkRegister-3186-thread-1) [    ] o.a.s.c.LeaderElector Joined leadership election with path: /collections/control_collection/leader_elect/shard1/election/95175969530904580-core_node1-n_0000000000
   [junit4]   2> 1216547 INFO  (coreZkRegister-3186-thread-1) [    ] o.a.s.c.ShardLeaderElectionContext Running the leader process for shard=shard1 and weAreReplacement=false and leaderVoteWait=10000
   [junit4]   2> 1216547 INFO  (coreZkRegister-3186-thread-1) [    ] o.a.s.c.ShardLeaderElectionContext Enough replicas found to continue.
   [junit4]   2> 1216547 INFO  (coreZkRegister-3186-thread-1) [    ] o.a.s.c.ShardLeaderElectionContext I may be the new leader - try and sync
   [junit4]   2> 1216547 INFO  (coreZkRegister-3186-thread-1) [    ] o.a.s.c.SyncStrategy Sync replicas to http://127.0.0.1:54641/collection1/
   [junit4]   2> 1216547 INFO  (coreZkRegister-3186-thread-1) [    ] o.a.s.c.SyncStrategy Sync Success - now sync replicas to me
   [junit4]   2> 1216547 INFO  (coreZkRegister-3186-thread-1) [    ] o.a.s.c.SyncStrategy http://127.0.0.1:54641/collection1/ has no replicas
   [junit4]   2> 1216547 INFO  (OverseerStateUpdate-95175969530904580-127.0.0.1:54641_-n_0000000000) [    ] o.a.s.c.Overseer processMessage: queueSize: 1, message = {
   [junit4]   2>   "operation":"leader",
   [junit4]   2>   "shard":"shard1",
   [junit4]   2>   "collection":"control_collection"} current state version: 1
   [junit4]   2> 1216548 INFO  (coreZkRegister-3186-thread-1) [    ] o.a.s.c.c.SolrZkClient makePath: /collections/control_collection/leaders/shard1
   [junit4]   2> 1216549 INFO  (coreZkRegister-3186-thread-1) [    ] o.a.s.c.ShardLeaderElectionContextBase Creating leader registration node
   [junit4]   2> 1216550 INFO  (coreZkRegister-3186-thread-1) [    ] o.a.s.c.ShardLeaderElectionContext I am the new leader: http://127.0.0.1:54641/collection1/ shard1
   [junit4]   2> 1216550 INFO  (OverseerStateUpdate-95175969530904580-127.0.0.1:54641_-n_0000000000) [    ] o.a.s.c.Overseer processMessage: queueSize: 1, message = {
   [junit4]   2>   "operation":"leader",
   [junit4]   2>   "shard":"shard1",
   [junit4]   2>   "collection":"control_collection",
   [junit4]   2>   "base_url":"http://127.0.0.1:54641",
   [junit4]   2>   "core":"collection1",
   [junit4]   2>   "state":"active"} current state version: 1
   [junit4]   2> 1216651 INFO  (zkCallback-1236-thread-1) [    ] o.a.s.c.c.ZkStateReader A cluster state change: [WatchedEvent state:SyncConnected type:NodeDataChanged path:/clusterstate.json], has occurred - updating... (live nodes size: [1])
   [junit4]   2> 1216701 INFO  (coreZkRegister-3186-thread-1) [    ] o.a.s.c.ZkController We are http://127.0.0.1:54641/collection1/ and leader is http://127.0.0.1:54641/collection1/
   [junit4]   2> 1216701 INFO  (coreZkRegister-3186-thread-1) [    ] o.a.s.c.ZkController No LogReplay needed for core=collection1 baseURL=http://127.0.0.1:54641
   [junit4]   2> 1216701 INFO  (coreZkRegister-3186-thread-1) [    ] o.a.s.c.ZkController I am the leader, no recovery necessary
   [junit4]   2> 1216701 INFO  (coreZkRegister-3186-thread-1) [    ] o.a.s.c.ZkController publishing state=active
   [junit4]   2> 1216701 INFO  (coreZkRegister-3186-thread-1) [    ] o.a.s.c.ZkController numShards not found on descriptor - reading it from system property
   [junit4]   2> 1216702 INFO  (OverseerStateUpdate-95175969530904580-127.0.0.1:54641_-n_0000000000) [    ] o.a.s.c.Overseer processMessage: queueSize: 1, message = {
   [junit4]   2>   "core":"collection1",
   [junit4]   2>   "core_node_name":"core_node1",
   [junit4]   2>   "roles":null,
   [junit4]   2>   "base_url":"http://127.0.0.1:54641",
   [junit4]   2>   "node_name":"127.0.0.1:54641_",
   [junit4]   2>   "numShards":"1",
   [junit4]   2>   "state":"active",
   [junit4]   2>   "shard":"shard1",
   [junit4]   2>   "collection":"control_collection",
   [junit4]   2>   "operation":"state"} current state version: 2
   [junit4]   2> 1216702 INFO  (OverseerStateUpdate-95175969530904580-127.0.0.1:54641_-n_0000000000) [    ] o.a.s.c.o.ReplicaMutator Update state numShards=1 message={
   [junit4]   2>   "core":"collection1",
   [junit4]   2>   "core_node_name":"core_node1",
   [junit4]   2>   "roles":null,
   [junit4]   2>   "base_url":"http://127.0.0.1:54641",
   [junit4]   2>   "node_name":"127.0.0.1:54641_",
   [junit4]   2>   "numShards":"1",
   [junit4]   2>   "state":"active",
   [junit4]   2>   "shard":"shard1",
   [junit4]   2>   "collection":"control_collection",
   [junit4]   2>   "operation":"state"}
   [junit4]   2> 1216803 INFO  (zkCallback-1236-thread-1) [    ] o.a.s.c.c.ZkStateReader A cluster state change: [WatchedEvent state:SyncConnected type:NodeDataChanged path:/clusterstate.json], has occurred - updating... (live nodes size: [1])
   [junit4]   2> 1216927 INFO  (TEST-HttpPartitionTest.test-seed#[BEB7D27458D91100]) [    ] o.a.s.c.c.SolrZkClient Using default ZkCredentialsProvider
   [junit4]   2> 1216927 INFO  (TEST-HttpPartitionTest.test-seed#[BEB7D27458D91100]) [    ] o.a.s.c.c.ConnectionManager Waiting for client to connect to ZooKeeper
   [junit4]   2> 1216928 INFO  (zkCallback-1238-thread-1) [    ] o.a.s.c.c.ConnectionManager Watcher org.apache.solr.common.cloud.ConnectionManager@1ef323d name:ZooKeeperConnection Watcher:127.0.0.1:37487/solr got event WatchedEvent state:SyncConnected type:None path:null path:null type:None
   [junit4]   2> 1216928 INFO  (TEST-HttpPartitionTest.test-seed#[BEB7D27458D91100]) [    ] o.a.s.c.c.ConnectionManager Client is connected to ZooKeeper
   [junit4]   2> 1216928 INFO  (TEST-HttpPartitionTest.test-seed#[BEB7D27458D91100]) [    ] o.a.s.c.c.SolrZkClient Using default ZkACLProvider
   [junit4]   2> 1216928 INFO  (TEST-HttpPartitionTest.test-seed#[BEB7D27458D91100]) [    ] o.a.s.c.c.ZkStateReader Updating cluster state from ZooKeeper... 
   [junit4]   2> 1216929 INFO  (TEST-HttpPartitionTest.test-seed#[BEB7D27458D91100]) [    ] o.a.s.c.ChaosMonkey monkey: init - expire sessions:false cause connection loss:false
   [junit4]   2> 1216986 INFO  (TEST-HttpPartitionTest.test-seed#[BEB7D27458D91100]) [    ] o.a.s.SolrTestCaseJ4 Writing core.properties file to /home/jenkins/workspace/Lucene-Solr-trunk-Linux/solr/build/solr-core/test/J2/temp/solr.cloud.HttpPartitionTest_BEB7D27458D91100-001/shard-1-001/cores/collection1
   [junit4]   2> 1216987 INFO  (TEST-HttpPartitionTest.test-seed#[BEB7D27458D91100]) [    ] o.a.s.c.AbstractFullDistribZkTestBase create jetty 1 in directory /home/jenkins/workspace/Lucene-Solr-trunk-Linux/solr/build/solr-core/test/J2/temp/solr.cloud.HttpPartitionTest_BEB7D27458D91100-001/shard-1-001
   [junit4]   2> 1216987 INFO  (TEST-HttpPartitionTest.test-seed#[BEB7D27458D91100]) [    ] o.e.j.s.Server jetty-9.2.13.v20150730
   [junit4]   2> 1216988 INFO  (TEST-HttpPartitionTest.test-seed#[BEB7D27458D91100]) [    ] o.e.j.s.h.ContextHandler Started o.e.j.s.ServletContextHandler@7aa61{/,null,AVAILABLE}
   [junit4]   2> 1216989 INFO  (TEST-HttpPartitionTest.test-seed#[BEB7D27458D91100]) [    ] o.e.j.s.ServerConnector Started ServerConnector@152fdf{HTTP/1.1}{127.0.0.1:49053}
   [junit4]   2> 1216989 INFO  (TEST-HttpPartitionTest.test-seed#[BEB7D27458D91100]) [    ] o.e.j.s.Server Started @1218739ms
   [junit4]   2> 1216989 INFO  (TEST-HttpPartitionTest.test-seed#[BEB7D27458D91100]) [    ] o.a.s.c.s.e.JettySolrRunner Jetty properties: {solr.data.dir=/home/jenkins/workspace/Lucene-Solr-trunk-Linux/solr/build/solr-core/test/J2/temp/solr.cloud.HttpPartitionTest_BEB7D27458D91100-001/tempDir-001/jetty1, solrconfig=solrconfig.xml, hostContext=/, hostPort=42728, coreRootDirectory=/home/jenkins/workspace/Lucene-Solr-trunk-Linux/solr/build/solr-core/test/J2/temp/solr.cloud.HttpPartitionTest_BEB7D27458D91100-001/shard-1-001/cores}
   [junit4]   2> 1216989 INFO  (TEST-HttpPartitionTest.test-seed#[BEB7D27458D91100]) [    ] o.a.s.s.SolrDispatchFilter SolrDispatchFilter.init(): sun.misc.Launcher$AppClassLoader@1eb6432
   [junit4]   2> 1216989 INFO  (TEST-HttpPartitionTest.test-seed#[BEB7D27458D91100]) [    ] o.a.s.c.SolrResourceLoader new SolrResourceLoader for directory: '/home/jenkins/workspace/Lucene-Solr-trunk-Linux/solr/build/solr-core/test/J2/temp/solr.cloud.HttpPartitionTest_BEB7D27458D91100-001/shard-1-001'
   [junit4]   2> 1216989 INFO  (TEST-HttpPartitionTest.test-seed#[BEB7D27458D91100]) [    ] o.a.s.c.SolrResourceLoader JNDI not configured for solr (NoInitialContextEx)
   [junit4]   2> 1216989 INFO  (TEST-HttpPartitionTest.test-seed#[BEB7D27458D91100]) [    ] o.a.s.c.SolrResourceLoader solr home defaulted to 'solr/' (could not find system property or JNDI)
   [junit4]   2> 1216989 INFO  (TEST-HttpPartitionTest.test-seed#[BEB7D27458D91100]) [    ] o.a.s.c.c.SolrZkClient Using default ZkCredentialsProvider
   [junit4]   2> 1216990 INFO  (TEST-HttpPartitionTest.test-seed#[BEB7D27458D91100]) [    ] o.a.s.c.c.ConnectionManager Waiting for client to connect to ZooKeeper
   [junit4]   2> 1216990 INFO  (zkCallback-1239-thread-1) [    ] o.a.s.c.c.ConnectionManager Watcher org.apache.solr.common.cloud.ConnectionManager@10e6444 name:ZooKeeperConnection Watcher:127.0.0.1:37487/solr got event WatchedEvent state:SyncConnected type:None path:null path:null type:None
   [junit4]   2> 1216990 INFO  (TEST-HttpPartitionTest.test-seed#[BEB7D27458D91100]) [    ] o.a.s.c.c.ConnectionManager Client is connected to ZooKeeper
   [junit4]   2> 1216991 INFO  (TEST-HttpPartitionTest.test-seed#[BEB7D27458D91100]) [    ] o.a.s.c.c.SolrZkClient Using default ZkACLProvider
   [junit4]   2> 1216991 INFO  (TEST-HttpPartitionTest.test-seed#[BEB7D27458D91100]) [    ] o.a.s.s.SolrDispatchFilter Loading solr.xml from SolrHome (not found in ZooKeeper)
   [junit4]   2> 1216991 INFO  (TEST-HttpPartitionTest.test-seed#[BEB7D27458D91100]) [    ] o.a.s.c.SolrXmlConfig Loading container configuration from /home/jenkins/workspace/Lucene-Solr-trunk-Linux/solr/build/solr-core/test/J2/temp/solr.cloud.HttpPartitionTest_BEB7D27458D91100-001/shard-1-001/solr.xml
   [junit4]   2> 1216994 INFO  (TEST-HttpPartitionTest.test-seed#[BEB7D27458D91100]) [    ] o.a.s.c.CorePropertiesLocator Config-defined core root directory: /home/jenkins/workspace/Lucene-Solr-trunk-Linux/solr/build/solr-core/test/J2/temp/solr.cloud.HttpPartitionTest_BEB7D27458D91100-001/shard-1-001/cores
   [junit4]   2> 1216994 INFO  (TEST-HttpPartitionTest.test-seed#[BEB7D27458D91100]) [    ] o.a.s.c.CoreContainer New CoreContainer 29692697
   [junit4]   2> 1216994 INFO  (TEST-HttpPartitionTest.test-seed#[BEB7D27458D91100]) [    ] o.a.s.c.CoreContainer Loading cores into CoreContainer [instanceDir=/home/jenkins/workspace/Lucene-Solr-trunk-Linux/solr/build/solr-core/test/J2/temp/solr.cloud.HttpPartitionTest_BEB7D27458D91100-001/shard-1-001]
   [junit4]   2> 1216994 WARN  (TEST-HttpPartitionTest.test-seed#[BEB7D27458D91100]) [    ] o.a.s.c.CoreContainer Couldn't add files from /home/jenkins/workspace/Lucene-Solr-trunk-Linux/solr/build/solr-core/test/J2/temp/solr.cloud.HttpPartitionTest_BEB7D27458D91100-001/shard-1-001/lib to classpath: /home/jenkins/workspace/Lucene-Solr-trunk-Linux/solr/build/solr-core/test/J2/temp/solr.cloud.HttpPartitionTest_BEB7D27458D91100-001/shard-1-001/lib
   [junit4]   2> 1216994 INFO  (TEST-HttpPartitionTest.test-seed#[BEB7D27458D91100]) [    ] o.a.s.h.c.HttpShardHandlerFactory created with socketTimeout : 90000,urlScheme : ,connTimeout : 15000,maxConnectionsPerHost : 20,maxConnections : 10000,corePoolSize : 0,maximumPoolSize : 2147483647,maxThreadIdleTime : 5,sizeOfQueue : -1,fairnessPolicy : false,useRetries : false,
   [junit4]   2> 1216995 INFO  (TEST-HttpPartitionTest.test-seed#[BEB7D27458D91100]) [    ] o.a.s.u.UpdateShardHandler Creating UpdateShardHandler HTTP client with params: socketTimeout=340000&connTimeout=45000&retry=true
   [junit4]   2> 1216995 INFO  (TEST-HttpPartitionTest.test-seed#[BEB7D27458D91100]) [    ] o.a.s.l.LogWatcher SLF4J impl is org.slf4j.impl.Log4jLoggerFactory
   [junit4]   2> 1216995 INFO  (TEST-HttpPartitionTest.test-seed#[BEB7D27458D91100]) [    ] o.a.s.l.LogWatcher Registering Log Listener [Log4j (org.slf4j.impl.Log4jLoggerFactory)]
   [junit4]   2> 1216995 INFO  (TEST-HttpPartitionTest.test-seed#[BEB7D27458D91100]) [    ] o.a.s.c.ZkContainer Zookeeper client=127.0.0.1:37487/solr
   [junit4]   2> 1216995 INFO  (TEST-HttpPartitionTest.test-seed#[BEB7D27458D91100]) [    ] o.a.s.c.ZkController zkHost includes chroot
   [junit4]   2> 1216995 INFO  (TEST-HttpPartitionTest.test-seed#[BEB7D27458D91100]) [    ] o.a.s.c.c.SolrZkClient Using default ZkCredentialsProvider
   [junit4]   2> 1216996 INFO  (TEST-HttpPartitionTest.test-seed#[BEB7D27458D91100]) [    ] o.a.s.c.c.ConnectionManager Waiting for client to connect to ZooKeeper
   [junit4]   2> 1216996 INFO  (zkCallback-1242-thread-1) [    ] o.a.s.c.c.ConnectionManager Watcher org.apache.solr.common.cloud.ConnectionManager@192a420 name:ZooKeeperConnection Watcher:127.0.0.1:37487 got event WatchedEvent state:SyncConnected type:None path:null path:null type:None
   [junit4]   2> 1216997 INFO  (TEST-HttpPartitionTest.test-seed#[BEB7D27458D91100]) [    ] o.a.s.c.c.ConnectionManager Client is connected to ZooKeeper
   [junit4]   2> 1216997 INFO  (TEST-HttpPartitionTest.test-seed#[BEB7D27458D91100]) [    ] o.a.s.c.c.SolrZkClient Using default ZkACLProvider
   [junit4]   2> 1216998 INFO  (TEST-HttpPartitionTest.test-seed#[BEB7D27458D91100]) [    ] o.a.s.c.c.ConnectionManager Waiting for client to connect to ZooKeeper
   [junit4]   2> 1216999 INFO  (zkCallback-1243-thread-1) [    ] o.a.s.c.c.ConnectionManager Watcher org.apache.solr.common.cloud.ConnectionManager@1484c83 name:ZooKeeperConnection Watcher:127.0.0.1:37487/solr got event WatchedEvent state:SyncConnected type:None path:null path:null type:None
   [junit4]   2> 1216999 INFO  (TEST-HttpPartitionTest.test-seed#[BEB7D27458D91100]) [    ] o.a.s.c.c.ConnectionManager Client is connected to ZooKeeper
   [junit4]   2> 1217001 INFO  (TEST-HttpPartitionTest.test-seed#[BEB7D27458D91100]) [    ] o.a.s.c.c.ZkStateReader Updating cluster state from ZooKeeper... 
   [junit4]   2> 1218002 INFO  (TEST-HttpPartitionTest.test-seed#[BEB7D27458D91100]) [    ] o.a.s.c.ZkController Register node as live in ZooKeeper:/live_nodes/127.0.0.1:42728_
   [junit4]   2> 1218003 INFO  (TEST-HttpPartitionTest.test-seed#[BEB7D27458D91100]) [    ] o.a.s.c.c.SolrZkClient makePath: /live_nodes/127.0.0.1:42728_
   [junit4]   2> 1218003 INFO  (zkCallback-1243-thread-1) [    ] o.a.s.c.c.ZkStateReader A live node change: [WatchedEvent state:SyncConnected type:NodeChildrenChanged path:/live_nodes], has occurred - updating... (live nodes size: [1])
   [junit4]   2> 1218003 INFO  (zkCallback-1238-thread-1) [    ] o.a.s.c.c.ZkStateReader A live node change: [WatchedEvent state:SyncConnected type:NodeChildrenChanged path:/live_nodes], has occurred - updating... (live nodes size: [1])
   [junit4]   2> 1218003 INFO  (zkCallback-1236-thread-1) [    ] o.a.s.c.c.ZkStateReader A live node change: [WatchedEvent state:SyncConnected type:NodeChildrenChanged path:/live_nodes], has occurred - updating... (live nodes size: [1])
   [junit4]   2> 1218004 INFO  (TEST-HttpPartitionTest.test-seed#[BEB7D27458D91100]) [    ] o.a.s.c.Overseer Overseer (id=null) closing
   [junit4]   2> 1218004 INFO  (TEST-HttpPartitionTest.test-seed#[BEB7D27458D91100]) [    ] o.a.s.c.LeaderElector Joined leadership election with path: /overseer_elect/election/95175969530904584-127.0.0.1:42728_-n_0000000001
   [junit4]   2> 1218004 INFO  (TEST-HttpPartitionTest.test-seed#[BEB7D27458D91100]) [    ] o.a.s.c.LeaderElector Watching path /overseer_elect/election/95175969530904580-127.0.0.1:54641_-n_0000000000 to know if I could be the leader
   [junit4]   2> 1218031 INFO  (TEST-HttpPartitionTest.test-seed#[BEB7D27458D91100]) [    ] o.a.s.c.CoreContainer Security conf doesn't exist. Skipping setup for authorization module.
   [junit4]   2> 1218031 INFO  (TEST-HttpPartitionTest.test-seed#[BEB7D27458D91100]) [    ] o.a.s.c.CoreContainer No authentication plugin used.
   [junit4]   2> 1218032 INFO  (TEST-HttpPartitionTest.test-seed#[BEB7D27458D91100]) [    ] o.a.s.c.CorePropertiesLocator Looking for core definitions underneath /home/jenkins/workspace/Lucene-Solr-trunk-Linux/solr/build/solr-core/test/J2/temp/solr.cloud.HttpPartitionTest_BEB7D27458D91100-001/shard-1-001/cores
   [junit4]   2> 1218032 INFO  (TEST-HttpPartitionTest.test-seed#[BEB7D27458D91100]) [    ] o.a.s.c.CoreDescriptor Created CoreDescriptor: {name=collection1, config=solrconfig.xml, transient=false, schema=schema.xml, loadOnStartup=true, configSetProperties=configsetprops.json, collection=collection1, coreNodeName=, dataDir=data/, shard=}
   [junit4]   2> 1218033 INFO  (TEST-HttpPartitionTest.test-seed#[BEB7D27458D91100]) [    ] o.a.s.c.CorePropertiesLocator Found core collection1 in /home/jenkins/workspace/Lucene-Solr-trunk-Linux/solr/build/solr-core/test/J2/temp/solr.cloud.HttpPartitionTest_BEB7D27458D91100-001/shard-1-001/cores/collection1
   [junit4]   2> 1218033 INFO  (TEST-HttpPartitionTest.test-seed#[BEB7D27458D91100]) [    ] o.a.s.c.CorePropertiesLocator Found 1 core definitions
   [junit4]   2> 1218033 INFO  (TEST-HttpPartitionTest.test-seed#[BEB7D27458D91100]) [    ] o.a.s.s.SolrDispatchFilter user.dir=/home/jenkins/workspace/Lucene-Solr-trunk-Linux/solr/build/solr-core/test/J2
   [junit4]   2> 1218033 INFO  (TEST-HttpPartitionTest.test-seed#[BEB7D27458D91100]) [    ] o.a.s.s.SolrDispatchFilter SolrDispatchFilter.init() done
   [junit4]   2> 1218033 INFO  (coreLoadExecutor-3203-thread-1) [    ] o.a.s.c.ZkController publishing state=down
   [junit4]   2> 1218033 INFO  (coreLoadExecutor-3203-thread-1) [    ] o.a.s.c.ZkController numShards not found on descriptor - reading it from system property
   [junit4]   2> 1218034 INFO  (coreLoadExecutor-3203-thread-1) [    ] o.a.s.c.ZkController look for our core node name
   [junit4]   2> 1218034 INFO  (OverseerStateUpdate-95175969530904580-127.0.0.1:54641_-n_0000000000) [    ] o.a.s.c.Overseer processMessage: queueSize: 1, message = {
   [junit4]   2>   "core":"collection1",
   [junit4]   2>   "roles":null,
   [junit4]   2>   "base_url":"http://127.0.0.1:42728",
   [junit4]   2>   "node_name":"127.0.0.1:42728_",
   [junit4]   2>   "numShards":"2",
   [junit4]   2>   "state":"down",
   [junit4]   2>   "shard":null,
   [junit4]   2>   "collection":"collection1",
   [junit4]   2>   "operation":"state"} current state version: 3
   [junit4]   2> 1218034 INFO  (OverseerStateUpdate-95175969530904580-127.0.0.1:54641_-n_0000000000) [    ] o.a.s.c.o.ReplicaMutator Update state numShards=2 message={
   [junit4]   2>   "core":"collection1",
   [junit4]   2>   "roles":null,
   [junit4]   2>   "base_url":"http://127.0.0.1:42728",
   [junit4]   2>   "node_name":"127.0.0.1:42728_",
   [junit4]   2>   "numShards":"2",
   [junit4]   2>   "state":"down",
   [junit4]   2>   "shard":null,
   [junit4]   2>   "collection":"collection1",
   [junit4]   2>   "operation":"state"}
   [junit4]   2> 1218034 INFO  (OverseerStateUpdate-95175969530904580-127.0.0.1:54641_-n_0000000000) [    ] o.a.s.c.o.ClusterStateMutator building a new cName: collection1
   [junit4]   2> 1218034 INFO  (OverseerStateUpdate-95175969530904580-127.0.0.1:54641_-n_0000000000) [    ] o.a.s.c.o.ReplicaMutator Assigning new node to shard shard=shard2
   [junit4]   2> 1218135 INFO  (zkCallback-1236-thread-1) [    ] o.a.s.c.c.ZkStateReader A cluster state change: [WatchedEvent state:SyncConnected type:NodeDataChanged path:/clusterstate.json], has occurred - updating... (live nodes size: [2])
   [junit4]   2> 1218135 INFO  (zkCallback-1243-thread-1) [    ] o.a.s.c.c.ZkStateReader A cluster state change: [WatchedEvent state:SyncConnected type:NodeDataChanged path:/clusterstate.json], has occurred - updating... (live nodes size: [2])
   [junit4]   2> 1218135 INFO  (zkCallback-1238-thread-1) [    ] o.a.s.c.c.ZkStateReader A cluster state change: [WatchedEvent state:SyncConnected type:NodeDataChanged path:/clusterstate.json], has occurred - updating... (live nodes size: [2])
   [junit4]   2> 1219034 INFO  (coreLoadExecutor-3203-thread-1) [    ] o.a.s.c.ZkController waiting to find shard id in clusterstate for collection1
   [junit4]   2> 1219034 INFO  (coreLoadExecutor-3203-thread-1) [    ] o.a.s.c.ZkController Check for collection zkNode:collection1
   [junit4]   2> 1219034 INFO  (coreLoadExecutor-3203-thread-1) [    ] o.a.s.c.ZkController Collection zkNode exists
   [junit4]   2> 1219034 INFO  (coreLoadExecutor-3203-thread-1) [    ] o.a.s.c.c.ZkStateReader Load collection config from: [/collections/collection1]
   [junit4]   2> 1219035 INFO  (coreLoadExecutor-3203-thread-1) [    ] o.a.s.c.c.ZkStateReader path=[/collections/collection1] [configName]=[conf1] specified config exists in ZooKeeper
   [junit4]   2> 1219035 INFO  (coreLoadExecutor-3203-thread-1) [    ] o.a.s.c.SolrResourceLoader new SolrResourceLoader for directory: '/home/jenkins/workspace/Lucene-Solr-trunk-Linux/solr/build/solr-core/test/J2/temp/solr.cloud.HttpPartitionTest_BEB7D27458D91100-001/shard-1-001/cores/collection1'
   [junit4]   2> 1219035 INFO  (coreLoadExecutor-3203-thread-1) [    ] o.a.s.c.SolrResourceLoader JNDI not configured for solr (NoInitialContextEx)
   [junit4]   2> 1219035 INFO  (coreLoadExecutor-3203-thread-1) [    ] o.a.s.c.SolrResourceLoader solr home defaulted to 'solr/' (could not find system property or JNDI)
   [junit4]   2> 1219036 INFO  (coreLoadExecutor-3203-thread-1) [    ] o.a.s.c.Config loaded config solrconfig.xml with version 0 
   [junit4]   2> 1219039 INFO  (coreLoadExecutor-3203-thread-1) [    ] o.a.s.c.SolrConfig current version of requestparams : -1
   [junit4]   2> 1219041 INFO  (coreLoadExecutor-3203-thread-1) [    ] o.a.s.c.SolrConfig Using Lucene MatchVersion: 6.0.0
   [junit4]   2> 1219045 INFO  (coreLoadExecutor-3203-thread-1) [    ] o.a.s.c.SolrConfig Loaded SolrConfig: solrconfig.xml
   [junit4]   2> 1219049 INFO  (coreLoadExecutor-3203-thread-1) [    ] o.a.s.s.IndexSchema [collection1] Schema name=test
   [junit4]   2> 1219102 INFO  (coreLoadExecutor-3203-thread-1) [    ] o.a.s.s.OpenExchangeRatesOrgProvider Initialized with rates=open-exchange-rates.json, refreshInterval=1440.
   [junit4]   2> 1219105 INFO  (coreLoadExecutor-3203-thread-1) [    ] o.a.s.s.IndexSchema default search field in schema is text
   [junit4]   2> 1219106 INFO  (coreLoadExecutor-3203-thread-1) [    ] o.a.s.s.IndexSchema unique key field: id
   [junit4]   2> 1219109 INFO  (coreLoadExecutor-3203-thread-1) [    ] o.a.s.s.FileExchangeRateProvider Reloading exchange rates from file currency.xml
   [junit4]   2> 1219110 INFO  (coreLoadExecutor-3203-thread-1) [    ] o.a.s.s.FileExchangeRateProvider Reloading exchange rates from file currency.xml
   [junit4]   2> 1219111 INFO  (coreLoadExecutor-3203-thread-1) [    ] o.a.s.s.OpenExchangeRatesOrgProvider Reloading exchange rates from open-exchange-rates.json
   [junit4]   2> 1219111 INFO  (coreLoadExecutor-3203-thread-1) [    ] o.a.s.s.OpenExchangeRatesOrgProvider Reloading exchange rates from open-exchange-rates.json
   [junit4]   2> 1219113 INFO  (coreLoadExecutor-3203-thread-1) [    ] o.a.s.c.ConfigSetProperties Did not find ConfigSet properties, assuming default properties: Can't find resource 'configsetprops.json' in classpath or '/configs/conf1', cwd=/home/jenkins/workspace/Lucene-Solr-trunk-Linux/solr/build/solr-core/test/J2
   [junit4]   2> 1219113 INFO  (coreLoadExecutor-3203-thread-1) [    ] o.a.s.c.CoreContainer Creating SolrCore 'collection1' using configuration from collection collection1
   [junit4]   2> 1219113 INFO  (coreLoadExecutor-3203-thread-1) [    ] o.a.s.c.SolrCore org.apache.solr.core.MockDirectoryFactory
   [junit4]   2> 1219113 INFO  (coreLoadExecutor-3203-thread-1) [    ] o.a.s.c.SolrCore [[collection1] ] Opening new SolrCore at [/home/jenkins/workspace/Lucene-Solr-trunk-Linux/solr/build/solr-core/test/J2/temp/solr.cloud.HttpPartitionTest_BEB7D27458D91100-001/shard-1-001/cores/collection1], dataDir=[/home/jenkins/workspace/Lucene-Solr-trunk-Linux/solr/build/solr-core/test/J2/temp/solr.cloud.HttpPartitionTest_BEB7D27458D91100-001/shard-1-001/cores/collection1/data/]
   [junit4]   2> 1219113 INFO  (coreLoadExecutor-3203-thread-1) [    ] o.a.s.c.JmxMonitoredMap JMX monitoring is enabled. Adding Solr mbeans to JMX Server: com.sun.jmx.mbeanserver.JmxMBeanServer@792597
   [junit4]   2> 1219113 INFO  (coreLoadExecutor-3203-thread-1) [    ] o.a.s.c.CachingDirectoryFactory return new directory for /home/jenkins/workspace/Lucene-Solr-trunk-Linux/solr/build/solr-core/test/J2/temp/solr.cloud.HttpPartitionTest_BEB7D27458D91100-001/shard-1-001/cores/collection1/data
   [junit4]   2> 1219114 INFO  (coreLoadExecutor-3203-thread-1) [    ] o.a.s.c.SolrCore New index directory detected: old=null new=/home/jenkins/workspace/Lucene-Solr-trunk-Linux/solr/build/solr-core/test/J2/temp/solr.cloud.HttpPartitionTest_BEB7D27458D91100-001/shard-1-001/cores/collection1/data/index/
   [junit4]   2> 1219114 WARN  (coreLoadExecutor-3203-thread-1) [    ] o.a.s.c.SolrCore [collection1] Solr index directory '/home/jenkins/workspace/Lucene-Solr-trunk-Linux/solr/build/solr-core/test/J2/temp/solr.cloud.HttpPartitionTest_BEB7D27458D91100-001/shard-1-001/cores/collection1/data/index' doesn't exist. Creating new index...
   [junit4]   2> 1219114 INFO  (coreLoadExecutor-3203-thread-1) [    ] o.a.s.c.CachingDirectoryFactory return new directory for /home/jenkins/workspace/Lucene-Solr-trunk-Linux/solr/build/solr-core/test/J2/temp/solr.cloud.HttpPartitionTest_BEB7D27458D91100-001/shard-1-001/cores/collection1/data/index
   [junit4]   2> 1219114 INFO  (coreLoadExecutor-3203-thread-1) [    ] o.a.s.u.RandomMergePolicy RandomMergePolicy wrapping class org.apache.lucene.index.LogDocMergePolicy: [LogDocMergePolicy: minMergeSize=1000, mergeFactor=44, maxMergeSize=9223372036854775807, maxMergeSizeForForcedMerge=9223372036854775807, calibrateSizeByDeletes=true, maxMergeDocs=2147483647, maxCFSSegmentSizeMB=8.796093022207999E12, noCFSRatio=0.642692310846994]
   [junit4]   2> 1219116 INFO  (coreLoadExecutor-3203-thread-1) [    ] o.a.s.c.SolrDeletionPolicy SolrDeletionPolicy.onCommit: commits: num=1
   [junit4]   2> 	commit{dir=MockDirectoryWrapper(SimpleFSDirectory@/home/jenkins/workspace/Lucene-Solr-trunk-Linux/solr/build/solr-core/test/J2/temp/solr.cloud.HttpPartitionTest_BEB7D27458D91100-001/index-SimpleFSDirectory-002 lockFactory=org.apache.lucene.store.NativeFSLockFactory@10523de),segFN=segments_1,generation=1}
   [junit4]   2> 1219116 INFO  (coreLoadExecutor-3203-thread-1) [    ] o.a.s.c.SolrDeletionPolicy newest commit generation = 1
   [junit4]   2> 1219116 INFO  (OldIndexDirectoryCleanupThreadForCore-collection1) [    ] o.a.s.c.SolrCore Looking for old index directories to cleanup for core collection1 in /home/jenkins/workspace/Lucene-Solr-trunk-Linux/solr/build/solr-core/test/J2/temp/solr.cloud.HttpPartitionTest_BEB7D27458D91100-001/shard-1-001/cores/collection1/data/
   [junit4]   2> 1219116 WARN  (OldIndexDirectoryCleanupThreadForCore-collection1) [    ] o.a.s.c.DirectoryFactory /home/jenkins/workspace/Lucene-Solr-trunk-Linux/solr/build/solr-core/test/J2/temp/solr.cloud.HttpPartitionTest_BEB7D27458D91100-001/shard-1-001/cores/collection1/data/ does not point to a valid data directory; skipping clean-up of old index directories.
   [junit4]   2> 1219119 INFO  (coreLoadExecutor-3203-thread-1) [    ] o.a.s.u.p.UpdateRequestProcessorChain creating updateRequestProcessorChain "nodistrib"
   [junit4]   2> 1219119 INFO  (coreLoadExecutor-3203-thread-1) [    ] o.a.s.u.p.UpdateRequestProcessorChain creating updateRequestProcessorChain "dedupe"
   [junit4]   2> 1219119 INFO  (coreLoadExecutor-3203-thread-1) [    ] o.a.s.u.p.UpdateRequestProcessorChain inserting DistributedUpdateProcessorFactory into updateRequestProcessorChain "dedupe"
   [junit4]   2> 1219119 INFO  (coreLoadExecutor-3203-thread-1) [    ] o.a.s.u.p.UpdateRequestProcessorChain creating updateRequestProcessorChain "stored_sig"
   [junit4]   2> 1219119 INFO  (coreLoadExecutor-3203-thread-1) [    ] o.a.s.u.p.UpdateRequestProcessorChain inserting DistributedUpdateProcessorFactory into updateRequestProcessorChain "stored_sig"
   [junit4]   2> 1219119 INFO  (coreLoadExecutor-3203-thread-1) [    ] o.a.s.u.p.UpdateRequestProcessorChain creating updateRequestProcessorChain "distrib-dup-test-chain-explicit"
   [junit4]   2> 1219119 INFO  (coreLoadExecutor-3203-thread-1) [    ] o.a.s.u.p.UpdateRequestProcessorChain creating updateRequestProcessorChain "distrib-dup-test-chain-implicit"
   [junit4]   2> 1219119 INFO  (coreLoadExecutor-3203-thread-1) [    ] o.a.s.u.p.UpdateRequestProcessorChain inserting DistributedUpdateProcessorFactory into updateRequestProcessorChain "distrib-dup-test-chain-implicit"
   [junit4]   2> 1219119 INFO  (coreLoadExecutor-3203-thread-1) [    ] o.a.s.c.SolrCore no updateRequestProcessorChain defined as default, creating implicit default
   [junit4]   2> 1219119 WARN  (coreLoadExecutor-3203-thread-1) [    ] o.a.s.c.RequestHandlers INVALID paramSet a in requestHandler {type = requestHandler,name = /dump,class = DumpRequestHandler,args = {defaults={a=A,b=B}}}
   [junit4]   2> 1219120 INFO  (coreLoadExecutor-3203-thread-1) [    ] o.a.s.h.l.XMLLoader xsltCacheLifetimeSeconds=60
   [junit4]   2> 1219121 INFO  (coreLoadExecutor-3203-thread-1) [    ] o.a.s.h.l.XMLLoader xsltCacheLifetimeSeconds=60
   [junit4]   2> 1219121 INFO  (coreLoadExecutor-3203-thread-1) [    ] o.a.s.h.l.XMLLoader xsltCacheLifetimeSeconds=60
   [junit4]   2> 1219122 INFO  (coreLoadExecutor-3203-thread-1) [    ] o.a.s.h.l.XMLLoader xsltCacheLifetimeSeconds=60
   [junit4]   2> 1219124 INFO  (coreLoadExecutor-3203-thread-1) [    ] o.a.s.c.RequestHandlers Registered paths: /admin/mbeans,standard,/dump,/update/csv,/sql,/update/json/docs,/admin/luke,/export,/admin/segments,/get,/admin/system,/replication,/admin/properties,/config,/stream,/schema,/admin/plugins,/admin/logging,/update/json,/admin/threads,/admin/ping,/update,/admin/file
   [junit4]   2> 1219124 INFO  (coreLoadExecutor-3203-thread-1) [    ] o.a.s.c.SolrCore Using default statsCache cache: org.apache.solr.search.stats.LocalStatsCache
   [junit4]   2> 1219124 INFO  (coreLoadExecutor-3203-thread-1) [    ] o.a.s.u.UpdateHandler Using UpdateLog implementation: org.apache.solr.update.UpdateLog
   [junit4]   2> 1219125 INFO  (coreLoadExecutor-3203-thread-1) [    ] o.a.s.u.UpdateLog Initializing UpdateLog: dataDir= defaultSyncLevel=FLUSH numRecordsToKeep=100 maxNumLogsToKeep=10 numVersionBuckets=65536
   [junit4]   2> 1219125 INFO  (coreLoadExecutor-3203-thread-1) [    ] o.a.s.u.CommitTracker Hard AutoCommit: disabled
   [junit4]   2> 1219125 INFO  (coreLoadExecutor-3203-thread-1) [    ] o.a.s.u.CommitTracker Soft AutoCommit: disabled
   [junit4]   2> 1219125 INFO  (coreLoadExecutor-3203-thread-1) [    ] o.a.s.u.RandomMergePolicy RandomMergePolicy wrapping class org.apache.lucene.index.TieredMergePolicy: [TieredMergePolicy: maxMergeAtOnce=20, maxMergeAtOnceExplicit=24, maxMergedSegmentMB=45.8173828125, floorSegmentMB=1.966796875, forceMergeDeletesPctAllowed=26.882391766014806, segmentsPerTier=17.0, maxCFSSegmentSizeMB=8.796093022207999E12, noCFSRatio=0.0
   [junit4]   2> 1219126 INFO  (coreLoadExecutor-3203-thread-1) [    ] o.a.s.c.SolrDeletionPolicy SolrDeletionPolicy.onInit: commits: num=1
   [junit4]   2> 	commit{dir=MockDirectoryWrapper(SimpleFSDirectory@/home/jenkins/workspace/Lucene-Solr-trunk-Linux/solr/build/solr-core/test/J2/temp/solr.cloud.HttpPartitionTest_BEB7D27458D91100-001/index-SimpleFSDirectory-002 lockFactory=org.apache.lucene.store.NativeFSLockFactory@10523de),segFN=segments_1,generation=1}
   [junit4]   2> 1219126 INFO  (coreLoadExecutor-3203-thread-1) [    ] o.a.s.c.SolrDeletionPolicy newest commit generation = 1
   [junit4]   2> 1219126 INFO  (coreLoadExecutor-3203-thread-1) [    ] o.a.s.s.SolrIndexSearcher Opening Searcher@1eb7830[collection1] main
   [junit4]   2> 1219126 INFO  (coreLoadExecutor-3203-thread-1) [    ] o.a.s.c.c.ZkStateReader Load collection config from: [/collections/collection1]
   [junit4]   2> 1219127 INFO  (coreLoadExecutor-3203-thread-1) [    ] o.a.s.c.c.ZkStateReader path=[/collections/collection1] [configName]=[conf1] specified config exists in ZooKeeper
   [junit4]   2> 1219127 INFO  (coreLoadExecutor-3203-thread-1) [    ] o.a.s.r.ManagedResourceStorage Setting up ZooKeeper-based storage for the RestManager with znodeBase: /configs/conf1
   [junit4]   2> 1219127 INFO  (coreLoadExecutor-3203-thread-1) [    ] o.a.s.r.ManagedResourceStorage Configured ZooKeeperStorageIO with znodeBase: /configs/conf1
   [junit4]   2> 1219127 INFO  (coreLoadExecutor-3203-thread-1) [    ] o.a.s.r.RestManager Initializing RestManager with initArgs: {}
   [junit4]   2> 1219127 INFO  (coreLoadExecutor-3203-thread-1) [    ] o.a.s.r.ManagedResourceStorage Reading _rest_managed.json using ZooKeeperStorageIO:path=/configs/conf1
   [junit4]   2> 1219127 INFO  (coreLoadExecutor-3203-thread-1) [    ] o.a.s.r.ManagedResourceStorage No data found for znode /configs/conf1/_rest_managed.json
   [junit4]   2> 1219127 INFO  (coreLoadExecutor-3203-thread-1) [    ] o.a.s.r.ManagedResourceStorage Loaded null at path _rest_managed.json using ZooKeeperStorageIO:path=/configs/conf1
   [junit4]   2> 1219127 INFO  (coreLoadExecutor-3203-thread-1) [    ] o.a.s.r.RestManager Initializing 0 registered ManagedResources
   [junit4]   2> 1219127 INFO  (coreLoadExecutor-3203-thread-1) [    ] o.a.s.h.ReplicationHandler Commits will be reserved for  10000
   [junit4]   2> 1219127 INFO  (searcherExecutor-3204-thread-1) [    ] o.a.s.c.SolrCore [collection1] Registered new searcher Searcher@1eb7830[collection1] main{ExitableDirectoryReader(UninvertingDirectoryReader())}
   [junit4]   2> 1219128 INFO  (coreLoadExecutor-3203-thread-1) [    ] o.a.s.u.UpdateLog Looking up max value of version field to seed version buckets
   [junit4]   2> 1219128 INFO  (coreLoadExecutor-3203-thread-1) [    ] o.a.s.u.VersionInfo Refreshing highest value of _version_ for 65536 version buckets from index
   [junit4]   2> 1219128 INFO  (coreLoadExecutor-3203-thread-1) [    ] o.a.s.u.VersionInfo No terms found for _version_, cannot seed version bucket highest value from index
   [junit4]   2> 1219128 INFO  (coreLoadExecutor-3203-thread-1) [    ] o.a.s.u.UpdateLog Could not find max version in index or recent updates, using new clock 1522815516609085440
   [junit4]   2> 1219129 INFO  (coreLoadExecutor-3203-thread-1) [    ] o.a.s.u.UpdateLog Took 1.0ms to seed version buckets with highest version 1522815516609085440
   [junit4]   2> 1219129 INFO  (coreLoadExecutor-3203-thread-1) [    ] o.a.s.c.ZkController watch zkdir /configs/conf1
   [junit4]   2> 1219130 INFO  (coreLoadExecutor-3203-thread-1) [    ] o.a.s.c.CoreContainer registering core: collection1
   [junit4]   2> 1219130 INFO  (coreZkRegister-3198-thread-1) [    ] o.a.s.c.ZkController Register replica - core:collection1 address:http://127.0.0.1:42728 collection:collection1 shard:shard2
   [junit4]   2> 1219130 INFO  (coreZkRegister-3198-thread-1) [    ] o.a.s.c.c.SolrZkClient makePath: /collections/collection1/leader_elect/shard2/election
   [junit4]   2> 1219131 INFO  (coreZkRegister-3198-thread-1) [    ] o.a.s.c.LeaderElector Joined leadership election with path: /collections/collection1/leader_elect/shard2/election/95175969530904584-core_node1-n_0000000000
   [junit4]   2> 1219131 INFO  (coreZkRegister-3198-thread-1) [    ] o.a.s.c.ShardLeaderElectionContext Running the leader process for shard=shard2 and weAreReplacement=false and leaderVoteWait=10000
   [junit4]   2> 1219132 INFO  (coreZkRegister-3198-thread-1) [    ] o.a.s.c.ShardLeaderElectionContext Enough replicas found to continue.
   [junit4]   2> 1219132 INFO  (coreZkRegister-3198-thread-1) [    ] o.a.s.c.ShardLeaderElectionContext I may be the new leader - try and sync
   [junit4]   2> 1219132 INFO  (coreZkRegister-3198-thread-1) [    ] o.a.s.c.SyncStrategy Sync replicas to http://127.0.0.1:42728/collection1/
   [junit4]   2> 1219132 INFO  (coreZkRegister-3198-thread-1) [    ] o.a.s.c.SyncStrategy Sync Success - now sync replicas to me
   [junit4]   2> 1219132 INFO  (coreZkRegister-3198-thread-1) [    ] o.a.s.c.SyncStrategy http://127.0.0.1:42728/collection1/ has no replicas
   [junit4]   2> 1219132 INFO  (OverseerStateUpdate-95175969530904580-127.0.0.1:54641_-n_0000000000) [    ] o.a.s.c.Overseer processMessage: queueSize: 1, message = {
   [junit4]   2>   "operation":"leader",
   [junit4]   2>   "shard":"shard2",
   [junit4]   2>   "collection":"collection1"} current state version: 4
   [junit4]   2> 1219133 INFO  (coreZkRegister-3198-thread-1) [    ] o.a.s.c.c.SolrZkClient makePath: /collections/collection1/leaders/shard2
   [junit4]   2> 1219133 INFO  (coreZkRegister-3198-thread-1) [    ] o.a.s.c.ShardLeaderElectionContextBase Creating leader registration node
   [junit4]   2> 1219134 INFO  (coreZkRegister-3198-thread-1) [    ] o.a.s.c.ShardLeaderElectionContext I am the new leader: http://127.0.0.1:42728/collection1/ shard2
   [junit4]   2> 1219134 INFO  (OverseerStateUpdate-95175969530904580-127.0.0.1:54641_-n_0000000000) [    ] o.a.s.c.Overseer processMessage: queueSize: 1, message = {
   [junit4]   2>   "operation":"leader",
   [junit4]   2>   "shard":"shard2",
   [junit4]   2>   "collection":"collection1",
   [junit4]   2>   "base_url":"http://127.0.0.1:42728",
   [junit4]   2>   "core":"collection1",
   [junit4]   2>   "state":"active"} current state version: 4
   [junit4]   2> 1219235 INFO  (zkCallback-1238-thread-1) [    ] o.a.s.c.c.ZkStateReader A cluster state change: [WatchedEvent state:SyncConnected type:NodeDataChanged path:/clusterstate.json], has occurred - updating... (live nodes size: [2])
   [junit4]   2> 1219235 INFO  (zkCallback-1236-thread-1) [    ] o.a.s.c.c.ZkStateReader A cluster state change: [WatchedEvent state:SyncConnected type:NodeDataChanged path:/clusterstate.json], has occurred - updating... (live nodes size: [2])
   [junit4]   2> 1219235 INFO  (zkCallback-1243-thread-1) [    ] o.a.s.c.c.ZkStateReader A cluster state change: [WatchedEvent state:SyncConnected type:NodeDataChanged path:/clusterstate.json], has occurred - updating... (live nodes size: [2])
   [junit4]   2> 1219284 INFO  (coreZkRegister-3198-thread-1) [    ] o.a.s.c.ZkController We are http://127.0.0.1:42728/collection1/ and leader is http://127.0.0.1:42728/collection1/
   [junit4]   2> 1219284 INFO  (coreZkRegister-3198-thread-1) [    ] o.a.s.c.ZkController No LogReplay needed for core=collection1 baseURL=http://127.0.0.1:42728
   [junit4]   2> 1219285 INFO  (coreZkRegister-3198-thread-1) [    ] o.a.s.c.ZkController I am the leader, no recovery necessary
   [junit4]   2> 1219285 INFO  (coreZkRegister-3198-thread-1) [    ] o.a.s.c.ZkController publishing state=active
   [junit4]   2> 1219285 INFO  (coreZkRegister-3198-thread-1) [    ] o.a.s.c.ZkController numShards not found on descriptor - reading it from system property
   [junit4]   2> 1219285 INFO  (OverseerStateUpdate-95175969530904580-127.0.0.1:54641_-n_0000000000) [    ] o.a.s.c.Overseer processMessage: queueSize: 1, message = {
   [junit4]   2>   "core":"collection1",
   [junit4]   2>   "core_node_name":"core_node1",
   [junit4]   2>   "roles":null,
   [junit4]   2>   "base_url":"http://127.0.0.1:42728",
   [junit4]   2>   "node_name":"127.0.0.1:42728_",
   [junit4]   2>   "numShards":"2",
   [junit4]   2>   "state":"active",
   [junit4]   2>   "shard":"shard2",
   [junit4]   2>   "collection":"collection1",
   [junit4]   2>   "operation":"state"} current state version: 5
   [junit4]   2> 1219286 INFO  (OverseerStateUpdate-95175969530904580-127.0.0.1:54641_-n_0000000000) [    ] o.a.s.c.o.ReplicaMutator Update state numShards=2 message={
   [junit4]   2>   "core":"collection1",
   [junit4]   2>   "core_node_name":"core_node1",
   [junit4]   2>   "roles":null,
   [junit4]   2>   "base_url":"http://127.0.0.1:42728",
   [junit4]   2>   "node_name":"127.0.0.1:42728_",
   [junit4]   2>   "numShards":"2",
   [junit4]   2>   "state":"active",
   [junit4]   2>   "shard":"shard2",
   [juni

[...truncated too long message...]


   [junit4]    >             "leader":"true"}}},
   [junit4]    >       "shard2":{
   [junit4]    >         "range":"0-7fffffff",
   [junit4]    >         "state":"active",
   [junit4]    >         "replicas":{
   [junit4]    >           "core_node1":{
   [junit4]    >             "core":"collection1",
   [junit4]    >             "base_url":"http://127.0.0.1:42728",
   [junit4]    >             "node_name":"127.0.0.1:42728_",
   [junit4]    >             "state":"active",
   [junit4]    >             "leader":"true"},
   [junit4]    >           "core_node3":{
   [junit4]    >             "core":"collection1",
   [junit4]    >             "base_url":"http://127.0.0.1:33470",
   [junit4]    >             "node_name":"127.0.0.1:33470_",
   [junit4]    >             "state":"active"}}}},
   [junit4]    >     "router":{"name":"compositeId"},
   [junit4]    >     "maxShardsPerNode":"1",
   [junit4]    >     "autoAddReplicas":"false",
   [junit4]    >     "autoCreated":"true"},
   [junit4]    >   "control_collection":{
   [junit4]    >     "replicationFactor":"1",
   [junit4]    >     "shards":{"shard1":{
   [junit4]    >         "range":"80000000-7fffffff",
   [junit4]    >         "state":"active",
   [junit4]    >         "replicas":{"core_node1":{
   [junit4]    >             "core":"collection1",
   [junit4]    >             "base_url":"http://127.0.0.1:54641",
   [junit4]    >             "node_name":"127.0.0.1:54641_",
   [junit4]    >             "state":"active",
   [junit4]    >             "leader":"true"}}}},
   [junit4]    >     "router":{"name":"compositeId"},
   [junit4]    >     "maxShardsPerNode":"1",
   [junit4]    >     "autoAddReplicas":"false",
   [junit4]    >     "autoCreated":"true"},
   [junit4]    >   "c8n_1x2":{
   [junit4]    >     "replicationFactor":"2",
   [junit4]    >     "shards":{"shard1":{
   [junit4]    >         "range":"80000000-7fffffff",
   [junit4]    >         "state":"active",
   [junit4]    >         "replicas":{
   [junit4]    >           "core_node1":{
   [junit4]    >             "core":"c8n_1x2_shard1_replica2",
   [junit4]    >             "base_url":"http://127.0.0.1:37914",
   [junit4]    >             "node_name":"127.0.0.1:37914_",
   [junit4]    >             "state":"recovering"},
   [junit4]    >           "core_node2":{
   [junit4]    >             "core":"c8n_1x2_shard1_replica1",
   [junit4]    >             "base_url":"http://127.0.0.1:54641",
   [junit4]    >             "node_name":"127.0.0.1:54641_",
   [junit4]    >             "state":"active",
   [junit4]    >             "leader":"true"}}}},
   [junit4]    >     "router":{"name":"compositeId"},
   [junit4]    >     "maxShardsPerNode":"1",
   [junit4]    >     "autoAddReplicas":"false"},
   [junit4]    >   "collMinRf_1x3":{
   [junit4]    >     "replicationFactor":"3",
   [junit4]    >     "shards":{"shard1":{
   [junit4]    >         "range":"80000000-7fffffff",
   [junit4]    >         "state":"active",
   [junit4]    >         "replicas":{
   [junit4]    >           "core_node1":{
   [junit4]    >             "core":"collMinRf_1x3_shard1_replica3",
   [junit4]    >             "base_url":"http://127.0.0.1:54641",
   [junit4]    >             "node_name":"127.0.0.1:54641_",
   [junit4]    >             "state":"active"},
   [junit4]    >           "core_node2":{
   [junit4]    >             "core":"collMinRf_1x3_shard1_replica2",
   [junit4]    >             "base_url":"http://127.0.0.1:33470",
   [junit4]    >             "node_name":"127.0.0.1:33470_",
   [junit4]    >             "state":"active"},
   [junit4]    >           "core_node3":{
   [junit4]    >             "core":"collMinRf_1x3_shard1_replica1",
   [junit4]    >             "base_url":"http://127.0.0.1:42728",
   [junit4]    >             "node_name":"127.0.0.1:42728_",
   [junit4]    >             "state":"active",
   [junit4]    >             "leader":"true"}}}},
   [junit4]    >     "router":{"name":"compositeId"},
   [junit4]    >     "maxShardsPerNode":"1",
   [junit4]    >     "autoAddReplicas":"false"}}
   [junit4]    > 	at __randomizedtesting.SeedInfo.seed([BEB7D27458D91100:36E3EDAEF6257CF8]:0)
   [junit4]    > 	at org.apache.solr.cloud.AbstractFullDistribZkTestBase.ensureAllReplicasAreActive(AbstractFullDistribZkTestBase.java:1844)
   [junit4]    > 	at org.apache.solr.cloud.HttpPartitionTest.testRf2(HttpPartitionTest.java:349)
   [junit4]    > 	at org.apache.solr.cloud.HttpPartitionTest.test(HttpPartitionTest.java:109)
   [junit4]    > 	at org.apache.solr.BaseDistributedSearchTestCase$ShardsRepeatRule$ShardsFixedStatement.callStatement(BaseDistributedSearchTestCase.java:965)
   [junit4]    > 	at org.apache.solr.BaseDistributedSearchTestCase$ShardsRepeatRule$ShardsStatement.evaluate(BaseDistributedSearchTestCase.java:940)
   [junit4]    > 	at java.lang.Thread.run(Thread.java:747)
   [junit4]   2> 1349020 INFO  (SUITE-HttpPartitionTest-seed#[BEB7D27458D91100]-worker) [    ] o.a.s.SolrTestCaseJ4 ###deleteCore
   [junit4]   2> NOTE: leaving temporary files on disk at: /home/jenkins/workspace/Lucene-Solr-trunk-Linux/solr/build/solr-core/test/J2/temp/solr.cloud.HttpPartitionTest_BEB7D27458D91100-001
   [junit4]   2> Jan 08, 2016 4:22:56 PM com.carrotsearch.randomizedtesting.ThreadLeakControl checkThreadLeaks
   [junit4]   2> WARNING: Will linger awaiting termination of 2 leaked thread(s).
   [junit4]   2> NOTE: test params are: codec=Asserting(Lucene60): {range_facet_l_dv=PostingsFormat(name=Asserting), _version_=PostingsFormat(name=LuceneVarGapDocFreqInterval), multiDefault=PostingsFormat(name=LuceneFixedGap), a_t=PostingsFormat(name=LuceneFixedGap), intDefault=PostingsFormat(name=LuceneVarGapDocFreqInterval), id=PostingsFormat(name=Asserting), range_facet_i_dv=PostingsFormat(name=LuceneFixedGap), text=PostingsFormat(name=LuceneVarGapFixedInterval), range_facet_l=PostingsFormat(name=LuceneFixedGap), timestamp=PostingsFormat(name=LuceneFixedGap)}, docValues:{range_facet_l_dv=DocValuesFormat(name=Asserting), range_facet_i_dv=DocValuesFormat(name=Lucene54), timestamp=DocValuesFormat(name=Lucene54)}, sim=RandomSimilarityProvider(queryNorm=true,coord=yes): {}, locale=en_KI, timezone=Etc/GMT+1
   [junit4]   2> NOTE: Linux 3.19.0-42-generic i386/Oracle Corporation 9-ea (32-bit)/cpus=12,threads=1,free=416401152,total=536870912
   [junit4]   2> NOTE: All tests run in this JVM: [TestSolrQueryParser, TestStressReorder, TestRemoveLastDynamicCopyField, SampleTest, TestIndexingPerformance, TestPerFieldSimilarity, LeaderFailoverAfterPartitionTest, SliceStateTest, StressHdfsTest, DirectSolrConnectionTest, RequestHandlersTest, ZkStateWriterTest, TestDistributedMissingSort, CoreMergeIndexesAdminHandlerTest, TestZkChroot, FieldMutatingUpdateProcessorTest, DeleteReplicaTest, RecoveryZkTest, QueryParsingTest, RemoteQueryErrorTest, BitVectorTest, TriLevelCompositeIdRoutingTest, DistributedFacetPivotLargeTest, TestSolrQueryResponse, TestConfigSetsAPIZkFailure, ShowFileRequestHandlerTest, CdcrUpdateLogTest, TestStressRecovery, DocValuesMultiTest, BaseCdcrDistributedZkTest, AutoCommitTest, TestDistribIDF, TestShardHandlerFactory, TestTrackingShardHandlerFactory, TestSha256AuthenticationProvider, HdfsThreadLeakTest, StatelessScriptUpdateProcessorFactoryTest, RollingRestartTest, TestSweetSpotSimilarityFactory, SuggesterWFSTTest, TestSolrIndexConfig, TestAuthenticationFramework, TestSolrJ, CoreAdminHandlerTest, TestSolrXml, SuggesterTSTTest, TestPostingsSolrHighlighter, CachingDirectoryFactoryTest, AnalyticsQueryTest, RegexBoostProcessorTest, ScriptEngineTest, TestDynamicFieldCollectionResource, TestCollectionAPI, HdfsCollectionsAPIDistributedZkTest, TestIndexSearcher, TestSuggestSpellingConverter, UnloadDistributedZkTest, CircularListTest, TestConfigReload, HdfsLockFactoryTest, TestClassNameShortening, DateMathParserTest, TestLeaderInitiatedRecoveryThread, TestExtendedDismaxParser, TestReRankQParserPlugin, TestSearcherReuse, TestLRUStatsCache, ConcurrentDeleteAndCreateCollectionTest, TestAuthorizationFramework, TestConfigSetImmutable, DistribDocExpirationUpdateProcessorTest, SearchHandlerTest, HardAutoCommitTest, TestSolrConfigHandlerConcurrent, TestManagedSchemaDynamicFieldResource, ShardSplitTest, TestCustomDocTransformer, ChangedSchemaMergeTest, TestSolrQueryParserDefaultOperatorResource, TestUtils, TestAnalyzeInfixSuggestions, CollectionStateFormat2Test, TestCollationFieldDocValues, TestCharFilters, FullSolrCloudDistribCmdsTest, TestRestoreCore, EnumFieldTest, StatsComponentTest, TestSchemaSimilarityResource, TestOrdValues, TestCollationField, TestHashQParserPlugin, TestRebalanceLeaders, DirectUpdateHandlerTest, HttpPartitionTest]
   [junit4] Completed [431/575 (1!)] on J2 in 134.34s, 1 test, 1 failure <<< FAILURES!

[...truncated 464 lines...]
BUILD FAILED
/home/jenkins/workspace/Lucene-Solr-trunk-Linux/build.xml:784: The following error occurred while executing this line:
/home/jenkins/workspace/Lucene-Solr-trunk-Linux/build.xml:728: The following error occurred while executing this line:
/home/jenkins/workspace/Lucene-Solr-trunk-Linux/build.xml:59: The following error occurred while executing this line:
/home/jenkins/workspace/Lucene-Solr-trunk-Linux/solr/build.xml:233: The following error occurred while executing this line:
/home/jenkins/workspace/Lucene-Solr-trunk-Linux/solr/common-build.xml:516: The following error occurred while executing this line:
/home/jenkins/workspace/Lucene-Solr-trunk-Linux/lucene/common-build.xml:1424: The following error occurred while executing this line:
/home/jenkins/workspace/Lucene-Solr-trunk-Linux/lucene/common-build.xml:981: There were test failures: 575 suites (8 ignored), 2290 tests, 1 failure, 115 ignored (70 assumptions) [seed: BEB7D27458D91100]

Total time: 52 minutes 16 seconds
Build step 'Invoke Ant' marked build as failure
Archiving artifacts
[WARNINGS] Skipping publisher since build result is FAILURE
Recording test results
Email was triggered for: Failure - Any
Sending email for trigger: Failure - Any



Mime
View raw message