lucene-dev mailing list archives

Site index · List index
Message view « Date » · « Thread »
Top « Date » · « Thread »
From Policeman Jenkins Server <jenk...@thetaphi.de>
Subject [JENKINS-EA] Lucene-Solr-5.x-Linux (64bit/jdk-9-ea+95) - Build # 15222 - Failure!
Date Mon, 11 Jan 2016 15:55:43 GMT
Build: http://jenkins.thetaphi.de/job/Lucene-Solr-5.x-Linux/15222/
Java: 64bit/jdk-9-ea+95 -XX:-UseCompressedOops -XX:+UseG1GC -XX:-CompactStrings

1 tests failed.
FAILED:  org.apache.solr.cloud.DistribDocExpirationUpdateProcessorTest.test

Error Message:
There are still nodes recoverying - waited for 30 seconds

Stack Trace:
java.lang.AssertionError: There are still nodes recoverying - waited for 30 seconds
	at __randomizedtesting.SeedInfo.seed([B691F4F2AC0AA467:3EC5CB2802F6C99F]:0)
	at org.junit.Assert.fail(Assert.java:93)
	at org.apache.solr.cloud.AbstractDistribZkTestBase.waitForRecoveriesToFinish(AbstractDistribZkTestBase.java:175)
	at org.apache.solr.cloud.AbstractFullDistribZkTestBase.waitForRecoveriesToFinish(AbstractFullDistribZkTestBase.java:837)
	at org.apache.solr.cloud.AbstractFullDistribZkTestBase.waitForThingsToLevelOut(AbstractFullDistribZkTestBase.java:1393)
	at org.apache.solr.cloud.DistribDocExpirationUpdateProcessorTest.test(DistribDocExpirationUpdateProcessorTest.java:73)
	at sun.reflect.NativeMethodAccessorImpl.invoke0(Native Method)
	at sun.reflect.NativeMethodAccessorImpl.invoke(NativeMethodAccessorImpl.java:62)
	at sun.reflect.DelegatingMethodAccessorImpl.invoke(DelegatingMethodAccessorImpl.java:43)
	at java.lang.reflect.Method.invoke(Method.java:520)
	at com.carrotsearch.randomizedtesting.RandomizedRunner.invoke(RandomizedRunner.java:1764)
	at com.carrotsearch.randomizedtesting.RandomizedRunner$8.evaluate(RandomizedRunner.java:871)
	at com.carrotsearch.randomizedtesting.RandomizedRunner$9.evaluate(RandomizedRunner.java:907)
	at com.carrotsearch.randomizedtesting.RandomizedRunner$10.evaluate(RandomizedRunner.java:921)
	at org.apache.solr.BaseDistributedSearchTestCase$ShardsRepeatRule$ShardsFixedStatement.callStatement(BaseDistributedSearchTestCase.java:965)
	at org.apache.solr.BaseDistributedSearchTestCase$ShardsRepeatRule$ShardsStatement.evaluate(BaseDistributedSearchTestCase.java:940)
	at com.carrotsearch.randomizedtesting.rules.SystemPropertiesRestoreRule$1.evaluate(SystemPropertiesRestoreRule.java:57)
	at org.apache.lucene.util.TestRuleSetupTeardownChained$1.evaluate(TestRuleSetupTeardownChained.java:50)
	at org.apache.lucene.util.AbstractBeforeAfterRule$1.evaluate(AbstractBeforeAfterRule.java:46)
	at org.apache.lucene.util.TestRuleThreadAndTestName$1.evaluate(TestRuleThreadAndTestName.java:49)
	at org.apache.lucene.util.TestRuleIgnoreAfterMaxFailures$1.evaluate(TestRuleIgnoreAfterMaxFailures.java:65)
	at org.apache.lucene.util.TestRuleMarkFailure$1.evaluate(TestRuleMarkFailure.java:48)
	at com.carrotsearch.randomizedtesting.rules.StatementAdapter.evaluate(StatementAdapter.java:36)
	at com.carrotsearch.randomizedtesting.ThreadLeakControl$StatementRunner.run(ThreadLeakControl.java:367)
	at com.carrotsearch.randomizedtesting.ThreadLeakControl.forkTimeoutingTask(ThreadLeakControl.java:809)
	at com.carrotsearch.randomizedtesting.ThreadLeakControl$3.evaluate(ThreadLeakControl.java:460)
	at com.carrotsearch.randomizedtesting.RandomizedRunner.runSingleTest(RandomizedRunner.java:880)
	at com.carrotsearch.randomizedtesting.RandomizedRunner$5.evaluate(RandomizedRunner.java:781)
	at com.carrotsearch.randomizedtesting.RandomizedRunner$6.evaluate(RandomizedRunner.java:816)
	at com.carrotsearch.randomizedtesting.RandomizedRunner$7.evaluate(RandomizedRunner.java:827)
	at com.carrotsearch.randomizedtesting.rules.StatementAdapter.evaluate(StatementAdapter.java:36)
	at com.carrotsearch.randomizedtesting.rules.SystemPropertiesRestoreRule$1.evaluate(SystemPropertiesRestoreRule.java:57)
	at org.apache.lucene.util.AbstractBeforeAfterRule$1.evaluate(AbstractBeforeAfterRule.java:46)
	at com.carrotsearch.randomizedtesting.rules.StatementAdapter.evaluate(StatementAdapter.java:36)
	at org.apache.lucene.util.TestRuleStoreClassName$1.evaluate(TestRuleStoreClassName.java:42)
	at com.carrotsearch.randomizedtesting.rules.NoShadowingOrOverridesOnMethodsRule$1.evaluate(NoShadowingOrOverridesOnMethodsRule.java:40)
	at com.carrotsearch.randomizedtesting.rules.NoShadowingOrOverridesOnMethodsRule$1.evaluate(NoShadowingOrOverridesOnMethodsRule.java:40)
	at com.carrotsearch.randomizedtesting.rules.StatementAdapter.evaluate(StatementAdapter.java:36)
	at com.carrotsearch.randomizedtesting.rules.StatementAdapter.evaluate(StatementAdapter.java:36)
	at com.carrotsearch.randomizedtesting.rules.StatementAdapter.evaluate(StatementAdapter.java:36)
	at org.apache.lucene.util.TestRuleAssertionsRequired$1.evaluate(TestRuleAssertionsRequired.java:54)
	at org.apache.lucene.util.TestRuleMarkFailure$1.evaluate(TestRuleMarkFailure.java:48)
	at org.apache.lucene.util.TestRuleIgnoreAfterMaxFailures$1.evaluate(TestRuleIgnoreAfterMaxFailures.java:65)
	at org.apache.lucene.util.TestRuleIgnoreTestSuites$1.evaluate(TestRuleIgnoreTestSuites.java:55)
	at com.carrotsearch.randomizedtesting.rules.StatementAdapter.evaluate(StatementAdapter.java:36)
	at com.carrotsearch.randomizedtesting.ThreadLeakControl$StatementRunner.run(ThreadLeakControl.java:367)
	at java.lang.Thread.run(Thread.java:747)




Build Log:
[...truncated 10348 lines...]
   [junit4] Suite: org.apache.solr.cloud.DistribDocExpirationUpdateProcessorTest
   [junit4]   2> Creating dataDir: /home/jenkins/workspace/Lucene-Solr-5.x-Linux/solr/build/solr-core/test/J2/temp/solr.cloud.DistribDocExpirationUpdateProcessorTest_B691F4F2AC0AA467-001/init-core-data-001
   [junit4]   2> 432463 INFO  (SUITE-DistribDocExpirationUpdateProcessorTest-seed#[B691F4F2AC0AA467]-worker) [    ] o.a.s.SolrTestCaseJ4 Randomized ssl (false) and clientAuth (true)
   [junit4]   2> 432463 INFO  (SUITE-DistribDocExpirationUpdateProcessorTest-seed#[B691F4F2AC0AA467]-worker) [    ] o.a.s.BaseDistributedSearchTestCase Setting hostContext system property: /pxqux/
   [junit4]   2> 432465 INFO  (TEST-DistribDocExpirationUpdateProcessorTest.test-seed#[B691F4F2AC0AA467]) [    ] o.a.s.c.ZkTestServer STARTING ZK TEST SERVER
   [junit4]   2> 432465 INFO  (Thread-1114) [    ] o.a.s.c.ZkTestServer client port:0.0.0.0/0.0.0.0:0
   [junit4]   2> 432465 INFO  (Thread-1114) [    ] o.a.s.c.ZkTestServer Starting server
   [junit4]   2> 432565 INFO  (TEST-DistribDocExpirationUpdateProcessorTest.test-seed#[B691F4F2AC0AA467]) [    ] o.a.s.c.ZkTestServer start zk server on port:57899
   [junit4]   2> 432565 INFO  (TEST-DistribDocExpirationUpdateProcessorTest.test-seed#[B691F4F2AC0AA467]) [    ] o.a.s.c.c.SolrZkClient Using default ZkCredentialsProvider
   [junit4]   2> 432565 INFO  (TEST-DistribDocExpirationUpdateProcessorTest.test-seed#[B691F4F2AC0AA467]) [    ] o.a.s.c.c.ConnectionManager Waiting for client to connect to ZooKeeper
   [junit4]   2> 432568 INFO  (zkCallback-1195-thread-1) [    ] o.a.s.c.c.ConnectionManager Watcher org.apache.solr.common.cloud.ConnectionManager@62658a07 name:ZooKeeperConnection Watcher:127.0.0.1:57899 got event WatchedEvent state:SyncConnected type:None path:null path:null type:None
   [junit4]   2> 432568 INFO  (TEST-DistribDocExpirationUpdateProcessorTest.test-seed#[B691F4F2AC0AA467]) [    ] o.a.s.c.c.ConnectionManager Client is connected to ZooKeeper
   [junit4]   2> 432568 INFO  (TEST-DistribDocExpirationUpdateProcessorTest.test-seed#[B691F4F2AC0AA467]) [    ] o.a.s.c.c.SolrZkClient Using default ZkACLProvider
   [junit4]   2> 432568 INFO  (TEST-DistribDocExpirationUpdateProcessorTest.test-seed#[B691F4F2AC0AA467]) [    ] o.a.s.c.c.SolrZkClient makePath: /solr
   [junit4]   2> 432569 INFO  (TEST-DistribDocExpirationUpdateProcessorTest.test-seed#[B691F4F2AC0AA467]) [    ] o.a.s.c.c.SolrZkClient Using default ZkCredentialsProvider
   [junit4]   2> 432569 INFO  (TEST-DistribDocExpirationUpdateProcessorTest.test-seed#[B691F4F2AC0AA467]) [    ] o.a.s.c.c.ConnectionManager Waiting for client to connect to ZooKeeper
   [junit4]   2> 432570 INFO  (zkCallback-1196-thread-1) [    ] o.a.s.c.c.ConnectionManager Watcher org.apache.solr.common.cloud.ConnectionManager@4c282788 name:ZooKeeperConnection Watcher:127.0.0.1:57899/solr got event WatchedEvent state:SyncConnected type:None path:null path:null type:None
   [junit4]   2> 432570 INFO  (TEST-DistribDocExpirationUpdateProcessorTest.test-seed#[B691F4F2AC0AA467]) [    ] o.a.s.c.c.ConnectionManager Client is connected to ZooKeeper
   [junit4]   2> 432570 INFO  (TEST-DistribDocExpirationUpdateProcessorTest.test-seed#[B691F4F2AC0AA467]) [    ] o.a.s.c.c.SolrZkClient Using default ZkACLProvider
   [junit4]   2> 432570 INFO  (TEST-DistribDocExpirationUpdateProcessorTest.test-seed#[B691F4F2AC0AA467]) [    ] o.a.s.c.c.SolrZkClient makePath: /collections/collection1
   [junit4]   2> 432572 INFO  (TEST-DistribDocExpirationUpdateProcessorTest.test-seed#[B691F4F2AC0AA467]) [    ] o.a.s.c.c.SolrZkClient makePath: /collections/collection1/shards
   [junit4]   2> 432572 INFO  (TEST-DistribDocExpirationUpdateProcessorTest.test-seed#[B691F4F2AC0AA467]) [    ] o.a.s.c.c.SolrZkClient makePath: /collections/control_collection
   [junit4]   2> 432572 INFO  (TEST-DistribDocExpirationUpdateProcessorTest.test-seed#[B691F4F2AC0AA467]) [    ] o.a.s.c.c.SolrZkClient makePath: /collections/control_collection/shards
   [junit4]   2> 432573 INFO  (TEST-DistribDocExpirationUpdateProcessorTest.test-seed#[B691F4F2AC0AA467]) [    ] o.a.s.c.AbstractZkTestCase put /home/jenkins/workspace/Lucene-Solr-5.x-Linux/solr/core/src/test-files/solr/collection1/conf/solrconfig-doc-expire-update-processor.xml to /configs/conf1/solrconfig.xml
   [junit4]   2> 432573 INFO  (TEST-DistribDocExpirationUpdateProcessorTest.test-seed#[B691F4F2AC0AA467]) [    ] o.a.s.c.c.SolrZkClient makePath: /configs/conf1/solrconfig.xml
   [junit4]   2> 432574 INFO  (TEST-DistribDocExpirationUpdateProcessorTest.test-seed#[B691F4F2AC0AA467]) [    ] o.a.s.c.AbstractZkTestCase put /home/jenkins/workspace/Lucene-Solr-5.x-Linux/solr/core/src/test-files/solr/collection1/conf/schema15.xml to /configs/conf1/schema.xml
   [junit4]   2> 432574 INFO  (TEST-DistribDocExpirationUpdateProcessorTest.test-seed#[B691F4F2AC0AA467]) [    ] o.a.s.c.c.SolrZkClient makePath: /configs/conf1/schema.xml
   [junit4]   2> 432576 INFO  (TEST-DistribDocExpirationUpdateProcessorTest.test-seed#[B691F4F2AC0AA467]) [    ] o.a.s.c.AbstractZkTestCase put /home/jenkins/workspace/Lucene-Solr-5.x-Linux/solr/core/src/test-files/solr/collection1/conf/solrconfig.snippet.randomindexconfig.xml to /configs/conf1/solrconfig.snippet.randomindexconfig.xml
   [junit4]   2> 432576 INFO  (TEST-DistribDocExpirationUpdateProcessorTest.test-seed#[B691F4F2AC0AA467]) [    ] o.a.s.c.c.SolrZkClient makePath: /configs/conf1/solrconfig.snippet.randomindexconfig.xml
   [junit4]   2> 432576 INFO  (TEST-DistribDocExpirationUpdateProcessorTest.test-seed#[B691F4F2AC0AA467]) [    ] o.a.s.c.AbstractZkTestCase put /home/jenkins/workspace/Lucene-Solr-5.x-Linux/solr/core/src/test-files/solr/collection1/conf/stopwords.txt to /configs/conf1/stopwords.txt
   [junit4]   2> 432576 INFO  (TEST-DistribDocExpirationUpdateProcessorTest.test-seed#[B691F4F2AC0AA467]) [    ] o.a.s.c.c.SolrZkClient makePath: /configs/conf1/stopwords.txt
   [junit4]   2> 432577 INFO  (TEST-DistribDocExpirationUpdateProcessorTest.test-seed#[B691F4F2AC0AA467]) [    ] o.a.s.c.AbstractZkTestCase put /home/jenkins/workspace/Lucene-Solr-5.x-Linux/solr/core/src/test-files/solr/collection1/conf/protwords.txt to /configs/conf1/protwords.txt
   [junit4]   2> 432577 INFO  (TEST-DistribDocExpirationUpdateProcessorTest.test-seed#[B691F4F2AC0AA467]) [    ] o.a.s.c.c.SolrZkClient makePath: /configs/conf1/protwords.txt
   [junit4]   2> 432578 INFO  (TEST-DistribDocExpirationUpdateProcessorTest.test-seed#[B691F4F2AC0AA467]) [    ] o.a.s.c.AbstractZkTestCase put /home/jenkins/workspace/Lucene-Solr-5.x-Linux/solr/core/src/test-files/solr/collection1/conf/currency.xml to /configs/conf1/currency.xml
   [junit4]   2> 432578 INFO  (TEST-DistribDocExpirationUpdateProcessorTest.test-seed#[B691F4F2AC0AA467]) [    ] o.a.s.c.c.SolrZkClient makePath: /configs/conf1/currency.xml
   [junit4]   2> 432578 INFO  (TEST-DistribDocExpirationUpdateProcessorTest.test-seed#[B691F4F2AC0AA467]) [    ] o.a.s.c.AbstractZkTestCase put /home/jenkins/workspace/Lucene-Solr-5.x-Linux/solr/core/src/test-files/solr/collection1/conf/enumsConfig.xml to /configs/conf1/enumsConfig.xml
   [junit4]   2> 432578 INFO  (TEST-DistribDocExpirationUpdateProcessorTest.test-seed#[B691F4F2AC0AA467]) [    ] o.a.s.c.c.SolrZkClient makePath: /configs/conf1/enumsConfig.xml
   [junit4]   2> 432579 INFO  (TEST-DistribDocExpirationUpdateProcessorTest.test-seed#[B691F4F2AC0AA467]) [    ] o.a.s.c.AbstractZkTestCase put /home/jenkins/workspace/Lucene-Solr-5.x-Linux/solr/core/src/test-files/solr/collection1/conf/open-exchange-rates.json to /configs/conf1/open-exchange-rates.json
   [junit4]   2> 432579 INFO  (TEST-DistribDocExpirationUpdateProcessorTest.test-seed#[B691F4F2AC0AA467]) [    ] o.a.s.c.c.SolrZkClient makePath: /configs/conf1/open-exchange-rates.json
   [junit4]   2> 432580 INFO  (TEST-DistribDocExpirationUpdateProcessorTest.test-seed#[B691F4F2AC0AA467]) [    ] o.a.s.c.AbstractZkTestCase put /home/jenkins/workspace/Lucene-Solr-5.x-Linux/solr/core/src/test-files/solr/collection1/conf/mapping-ISOLatin1Accent.txt to /configs/conf1/mapping-ISOLatin1Accent.txt
   [junit4]   2> 432580 INFO  (TEST-DistribDocExpirationUpdateProcessorTest.test-seed#[B691F4F2AC0AA467]) [    ] o.a.s.c.c.SolrZkClient makePath: /configs/conf1/mapping-ISOLatin1Accent.txt
   [junit4]   2> 432580 INFO  (TEST-DistribDocExpirationUpdateProcessorTest.test-seed#[B691F4F2AC0AA467]) [    ] o.a.s.c.AbstractZkTestCase put /home/jenkins/workspace/Lucene-Solr-5.x-Linux/solr/core/src/test-files/solr/collection1/conf/old_synonyms.txt to /configs/conf1/old_synonyms.txt
   [junit4]   2> 432580 INFO  (TEST-DistribDocExpirationUpdateProcessorTest.test-seed#[B691F4F2AC0AA467]) [    ] o.a.s.c.c.SolrZkClient makePath: /configs/conf1/old_synonyms.txt
   [junit4]   2> 432581 INFO  (TEST-DistribDocExpirationUpdateProcessorTest.test-seed#[B691F4F2AC0AA467]) [    ] o.a.s.c.AbstractZkTestCase put /home/jenkins/workspace/Lucene-Solr-5.x-Linux/solr/core/src/test-files/solr/collection1/conf/synonyms.txt to /configs/conf1/synonyms.txt
   [junit4]   2> 432581 INFO  (TEST-DistribDocExpirationUpdateProcessorTest.test-seed#[B691F4F2AC0AA467]) [    ] o.a.s.c.c.SolrZkClient makePath: /configs/conf1/synonyms.txt
   [junit4]   2> 432636 INFO  (TEST-DistribDocExpirationUpdateProcessorTest.test-seed#[B691F4F2AC0AA467]) [    ] o.a.s.SolrTestCaseJ4 Writing core.properties file to /home/jenkins/workspace/Lucene-Solr-5.x-Linux/solr/build/solr-core/test/J2/temp/solr.cloud.DistribDocExpirationUpdateProcessorTest_B691F4F2AC0AA467-001/control-001/cores/collection1
   [junit4]   2> 432637 INFO  (TEST-DistribDocExpirationUpdateProcessorTest.test-seed#[B691F4F2AC0AA467]) [    ] o.e.j.s.Server jetty-9.2.13.v20150730
   [junit4]   2> 432638 INFO  (TEST-DistribDocExpirationUpdateProcessorTest.test-seed#[B691F4F2AC0AA467]) [    ] o.e.j.s.h.ContextHandler Started o.e.j.s.ServletContextHandler@60a2900{/pxqux,null,AVAILABLE}
   [junit4]   2> 432641 INFO  (TEST-DistribDocExpirationUpdateProcessorTest.test-seed#[B691F4F2AC0AA467]) [    ] o.e.j.s.ServerConnector Started ServerConnector@319e93db{HTTP/1.1}{127.0.0.1:47416}
   [junit4]   2> 432642 INFO  (TEST-DistribDocExpirationUpdateProcessorTest.test-seed#[B691F4F2AC0AA467]) [    ] o.e.j.s.Server Started @434269ms
   [junit4]   2> 432642 INFO  (TEST-DistribDocExpirationUpdateProcessorTest.test-seed#[B691F4F2AC0AA467]) [    ] o.a.s.c.s.e.JettySolrRunner Jetty properties: {solr.data.dir=/home/jenkins/workspace/Lucene-Solr-5.x-Linux/solr/build/solr-core/test/J2/temp/solr.cloud.DistribDocExpirationUpdateProcessorTest_B691F4F2AC0AA467-001/tempDir-001/control/data, hostContext=/pxqux, hostPort=47416, coreRootDirectory=/home/jenkins/workspace/Lucene-Solr-5.x-Linux/solr/build/solr-core/test/J2/../../../../../../../../../home/jenkins/workspace/Lucene-Solr-5.x-Linux/solr/build/solr-core/test/J2/temp/solr.cloud.DistribDocExpirationUpdateProcessorTest_B691F4F2AC0AA467-001/control-001/cores}
   [junit4]   2> 432642 INFO  (TEST-DistribDocExpirationUpdateProcessorTest.test-seed#[B691F4F2AC0AA467]) [    ] o.a.s.s.SolrDispatchFilter SolrDispatchFilter.init(): sun.misc.Launcher$AppClassLoader@deb6432
   [junit4]   2> 432642 INFO  (TEST-DistribDocExpirationUpdateProcessorTest.test-seed#[B691F4F2AC0AA467]) [    ] o.a.s.c.SolrResourceLoader new SolrResourceLoader for directory: '/home/jenkins/workspace/Lucene-Solr-5.x-Linux/solr/build/solr-core/test/J2/temp/solr.cloud.DistribDocExpirationUpdateProcessorTest_B691F4F2AC0AA467-001/control-001'
   [junit4]   2> 432642 INFO  (TEST-DistribDocExpirationUpdateProcessorTest.test-seed#[B691F4F2AC0AA467]) [    ] o.a.s.c.SolrResourceLoader JNDI not configured for solr (NoInitialContextEx)
   [junit4]   2> 432642 INFO  (TEST-DistribDocExpirationUpdateProcessorTest.test-seed#[B691F4F2AC0AA467]) [    ] o.a.s.c.SolrResourceLoader solr home defaulted to 'solr/' (could not find system property or JNDI)
   [junit4]   2> 432643 INFO  (TEST-DistribDocExpirationUpdateProcessorTest.test-seed#[B691F4F2AC0AA467]) [    ] o.a.s.c.c.SolrZkClient Using default ZkCredentialsProvider
   [junit4]   2> 432643 INFO  (TEST-DistribDocExpirationUpdateProcessorTest.test-seed#[B691F4F2AC0AA467]) [    ] o.a.s.c.c.ConnectionManager Waiting for client to connect to ZooKeeper
   [junit4]   2> 432644 INFO  (zkCallback-1197-thread-1) [    ] o.a.s.c.c.ConnectionManager Watcher org.apache.solr.common.cloud.ConnectionManager@96b9b49 name:ZooKeeperConnection Watcher:127.0.0.1:57899/solr got event WatchedEvent state:SyncConnected type:None path:null path:null type:None
   [junit4]   2> 432644 INFO  (TEST-DistribDocExpirationUpdateProcessorTest.test-seed#[B691F4F2AC0AA467]) [    ] o.a.s.c.c.ConnectionManager Client is connected to ZooKeeper
   [junit4]   2> 432644 INFO  (TEST-DistribDocExpirationUpdateProcessorTest.test-seed#[B691F4F2AC0AA467]) [    ] o.a.s.c.c.SolrZkClient Using default ZkACLProvider
   [junit4]   2> 432645 INFO  (TEST-DistribDocExpirationUpdateProcessorTest.test-seed#[B691F4F2AC0AA467]) [    ] o.a.s.s.SolrDispatchFilter Loading solr.xml from SolrHome (not found in ZooKeeper)
   [junit4]   2> 432645 INFO  (TEST-DistribDocExpirationUpdateProcessorTest.test-seed#[B691F4F2AC0AA467]) [    ] o.a.s.c.SolrXmlConfig Loading container configuration from /home/jenkins/workspace/Lucene-Solr-5.x-Linux/solr/build/solr-core/test/J2/temp/solr.cloud.DistribDocExpirationUpdateProcessorTest_B691F4F2AC0AA467-001/control-001/solr.xml
   [junit4]   2> 432648 INFO  (TEST-DistribDocExpirationUpdateProcessorTest.test-seed#[B691F4F2AC0AA467]) [    ] o.a.s.c.CorePropertiesLocator Config-defined core root directory: /home/jenkins/workspace/Lucene-Solr-5.x-Linux/solr/build/solr-core/test/J2/../../../../../../../../../home/jenkins/workspace/Lucene-Solr-5.x-Linux/solr/build/solr-core/test/J2/temp/solr.cloud.DistribDocExpirationUpdateProcessorTest_B691F4F2AC0AA467-001/control-001/cores
   [junit4]   2> 432648 INFO  (TEST-DistribDocExpirationUpdateProcessorTest.test-seed#[B691F4F2AC0AA467]) [    ] o.a.s.c.CoreContainer New CoreContainer 993352833
   [junit4]   2> 432648 INFO  (TEST-DistribDocExpirationUpdateProcessorTest.test-seed#[B691F4F2AC0AA467]) [    ] o.a.s.c.CoreContainer Loading cores into CoreContainer [instanceDir=/home/jenkins/workspace/Lucene-Solr-5.x-Linux/solr/build/solr-core/test/J2/temp/solr.cloud.DistribDocExpirationUpdateProcessorTest_B691F4F2AC0AA467-001/control-001]
   [junit4]   2> 432648 WARN  (TEST-DistribDocExpirationUpdateProcessorTest.test-seed#[B691F4F2AC0AA467]) [    ] o.a.s.c.CoreContainer Couldn't add files from /home/jenkins/workspace/Lucene-Solr-5.x-Linux/solr/build/solr-core/test/J2/temp/solr.cloud.DistribDocExpirationUpdateProcessorTest_B691F4F2AC0AA467-001/control-001/lib to classpath: /home/jenkins/workspace/Lucene-Solr-5.x-Linux/solr/build/solr-core/test/J2/temp/solr.cloud.DistribDocExpirationUpdateProcessorTest_B691F4F2AC0AA467-001/control-001/lib
   [junit4]   2> 432648 INFO  (TEST-DistribDocExpirationUpdateProcessorTest.test-seed#[B691F4F2AC0AA467]) [    ] o.a.s.h.c.HttpShardHandlerFactory created with socketTimeout : 90000,urlScheme : ,connTimeout : 15000,maxConnectionsPerHost : 20,maxConnections : 10000,corePoolSize : 0,maximumPoolSize : 2147483647,maxThreadIdleTime : 5,sizeOfQueue : -1,fairnessPolicy : false,useRetries : false,
   [junit4]   2> 432649 INFO  (TEST-DistribDocExpirationUpdateProcessorTest.test-seed#[B691F4F2AC0AA467]) [    ] o.a.s.u.UpdateShardHandler Creating UpdateShardHandler HTTP client with params: socketTimeout=340000&connTimeout=45000&retry=true
   [junit4]   2> 432649 INFO  (TEST-DistribDocExpirationUpdateProcessorTest.test-seed#[B691F4F2AC0AA467]) [    ] o.a.s.l.LogWatcher SLF4J impl is org.slf4j.impl.Log4jLoggerFactory
   [junit4]   2> 432649 INFO  (TEST-DistribDocExpirationUpdateProcessorTest.test-seed#[B691F4F2AC0AA467]) [    ] o.a.s.l.LogWatcher Registering Log Listener [Log4j (org.slf4j.impl.Log4jLoggerFactory)]
   [junit4]   2> 432650 INFO  (TEST-DistribDocExpirationUpdateProcessorTest.test-seed#[B691F4F2AC0AA467]) [    ] o.a.s.c.ZkContainer Zookeeper client=127.0.0.1:57899/solr
   [junit4]   2> 432650 INFO  (TEST-DistribDocExpirationUpdateProcessorTest.test-seed#[B691F4F2AC0AA467]) [    ] o.a.s.c.ZkController zkHost includes chroot
   [junit4]   2> 432650 INFO  (TEST-DistribDocExpirationUpdateProcessorTest.test-seed#[B691F4F2AC0AA467]) [    ] o.a.s.c.c.SolrZkClient Using default ZkCredentialsProvider
   [junit4]   2> 432654 INFO  (TEST-DistribDocExpirationUpdateProcessorTest.test-seed#[B691F4F2AC0AA467]) [    ] o.a.s.c.c.ConnectionManager Waiting for client to connect to ZooKeeper
   [junit4]   2> 432655 INFO  (zkCallback-1199-thread-1) [    ] o.a.s.c.c.ConnectionManager Watcher org.apache.solr.common.cloud.ConnectionManager@4fff03d6 name:ZooKeeperConnection Watcher:127.0.0.1:57899 got event WatchedEvent state:SyncConnected type:None path:null path:null type:None
   [junit4]   2> 432655 INFO  (TEST-DistribDocExpirationUpdateProcessorTest.test-seed#[B691F4F2AC0AA467]) [    ] o.a.s.c.c.ConnectionManager Client is connected to ZooKeeper
   [junit4]   2> 432656 INFO  (TEST-DistribDocExpirationUpdateProcessorTest.test-seed#[B691F4F2AC0AA467]) [    ] o.a.s.c.c.SolrZkClient Using default ZkACLProvider
   [junit4]   2> 432656 INFO  (TEST-DistribDocExpirationUpdateProcessorTest.test-seed#[B691F4F2AC0AA467]) [    ] o.a.s.c.c.ConnectionManager Waiting for client to connect to ZooKeeper
   [junit4]   2> 432657 INFO  (zkCallback-1200-thread-1) [    ] o.a.s.c.c.ConnectionManager Watcher org.apache.solr.common.cloud.ConnectionManager@6c1c56d9 name:ZooKeeperConnection Watcher:127.0.0.1:57899/solr got event WatchedEvent state:SyncConnected type:None path:null path:null type:None
   [junit4]   2> 432657 INFO  (TEST-DistribDocExpirationUpdateProcessorTest.test-seed#[B691F4F2AC0AA467]) [    ] o.a.s.c.c.ConnectionManager Client is connected to ZooKeeper
   [junit4]   2> 432657 INFO  (TEST-DistribDocExpirationUpdateProcessorTest.test-seed#[B691F4F2AC0AA467]) [    ] o.a.s.c.c.SolrZkClient makePath: /overseer/queue
   [junit4]   2> 432658 INFO  (TEST-DistribDocExpirationUpdateProcessorTest.test-seed#[B691F4F2AC0AA467]) [    ] o.a.s.c.c.SolrZkClient makePath: /overseer/collection-queue-work
   [junit4]   2> 432659 INFO  (TEST-DistribDocExpirationUpdateProcessorTest.test-seed#[B691F4F2AC0AA467]) [    ] o.a.s.c.c.SolrZkClient makePath: /overseer/collection-map-running
   [junit4]   2> 432660 INFO  (TEST-DistribDocExpirationUpdateProcessorTest.test-seed#[B691F4F2AC0AA467]) [    ] o.a.s.c.c.SolrZkClient makePath: /overseer/collection-map-completed
   [junit4]   2> 432661 INFO  (TEST-DistribDocExpirationUpdateProcessorTest.test-seed#[B691F4F2AC0AA467]) [    ] o.a.s.c.c.SolrZkClient makePath: /overseer/collection-map-failure
   [junit4]   2> 432662 INFO  (TEST-DistribDocExpirationUpdateProcessorTest.test-seed#[B691F4F2AC0AA467]) [    ] o.a.s.c.c.SolrZkClient makePath: /live_nodes
   [junit4]   2> 432662 INFO  (TEST-DistribDocExpirationUpdateProcessorTest.test-seed#[B691F4F2AC0AA467]) [    ] o.a.s.c.c.SolrZkClient makePath: /aliases.json
   [junit4]   2> 432663 INFO  (TEST-DistribDocExpirationUpdateProcessorTest.test-seed#[B691F4F2AC0AA467]) [    ] o.a.s.c.c.SolrZkClient makePath: /clusterstate.json
   [junit4]   2> 432664 INFO  (TEST-DistribDocExpirationUpdateProcessorTest.test-seed#[B691F4F2AC0AA467]) [    ] o.a.s.c.c.SolrZkClient makePath: /security.json
   [junit4]   2> 432664 INFO  (TEST-DistribDocExpirationUpdateProcessorTest.test-seed#[B691F4F2AC0AA467]) [    ] o.a.s.c.ZkController Register node as live in ZooKeeper:/live_nodes/127.0.0.1:47416_pxqux
   [junit4]   2> 432664 INFO  (TEST-DistribDocExpirationUpdateProcessorTest.test-seed#[B691F4F2AC0AA467]) [    ] o.a.s.c.c.SolrZkClient makePath: /live_nodes/127.0.0.1:47416_pxqux
   [junit4]   2> 432665 INFO  (TEST-DistribDocExpirationUpdateProcessorTest.test-seed#[B691F4F2AC0AA467]) [    ] o.a.s.c.c.SolrZkClient makePath: /overseer_elect
   [junit4]   2> 432665 INFO  (TEST-DistribDocExpirationUpdateProcessorTest.test-seed#[B691F4F2AC0AA467]) [    ] o.a.s.c.c.SolrZkClient makePath: /overseer_elect/election
   [junit4]   2> 432666 INFO  (TEST-DistribDocExpirationUpdateProcessorTest.test-seed#[B691F4F2AC0AA467]) [    ] o.a.s.c.Overseer Overseer (id=null) closing
   [junit4]   2> 432666 INFO  (TEST-DistribDocExpirationUpdateProcessorTest.test-seed#[B691F4F2AC0AA467]) [    ] o.a.s.c.LeaderElector Joined leadership election with path: /overseer_elect/election/95192678345080836-127.0.0.1:47416_pxqux-n_0000000000
   [junit4]   2> 432666 INFO  (TEST-DistribDocExpirationUpdateProcessorTest.test-seed#[B691F4F2AC0AA467]) [    ] o.a.s.c.OverseerElectionContext I am going to be the leader 127.0.0.1:47416_pxqux
   [junit4]   2> 432666 INFO  (TEST-DistribDocExpirationUpdateProcessorTest.test-seed#[B691F4F2AC0AA467]) [    ] o.a.s.c.c.SolrZkClient makePath: /overseer_elect/leader
   [junit4]   2> 432666 INFO  (TEST-DistribDocExpirationUpdateProcessorTest.test-seed#[B691F4F2AC0AA467]) [    ] o.a.s.c.Overseer Overseer (id=95192678345080836-127.0.0.1:47416_pxqux-n_0000000000) starting
   [junit4]   2> 432668 INFO  (TEST-DistribDocExpirationUpdateProcessorTest.test-seed#[B691F4F2AC0AA467]) [    ] o.a.s.c.c.SolrZkClient makePath: /overseer/queue-work
   [junit4]   2> 432670 INFO  (TEST-DistribDocExpirationUpdateProcessorTest.test-seed#[B691F4F2AC0AA467]) [    ] o.a.s.c.OverseerAutoReplicaFailoverThread Starting OverseerAutoReplicaFailoverThread autoReplicaFailoverWorkLoopDelay=10000 autoReplicaFailoverWaitAfterExpiration=30000 autoReplicaFailoverBadNodeExpiration=60000
   [junit4]   2> 432670 INFO  (OverseerCollectionConfigSetProcessor-95192678345080836-127.0.0.1:47416_pxqux-n_0000000000) [    ] o.a.s.c.OverseerTaskProcessor Process current queue of overseer operations
   [junit4]   2> 432670 INFO  (OverseerStateUpdate-95192678345080836-127.0.0.1:47416_pxqux-n_0000000000) [    ] o.a.s.c.Overseer Starting to work on the main queue
   [junit4]   2> 432670 INFO  (TEST-DistribDocExpirationUpdateProcessorTest.test-seed#[B691F4F2AC0AA467]) [    ] o.a.s.c.c.ZkStateReader Updating cluster state from ZooKeeper... 
   [junit4]   2> 432682 INFO  (TEST-DistribDocExpirationUpdateProcessorTest.test-seed#[B691F4F2AC0AA467]) [    ] o.a.s.c.CoreContainer Security conf doesn't exist. Skipping setup for authorization module.
   [junit4]   2> 432682 INFO  (TEST-DistribDocExpirationUpdateProcessorTest.test-seed#[B691F4F2AC0AA467]) [    ] o.a.s.c.CoreContainer No authentication plugin used.
   [junit4]   2> 432683 INFO  (TEST-DistribDocExpirationUpdateProcessorTest.test-seed#[B691F4F2AC0AA467]) [    ] o.a.s.c.CorePropertiesLocator Looking for core definitions underneath /home/jenkins/workspace/Lucene-Solr-5.x-Linux/solr/build/solr-core/test/J2/../../../../../../../../../home/jenkins/workspace/Lucene-Solr-5.x-Linux/solr/build/solr-core/test/J2/temp/solr.cloud.DistribDocExpirationUpdateProcessorTest_B691F4F2AC0AA467-001/control-001/cores
   [junit4]   2> 432684 INFO  (TEST-DistribDocExpirationUpdateProcessorTest.test-seed#[B691F4F2AC0AA467]) [    ] o.a.s.c.CoreDescriptor Created CoreDescriptor: {name=collection1, config=solrconfig.xml, transient=false, schema=schema.xml, loadOnStartup=true, configSetProperties=configsetprops.json, collection=control_collection, coreNodeName=, dataDir=data/, shard=}
   [junit4]   2> 432684 INFO  (TEST-DistribDocExpirationUpdateProcessorTest.test-seed#[B691F4F2AC0AA467]) [    ] o.a.s.c.CorePropertiesLocator Found core collection1 in /home/jenkins/workspace/Lucene-Solr-5.x-Linux/solr/build/solr-core/test/J2/../../../../../../../../../home/jenkins/workspace/Lucene-Solr-5.x-Linux/solr/build/solr-core/test/J2/temp/solr.cloud.DistribDocExpirationUpdateProcessorTest_B691F4F2AC0AA467-001/control-001/cores/collection1
   [junit4]   2> 432684 INFO  (TEST-DistribDocExpirationUpdateProcessorTest.test-seed#[B691F4F2AC0AA467]) [    ] o.a.s.c.CorePropertiesLocator Found 1 core definitions
   [junit4]   2> 432685 INFO  (TEST-DistribDocExpirationUpdateProcessorTest.test-seed#[B691F4F2AC0AA467]) [    ] o.a.s.s.SolrDispatchFilter user.dir=/home/jenkins/workspace/Lucene-Solr-5.x-Linux/solr/build/solr-core/test/J2
   [junit4]   2> 432685 INFO  (TEST-DistribDocExpirationUpdateProcessorTest.test-seed#[B691F4F2AC0AA467]) [    ] o.a.s.s.SolrDispatchFilter SolrDispatchFilter.init() done
   [junit4]   2> 432685 INFO  (coreLoadExecutor-1554-thread-1) [    ] o.a.s.c.ZkController publishing state=down
   [junit4]   2> 432685 INFO  (coreLoadExecutor-1554-thread-1) [    ] o.a.s.c.ZkController numShards not found on descriptor - reading it from system property
   [junit4]   2> 432686 INFO  (OverseerStateUpdate-95192678345080836-127.0.0.1:47416_pxqux-n_0000000000) [    ] o.a.s.c.Overseer processMessage: queueSize: 1, message = {
   [junit4]   2>   "core":"collection1",
   [junit4]   2>   "roles":null,
   [junit4]   2>   "base_url":"http://127.0.0.1:47416/pxqux",
   [junit4]   2>   "node_name":"127.0.0.1:47416_pxqux",
   [junit4]   2>   "numShards":"1",
   [junit4]   2>   "state":"down",
   [junit4]   2>   "shard":null,
   [junit4]   2>   "collection":"control_collection",
   [junit4]   2>   "operation":"state"} current state version: 0
   [junit4]   2> 432686 INFO  (coreLoadExecutor-1554-thread-1) [    ] o.a.s.c.ZkController look for our core node name
   [junit4]   2> 432686 INFO  (OverseerStateUpdate-95192678345080836-127.0.0.1:47416_pxqux-n_0000000000) [    ] o.a.s.c.o.ReplicaMutator Update state numShards=1 message={
   [junit4]   2>   "core":"collection1",
   [junit4]   2>   "roles":null,
   [junit4]   2>   "base_url":"http://127.0.0.1:47416/pxqux",
   [junit4]   2>   "node_name":"127.0.0.1:47416_pxqux",
   [junit4]   2>   "numShards":"1",
   [junit4]   2>   "state":"down",
   [junit4]   2>   "shard":null,
   [junit4]   2>   "collection":"control_collection",
   [junit4]   2>   "operation":"state"}
   [junit4]   2> 432686 INFO  (OverseerStateUpdate-95192678345080836-127.0.0.1:47416_pxqux-n_0000000000) [    ] o.a.s.c.o.ClusterStateMutator building a new cName: control_collection
   [junit4]   2> 432686 INFO  (OverseerStateUpdate-95192678345080836-127.0.0.1:47416_pxqux-n_0000000000) [    ] o.a.s.c.o.ReplicaMutator Assigning new node to shard shard=shard1
   [junit4]   2> 432687 INFO  (zkCallback-1200-thread-1) [    ] o.a.s.c.c.ZkStateReader A cluster state change: [WatchedEvent state:SyncConnected type:NodeDataChanged path:/clusterstate.json], has occurred - updating... (live nodes size: [1])
   [junit4]   2> 433686 INFO  (coreLoadExecutor-1554-thread-1) [    ] o.a.s.c.ZkController waiting to find shard id in clusterstate for collection1
   [junit4]   2> 433686 INFO  (coreLoadExecutor-1554-thread-1) [    ] o.a.s.c.ZkController Check for collection zkNode:control_collection
   [junit4]   2> 433686 INFO  (coreLoadExecutor-1554-thread-1) [    ] o.a.s.c.ZkController Collection zkNode exists
   [junit4]   2> 433686 INFO  (coreLoadExecutor-1554-thread-1) [    ] o.a.s.c.c.ZkStateReader Load collection config from: [/collections/control_collection]
   [junit4]   2> 433687 INFO  (coreLoadExecutor-1554-thread-1) [    ] o.a.s.c.c.ZkStateReader path=[/collections/control_collection] [configName]=[conf1] specified config exists in ZooKeeper
   [junit4]   2> 433687 INFO  (coreLoadExecutor-1554-thread-1) [    ] o.a.s.c.SolrResourceLoader new SolrResourceLoader for directory: '/home/jenkins/workspace/Lucene-Solr-5.x-Linux/solr/build/solr-core/test/J2/temp/solr.cloud.DistribDocExpirationUpdateProcessorTest_B691F4F2AC0AA467-001/control-001/cores/collection1'
   [junit4]   2> 433687 INFO  (coreLoadExecutor-1554-thread-1) [    ] o.a.s.c.SolrResourceLoader JNDI not configured for solr (NoInitialContextEx)
   [junit4]   2> 433687 INFO  (coreLoadExecutor-1554-thread-1) [    ] o.a.s.c.SolrResourceLoader solr home defaulted to 'solr/' (could not find system property or JNDI)
   [junit4]   2> 433688 INFO  (coreLoadExecutor-1554-thread-1) [    ] o.a.s.c.Config loaded config solrconfig.xml with version 0 
   [junit4]   2> 433704 INFO  (coreLoadExecutor-1554-thread-1) [    ] o.a.s.c.SolrConfig current version of requestparams : -1
   [junit4]   2> 433706 INFO  (coreLoadExecutor-1554-thread-1) [    ] o.a.s.c.SolrConfig Using Lucene MatchVersion: 5.5.0
   [junit4]   2> 433711 INFO  (coreLoadExecutor-1554-thread-1) [    ] o.a.s.c.SolrConfig Loaded SolrConfig: solrconfig.xml
   [junit4]   2> 433714 INFO  (coreLoadExecutor-1554-thread-1) [    ] o.a.s.s.IndexSchema [collection1] Schema name=test
   [junit4]   2> 433764 INFO  (coreLoadExecutor-1554-thread-1) [    ] o.a.s.s.IndexSchema default search field in schema is text
   [junit4]   2> 433764 INFO  (coreLoadExecutor-1554-thread-1) [    ] o.a.s.s.IndexSchema unique key field: id
   [junit4]   2> 433765 INFO  (coreLoadExecutor-1554-thread-1) [    ] o.a.s.s.FileExchangeRateProvider Reloading exchange rates from file currency.xml
   [junit4]   2> 433766 INFO  (coreLoadExecutor-1554-thread-1) [    ] o.a.s.s.FileExchangeRateProvider Reloading exchange rates from file currency.xml
   [junit4]   2> 433774 INFO  (coreLoadExecutor-1554-thread-1) [    ] o.a.s.c.ConfigSetProperties Did not find ConfigSet properties, assuming default properties: Can't find resource 'configsetprops.json' in classpath or '/configs/conf1', cwd=/home/jenkins/workspace/Lucene-Solr-5.x-Linux/solr/build/solr-core/test/J2
   [junit4]   2> 433774 INFO  (coreLoadExecutor-1554-thread-1) [    ] o.a.s.c.CoreContainer Creating SolrCore 'collection1' using configuration from collection control_collection
   [junit4]   2> 433774 INFO  (coreLoadExecutor-1554-thread-1) [    ] o.a.s.c.SolrCore org.apache.solr.core.MockDirectoryFactory
   [junit4]   2> 433774 INFO  (coreLoadExecutor-1554-thread-1) [    ] o.a.s.c.SolrCore [[collection1] ] Opening new SolrCore at [/home/jenkins/workspace/Lucene-Solr-5.x-Linux/solr/build/solr-core/test/J2/temp/solr.cloud.DistribDocExpirationUpdateProcessorTest_B691F4F2AC0AA467-001/control-001/cores/collection1], dataDir=[/home/jenkins/workspace/Lucene-Solr-5.x-Linux/solr/build/solr-core/test/J2/../../../../../../../../../home/jenkins/workspace/Lucene-Solr-5.x-Linux/solr/build/solr-core/test/J2/temp/solr.cloud.DistribDocExpirationUpdateProcessorTest_B691F4F2AC0AA467-001/control-001/cores/collection1/data/]
   [junit4]   2> 433774 INFO  (coreLoadExecutor-1554-thread-1) [    ] o.a.s.c.SolrCore JMX monitoring not detected for core: collection1
   [junit4]   2> 433774 INFO  (coreLoadExecutor-1554-thread-1) [    ] o.a.s.c.CachingDirectoryFactory return new directory for /home/jenkins/workspace/Lucene-Solr-5.x-Linux/solr/build/solr-core/test/J2/../../../../../../../../../home/jenkins/workspace/Lucene-Solr-5.x-Linux/solr/build/solr-core/test/J2/temp/solr.cloud.DistribDocExpirationUpdateProcessorTest_B691F4F2AC0AA467-001/control-001/cores/collection1/data
   [junit4]   2> 433774 INFO  (coreLoadExecutor-1554-thread-1) [    ] o.a.s.c.SolrCore New index directory detected: old=null new=/home/jenkins/workspace/Lucene-Solr-5.x-Linux/solr/build/solr-core/test/J2/../../../../../../../../../home/jenkins/workspace/Lucene-Solr-5.x-Linux/solr/build/solr-core/test/J2/temp/solr.cloud.DistribDocExpirationUpdateProcessorTest_B691F4F2AC0AA467-001/control-001/cores/collection1/data/index/
   [junit4]   2> 433774 WARN  (coreLoadExecutor-1554-thread-1) [    ] o.a.s.c.SolrCore [collection1] Solr index directory '/home/jenkins/workspace/Lucene-Solr-5.x-Linux/solr/build/solr-core/test/J2/../../../../../../../../../home/jenkins/workspace/Lucene-Solr-5.x-Linux/solr/build/solr-core/test/J2/temp/solr.cloud.DistribDocExpirationUpdateProcessorTest_B691F4F2AC0AA467-001/control-001/cores/collection1/data/index' doesn't exist. Creating new index...
   [junit4]   2> 433775 INFO  (coreLoadExecutor-1554-thread-1) [    ] o.a.s.c.CachingDirectoryFactory return new directory for /home/jenkins/workspace/Lucene-Solr-5.x-Linux/solr/build/solr-core/test/J2/../../../../../../../../../home/jenkins/workspace/Lucene-Solr-5.x-Linux/solr/build/solr-core/test/J2/temp/solr.cloud.DistribDocExpirationUpdateProcessorTest_B691F4F2AC0AA467-001/control-001/cores/collection1/data/index
   [junit4]   2> 433775 INFO  (coreLoadExecutor-1554-thread-1) [    ] o.a.s.u.RandomMergePolicy RandomMergePolicy wrapping class org.apache.lucene.index.TieredMergePolicy: [TieredMergePolicy: maxMergeAtOnce=28, maxMergeAtOnceExplicit=46, maxMergedSegmentMB=88.396484375, floorSegmentMB=1.390625, forceMergeDeletesPctAllowed=16.495359723605212, segmentsPerTier=34.0, maxCFSSegmentSizeMB=8.796093022207999E12, noCFSRatio=1.0
   [junit4]   2> 433775 INFO  (coreLoadExecutor-1554-thread-1) [    ] o.a.s.c.SolrDeletionPolicy SolrDeletionPolicy.onCommit: commits: num=1
   [junit4]   2> 	commit{dir=MockDirectoryWrapper(RAMDirectory@4e810a0c lockFactory=org.apache.lucene.store.SingleInstanceLockFactory@6233a3e0),segFN=segments_1,generation=1}
   [junit4]   2> 433775 INFO  (coreLoadExecutor-1554-thread-1) [    ] o.a.s.c.SolrDeletionPolicy newest commit generation = 1
   [junit4]   2> 433775 INFO  (OldIndexDirectoryCleanupThreadForCore-collection1) [    ] o.a.s.c.SolrCore Looking for old index directories to cleanup for core collection1 in /home/jenkins/workspace/Lucene-Solr-5.x-Linux/solr/build/solr-core/test/J2/../../../../../../../../../home/jenkins/workspace/Lucene-Solr-5.x-Linux/solr/build/solr-core/test/J2/temp/solr.cloud.DistribDocExpirationUpdateProcessorTest_B691F4F2AC0AA467-001/control-001/cores/collection1/data/
   [junit4]   2> 433775 WARN  (OldIndexDirectoryCleanupThreadForCore-collection1) [    ] o.a.s.c.DirectoryFactory /home/jenkins/workspace/Lucene-Solr-5.x-Linux/solr/build/solr-core/test/J2/../../../../../../../../../home/jenkins/workspace/Lucene-Solr-5.x-Linux/solr/build/solr-core/test/J2/temp/solr.cloud.DistribDocExpirationUpdateProcessorTest_B691F4F2AC0AA467-001/control-001/cores/collection1/data/ does not point to a valid data directory; skipping clean-up of old index directories.
   [junit4]   2> 433776 INFO  (coreLoadExecutor-1554-thread-1) [    ] o.a.s.u.p.UpdateRequestProcessorChain creating updateRequestProcessorChain "convert-ttl-defaults"
   [junit4]   2> 433782 INFO  (coreLoadExecutor-1554-thread-1) [    ] o.a.s.u.p.UpdateRequestProcessorChain creating updateRequestProcessorChain "convert-ttl-field"
   [junit4]   2> 433788 INFO  (coreLoadExecutor-1554-thread-1) [    ] o.a.s.u.p.UpdateRequestProcessorChain creating updateRequestProcessorChain "convert-ttl-param"
   [junit4]   2> 433788 INFO  (coreLoadExecutor-1554-thread-1) [    ] o.a.s.u.p.UpdateRequestProcessorChain creating updateRequestProcessorChain "convert-ttl-field-with-param-default"
   [junit4]   2> 433788 INFO  (coreLoadExecutor-1554-thread-1) [    ] o.a.s.u.p.UpdateRequestProcessorChain creating updateRequestProcessorChain "scheduled-delete" (default)
   [junit4]   2> 433794 INFO  (coreLoadExecutor-1554-thread-1) [    ] o.a.s.u.p.UpdateRequestProcessorChain inserting DistributedUpdateProcessorFactory into updateRequestProcessorChain "scheduled-delete" (default)
   [junit4]   2> 433796 INFO  (coreLoadExecutor-1554-thread-1) [    ] o.a.s.h.l.XMLLoader xsltCacheLifetimeSeconds=60
   [junit4]   2> 433796 INFO  (coreLoadExecutor-1554-thread-1) [    ] o.a.s.h.l.XMLLoader xsltCacheLifetimeSeconds=60
   [junit4]   2> 433796 INFO  (coreLoadExecutor-1554-thread-1) [    ] o.a.s.h.l.XMLLoader xsltCacheLifetimeSeconds=60
   [junit4]   2> 433797 INFO  (coreLoadExecutor-1554-thread-1) [    ] o.a.s.h.l.XMLLoader xsltCacheLifetimeSeconds=60
   [junit4]   2> 433797 INFO  (coreLoadExecutor-1554-thread-1) [    ] o.a.s.c.RequestHandlers Registered paths: /admin/mbeans,,/update/csv,/update/json/docs,/admin/luke,/select,/admin/segments,/get,/admin/system,/replication,/admin/properties,/config,/schema,/admin/plugins,/admin/logging,/update/json,/admin/threads,/admin/ping,/update,/admin/file
   [junit4]   2> 433798 INFO  (coreLoadExecutor-1554-thread-1) [    ] o.a.s.c.SolrCore Using default statsCache cache: org.apache.solr.search.stats.LocalStatsCache
   [junit4]   2> 433798 INFO  (coreLoadExecutor-1554-thread-1) [    ] o.a.s.u.UpdateHandler Using UpdateLog implementation: org.apache.solr.update.UpdateLog
   [junit4]   2> 433798 INFO  (coreLoadExecutor-1554-thread-1) [    ] o.a.s.u.UpdateLog Initializing UpdateLog: dataDir= defaultSyncLevel=FLUSH numRecordsToKeep=100 maxNumLogsToKeep=10 numVersionBuckets=65536
   [junit4]   2> 433799 INFO  (coreLoadExecutor-1554-thread-1) [    ] o.a.s.u.CommitTracker Hard AutoCommit: disabled
   [junit4]   2> 433799 INFO  (coreLoadExecutor-1554-thread-1) [    ] o.a.s.u.CommitTracker Soft AutoCommit: disabled
   [junit4]   2> 433799 INFO  (coreLoadExecutor-1554-thread-1) [    ] o.a.s.u.RandomMergePolicy RandomMergePolicy wrapping class org.apache.lucene.index.LogDocMergePolicy: [LogDocMergePolicy: minMergeSize=1000, mergeFactor=10, maxMergeSize=9223372036854775807, maxMergeSizeForForcedMerge=9223372036854775807, calibrateSizeByDeletes=false, maxMergeDocs=2147483647, maxCFSSegmentSizeMB=8.796093022207999E12, noCFSRatio=0.5973551200078442]
   [junit4]   2> 433800 INFO  (coreLoadExecutor-1554-thread-1) [    ] o.a.s.c.SolrDeletionPolicy SolrDeletionPolicy.onInit: commits: num=1
   [junit4]   2> 	commit{dir=MockDirectoryWrapper(RAMDirectory@4e810a0c lockFactory=org.apache.lucene.store.SingleInstanceLockFactory@6233a3e0),segFN=segments_1,generation=1}
   [junit4]   2> 433800 INFO  (coreLoadExecutor-1554-thread-1) [    ] o.a.s.c.SolrDeletionPolicy newest commit generation = 1
   [junit4]   2> 433800 INFO  (coreLoadExecutor-1554-thread-1) [    ] o.a.s.s.SolrIndexSearcher Opening Searcher@425a1818[collection1] main
   [junit4]   2> 433800 INFO  (coreLoadExecutor-1554-thread-1) [    ] o.a.s.c.c.ZkStateReader Load collection config from: [/collections/control_collection]
   [junit4]   2> 433800 INFO  (coreLoadExecutor-1554-thread-1) [    ] o.a.s.c.c.ZkStateReader path=[/collections/control_collection] [configName]=[conf1] specified config exists in ZooKeeper
   [junit4]   2> 433800 INFO  (coreLoadExecutor-1554-thread-1) [    ] o.a.s.r.ManagedResourceStorage Setting up ZooKeeper-based storage for the RestManager with znodeBase: /configs/conf1
   [junit4]   2> 433800 INFO  (coreLoadExecutor-1554-thread-1) [    ] o.a.s.r.ManagedResourceStorage Configured ZooKeeperStorageIO with znodeBase: /configs/conf1
   [junit4]   2> 433800 INFO  (coreLoadExecutor-1554-thread-1) [    ] o.a.s.r.RestManager Initializing RestManager with initArgs: {}
   [junit4]   2> 433801 INFO  (coreLoadExecutor-1554-thread-1) [    ] o.a.s.r.ManagedResourceStorage Reading _rest_managed.json using ZooKeeperStorageIO:path=/configs/conf1
   [junit4]   2> 433801 INFO  (coreLoadExecutor-1554-thread-1) [    ] o.a.s.r.ManagedResourceStorage No data found for znode /configs/conf1/_rest_managed.json
   [junit4]   2> 433801 INFO  (coreLoadExecutor-1554-thread-1) [    ] o.a.s.r.ManagedResourceStorage Loaded null at path _rest_managed.json using ZooKeeperStorageIO:path=/configs/conf1
   [junit4]   2> 433801 INFO  (coreLoadExecutor-1554-thread-1) [    ] o.a.s.r.RestManager Initializing 0 registered ManagedResources
   [junit4]   2> 433806 INFO  (coreLoadExecutor-1554-thread-1) [    ] o.a.s.h.ReplicationHandler Commits will be reserved for  10000
   [junit4]   2> 433806 INFO  (searcherExecutor-1555-thread-1) [    ] o.a.s.c.SolrCore [collection1] Registered new searcher Searcher@425a1818[collection1] main{ExitableDirectoryReader(UninvertingDirectoryReader())}
   [junit4]   2> 433806 INFO  (coreLoadExecutor-1554-thread-1) [    ] o.a.s.u.UpdateLog Looking up max value of version field to seed version buckets
   [junit4]   2> 433806 INFO  (coreLoadExecutor-1554-thread-1) [    ] o.a.s.u.VersionInfo Refreshing highest value of _version_ for 65536 version buckets from index
   [junit4]   2> 433806 INFO  (coreLoadExecutor-1554-thread-1) [    ] o.a.s.u.VersionInfo No terms found for _version_, cannot seed version bucket highest value from index
   [junit4]   2> 433806 INFO  (coreLoadExecutor-1554-thread-1) [    ] o.a.s.u.UpdateLog Could not find max version in index or recent updates, using new clock 1523082854926385152
   [junit4]   2> 433809 INFO  (coreLoadExecutor-1554-thread-1) [    ] o.a.s.u.UpdateLog Took 2.0ms to seed version buckets with highest version 1523082854926385152
   [junit4]   2> 433809 INFO  (coreLoadExecutor-1554-thread-1) [    ] o.a.s.c.ZkController watch zkdir /configs/conf1
   [junit4]   2> 433809 INFO  (coreLoadExecutor-1554-thread-1) [    ] o.a.s.c.CoreContainer registering core: collection1
   [junit4]   2> 433809 INFO  (coreZkRegister-1548-thread-1) [    ] o.a.s.c.ZkController Register replica - core:collection1 address:http://127.0.0.1:47416/pxqux collection:control_collection shard:shard1
   [junit4]   2> 433810 INFO  (coreZkRegister-1548-thread-1) [    ] o.a.s.c.c.SolrZkClient makePath: /collections/control_collection/leader_elect/shard1/election
   [junit4]   2> 433811 INFO  (coreZkRegister-1548-thread-1) [    ] o.a.s.c.LeaderElector Joined leadership election with path: /collections/control_collection/leader_elect/shard1/election/95192678345080836-core_node1-n_0000000000
   [junit4]   2> 433811 INFO  (coreZkRegister-1548-thread-1) [    ] o.a.s.c.ShardLeaderElectionContext Running the leader process for shard=shard1 and weAreReplacement=false and leaderVoteWait=10000
   [junit4]   2> 433812 INFO  (coreZkRegister-1548-thread-1) [    ] o.a.s.c.ShardLeaderElectionContext Enough replicas found to continue.
   [junit4]   2> 433812 INFO  (coreZkRegister-1548-thread-1) [    ] o.a.s.c.ShardLeaderElectionContext I may be the new leader - try and sync
   [junit4]   2> 433812 INFO  (coreZkRegister-1548-thread-1) [    ] o.a.s.c.SyncStrategy Sync replicas to http://127.0.0.1:47416/pxqux/collection1/
   [junit4]   2> 433812 INFO  (coreZkRegister-1548-thread-1) [    ] o.a.s.c.SyncStrategy Sync Success - now sync replicas to me
   [junit4]   2> 433812 INFO  (coreZkRegister-1548-thread-1) [    ] o.a.s.c.SyncStrategy http://127.0.0.1:47416/pxqux/collection1/ has no replicas
   [junit4]   2> 433812 INFO  (OverseerStateUpdate-95192678345080836-127.0.0.1:47416_pxqux-n_0000000000) [    ] o.a.s.c.Overseer processMessage: queueSize: 1, message = {
   [junit4]   2>   "operation":"leader",
   [junit4]   2>   "shard":"shard1",
   [junit4]   2>   "collection":"control_collection"} current state version: 1
   [junit4]   2> 433812 INFO  (coreZkRegister-1548-thread-1) [    ] o.a.s.c.c.SolrZkClient makePath: /collections/control_collection/leaders/shard1
   [junit4]   2> 433813 INFO  (coreZkRegister-1548-thread-1) [    ] o.a.s.c.ShardLeaderElectionContextBase Creating leader registration node
   [junit4]   2> 433814 INFO  (coreZkRegister-1548-thread-1) [    ] o.a.s.c.ShardLeaderElectionContext I am the new leader: http://127.0.0.1:47416/pxqux/collection1/ shard1
   [junit4]   2> 433814 INFO  (OverseerStateUpdate-95192678345080836-127.0.0.1:47416_pxqux-n_0000000000) [    ] o.a.s.c.Overseer processMessage: queueSize: 1, message = {
   [junit4]   2>   "operation":"leader",
   [junit4]   2>   "shard":"shard1",
   [junit4]   2>   "collection":"control_collection",
   [junit4]   2>   "base_url":"http://127.0.0.1:47416/pxqux",
   [junit4]   2>   "core":"collection1",
   [junit4]   2>   "state":"active"} current state version: 1
   [junit4]   2> 433916 INFO  (zkCallback-1200-thread-1) [    ] o.a.s.c.c.ZkStateReader A cluster state change: [WatchedEvent state:SyncConnected type:NodeDataChanged path:/clusterstate.json], has occurred - updating... (live nodes size: [1])
   [junit4]   2> 433965 INFO  (coreZkRegister-1548-thread-1) [    ] o.a.s.c.ZkController We are http://127.0.0.1:47416/pxqux/collection1/ and leader is http://127.0.0.1:47416/pxqux/collection1/
   [junit4]   2> 433965 INFO  (coreZkRegister-1548-thread-1) [    ] o.a.s.c.ZkController No LogReplay needed for core=collection1 baseURL=http://127.0.0.1:47416/pxqux
   [junit4]   2> 433965 INFO  (coreZkRegister-1548-thread-1) [    ] o.a.s.c.ZkController I am the leader, no recovery necessary
   [junit4]   2> 433965 INFO  (coreZkRegister-1548-thread-1) [    ] o.a.s.c.ZkController publishing state=active
   [junit4]   2> 433965 INFO  (coreZkRegister-1548-thread-1) [    ] o.a.s.c.ZkController numShards not found on descriptor - reading it from system property
   [junit4]   2> 433966 INFO  (OverseerStateUpdate-95192678345080836-127.0.0.1:47416_pxqux-n_0000000000) [    ] o.a.s.c.Overseer processMessage: queueSize: 1, message = {
   [junit4]   2>   "core":"collection1",
   [junit4]   2>   "core_node_name":"core_node1",
   [junit4]   2>   "roles":null,
   [junit4]   2>   "base_url":"http://127.0.0.1:47416/pxqux",
   [junit4]   2>   "node_name":"127.0.0.1:47416_pxqux",
   [junit4]   2>   "numShards":"1",
   [junit4]   2>   "state":"active",
   [junit4]   2>   "shard":"shard1",
   [junit4]   2>   "collection":"control_collection",
   [junit4]   2>   "operation":"state"} current state version: 2
   [junit4]   2> 433966 INFO  (OverseerStateUpdate-95192678345080836-127.0.0.1:47416_pxqux-n_0000000000) [    ] o.a.s.c.o.ReplicaMutator Update state numShards=1 message={
   [junit4]   2>   "core":"collection1",
   [junit4]   2>   "core_node_name":"core_node1",
   [junit4]   2>   "roles":null,
   [junit4]   2>   "base_url":"http://127.0.0.1:47416/pxqux",
   [junit4]   2>   "node_name":"127.0.0.1:47416_pxqux",
   [junit4]   2>   "numShards":"1",
   [junit4]   2>   "state":"active",
   [junit4]   2>   "shard":"shard1",
   [junit4]   2>   "collection":"control_collection",
   [junit4]   2>   "operation":"state"}
   [junit4]   2> 434067 INFO  (zkCallback-1200-thread-1) [    ] o.a.s.c.c.ZkStateReader A cluster state change: [WatchedEvent state:SyncConnected type:NodeDataChanged path:/clusterstate.json], has occurred - updating... (live nodes size: [1])
   [junit4]   2> 434186 INFO  (TEST-DistribDocExpirationUpdateProcessorTest.test-seed#[B691F4F2AC0AA467]) [    ] o.a.s.c.c.SolrZkClient Using default ZkCredentialsProvider
   [junit4]   2> 434186 INFO  (TEST-DistribDocExpirationUpdateProcessorTest.test-seed#[B691F4F2AC0AA467]) [    ] o.a.s.c.c.ConnectionManager Waiting for client to connect to ZooKeeper
   [junit4]   2> 434187 INFO  (zkCallback-1202-thread-1) [    ] o.a.s.c.c.ConnectionManager Watcher org.apache.solr.common.cloud.ConnectionManager@6bb3f3e7 name:ZooKeeperConnection Watcher:127.0.0.1:57899/solr got event WatchedEvent state:SyncConnected type:None path:null path:null type:None
   [junit4]   2> 434187 INFO  (TEST-DistribDocExpirationUpdateProcessorTest.test-seed#[B691F4F2AC0AA467]) [    ] o.a.s.c.c.ConnectionManager Client is connected to ZooKeeper
   [junit4]   2> 434187 INFO  (TEST-DistribDocExpirationUpdateProcessorTest.test-seed#[B691F4F2AC0AA467]) [    ] o.a.s.c.c.SolrZkClient Using default ZkACLProvider
   [junit4]   2> 434187 INFO  (TEST-DistribDocExpirationUpdateProcessorTest.test-seed#[B691F4F2AC0AA467]) [    ] o.a.s.c.c.ZkStateReader Updating cluster state from ZooKeeper... 
   [junit4]   2> 434188 INFO  (TEST-DistribDocExpirationUpdateProcessorTest.test-seed#[B691F4F2AC0AA467]) [    ] o.a.s.c.ChaosMonkey monkey: init - expire sessions:false cause connection loss:false
   [junit4]   2> 434237 INFO  (TEST-DistribDocExpirationUpdateProcessorTest.test-seed#[B691F4F2AC0AA467]) [    ] o.a.s.SolrTestCaseJ4 Writing core.properties file to /home/jenkins/workspace/Lucene-Solr-5.x-Linux/solr/build/solr-core/test/J2/temp/solr.cloud.DistribDocExpirationUpdateProcessorTest_B691F4F2AC0AA467-001/shard-1-001/cores/collection1
   [junit4]   2> 434237 INFO  (TEST-DistribDocExpirationUpdateProcessorTest.test-seed#[B691F4F2AC0AA467]) [    ] o.a.s.c.AbstractFullDistribZkTestBase create jetty 1 in directory /home/jenkins/workspace/Lucene-Solr-5.x-Linux/solr/build/solr-core/test/J2/temp/solr.cloud.DistribDocExpirationUpdateProcessorTest_B691F4F2AC0AA467-001/shard-1-001
   [junit4]   2> 434238 INFO  (TEST-DistribDocExpirationUpdateProcessorTest.test-seed#[B691F4F2AC0AA467]) [    ] o.e.j.s.Server jetty-9.2.13.v20150730
   [junit4]   2> 434239 INFO  (TEST-DistribDocExpirationUpdateProcessorTest.test-seed#[B691F4F2AC0AA467]) [    ] o.e.j.s.h.ContextHandler Started o.e.j.s.ServletContextHandler@231c1e73{/pxqux,null,AVAILABLE}
   [junit4]   2> 434240 INFO  (TEST-DistribDocExpirationUpdateProcessorTest.test-seed#[B691F4F2AC0AA467]) [    ] o.e.j.s.ServerConnector Started ServerConnector@4b769d38{HTTP/1.1}{127.0.0.1:48822}
   [junit4]   2> 434240 INFO  (TEST-DistribDocExpirationUpdateProcessorTest.test-seed#[B691F4F2AC0AA467]) [    ] o.e.j.s.Server Started @435867ms
   [junit4]   2> 434240 INFO  (TEST-DistribDocExpirationUpdateProcessorTest.test-seed#[B691F4F2AC0AA467]) [    ] o.a.s.c.s.e.JettySolrRunner Jetty properties: {solr.data.dir=/home/jenkins/workspace/Lucene-Solr-5.x-Linux/solr/build/solr-core/test/J2/temp/solr.cloud.DistribDocExpirationUpdateProcessorTest_B691F4F2AC0AA467-001/tempDir-001/jetty1, solrconfig=solrconfig.xml, hostContext=/pxqux, hostPort=48822, coreRootDirectory=/home/jenkins/workspace/Lucene-Solr-5.x-Linux/solr/build/solr-core/test/J2/../../../../../../../../../home/jenkins/workspace/Lucene-Solr-5.x-Linux/solr/build/solr-core/test/J2/temp/solr.cloud.DistribDocExpirationUpdateProcessorTest_B691F4F2AC0AA467-001/shard-1-001/cores}
   [junit4]   2> 434240 INFO  (TEST-DistribDocExpirationUpdateProcessorTest.test-seed#[B691F4F2AC0AA467]) [    ] o.a.s.s.SolrDispatchFilter SolrDispatchFilter.init(): sun.misc.Launcher$AppClassLoader@deb6432
   [junit4]   2> 434240 INFO  (TEST-DistribDocExpirationUpdateProcessorTest.test-seed#[B691F4F2AC0AA467]) [    ] o.a.s.c.SolrResourceLoader new SolrResourceLoader for directory: '/home/jenkins/workspace/Lucene-Solr-5.x-Linux/solr/build/solr-core/test/J2/temp/solr.cloud.DistribDocExpirationUpdateProcessorTest_B691F4F2AC0AA467-001/shard-1-001'
   [junit4]   2> 434240 INFO  (TEST-DistribDocExpirationUpdateProcessorTest.test-seed#[B691F4F2AC0AA467]) [    ] o.a.s.c.SolrResourceLoader JNDI not configured for solr (NoInitialContextEx)
   [junit4]   2> 434240 INFO  (TEST-DistribDocExpirationUpdateProcessorTest.test-seed#[B691F4F2AC0AA467]) [    ] o.a.s.c.SolrResourceLoader solr home defaulted to 'solr/' (could not find system property or JNDI)
   [junit4]   2> 434240 INFO  (TEST-DistribDocExpirationUpdateProcessorTest.test-seed#[B691F4F2AC0AA467]) [    ] o.a.s.c.c.SolrZkClient Using default ZkCredentialsProvider
   [junit4]   2> 434241 INFO  (TEST-DistribDocExpirationUpdateProcessorTest.test-seed#[B691F4F2AC0AA467]) [    ] o.a.s.c.c.ConnectionManager Waiting for client to connect to ZooKeeper
   [junit4]   2> 434241 INFO  (zkCallback-1203-thread-1) [    ] o.a.s.c.c.ConnectionManager Watcher org.apache.solr.common.cloud.ConnectionManager@43eb42d4 name:ZooKeeperConnection Watcher:127.0.0.1:57899/solr got event WatchedEvent state:SyncConnected type:None path:null path:null type:None
   [junit4]   2> 434241 INFO  (TEST-DistribDocExpirationUpdateProcessorTest.test-seed#[B691F4F2AC0AA467]) [    ] o.a.s.c.c.ConnectionManager Client is connected to ZooKeeper
   [junit4]   2> 434242 INFO  (TEST-DistribDocExpirationUpdateProcessorTest.test-seed#[B691F4F2AC0AA467]) [    ] o.a.s.c.c.SolrZkClient Using default ZkACLProvider
   [junit4]   2> 434242 INFO  (TEST-DistribDocExpirationUpdateProcessorTest.test-seed#[B691F4F2AC0AA467]) [    ] o.a.s.s.SolrDispatchFilter Loading solr.xml from SolrHome (not found in ZooKeeper)
   [junit4]   2> 434242 INFO  (TEST-DistribDocExpirationUpdateProcessorTest.test-seed#[B691F4F2AC0AA467]) [    ] o.a.s.c.SolrXmlConfig Loading container configuration from /home/jenkins/workspace/Lucene-Solr-5.x-Linux/solr/build/solr-core/test/J2/temp/solr.cloud.DistribDocExpirationUpdateProcessorTest_B691F4F2AC0AA467-001/shard-1-001/solr.xml
   [junit4]   2> 434247 INFO  (TEST-DistribDocExpirationUpdateProcessorTest.test-seed#[B691F4F2AC0AA467]) [    ] o.a.s.c.CorePropertiesLocator Config-defined core root directory: /home/jenkins/workspace/Lucene-Solr-5.x-Linux/solr/build/solr-core/test/J2/../../../../../../../../../home/jenkins/workspace/Lucene-Solr-5.x-Linux/solr/build/solr-core/test/J2/temp/solr.cloud.DistribDocExpirationUpdateProcessorTest_B691F4F2AC0AA467-001/shard-1-001/cores
   [junit4]   2> 434247 INFO  (TEST-DistribDocExpirationUpdateProcessorTest.test-seed#[B691F4F2AC0AA467]) [    ] o.a.s.c.CoreContainer New CoreContainer 209972867
   [junit4]   2> 434247 INFO  (TEST-DistribDocExpirationUpdateProcessorTest.test-seed#[B691F4F2AC0AA467]) [    ] o.a.s.c.CoreContainer Loading cores into CoreContainer [instanceDir=/home/jenkins/workspace/Lucene-Solr-5.x-Linux/solr/build/solr-core/test/J2/temp/solr.cloud.DistribDocExpirationUpdateProcessorTest_B691F4F2AC0AA467-001/shard-1-001]
   [junit4]   2> 434247 WARN  (TEST-DistribDocExpirationUpdateProcessorTest.test-seed#[B691F4F2AC0AA467]) [    ] o.a.s.c.CoreContainer Couldn't add files from /home/jenkins/workspace/Lucene-Solr-5.x-Linux/solr/build/solr-core/test/J2/temp/solr.cloud.DistribDocExpirationUpdateProcessorTest_B691F4F2AC0AA467-001/shard-1-001/lib to classpath: /home/jenkins/workspace/Lucene-Solr-5.x-Linux/solr/build/solr-core/test/J2/temp/solr.cloud.DistribDocExpirationUpdateProcessorTest_B691F4F2AC0AA467-001/shard-1-001/lib
   [junit4]   2> 434247 INFO  (TEST-DistribDocExpirationUpdateProcessorTest.test-seed#[B691F4F2AC0AA467]) [    ] o.a.s.h.c.HttpShardHandlerFactory created with socketTimeout : 90000,urlScheme : ,connTimeout : 15000,maxConnectionsPerHost : 20,maxConnections : 10000,corePoolSize : 0,maximumPoolSize : 2147483647,maxThreadIdleTime : 5,sizeOfQueue : -1,fairnessPolicy : false,useRetries : false,
   [junit4]   2> 434248 INFO  (TEST-DistribDocExpirationUpdateProcessorTest.test-seed#[B691F4F2AC0AA467]) [    ] o.a.s.u.UpdateShardHandler Creating UpdateShardHandler HTTP client with params: socketTimeout=340000&connTimeout=45000&retry=true
   [junit4]   2> 434249 INFO  (TEST-DistribDocExpirationUpdateProcessorTest.test-seed#[B691F4F2AC0AA467]) [    ] o.a.s.l.LogWatcher SLF4J impl is org.slf4j.impl.Log4jLoggerFactory
   [junit4]   2> 434249 INFO  (TEST-DistribDocExpirationUpdateProcessorTest.test-seed#[B691F4F2AC0AA467]) [    ] o.a.s.l.LogWatcher Registering Log Listener [Log4j (org.slf4j.impl.Log4jLoggerFactory)]
   [junit4]   2> 434249 INFO  (TEST-DistribDocExpirationUpdateProcessorTest.test-seed#[B691F4F2AC0AA467]) [    ] o.a.s.c.ZkContainer Zookeeper client=127.0.0.1:57899/solr
   [junit4]   2> 434249 INFO  (TEST-DistribDocExpirationUpdateProcessorTest.test-seed#[B691F4F2AC0AA467]) [    ] o.a.s.c.ZkController zkHost includes chroot
   [junit4]   2> 434249 INFO  (TEST-DistribDocExpirationUpdateProcessorTest.test-seed#[B691F4F2AC0AA467]) [    ] o.a.s.c.c.SolrZkClient Using default ZkCredentialsProvider
   [junit4]   2> 434249 INFO  (TEST-DistribDocExpirationUpdateProcessorTest.test-seed#[B691F4F2AC0AA467]) [    ] o.a.s.c.c.ConnectionManager Waiting for client to connect to ZooKeeper
   [junit4]   2> 434250 INFO  (zkCallback-1205-thread-1) [    ] o.a.s.c.c.ConnectionManager Watcher org.apache.solr.common.cloud.ConnectionManager@2b4e5095 name:ZooKeeperConnection Watcher:127.0.0.1:57899 got event WatchedEvent state:SyncConnected type:None path:null path:null type:None
   [junit4]   2> 434250 INFO  (TEST-DistribDocExpirationUpdateProcessorTest.test-seed#[B691F4F2AC0AA467]) [    ] o.a.s.c.c.ConnectionManager Client is connected to ZooKeeper
   [junit4]   2> 434251 INFO  (TEST-DistribDocExpirationUpdateProcessorTest.test-seed#[B691F4F2AC0AA467]) [    ] o.a.s.c.c.SolrZkClient Using default ZkACLProvider
   [junit4]   2> 434299 INFO  (TEST-DistribDocExpirationUpdateProcessorTest.test-seed#[B691F4F2AC0AA467]) [    ] o.a.s.c.c.ConnectionManager Waiting for client to connect to ZooKeeper
   [junit4]   2> 434300 INFO  (zkCallback-1206-thread-1) [    ] o.a.s.c.c.ConnectionManager Watcher org.apache.solr.common.cloud.ConnectionManager@2c233cc7 name:ZooKeeperConnection Watcher:127.0.0.1:57899/solr got event WatchedEvent state:SyncConnected type:None path:null path:null type:None
   [junit4]   2> 434300 INFO  (TEST-DistribDocExpirationUpdateProcessorTest.test-seed#[B691F4F2AC0AA467]) [    ] o.a.s.c.c.ConnectionManager Client is connected to ZooKeeper
   [junit4]   2> 434302 INFO  (TEST-DistribDocExpirationUpdateProcessorTest.test-seed#[B691F4F2AC0AA467]) [    ] o.a.s.c.c.ZkStateReader Updating cluster state from ZooKeeper... 
   [junit4]   2> 435305 INFO  (TEST-DistribDocExpirationUpdateProcessorTest.test-seed#[B691F4F2AC0AA467]) [    ] o.a.s.c.ZkController Register node as live in ZooKeeper:/live_nodes/127.0.0.1:48822_pxqux
   [junit4]   2> 435305 INFO  (TEST-DistribDocExpirationUpdateProcessorTest.test-seed#[B691F4F2AC0AA467]) [    ] o.a.s.c.c.SolrZkClient makePath: /live_nodes/127.0.0.1:48822_pxqux
   [junit4]   2> 435306 INFO  (zkCallback-1206-thread-1) [    ] o.a.s.c.c.ZkStateReader A live node change: [WatchedEvent state:SyncConnected type:NodeChildrenChanged path:/live_nodes], has occurred - updating... (live nodes size: [1])
   [junit4]   2> 435306 INFO  (zkCallback-1200-thread-1) [    ] o.a.s.c.c.ZkStateReader A live node change: [WatchedEvent state:SyncConnected type:NodeChildrenChanged path:/live_nodes], has occurred - updating... (live nodes size: [1])
   [junit4]   2> 435306 INFO  (zkCallback-1202-thread-1) [    ] o.a.s.c.c.ZkStateReader A live node change: [WatchedEvent state:SyncConnected type:NodeChildrenChanged path:/live_nodes], has occurred - updating... (live nodes size: [1])
   [junit4]   2> 435306 INFO  (TEST-DistribDocExpirationUpdateProcessorTest.test-seed#[B691F4F2AC0AA467]) [    ] o.a.s.c.Overseer Overseer (id=null) closing
   [junit4]   2> 435306 INFO  (TEST-DistribDocExpirationUpdateProcessorTest.test-seed#[B691F4F2AC0AA467]) [    ] o.a.s.c.LeaderElector Joined leadership election with path: /overseer_elect/election/95192678345080840-127.0.0.1:48822_pxqux-n_0000000001
   [junit4]   2> 435307 INFO  (TEST-DistribDocExpirationUpdateProcessorTest.test-seed#[B691F4F2AC0AA467]) [    ] o.a.s.c.LeaderElector Watching path /overseer_elect/election/95192678345080836-127.0.0.1:47416_pxqux-n_0000000000 to know if I could be the leader
   [junit4]   2> 435314 INFO  (TEST-DistribDocExpirationUpdateProcessorTest.test-seed#[B691F4F2AC0AA467]) [    ] o.a.s.c.CoreContainer Security conf doesn't exist. Skipping setup for authorization module.
   [junit4]   2> 435314 INFO  (TEST-DistribDocExpirationUpdateProcessorTest.test-seed#[B691F4F2AC0AA467]) [    ] o.a.s.c.CoreContainer No authentication plugin used.
   [junit4]   2> 435314 INFO  (TEST-DistribDocExpirationUpdateProcessorTest.test-seed#[B691F4F2AC0AA467]) [    ] o.a.s.c.CorePropertiesLocator Looking for core definitions underneath /home/jenkins/workspace/Lucene-Solr-5.x-Linux/solr/build/solr-core/test/J2/../../../../../../../../../home/jenkins/workspace/Lucene-Solr-5.x-Linux/solr/build/solr-core/test/J2/temp/solr.cloud.DistribDocExpirationUpdateProcessorTest_B691F4F2AC0AA467-001/shard-1-001/cores
   [junit4]   2> 435315 INFO  (TEST-DistribDocExpirationUpdateProcessorTest.test-seed#[B691F4F2AC0AA467]) [    ] o.a.s.c.CoreDescriptor Created CoreDescriptor: {name=collection1, config=solrconfig.xml, transient=false, schema=schema.xml, loadOnStartup=true, configSetProperties=configsetprops.json, collection=collection1, coreNodeName=, dataDir=data/, shard=}
   [junit4]   2> 435315 INFO  (TEST-DistribDocExpirationUpdateProcessorTest.test-seed#[B691F4F2AC0AA467]) [    ] o.a.s.c.CorePropertiesLocator Found core collection1 in /home/jenkins/workspace/Lucene-Solr-5.x-Linux/solr/build/solr-core/test/J2/../../../../../../../../../home/jenkins/workspace/Lucene-Solr-5.x-Linux/solr/build/solr-core/test/J2/temp/solr.cloud.DistribDocExpirationUpdateProcessorTest_B691F4F2AC0AA467-001/shard-1-001/cores/collection1
   [junit4]   2> 435315 INFO  (TEST-DistribDocExpirationUpdateProcessorTest.test-seed#[B691F4F2AC0AA467]) [    ] o.a.s.c.CorePropertiesLocator Found 1 core definitions
   [junit4]   2> 435316 INFO  (TEST-DistribDocExpirationUpdateProcessorTest.test-seed#[B691F4F2AC0AA467]) [    ] o.a.s.s.SolrDispatchFilter user.dir=/home/jenkins/workspace/Lucene-Solr-5.x-Linux/solr/build/solr-core/test/J2
   [junit4]   2> 435316 INFO  (TEST-DistribDocExpirationUpdateProcessorTest.test-seed#[B691F4F2AC0AA467]) [    ] o.a.s.s.SolrDispatchFilter SolrDispatchFilter.init() done
   [junit4]   2> 435316 INFO  (coreLoadExecutor-1566-thread-1) [    ] o.a.s.c.ZkController publishing state=down
   [junit4]   2> 435316 INFO  (coreLoadExecutor-1566-thread-1) [    ] o.a.s.c.ZkController numShards not found on descriptor - reading it from system property
   [junit4]   2> 435316 INFO  (coreLoadExecutor-1566-thread-1) [    ] o.a.s.c.ZkController look for our core node name
   [junit4]   2> 435317 INFO  (OverseerStateUpdate-95192678345080836-127.0.0.1:47416_pxqux-n_0000000000) [    ] o.a.s.c.Overseer processMessage: queueSize: 1, message = {
   [junit4]   2>   "core":"collection1",
   [junit4]   2>   "roles":null,
   [junit4]   2>   "base_url":"http://127.0.0.1:48822/pxqux",
   [junit4]   2>   "node_name":"127.0.0.1:48822_pxqux",
   [junit4]   2>   "numShards":"2",
   [junit4]   2>   "state":"down",
   [junit4]   2>   "shard":null,
   [junit4]   2>   "collection":"collection1",
   [junit4]   2>   "operation":"state"} current state version: 3
   [junit4]   2> 435317 INFO  (OverseerStateUpdate-95192678345080836-127.0.0.1:47416_pxqux-n_0000000000) [    ] o.a.s.c.o.ReplicaMutator Update state numShards=2 message={
   [junit4]   2>   "core":"collection1",
   [junit4]   2>   "roles":null,
   [junit4]   2>   "base_url":"http://127.0.0.1:48822/pxqux",
   [junit4]   2>   "node_name":"127.0.0.1:48822_pxqux",
   [junit4]   2>   "numShards":"2",
   [junit4]   2>   "state":"down",
   [junit4]   2>   "shard":null,
   [junit4]   2>   "collection":"collection1",
   [junit4]   2>   "operation":"state"}
   [junit4]   2> 435317 INFO  (OverseerStateUpdate-95192678345080836-127.0.0.1:47416_pxqux-n_0000000000) [    ] o.a.s.c.o.ClusterStateMutator building a new cName: collection1
   [junit4]   2> 435317 INFO  (OverseerStateUpdate-95192678345080836-127.0.0.1:47416_pxqux-n_0000000000) [    ] o.a.s.c.o.ReplicaMutator Assigning new node to shard shard=shard2
   [junit4]   2> 435418 INFO  (zkCallback-1206-thread-1) [    ] o.a.s.c.c.ZkStateReader A cluster state change: [WatchedEvent state:SyncConnected type:NodeDataChanged path:/clusterstate.json], has occurred - updating... (live nodes size: [2])
   [junit4]   2> 435418 INFO  (zkCallback-1200-thread-1) [    ] o.a.s.c.c.ZkStateReader A cluster state change: [WatchedEvent state:SyncConnected type:NodeDataChanged path:/clusterstate.json], has occurred - updating... (live nodes size: [2])
   [junit4]   2> 435418 INFO  (zkCallback-1202-thread-1) [    ] o.a.s.c.c.ZkStateReader A cluster state change: [WatchedEvent state:SyncConnected type:NodeDataChanged path:/clusterstate.json], has occurred - updating... (live nodes size: [2])
   [junit4]   2> 436317 INFO  (coreLoadExecutor-1566-thread-1) [    ] o.a.s.c.ZkController waiting to find shard id in clusterstate for collection1
   [junit4]   2> 436317 INFO  (coreLoadExecutor-1566-thread-1) [    ] o.a.s.c.ZkController Check for collection zkNode:collection1
   [junit4]   2> 436317 INFO  (coreLoadExecutor-1566-thread-1) [    ] o.a.s.c.ZkController Collection zkNode exists
   [junit4]   2> 436317 INFO  (coreLoadExecutor-1566-thread-1) [    ] o.a.s.c.c.ZkStateReader Load collection config from: [/collections/collection1]
   [junit4]   2> 436317 INFO  (coreLoadExecutor-1566-thread-1) [    ] o.a.s.c.c.ZkStateReader path=[/collections/collection1] [configName]=[conf1] specified config exists in ZooKeeper
   [junit4]   2> 436317 INFO  (coreLoadExecutor-1566-thread-1) [    ] o.a.s.c.SolrResourceLoader new SolrResourceLoader for directory: '/home/jenkins/workspace/Lucene-Solr-5.x-Linux/solr/build/solr-core/test/J2/temp/solr.cloud.DistribDocExpirationUpdateProcessorTest_B691F4F2AC0AA467-001/shard-1-001/cores/collection1'
   [junit4]   2> 436318 INFO  (coreLoadExecutor-1566-thread-1) [    ] o.a.s.c.SolrResourceLoader JNDI not configured for solr (NoInitialContextEx)
   [junit4]   2> 436318 INFO  (coreLoadExecutor-1566-thread-1) [    ] o.a.s.c.SolrResourceLoader solr home defaulted to 'solr/' (could not find system property or JNDI)
   [junit4]   2> 436319 INFO  (coreLoadExecutor-1566-thread-1) [    ] o.a.s.c.Config loaded config solrconfig.xml with version 0 
   [junit4]   2> 436323 INFO  (coreLoadExecutor-1566-thread-1) [    ] o.a.s.c.SolrConfig current version of requestparams : -1
   [junit4]   2> 436326 INFO  (coreLoadExecutor-1566-thread-1) [    ] o.a.s.c.SolrConfig Using Lucene MatchVersion: 5.5.0
   [junit4]   2> 436333 INFO  (coreLoadExecutor-1566-thread-1) [    ] o.a.s.c.SolrConfig Loaded SolrConfig: solrconfig.xml
   [junit4]   2> 436338 INFO  (coreLoadExecutor-1566-thread-1) [    ] o.a.s.s.IndexSchema [collection1] Schema name=test
   [junit4]   2> 436416 INFO  (coreLoadExecutor-1566-thread-1) [    ] o.a.s.s.IndexSchema default search field in schema is text
   [junit4]   2> 436417 INFO  (coreLoadExecutor-1566-thread-1) [    ] o.a.s.s.IndexSchema unique key field: id
   [junit4]   2> 436418 INFO  (coreLoadExecutor-1566-thread-1) [    ] o.a.s.s.FileExchangeRateProvider Reloading exchange rates from file currency.xml
   [junit4]   2> 436420 INFO  (coreLoadExecutor-1566-thread-1) [    ] o.a.s.s.FileExchangeRateProvider Reloading exchange rates from file currency.xml
   [junit4]   2> 436427 INFO  (coreLoadExecutor-1566-thread-1) [    ] o.a.s.c.ConfigSetProperties Did not find ConfigSet properties, assuming default properties: Can't find resource 'configsetprops.json' in classpath or '/configs/conf1', cwd=/home/jenkins/workspace/Lucene-Solr-5.x-Linux/solr/build/solr-core/test/J2
   [junit4]   2> 436427 INFO  (coreLoadExecutor-1566-thread-1) [    ] o.a.s.c.CoreContainer Creating SolrCore 'collection1' using configuration from collection collection1
   [junit4]   2> 436428 INFO  (coreLoadExecutor-1566-thread-1) [    ] o.a.s.c.SolrCore org.apache.solr.core.MockDirectoryFactory
   [junit4]   2> 436428 INFO  (coreLoadExecutor-1566-thread-1) [    ] o.a.s.c.SolrCore [[collection1] ] Opening new SolrCore at [/home/jenkins/workspace/Lucene-Solr-5.x-Linux/solr/build/solr-core/test/J2/temp/solr.cloud.DistribDocExpirationUpdateProcessorTest_B691F4F2AC0AA467-001/shard-1-001/cores/collection1], dataDir=[/home/jenkins/workspace/Lucene-Solr-5.x-Linux/solr/build/solr-core/test/J2/../../../../../../../../../home/jenkins/workspace/Lucene-Solr-5.x-Linux/solr/build/solr-core/test/J2/temp/solr.cloud.DistribDocExpirationUpdateProcessorTest_B691F4F2AC0AA467-001/shard-1-001/cores/collection1/data/]
   [junit4]   2> 436428 INFO  (coreLoadExecutor-1566-thread-1) [    ] o.a.s.c.SolrCore JMX monitoring not detected for core: collection1
   [junit4]   2> 436428 INFO  (coreLoadExecutor-1566-thread-1) [    ] o.a.s.c.CachingDirectoryFactory return new directory for /home/jenkins/workspace/Lucene-Solr-5.x-Linux/solr/build/solr-core/test/J2/../../../../../../../../../home/jenkins/workspace/Lucene-Solr-5.x-Linux/solr/build/solr-core/test/J2/temp/solr.cloud.DistribDocExpirationUpdateProcessorTest_B691F4F2AC0AA467-001/shard-1-001/cores/collection1/data
   [junit4]   2> 436428 INFO  (coreLoadExecutor-1566-thread-1) [    ] o.a.s.c.SolrCore New index directory detected: old=null new=/home/jenkins/workspace/Lucene-Solr-5.x-Linux/solr/build/solr-core/test/J2/../../../../../../../../../home/jenkins/workspace/Lucene-Solr-5.x-Linux/solr/build/solr-core/test/J2/temp/solr.cloud.DistribDocExpirationUpdateProcessorTest_B691F4F2AC0AA467-001/shard-1-001/cores/collection1/data/index/
   [junit4]   2> 436428 WARN  (coreLoadExecutor-1566-thread-1) [    ] o.a.s.c.SolrCore [collection1] Solr index directory '/home/jenkins/workspace/Lucene-Solr-5.x-Linux/solr/build/solr-core/test/J2/../../../../../../../../../home/jenkins/workspace/Lucene-Solr-5.x-Linux/solr/build/solr-core/test/J2/temp/solr.cloud.DistribDocExpirationUpdateProcessorTest_B691F4F2AC0AA467-001/shard-1-001/cores/collection1/data/index' doesn't exist. Creating new index...
   [junit4]   2> 436429 INFO  (coreLoadExecutor-1566-thread-1) [    ] o.a.s.c.CachingDirectoryFactory return new directory for /home/jenkins/workspace/Lucene-Solr-5.x-Linux/solr/build/solr-core/test/J2/../../../../../../../../../home/jenkins/workspace/Lucene-Solr-5.x-Linux/solr/build/solr-core/test/J2/temp/solr.cloud.DistribDocExpirationUpdateProcessorTest_B691F4F2AC0AA467-001/shard-1-001/cores/collection1/data/index
   [junit4]   2> 436429 INFO  (coreLoadExecutor-1566-thread-1) [    ] o.a.s.u.RandomMergePolicy RandomMergePolicy wrapping class org.apache.lucene.index.TieredMergePolicy: [TieredMergePolicy: maxMergeAtOnce=28, maxMergeAtOnceExplicit=46, maxMergedSegmentMB=88.396484375, floorSegmentMB=1.390625, forceMergeDeletesPctAllowed=16.495359723605212, segmentsPerTier=34.0, maxCFSSegmentSizeMB=8.796093022207999E12, noCFSRatio=1.0
   [junit4]   2> 436429 INFO  (coreLoadExecutor-1566-thread-1) [    ] o.a.s.c.SolrDeletionPolicy SolrDeletionPolicy.onCommit: commits: num=1
   [junit4]   2> 	commit{dir=MockDirectoryWrapper(RAMDirectory@25dfe8dd lockFactory=org.apache.lucene.store.SingleInstanceLockFactory@5baf69ab),segFN=segments_1,generation=1}
   [junit4]   2> 436429 INFO  (coreLoadExecutor-1566-thread-1) [    ] o.a.s.c.SolrDeletionPolicy newest commit generation = 1
   [junit4]   2> 436430 INFO  (OldIndexDirectoryCleanupThreadForCore-collection1) [    ] o.a.s.c.SolrCore Looking for old index directories to cleanup for core collection1 in /home/jenkins/workspace/Lucene-Solr-5.x-Linux/solr/build/solr-core/test/J2/../../../../../../../../../home/jenkins/workspace/Lucene-Solr-5.x-Linux/solr/build/solr-core/test/J2/temp/solr.cloud.DistribDocExpirationUpdateProcessorTest_B691F4F2AC0AA467-001/shard-1-001/cores/collection1/data/
   [junit4]   2> 436430 WARN  (OldIndexDirectoryCleanupThreadForCore-collection1) [    ] o.a.s.c.DirectoryFactory /home/jenkins/workspace/Lucene-Solr-5.x-Linux/solr/build/solr-core/test/J2/../../../../../../../../../home/jenkins/workspace/Lucene-Solr-5.x-Linux/solr/build/solr-core/test/J2/temp/solr.cloud.DistribDocExpirationUpdateProcessorTest_B691F4F2AC0AA467-001/shard-1-001/cores/collection1/data/ does not point to a valid data directory; skipping clean-up of old index directories.
   [junit4]   2> 436431 INFO  (coreLoadExecutor-1566-thread-1) [    ] o.a.s.u.p.UpdateRequestProcessorChain creating updateRequestProcessorChain "convert-ttl-defaults"
   [junit4]   2> 436431 INFO  (coreLoadExecutor-1566-thread-1) [    ] o.a.s.u.p.UpdateRequestProcessorChain creating updateRequestProcessorChain "convert-ttl-field"
   [junit4]   2> 436431 INFO  (coreLoadExecutor-1566-thread-1) [    ] o.a.s.u.p.UpdateRequestProcessorChain creating updateRequestProcessorChain "convert-ttl-param"
   [junit4]   2> 436431 INFO  (coreLoadExecutor-1566-thread-1) [    ] o.a.s.u.p.UpdateRequestProcessorChain creating updateRequestProcessorChain "convert-ttl-field-with-param-default"
   [junit4]   2> 436432 INFO  (coreLoadExecutor-1566-thread-1) [    ] o.a.s.u.p.UpdateRequestProcessorChain creating updateRequestProcessorChain "scheduled-delete" (default)
   [junit4]   2> 436432 INFO  (coreLoadExecutor-1566-thread-1) [    ] o.a.s.u.p.UpdateRequestProcessorChain inserting DistributedUpdateProcessorFactory into updateRequestProcessorChain "scheduled-delete" (default)
   [junit4]   2> 436434 INFO  (coreLoadExecutor-1566-thread-1) [    ] o.a.s.h.l.XMLLoader xsltCacheLifetimeSeconds=60
   [junit4]   2> 436434 INFO  (coreLoadExecutor-1566-thread-1) [    ] o.a.s.h.l.XMLLoader xsltCacheLifetimeSeconds=60
   [junit4]   2> 436435 INFO  (coreLoadExecutor-1566-thread-1) [    ] o.a.s.h.l.XMLLoader xsltCacheLifetimeSeconds=60
   [junit4]   2> 436436 INFO  (coreLoadExecutor-1566-thread-1) [    ] o.a.s.h.l.XMLLoader xsltCacheLifetimeSeconds=60
   [junit4]   2> 436437 INFO  (coreLoadExecutor-1566-thread-1) [    ] o.a.s.c.RequestHandlers Registered paths: /admin/mbeans,,/update/csv,/update/json/docs,/admin/luke,/select,/admin/segments,/get,/admin/system,/replication,/admin/properties,/config,/schema,/admin/plugins,/admin/logging,/update/json,/admin/threads,/admin/ping,/update,/admin/file
   [junit4]   2> 436437 INFO  (coreLoadExecutor-1566-thread-1) [    ] o.a.s.c.SolrCore Using default statsCache cache: org.apache.solr.search.stats.LocalStatsCache
   [junit4]   2> 436438 INFO  (coreLoadExecutor-1566-thread-1) [    ] o.a.s.u.UpdateHandler Using UpdateLog implementation: org.apache.solr.update.UpdateLog
   [junit4]   2> 436438 INFO  (coreLoadExecutor-1566-thread-1) [    ] o.a.s.u.UpdateLog Initializing UpdateLog: dataDir= defaultSyncLevel=FLUSH numRecordsToKeep=100 maxNumLogsToKeep=10 numVersionBuckets=65536
   [junit4]   2> 436439 INFO  (coreLoadExecutor-1566-thread-1) [    ] o.a.s.u.CommitTracker Hard AutoCommit: disabled
   [junit4]   2> 436440 INFO  (coreLoadExecutor-1566-thread-1) [    ] o.a.s.u.CommitTracker Soft AutoCommit: disabled
   [junit4]   2> 436440 INFO  (coreLoadExecutor-1566-thread-1) [    ] o.a.s.u.RandomMergePolicy RandomMergePolicy wrapping class org.apache.lucene.index.LogDocMergePolicy: [LogDocMergePolicy: minMergeSize=1000, mergeFactor=10, maxMergeSize=9223372036854775807, maxMergeSizeForForcedMerge=9223372036854775807, calibrateSizeByDeletes=false, maxMergeDocs=2147483647, maxCFSSegmentSizeMB=8.796093022207999E12, noCFSRatio=0.5973551200078442]
   [junit4]   2> 436440 INFO  (coreLoadExecutor-1566-thread-1) [    ] o.a.s.c.SolrDeletionPolicy SolrDeletionPolicy.onInit: commits: num=1
   [junit4]   2> 	commit{dir=MockDirectoryWrapper(RAMDirectory@25dfe8dd lockFactory=org.apache.lucene.store.SingleInstanceLockFactory@5baf69ab),segFN=segments_1,generation=1}
   [junit4]   2> 436440 INFO  (coreLoadExecutor-1566-thread-1) [    ] o.a.s.c.SolrDeletionPolicy newest commit generation = 1
   [junit4]   2> 436440 INFO  (coreLoadExecutor-1566-thread-1) [    ] o.a.s.s.SolrIndexSearcher Opening Searcher@24e98717[collection1] main
   [junit4]   2> 436440 INFO  (coreLoadExecutor-1566-thread-1) [    ] o.a.s.c.c.ZkStateReader Load collection config from: [/collections/collection1]
   [junit4]   2> 436441 INFO  (coreLoadExecutor-1566-thread-1) [    ] o.a.s.c.c.ZkStateReader path=[/collections/collection1] [configName]=[conf1] specified config exists in ZooKeeper
   [junit4]   2> 436441 INFO  (coreLoadExecutor-1566-thread-1) [    ] o.a.s.r.ManagedResourceStorage Setting up ZooKeeper-based storage for the RestManager with znodeBase: /configs/conf1
   [junit4]   2> 436441 INFO  (coreLoadExecutor-1566-thread-1) [    ] o.a.s.r.ManagedResourceStorage Configured ZooKeeperStorageIO with znodeBase: /configs/conf1
   [junit4]   2> 436441 INFO  (coreLoadExecutor-1566-thread-1) [    ] o.a.s.r.RestManager Initializing RestManager with initArgs: {}
   [junit4]   2> 436441 INFO  (coreLoadExecutor-1566-thread-1) [    ] o.a.s.r.ManagedResourceStorage Reading _rest_managed.json using ZooKeeperStorageIO:path=/configs/conf1
   [junit4]   2> 436441 INFO  (coreLoadExecutor-1566-thread-1) [    ] o.a.s.r.ManagedResourceStorage No data found for znode /configs/conf1/_rest_managed.json
   [junit4]   2> 436441 INFO  (coreLoadExecutor-1566-thread-1) [    ] o.a.s.r.ManagedResourceStorage Loaded null at path _rest_managed.json using ZooKeeperStorageIO:path=/configs/conf1
   [junit4]   2> 436441 INFO  (coreLoadExecutor-1566-thread-1) [    ] o.a.s.r.RestManager Initializing 0 registered ManagedResources
   [junit4]   2> 436441 INFO  (coreLoadExecutor-1566-thread-1) [    ] o.a.s.h.ReplicationHandler Commits will be reserved for  10000
   [junit4]   2> 436441 INFO  (searcherExecutor-1567-thread-1) [    ] o.a.s.c.SolrCore [collection1] Registered new searcher Searcher@24e98717[collection1] main{ExitableDirectoryReader(UninvertingDirectoryReader())}
   [junit4]   2> 436441 INFO  (coreLoadExecutor-1566-thread-1) [    ] o.a.s.u.UpdateLog Looking up max value of version field to seed version buckets
   [junit4]   2> 436441 INFO  (coreLoadExecutor-1566-thread-1) [    ] o.a.s.u.VersionInfo Refreshing highest value of _version_ for 65536 version buckets from index
   [junit4]   2> 436442 INFO  (coreLoadExecutor-1566-thread-1) [    ] o.a.s.u.VersionInfo No terms found for _version_, cannot seed version bucket highest value from index
   [junit4]   2> 436442 INFO  (coreLoadExecutor-1566-thread-1) [    ] o.a.s.u.UpdateLog Could not find max version in index or recent updates, using new clock 1523082857690431488
   [junit4]   2> 436443 INFO  (coreLoadExecutor-1566-thread-1) [    ] o.a.s.u.UpdateLog Took 1.0ms to seed version buckets with highest version 1523082857690431488
   [junit4]   2> 436443 INFO  (coreLoadExecutor-1566-thread-1) [    ] o.a.s.c.ZkController watch zkdir /configs/conf1
   [junit4]   2> 436444 INFO  (coreLoadExecutor-1566-thread-1) [    ] o.a.s.c.CoreContainer registering core: collection1
   [junit4]   2> 436444 INFO  (coreZkRegister-1561-thread-1) [    ] o.a.s.c.ZkController Register replica - core:collection1 address:http://127.0.0.1:48822/pxqux collection:collection1 shard:shard2
   [junit4]   2> 436444 INFO  (coreZkRegister-1561-thread-1) [    ] o.a.s.c.c.SolrZkClient makePath: /collections/collection1/leader_elect/shard2/election
   [junit4]   2> 436445 INFO  (coreZkRegister-1561-thread-1) [    ] o.a.s.c.LeaderElector Joined leadership election with path: /collections/collection1/leader_elect/shard2/election/95192678345080840-core_node1-n_0000000000
   [junit4]   2> 436446 INFO  (coreZkRegister-1561-thread-1) [    ] o.a.s.c.ShardLeaderElectionContext Running the leader process for shard=shard2 and weAreReplacement=false and leaderVoteWait=10000
   [junit4]   2> 436446 INFO  (coreZkRegister-1561-thread-1) [    ] o.a.s.c.ShardLeaderElectionContext Enough replicas found to continue.
   [junit4]   2> 436446 INFO  (coreZkRegister-1561-thread-1) [    ] o.a.s.c.ShardLeaderElectionContext I may be the new leader - try and sync
   [junit4]   2> 436446 INFO  (coreZkRegister-1561-thread-1) [    ] o.a.s.c.SyncStrategy Sync replicas to http://127.0.0.1:48822/pxqux/collection1/
   [junit4]   2> 436446 INFO  (coreZkRegister-1561-thread-1) [    ] o.a.s.c.SyncStrategy Sync Success - now sync replicas to me
   [junit4]   2> 436446 INFO  (coreZkRegister-1561-thread-1) [    ] o.a.s.c.SyncStrategy http://127.0.0.1:48822/pxqux/collection1/ has no replicas
   [junit4]   2> 436446 INFO  (OverseerStateUpdate-95192678345080836-127.0.0.1:47416_pxqux-n_0000000000) [    ] o.a.s.c.Overseer processMessage: queueSize: 1, message = {
   [junit4]   2>   "operation":"leader",
   [junit4]   2>   "shard":"shard2",
   [junit4]   2>   "collection":"collection1"} current state version: 4
   [junit4]   2> 436447 INFO  (coreZkRegister-1561-thread-1) [    ] o.a.s.c.c.SolrZkClient makePath: /collections/collection1/leaders/shard2
   [junit4]   2> 436448 INFO  (coreZkRegister-1561-thread-1) [    ] o.a.s.c.ShardLeaderElectionContextBase Creating leader registration node
   [junit4]   2> 436449 INFO  (coreZkRegister-1561-thread-1) [    ] o.a.s.c.ShardLeaderElectionContext I am the new leader: http://127.0.0.1:48822/pxqux/collection1/ shard2
   [junit4]   2> 436449 INFO  (OverseerStateUpdate-95192678345080836-127.0.0.1:47416_pxqux-n_0000000000) [    ] o.a.s.c.Overseer processMessage: queueSize: 1, message = {
   [junit4]   2>   "operation":"leader",
   [junit4]   2>   "shard":"shard2",
   [junit4]   2>   "collection":"collection1",
   [junit4]   2>   "base_url":"http://127.0.0.1:48822/pxqux",
   [junit4]   2>   "core":"collection1",
   [junit4]   2>   "state":"active"} current state version: 4
   [junit4]   2> 436551 INFO  (zkCallback-1200-thread-1) [    ] o.a.s.c.c.ZkStateReader A cluster state change: [WatchedEvent state:SyncConnected type:NodeDataChanged path:/clusterstate.json], has occurred - updating... (live nodes size: [2])
   [junit4]   2> 436551 INFO  (zkCallback-1206-thread-1) [    ] o.a.s.c.c.ZkStateReader A cluster state change: [WatchedEvent state:SyncConnected type:NodeDataChanged path:/clusterstate.json], has occurred - updating... (live nodes size: [2])
   [junit4]   2> 436551 INFO  (zkCallback-1202-thread-1) [    ] o.a.s.c.c.ZkStateReader A cluster state change: [WatchedEvent state:SyncConnected type:NodeDataChanged path:/clusterstate.json], has occurred - updating... (live nodes size: [2])
   [junit4]   2> 436600 INFO  (coreZkRegister-1561-thread-1) [    ] o.a.s.c.ZkController We are http://127.0.0.1:48822/pxqux/collection1/ and leader is http://127.0.0.1:48822/pxqux/collection1/
   [junit4]   2> 436600 INFO  (coreZkRegister-1561-thread-1) [    ] o.a.s.c.ZkController No LogReplay needed for core=collection1 baseURL=http://127.0.0.1:48822/pxqux
   [junit4]   2> 436600 INFO  (coreZkRegister-1561-thread-1) [    ] o.a.s.c.ZkController I am the leader, no recovery necessary
   [junit4]   2> 436600 INFO  (coreZkRegister-1561-thread-1) [    ] o.a.s.c.ZkController publishing state=active
   [junit4]   2> 436600 INFO  (coreZkRegister-1561-thread-1) [    ] o.a.s.c.ZkController numShards not found on descriptor - reading it from system property
   [junit4]   2> 436601 INFO  (OverseerStateUpdate-95192678345080836-127.0.0.1:47416_pxqux-n_0000000000) [    ] o.a.s.c.Overseer processMessage: queueSize: 1, message = {
   [junit4]   2>   "core":"collection1",
   [junit4]   2>   "core_node_name":"core_node1",
   [junit4]   2>   "roles":null,
   [junit4]   2>   "base_url":"http://127.0.0.1:48822/pxqux",
   [junit4]   2>   "node_name":"127.0.0.1:48822_pxqux",
   [junit4]   2>   "numShards":"2",
   [junit4]   2>   "state":"active",
   [junit4]   2>   "shard":"shard2",
   [junit4]   2>   "collection":"collection1",
   [junit4]   2>   "operation":"state"} current state version: 5
   [junit4]   2> 436601 INFO  (OverseerStateUpdate-95192678345080836-127.0.0.1:47416_pxqux-n_0000000000) [    ] o.a.s.c.o.ReplicaMutator Update state numShards=2 message={
   [junit4]   2>   "core":"collection1",
   [junit4]   2>   "core_node_name":"core_node1",
   [junit4]   2>   "roles":null,
   [junit4]   2>   "base_url":"http://127.0.0.1:48822/pxqux",
   [junit4]   2>   "node_name":"127.0.0.1:48822_pxqux",
   [junit4]   2>   "numShards":"2",
   [junit4]   2>   "state":"active",
   [junit4]   2>   "shard":"shard2",
   [junit4]   2>   "collection":"collection1",
   [junit4]   2>   "operation":"state"}
   [junit4]   2> 436702 INFO  (zkCallback-1206-thread-1) [    ] o.a.s.c.c.ZkStateReader A cluster state change: [WatchedEvent state:SyncConnected type:NodeDataChanged path:/clusterstate.json], has occurred - updating... (live nodes size: [2])
   [junit4]   2> 436702 INFO  (zkCallback-1202-thread-1) [    ] o.a.s.c.c.ZkStateReader A cluster state change: [WatchedEvent state:SyncConnected type:NodeDataChanged path:/clusterstate.json], has occurred - updating... (live nodes size: [2])
   [junit4]   2> 436702 INFO  (zkCallback-1200-thread-1) [    ] o.a.s.c.c.ZkStateReader A cluster state change: [WatchedEvent state:SyncConnected type:NodeDataChanged path:/clusterstate.json], has occurred - updating... (live nodes size: [2])
   [junit4]   2> 436806 INFO  (autoExpireDocs-1560-thread-1) [    ] o.a.s.u.p.DocExpirationUpdateProcessorFactory Begining periodic deletion of expired docs
   [junit4]   2> 436810 INFO  (autoExpireDocs-1560-thread-1) [    ] o.a.s.u.DirectUpdateHandler2 start commit{,optimize=false,openSearcher=true,waitSearcher=true,expungeDeletes=false,softCommit=true,prepareCommit=false}
   [junit4]   2> 436810 INFO  (autoExpireDocs-1560-thread-1) [    ] o.a.s.c.SolrCore SolrIndexSearcher has not changed - not re-opening: org.apache.solr.search.SolrIndexSearcher
   [junit4]   2> 436810 INFO  (autoExpireDocs-1560-thread-1) [    ] o.a.s.u.DirectUpdateHandler2 end_commit_flush
   [junit4]   2> 436810 INFO  (autoExpireDocs-1560-thread-1) [    ] o.a.s.u.p.LogUpdateProcessorFactory [collection1] {deleteByQuery={!cache=false}eXpField_tdt:[* TO 2016-01-11T15:10:03.502Z] (-1523082858074210304),commit=} 0 4
   [junit4]   2> 436810 INFO  (autoExpireDocs-1560-thread-1) [    ] o.a.s.u.p.DocExpirationUpdateProcessorFactory Finished periodic deletion of expired docs
   [junit4]   2> 436901 INFO  (TEST-DistribDocExpirationUpdateProcessorTest.test-seed#[B691F4F2AC0AA467]) [    ] o.a.s.SolrTestCaseJ4 Writing core.properties file to /home/jenkins/workspace/Lucene-Solr-5.x-Linux/solr/build/solr-core/test/J2/temp/solr.cloud.DistribDocExpirationUpdateProcessorTest_B691F4F2AC0AA467-001/shard-2-001/cores/collection1
   [junit4]   2> 436901 INFO  (TEST-DistribDocExpirationUpdateProcessorTest.test-seed#[B691F4F2AC0AA467]) [    ] o.a.s.c.AbstractFullDistribZkTestBase create jetty 2 in directory /home/jenkins/workspace/Lucene-Solr-5.x-Linux/solr/build/solr-core/test/J2/temp/solr.cloud.DistribDocExpirationUpdateProcessorTest_B691F4F2AC0AA467-001/shard-2-001
   [junit4]   2> 436902 INFO  (TEST-DistribDocExpirationUpdatePr

[...truncated too long message...]

r on request.
   [junit4]   2> 508535 INFO  (zkCallback-1219-thread-1) [    ] o.a.s.c.CachingDirectoryFactory Closing MockDirectoryFactory - 2 directories currently being tracked
   [junit4]   2> 508535 INFO  (zkCallback-1219-thread-1) [    ] o.a.s.c.CachingDirectoryFactory looking to close /home/jenkins/workspace/Lucene-Solr-5.x-Linux/solr/build/solr-core/test/J2/temp/solr.cloud.DistribDocExpirationUpdateProcessorTest_B691F4F2AC0AA467-001/shard-4-001/cores/collection1/data [CachedDir<<refCount=0;path=/home/jenkins/workspace/Lucene-Solr-5.x-Linux/solr/build/solr-core/test/J2/temp/solr.cloud.DistribDocExpirationUpdateProcessorTest_B691F4F2AC0AA467-001/shard-4-001/cores/collection1/data;done=false>>]
   [junit4]   2> 508535 INFO  (zkCallback-1219-thread-1) [    ] o.a.s.c.CachingDirectoryFactory Closing directory: /home/jenkins/workspace/Lucene-Solr-5.x-Linux/solr/build/solr-core/test/J2/temp/solr.cloud.DistribDocExpirationUpdateProcessorTest_B691F4F2AC0AA467-001/shard-4-001/cores/collection1/data
   [junit4]   2> 508535 INFO  (zkCallback-1219-thread-1) [    ] o.a.s.c.CachingDirectoryFactory looking to close /home/jenkins/workspace/Lucene-Solr-5.x-Linux/solr/build/solr-core/test/J2/temp/solr.cloud.DistribDocExpirationUpdateProcessorTest_B691F4F2AC0AA467-001/shard-4-001/cores/collection1/data/index [CachedDir<<refCount=0;path=/home/jenkins/workspace/Lucene-Solr-5.x-Linux/solr/build/solr-core/test/J2/temp/solr.cloud.DistribDocExpirationUpdateProcessorTest_B691F4F2AC0AA467-001/shard-4-001/cores/collection1/data/index;done=false>>]
   [junit4]   2> 508535 INFO  (zkCallback-1219-thread-1) [    ] o.a.s.c.CachingDirectoryFactory Closing directory: /home/jenkins/workspace/Lucene-Solr-5.x-Linux/solr/build/solr-core/test/J2/temp/solr.cloud.DistribDocExpirationUpdateProcessorTest_B691F4F2AC0AA467-001/shard-4-001/cores/collection1/data/index
   [junit4]   2> 508535 WARN  (zkCallback-1219-thread-1) [    ] o.a.s.c.LeaderElector 
   [junit4]   2> org.apache.solr.common.SolrException: SolrCore not found:collection1 in []
   [junit4]   2> 	at org.apache.solr.cloud.ShardLeaderElectionContext.runLeaderProcess(ElectionContext.java:287)
   [junit4]   2> 	at org.apache.solr.cloud.LeaderElector.runIamLeaderProcess(LeaderElector.java:198)
   [junit4]   2> 	at org.apache.solr.cloud.LeaderElector.checkIfIamLeader(LeaderElector.java:158)
   [junit4]   2> 	at org.apache.solr.cloud.LeaderElector.joinElection(LeaderElector.java:347)
   [junit4]   2> 	at org.apache.solr.cloud.LeaderElector.joinElection(LeaderElector.java:256)
   [junit4]   2> 	at org.apache.solr.cloud.ShardLeaderElectionContext.rejoinLeaderElection(ElectionContext.java:658)
   [junit4]   2> 	at org.apache.solr.cloud.ShardLeaderElectionContext.runLeaderProcess(ElectionContext.java:330)
   [junit4]   2> 	at org.apache.solr.cloud.LeaderElector.runIamLeaderProcess(LeaderElector.java:198)
   [junit4]   2> 	at org.apache.solr.cloud.LeaderElector.checkIfIamLeader(LeaderElector.java:158)
   [junit4]   2> 	at org.apache.solr.cloud.LeaderElector.access$200(LeaderElector.java:59)
   [junit4]   2> 	at org.apache.solr.cloud.LeaderElector$ElectionWatcher.process(LeaderElector.java:389)
   [junit4]   2> 	at org.apache.solr.common.cloud.SolrZkClient$3$1.run(SolrZkClient.java:264)
   [junit4]   2> 	at java.util.concurrent.Executors$RunnableAdapter.call(Executors.java:514)
   [junit4]   2> 	at java.util.concurrent.FutureTask.run(FutureTask.java:266)
   [junit4]   2> 	at org.apache.solr.common.util.ExecutorUtil$MDCAwareThreadPoolExecutor$1.run(ExecutorUtil.java:232)
   [junit4]   2> 	at java.util.concurrent.ThreadPoolExecutor.runWorker(ThreadPoolExecutor.java:1158)
   [junit4]   2> 	at java.util.concurrent.ThreadPoolExecutor$Worker.run(ThreadPoolExecutor.java:632)
   [junit4]   2> 	at java.lang.Thread.run(Thread.java:747)
   [junit4]   2> 508536 INFO  (TEST-DistribDocExpirationUpdateProcessorTest.test-seed#[B691F4F2AC0AA467]) [    ] o.e.j.s.ServerConnector Stopped ServerConnector@7b7918db{HTTP/1.1}{127.0.0.1:0}
   [junit4]   2> 508536 INFO  (TEST-DistribDocExpirationUpdateProcessorTest.test-seed#[B691F4F2AC0AA467]) [    ] o.e.j.s.h.ContextHandler Stopped o.e.j.s.ServletContextHandler@76843caa{/pxqux,null,UNAVAILABLE}
   [junit4]   2> 508537 INFO  (TEST-DistribDocExpirationUpdateProcessorTest.test-seed#[B691F4F2AC0AA467]) [    ] o.a.s.c.ZkTestServer connecting to 127.0.0.1:57899 57899
   [junit4]   2> 508679 INFO  (Thread-1114) [    ] o.a.s.c.ZkTestServer connecting to 127.0.0.1:57899 57899
   [junit4]   2> 508680 WARN  (Thread-1114) [    ] o.a.s.c.ZkTestServer Watch limit violations: 
   [junit4]   2> Maximum concurrent create/delete watches above limit:
   [junit4]   2> 
   [junit4]   2> 	6	/solr/aliases.json
   [junit4]   2> 	5	/solr/security.json
   [junit4]   2> 	5	/solr/configs/conf1
   [junit4]   2> 
   [junit4]   2> Maximum concurrent data watches above limit:
   [junit4]   2> 
   [junit4]   2> 	6	/solr/clusterstate.json
   [junit4]   2> 
   [junit4]   2> Maximum concurrent children watches above limit:
   [junit4]   2> 
   [junit4]   2> 	6	/solr/live_nodes
   [junit4]   2> 	6	/solr/collections
   [junit4]   2> 	5	/solr/overseer/queue
   [junit4]   2> 	5	/solr/overseer/collection-queue-work
   [junit4]   2> 	3	/solr/overseer/queue-work
   [junit4]   2> 
   [junit4]   2> NOTE: reproduce with: ant test  -Dtestcase=DistribDocExpirationUpdateProcessorTest -Dtests.method=test -Dtests.seed=B691F4F2AC0AA467 -Dtests.multiplier=3 -Dtests.slow=true -Dtests.locale=bem_ZM -Dtests.timezone=Asia/Bahrain -Dtests.asserts=true -Dtests.file.encoding=UTF-8
   [junit4] FAILURE 76.2s J2 | DistribDocExpirationUpdateProcessorTest.test <<<
   [junit4]    > Throwable #1: java.lang.AssertionError: There are still nodes recoverying - waited for 30 seconds
   [junit4]    > 	at __randomizedtesting.SeedInfo.seed([B691F4F2AC0AA467:3EC5CB2802F6C99F]:0)
   [junit4]    > 	at org.apache.solr.cloud.AbstractDistribZkTestBase.waitForRecoveriesToFinish(AbstractDistribZkTestBase.java:175)
   [junit4]    > 	at org.apache.solr.cloud.AbstractFullDistribZkTestBase.waitForRecoveriesToFinish(AbstractFullDistribZkTestBase.java:837)
   [junit4]    > 	at org.apache.solr.cloud.AbstractFullDistribZkTestBase.waitForThingsToLevelOut(AbstractFullDistribZkTestBase.java:1393)
   [junit4]    > 	at org.apache.solr.cloud.DistribDocExpirationUpdateProcessorTest.test(DistribDocExpirationUpdateProcessorTest.java:73)
   [junit4]    > 	at org.apache.solr.BaseDistributedSearchTestCase$ShardsRepeatRule$ShardsFixedStatement.callStatement(BaseDistributedSearchTestCase.java:965)
   [junit4]    > 	at org.apache.solr.BaseDistributedSearchTestCase$ShardsRepeatRule$ShardsStatement.evaluate(BaseDistributedSearchTestCase.java:940)
   [junit4]    > 	at java.lang.Thread.run(Thread.java:747)
   [junit4]   2> 508682 INFO  (SUITE-DistribDocExpirationUpdateProcessorTest-seed#[B691F4F2AC0AA467]-worker) [    ] o.a.s.SolrTestCaseJ4 ###deleteCore
   [junit4]   2> NOTE: leaving temporary files on disk at: /home/jenkins/workspace/Lucene-Solr-5.x-Linux/solr/build/solr-core/test/J2/temp/solr.cloud.DistribDocExpirationUpdateProcessorTest_B691F4F2AC0AA467-001
   [junit4]   2> Jan 11, 2016 3:11:15 PM com.carrotsearch.randomizedtesting.ThreadLeakControl checkThreadLeaks
   [junit4]   2> WARNING: Will linger awaiting termination of 1 leaked thread(s).
   [junit4]   2> NOTE: test params are: codec=Lucene54, sim=RandomSimilarityProvider(queryNorm=true,coord=crazy): {}, locale=bem_ZM, timezone=Asia/Bahrain
   [junit4]   2> NOTE: Linux 3.19.0-42-generic amd64/Oracle Corporation 9-ea (64-bit)/cpus=12,threads=1,free=288127136,total=536870912
   [junit4]   2> NOTE: All tests run in this JVM: [TestRecovery, TestShardHandlerFactory, TestExtendedDismaxParser, TestReRankQParserPlugin, TestCollationField, DistributedFacetPivotWhiteBoxTest, TestIndexingPerformance, ScriptEngineTest, TestRandomForceMergePolicy, TestFuzzyAnalyzedSuggestions, TestManagedSchemaFieldResource, TestCSVResponseWriter, SuggesterWFSTTest, TestCharFilters, TestSearcherReuse, TestCoreDiscovery, RemoteQueryErrorTest, DirectUpdateHandlerTest, UnloadDistributedZkTest, OverseerTest, SolrTestCaseJ4Test, DeleteReplicaTest, TestSolr4Spatial2, DistributedFacetPivotLongTailTest, TestMaxScoreQueryParser, DocValuesMultiTest, StatsComponentTest, TestFieldTypeCollectionResource, TestConfigSetImmutable, TestConfigReload, SortSpecParsingTest, SampleTest, TestSearchPerf, TestCloudManagedSchemaConcurrent, TestElisionMultitermQuery, ConcurrentDeleteAndCreateCollectionTest, TestTestInjection, TestSolrIndexConfig, TestRestoreCore, TestCopyFieldCollectionResource, InfoHandlerTest, BlockCacheTest, DistribDocExpirationUpdateProcessorTest]
   [junit4] Completed [167/563 (1!)] on J2 in 76.99s, 1 test, 1 failure <<< FAILURES!

[...truncated 1290 lines...]
BUILD FAILED
/home/jenkins/workspace/Lucene-Solr-5.x-Linux/build.xml:794: The following error occurred while executing this line:
/home/jenkins/workspace/Lucene-Solr-5.x-Linux/build.xml:738: The following error occurred while executing this line:
/home/jenkins/workspace/Lucene-Solr-5.x-Linux/build.xml:59: The following error occurred while executing this line:
/home/jenkins/workspace/Lucene-Solr-5.x-Linux/solr/build.xml:233: The following error occurred while executing this line:
/home/jenkins/workspace/Lucene-Solr-5.x-Linux/solr/common-build.xml:526: The following error occurred while executing this line:
/home/jenkins/workspace/Lucene-Solr-5.x-Linux/lucene/common-build.xml:1444: The following error occurred while executing this line:
/home/jenkins/workspace/Lucene-Solr-5.x-Linux/lucene/common-build.xml:1000: There were test failures: 563 suites (7 ignored), 2236 tests, 1 failure, 84 ignored (39 assumptions) [seed: B691F4F2AC0AA467]

Total time: 77 minutes 2 seconds
Build step 'Invoke Ant' marked build as failure
Archiving artifacts
[WARNINGS] Skipping publisher since build result is FAILURE
Recording test results
Email was triggered for: Failure - Any
Sending email for trigger: Failure - Any



Mime
View raw message