lucene-dev mailing list archives

Site index · List index
Message view « Date » · « Thread »
Top « Date » · « Thread »
From Policeman Jenkins Server <jenk...@thetaphi.de>
Subject [JENKINS] Lucene-Solr-trunk-MacOSX (64bit/jdk1.8.0) - Build # 2996 - Still Failing!
Date Wed, 06 Jan 2016 08:00:35 GMT
Build: http://jenkins.thetaphi.de/job/Lucene-Solr-trunk-MacOSX/2996/
Java: 64bit/jdk1.8.0 -XX:-UseCompressedOops -XX:+UseG1GC

2 tests failed.
FAILED:  org.apache.solr.cloud.CollectionsAPIDistributedZkTest.test

Error Message:
Error from server at https://127.0.0.1:61876/awholynewcollection_0: Expected mime type application/octet-stream but got text/html. <html> <head> <meta http-equiv="Content-Type" content="text/html;charset=ISO-8859-1"/> <title>Error 500 </title> </head> <body> <h2>HTTP ERROR: 500</h2> <p>Problem accessing /awholynewcollection_0/select. Reason: <pre>    {msg=Error trying to proxy request for url: https://127.0.0.1:61857/awholynewcollection_0/select,trace=org.apache.solr.common.SolrException: Error trying to proxy request for url: https://127.0.0.1:61857/awholynewcollection_0/select  at org.apache.solr.servlet.HttpSolrCall.remoteQuery(HttpSolrCall.java:591)  at org.apache.solr.servlet.HttpSolrCall.call(HttpSolrCall.java:441)  at org.apache.solr.servlet.SolrDispatchFilter.doFilter(SolrDispatchFilter.java:226)  at org.apache.solr.servlet.SolrDispatchFilter.doFilter(SolrDispatchFilter.java:184)  at org.eclipse.jetty.servlet.ServletHandler$CachedChain.doFilter(ServletHandler.java:1668)  at org.apache.solr.client.solrj.embedded.JettySolrRunner$DebugFilter.doFilter(JettySolrRunner.java:111)  at org.eclipse.jetty.servlet.ServletHandler$CachedChain.doFilter(ServletHandler.java:1668)  at org.eclipse.jetty.servlets.GzipFilter.doFilter(GzipFilter.java:45)  at org.eclipse.jetty.servlet.ServletHandler$CachedChain.doFilter(ServletHandler.java:1668)  at org.eclipse.jetty.servlet.ServletHandler.doHandle(ServletHandler.java:581)  at org.eclipse.jetty.server.session.SessionHandler.doHandle(SessionHandler.java:224)  at org.eclipse.jetty.server.handler.ContextHandler.doHandle(ContextHandler.java:1158)  at org.eclipse.jetty.servlet.ServletHandler.doScope(ServletHandler.java:511)  at org.eclipse.jetty.server.session.SessionHandler.doScope(SessionHandler.java:185)  at org.eclipse.jetty.server.handler.ContextHandler.doScope(ContextHandler.java:1090)  at org.eclipse.jetty.server.handler.ScopedHandler.handle(ScopedHandler.java:141)  at org.eclipse.jetty.server.handler.gzip.GzipHandler.handle(GzipHandler.java:437)  at org.eclipse.jetty.server.handler.HandlerWrapper.handle(HandlerWrapper.java:119)  at org.eclipse.jetty.server.Server.handle(Server.java:517)  at org.eclipse.jetty.server.HttpChannel.handle(HttpChannel.java:308)  at org.eclipse.jetty.server.HttpConnection.onFillable(HttpConnection.java:242)  at org.eclipse.jetty.io.AbstractConnection$ReadCallback.succeeded(AbstractConnection.java:261)  at org.eclipse.jetty.io.FillInterest.fillable(FillInterest.java:95)  at org.eclipse.jetty.io.ssl.SslConnection.onFillable(SslConnection.java:192)  at org.eclipse.jetty.io.AbstractConnection$ReadCallback.succeeded(AbstractConnection.java:261)  at org.eclipse.jetty.io.FillInterest.fillable(FillInterest.java:95)  at org.eclipse.jetty.io.SelectChannelEndPoint$2.run(SelectChannelEndPoint.java:75)  at org.eclipse.jetty.util.thread.strategy.ExecuteProduceConsume.produceAndRun(ExecuteProduceConsume.java:213)  at org.eclipse.jetty.util.thread.strategy.ExecuteProduceConsume.run(ExecuteProduceConsume.java:147)  at org.eclipse.jetty.util.thread.QueuedThreadPool.runJob(QueuedThreadPool.java:654)  at org.eclipse.jetty.util.thread.QueuedThreadPool$3.run(QueuedThreadPool.java:572)  at java.lang.Thread.run(Thread.java:745) Caused by: org.apache.http.conn.ConnectionPoolTimeoutException: Timeout waiting for connection from pool  at org.apache.http.impl.conn.PoolingClientConnectionManager.leaseConnection(PoolingClientConnectionManager.java:226)  at org.apache.http.impl.conn.PoolingClientConnectionManager$1.getConnection(PoolingClientConnectionManager.java:195)  at org.apache.http.impl.client.DefaultRequestDirector.execute(DefaultRequestDirector.java:423)  at org.apache.http.impl.client.AbstractHttpClient.doExecute(AbstractHttpClient.java:882)  at org.apache.http.impl.client.CloseableHttpClient.execute(CloseableHttpClient.java:82)  at org.apache.http.impl.client.CloseableHttpClient.execute(CloseableHttpClient.java:107)  at org.apache.http.impl.client.CloseableHttpClient.execute(CloseableHttpClient.java:55)  at org.apache.solr.servlet.HttpSolrCall.remoteQuery(HttpSolrCall.java:558)  ... 31 more ,code=500}</pre></p> <hr /><a href="http://eclipse.org/jetty">Powered by Jetty:// 9.3.6.v20151106</a><hr/> </body> </html> 

Stack Trace:
org.apache.solr.client.solrj.impl.HttpSolrClient$RemoteSolrException: Error from server at https://127.0.0.1:61876/awholynewcollection_0: Expected mime type application/octet-stream but got text/html. <html>
<head>
<meta http-equiv="Content-Type" content="text/html;charset=ISO-8859-1"/>
<title>Error 500 </title>
</head>
<body>
<h2>HTTP ERROR: 500</h2>
<p>Problem accessing /awholynewcollection_0/select. Reason:
<pre>    {msg=Error trying to proxy request for url: https://127.0.0.1:61857/awholynewcollection_0/select,trace=org.apache.solr.common.SolrException: Error trying to proxy request for url: https://127.0.0.1:61857/awholynewcollection_0/select
	at org.apache.solr.servlet.HttpSolrCall.remoteQuery(HttpSolrCall.java:591)
	at org.apache.solr.servlet.HttpSolrCall.call(HttpSolrCall.java:441)
	at org.apache.solr.servlet.SolrDispatchFilter.doFilter(SolrDispatchFilter.java:226)
	at org.apache.solr.servlet.SolrDispatchFilter.doFilter(SolrDispatchFilter.java:184)
	at org.eclipse.jetty.servlet.ServletHandler$CachedChain.doFilter(ServletHandler.java:1668)
	at org.apache.solr.client.solrj.embedded.JettySolrRunner$DebugFilter.doFilter(JettySolrRunner.java:111)
	at org.eclipse.jetty.servlet.ServletHandler$CachedChain.doFilter(ServletHandler.java:1668)
	at org.eclipse.jetty.servlets.GzipFilter.doFilter(GzipFilter.java:45)
	at org.eclipse.jetty.servlet.ServletHandler$CachedChain.doFilter(ServletHandler.java:1668)
	at org.eclipse.jetty.servlet.ServletHandler.doHandle(ServletHandler.java:581)
	at org.eclipse.jetty.server.session.SessionHandler.doHandle(SessionHandler.java:224)
	at org.eclipse.jetty.server.handler.ContextHandler.doHandle(ContextHandler.java:1158)
	at org.eclipse.jetty.servlet.ServletHandler.doScope(ServletHandler.java:511)
	at org.eclipse.jetty.server.session.SessionHandler.doScope(SessionHandler.java:185)
	at org.eclipse.jetty.server.handler.ContextHandler.doScope(ContextHandler.java:1090)
	at org.eclipse.jetty.server.handler.ScopedHandler.handle(ScopedHandler.java:141)
	at org.eclipse.jetty.server.handler.gzip.GzipHandler.handle(GzipHandler.java:437)
	at org.eclipse.jetty.server.handler.HandlerWrapper.handle(HandlerWrapper.java:119)
	at org.eclipse.jetty.server.Server.handle(Server.java:517)
	at org.eclipse.jetty.server.HttpChannel.handle(HttpChannel.java:308)
	at org.eclipse.jetty.server.HttpConnection.onFillable(HttpConnection.java:242)
	at org.eclipse.jetty.io.AbstractConnection$ReadCallback.succeeded(AbstractConnection.java:261)
	at org.eclipse.jetty.io.FillInterest.fillable(FillInterest.java:95)
	at org.eclipse.jetty.io.ssl.SslConnection.onFillable(SslConnection.java:192)
	at org.eclipse.jetty.io.AbstractConnection$ReadCallback.succeeded(AbstractConnection.java:261)
	at org.eclipse.jetty.io.FillInterest.fillable(FillInterest.java:95)
	at org.eclipse.jetty.io.SelectChannelEndPoint$2.run(SelectChannelEndPoint.java:75)
	at org.eclipse.jetty.util.thread.strategy.ExecuteProduceConsume.produceAndRun(ExecuteProduceConsume.java:213)
	at org.eclipse.jetty.util.thread.strategy.ExecuteProduceConsume.run(ExecuteProduceConsume.java:147)
	at org.eclipse.jetty.util.thread.QueuedThreadPool.runJob(QueuedThreadPool.java:654)
	at org.eclipse.jetty.util.thread.QueuedThreadPool$3.run(QueuedThreadPool.java:572)
	at java.lang.Thread.run(Thread.java:745)
Caused by: org.apache.http.conn.ConnectionPoolTimeoutException: Timeout waiting for connection from pool
	at org.apache.http.impl.conn.PoolingClientConnectionManager.leaseConnection(PoolingClientConnectionManager.java:226)
	at org.apache.http.impl.conn.PoolingClientConnectionManager$1.getConnection(PoolingClientConnectionManager.java:195)
	at org.apache.http.impl.client.DefaultRequestDirector.execute(DefaultRequestDirector.java:423)
	at org.apache.http.impl.client.AbstractHttpClient.doExecute(AbstractHttpClient.java:882)
	at org.apache.http.impl.client.CloseableHttpClient.execute(CloseableHttpClient.java:82)
	at org.apache.http.impl.client.CloseableHttpClient.execute(CloseableHttpClient.java:107)
	at org.apache.http.impl.client.CloseableHttpClient.execute(CloseableHttpClient.java:55)
	at org.apache.solr.servlet.HttpSolrCall.remoteQuery(HttpSolrCall.java:558)
	... 31 more
,code=500}</pre></p>
<hr /><a href="http://eclipse.org/jetty">Powered by Jetty:// 9.3.6.v20151106</a><hr/>
</body>
</html>

	at __randomizedtesting.SeedInfo.seed([A2A827B1B8FD3003:2AFC186B16015DFB]:0)
	at org.apache.solr.client.solrj.impl.HttpSolrClient.executeMethod(HttpSolrClient.java:543)
	at org.apache.solr.client.solrj.impl.HttpSolrClient.request(HttpSolrClient.java:241)
	at org.apache.solr.client.solrj.impl.HttpSolrClient.request(HttpSolrClient.java:230)
	at org.apache.solr.client.solrj.SolrRequest.process(SolrRequest.java:150)
	at org.apache.solr.client.solrj.SolrClient.query(SolrClient.java:943)
	at org.apache.solr.client.solrj.SolrClient.query(SolrClient.java:958)
	at org.apache.solr.cloud.AbstractFullDistribZkTestBase.waitForNon403or404or503(AbstractFullDistribZkTestBase.java:1754)
	at org.apache.solr.cloud.CollectionsAPIDistributedZkTest.testCollectionsAPI(CollectionsAPIDistributedZkTest.java:658)
	at org.apache.solr.cloud.CollectionsAPIDistributedZkTest.test(CollectionsAPIDistributedZkTest.java:160)
	at sun.reflect.NativeMethodAccessorImpl.invoke0(Native Method)
	at sun.reflect.NativeMethodAccessorImpl.invoke(NativeMethodAccessorImpl.java:62)
	at sun.reflect.DelegatingMethodAccessorImpl.invoke(DelegatingMethodAccessorImpl.java:43)
	at java.lang.reflect.Method.invoke(Method.java:497)
	at com.carrotsearch.randomizedtesting.RandomizedRunner.invoke(RandomizedRunner.java:1764)
	at com.carrotsearch.randomizedtesting.RandomizedRunner$8.evaluate(RandomizedRunner.java:871)
	at com.carrotsearch.randomizedtesting.RandomizedRunner$9.evaluate(RandomizedRunner.java:907)
	at com.carrotsearch.randomizedtesting.RandomizedRunner$10.evaluate(RandomizedRunner.java:921)
	at org.apache.solr.BaseDistributedSearchTestCase$ShardsRepeatRule$ShardsFixedStatement.callStatement(BaseDistributedSearchTestCase.java:965)
	at org.apache.solr.BaseDistributedSearchTestCase$ShardsRepeatRule$ShardsStatement.evaluate(BaseDistributedSearchTestCase.java:940)
	at com.carrotsearch.randomizedtesting.rules.SystemPropertiesRestoreRule$1.evaluate(SystemPropertiesRestoreRule.java:57)
	at org.apache.lucene.util.TestRuleSetupTeardownChained$1.evaluate(TestRuleSetupTeardownChained.java:50)
	at org.apache.lucene.util.AbstractBeforeAfterRule$1.evaluate(AbstractBeforeAfterRule.java:46)
	at org.apache.lucene.util.TestRuleThreadAndTestName$1.evaluate(TestRuleThreadAndTestName.java:49)
	at org.apache.lucene.util.TestRuleIgnoreAfterMaxFailures$1.evaluate(TestRuleIgnoreAfterMaxFailures.java:65)
	at org.apache.lucene.util.TestRuleMarkFailure$1.evaluate(TestRuleMarkFailure.java:48)
	at com.carrotsearch.randomizedtesting.rules.StatementAdapter.evaluate(StatementAdapter.java:36)
	at com.carrotsearch.randomizedtesting.ThreadLeakControl$StatementRunner.run(ThreadLeakControl.java:367)
	at com.carrotsearch.randomizedtesting.ThreadLeakControl.forkTimeoutingTask(ThreadLeakControl.java:809)
	at com.carrotsearch.randomizedtesting.ThreadLeakControl$3.evaluate(ThreadLeakControl.java:460)
	at com.carrotsearch.randomizedtesting.RandomizedRunner.runSingleTest(RandomizedRunner.java:880)
	at com.carrotsearch.randomizedtesting.RandomizedRunner$5.evaluate(RandomizedRunner.java:781)
	at com.carrotsearch.randomizedtesting.RandomizedRunner$6.evaluate(RandomizedRunner.java:816)
	at com.carrotsearch.randomizedtesting.RandomizedRunner$7.evaluate(RandomizedRunner.java:827)
	at com.carrotsearch.randomizedtesting.rules.StatementAdapter.evaluate(StatementAdapter.java:36)
	at com.carrotsearch.randomizedtesting.rules.SystemPropertiesRestoreRule$1.evaluate(SystemPropertiesRestoreRule.java:57)
	at org.apache.lucene.util.AbstractBeforeAfterRule$1.evaluate(AbstractBeforeAfterRule.java:46)
	at com.carrotsearch.randomizedtesting.rules.StatementAdapter.evaluate(StatementAdapter.java:36)
	at org.apache.lucene.util.TestRuleStoreClassName$1.evaluate(TestRuleStoreClassName.java:42)
	at com.carrotsearch.randomizedtesting.rules.NoShadowingOrOverridesOnMethodsRule$1.evaluate(NoShadowingOrOverridesOnMethodsRule.java:40)
	at com.carrotsearch.randomizedtesting.rules.NoShadowingOrOverridesOnMethodsRule$1.evaluate(NoShadowingOrOverridesOnMethodsRule.java:40)
	at com.carrotsearch.randomizedtesting.rules.StatementAdapter.evaluate(StatementAdapter.java:36)
	at com.carrotsearch.randomizedtesting.rules.StatementAdapter.evaluate(StatementAdapter.java:36)
	at com.carrotsearch.randomizedtesting.rules.StatementAdapter.evaluate(StatementAdapter.java:36)
	at org.apache.lucene.util.TestRuleAssertionsRequired$1.evaluate(TestRuleAssertionsRequired.java:54)
	at org.apache.lucene.util.TestRuleMarkFailure$1.evaluate(TestRuleMarkFailure.java:48)
	at org.apache.lucene.util.TestRuleIgnoreAfterMaxFailures$1.evaluate(TestRuleIgnoreAfterMaxFailures.java:65)
	at org.apache.lucene.util.TestRuleIgnoreTestSuites$1.evaluate(TestRuleIgnoreTestSuites.java:55)
	at com.carrotsearch.randomizedtesting.rules.StatementAdapter.evaluate(StatementAdapter.java:36)
	at com.carrotsearch.randomizedtesting.ThreadLeakControl$StatementRunner.run(ThreadLeakControl.java:367)
	at java.lang.Thread.run(Thread.java:745)


FAILED:  org.apache.solr.util.TestSolrCLIRunExample.testInteractiveSolrCloudExample

Error Message:
Could not find a healthy node to handle the request.

Stack Trace:
org.apache.solr.common.SolrException: Could not find a healthy node to handle the request.
	at __randomizedtesting.SeedInfo.seed([A2A827B1B8FD3003:79D9C77B8F88F565]:0)
	at org.apache.solr.client.solrj.impl.CloudSolrClient.sendRequest(CloudSolrClient.java:1085)
	at org.apache.solr.client.solrj.impl.CloudSolrClient.requestWithRetryOnStaleState(CloudSolrClient.java:871)
	at org.apache.solr.client.solrj.impl.CloudSolrClient.requestWithRetryOnStaleState(CloudSolrClient.java:954)
	at org.apache.solr.client.solrj.impl.CloudSolrClient.requestWithRetryOnStaleState(CloudSolrClient.java:954)
	at org.apache.solr.client.solrj.impl.CloudSolrClient.requestWithRetryOnStaleState(CloudSolrClient.java:954)
	at org.apache.solr.client.solrj.impl.CloudSolrClient.requestWithRetryOnStaleState(CloudSolrClient.java:954)
	at org.apache.solr.client.solrj.impl.CloudSolrClient.requestWithRetryOnStaleState(CloudSolrClient.java:954)
	at org.apache.solr.client.solrj.impl.CloudSolrClient.request(CloudSolrClient.java:807)
	at org.apache.solr.client.solrj.SolrRequest.process(SolrRequest.java:150)
	at org.apache.solr.client.solrj.SolrClient.commit(SolrClient.java:485)
	at org.apache.solr.client.solrj.SolrClient.commit(SolrClient.java:464)
	at org.apache.solr.util.TestSolrCLIRunExample.testInteractiveSolrCloudExample(TestSolrCLIRunExample.java:447)
	at sun.reflect.NativeMethodAccessorImpl.invoke0(Native Method)
	at sun.reflect.NativeMethodAccessorImpl.invoke(NativeMethodAccessorImpl.java:62)
	at sun.reflect.DelegatingMethodAccessorImpl.invoke(DelegatingMethodAccessorImpl.java:43)
	at java.lang.reflect.Method.invoke(Method.java:497)
	at com.carrotsearch.randomizedtesting.RandomizedRunner.invoke(RandomizedRunner.java:1764)
	at com.carrotsearch.randomizedtesting.RandomizedRunner$8.evaluate(RandomizedRunner.java:871)
	at com.carrotsearch.randomizedtesting.RandomizedRunner$9.evaluate(RandomizedRunner.java:907)
	at com.carrotsearch.randomizedtesting.RandomizedRunner$10.evaluate(RandomizedRunner.java:921)
	at com.carrotsearch.randomizedtesting.rules.SystemPropertiesRestoreRule$1.evaluate(SystemPropertiesRestoreRule.java:57)
	at org.apache.lucene.util.TestRuleSetupTeardownChained$1.evaluate(TestRuleSetupTeardownChained.java:50)
	at org.apache.lucene.util.AbstractBeforeAfterRule$1.evaluate(AbstractBeforeAfterRule.java:46)
	at org.apache.lucene.util.TestRuleThreadAndTestName$1.evaluate(TestRuleThreadAndTestName.java:49)
	at org.apache.lucene.util.TestRuleIgnoreAfterMaxFailures$1.evaluate(TestRuleIgnoreAfterMaxFailures.java:65)
	at org.apache.lucene.util.TestRuleMarkFailure$1.evaluate(TestRuleMarkFailure.java:48)
	at com.carrotsearch.randomizedtesting.rules.StatementAdapter.evaluate(StatementAdapter.java:36)
	at com.carrotsearch.randomizedtesting.ThreadLeakControl$StatementRunner.run(ThreadLeakControl.java:367)
	at com.carrotsearch.randomizedtesting.ThreadLeakControl.forkTimeoutingTask(ThreadLeakControl.java:809)
	at com.carrotsearch.randomizedtesting.ThreadLeakControl$3.evaluate(ThreadLeakControl.java:460)
	at com.carrotsearch.randomizedtesting.RandomizedRunner.runSingleTest(RandomizedRunner.java:880)
	at com.carrotsearch.randomizedtesting.RandomizedRunner$5.evaluate(RandomizedRunner.java:781)
	at com.carrotsearch.randomizedtesting.RandomizedRunner$6.evaluate(RandomizedRunner.java:816)
	at com.carrotsearch.randomizedtesting.RandomizedRunner$7.evaluate(RandomizedRunner.java:827)
	at com.carrotsearch.randomizedtesting.rules.StatementAdapter.evaluate(StatementAdapter.java:36)
	at com.carrotsearch.randomizedtesting.rules.SystemPropertiesRestoreRule$1.evaluate(SystemPropertiesRestoreRule.java:57)
	at org.apache.lucene.util.AbstractBeforeAfterRule$1.evaluate(AbstractBeforeAfterRule.java:46)
	at com.carrotsearch.randomizedtesting.rules.StatementAdapter.evaluate(StatementAdapter.java:36)
	at org.apache.lucene.util.TestRuleStoreClassName$1.evaluate(TestRuleStoreClassName.java:42)
	at com.carrotsearch.randomizedtesting.rules.NoShadowingOrOverridesOnMethodsRule$1.evaluate(NoShadowingOrOverridesOnMethodsRule.java:40)
	at com.carrotsearch.randomizedtesting.rules.NoShadowingOrOverridesOnMethodsRule$1.evaluate(NoShadowingOrOverridesOnMethodsRule.java:40)
	at com.carrotsearch.randomizedtesting.rules.StatementAdapter.evaluate(StatementAdapter.java:36)
	at com.carrotsearch.randomizedtesting.rules.StatementAdapter.evaluate(StatementAdapter.java:36)
	at com.carrotsearch.randomizedtesting.rules.StatementAdapter.evaluate(StatementAdapter.java:36)
	at org.apache.lucene.util.TestRuleAssertionsRequired$1.evaluate(TestRuleAssertionsRequired.java:54)
	at org.apache.lucene.util.TestRuleMarkFailure$1.evaluate(TestRuleMarkFailure.java:48)
	at org.apache.lucene.util.TestRuleIgnoreAfterMaxFailures$1.evaluate(TestRuleIgnoreAfterMaxFailures.java:65)
	at org.apache.lucene.util.TestRuleIgnoreTestSuites$1.evaluate(TestRuleIgnoreTestSuites.java:55)
	at com.carrotsearch.randomizedtesting.rules.StatementAdapter.evaluate(StatementAdapter.java:36)
	at com.carrotsearch.randomizedtesting.ThreadLeakControl$StatementRunner.run(ThreadLeakControl.java:367)
	at java.lang.Thread.run(Thread.java:745)




Build Log:
[...truncated 9435 lines...]
   [junit4] Suite: org.apache.solr.cloud.CollectionsAPIDistributedZkTest
   [junit4]   2> Creating dataDir: /Users/jenkins/workspace/Lucene-Solr-trunk-MacOSX/solr/build/solr-core/test/J1/temp/solr.cloud.CollectionsAPIDistributedZkTest_A2A827B1B8FD3003-001/init-core-data-001
   [junit4]   2> 95138 INFO  (SUITE-CollectionsAPIDistributedZkTest-seed#[A2A827B1B8FD3003]-worker) [    ] o.a.s.SolrTestCaseJ4 Randomized ssl (true) and clientAuth (false)
   [junit4]   2> 95138 INFO  (SUITE-CollectionsAPIDistributedZkTest-seed#[A2A827B1B8FD3003]-worker) [    ] o.a.s.BaseDistributedSearchTestCase Setting hostContext system property: /
   [junit4]   2> 95140 INFO  (TEST-CollectionsAPIDistributedZkTest.test-seed#[A2A827B1B8FD3003]) [    ] o.a.s.c.ZkTestServer STARTING ZK TEST SERVER
   [junit4]   2> 95141 INFO  (Thread-250) [    ] o.a.s.c.ZkTestServer client port:0.0.0.0/0.0.0.0:0
   [junit4]   2> 95141 INFO  (Thread-250) [    ] o.a.s.c.ZkTestServer Starting server
   [junit4]   2> 95247 INFO  (TEST-CollectionsAPIDistributedZkTest.test-seed#[A2A827B1B8FD3003]) [    ] o.a.s.c.ZkTestServer start zk server on port:61806
   [junit4]   2> 95247 INFO  (TEST-CollectionsAPIDistributedZkTest.test-seed#[A2A827B1B8FD3003]) [    ] o.a.s.c.c.SolrZkClient Using default ZkCredentialsProvider
   [junit4]   2> 95249 INFO  (TEST-CollectionsAPIDistributedZkTest.test-seed#[A2A827B1B8FD3003]) [    ] o.a.s.c.c.ConnectionManager Waiting for client to connect to ZooKeeper
   [junit4]   2> 95258 INFO  (zkCallback-85-thread-1) [    ] o.a.s.c.c.ConnectionManager Watcher org.apache.solr.common.cloud.ConnectionManager@347e3208 name:ZooKeeperConnection Watcher:127.0.0.1:61806 got event WatchedEvent state:SyncConnected type:None path:null path:null type:None
   [junit4]   2> 95259 INFO  (TEST-CollectionsAPIDistributedZkTest.test-seed#[A2A827B1B8FD3003]) [    ] o.a.s.c.c.ConnectionManager Client is connected to ZooKeeper
   [junit4]   2> 95259 INFO  (TEST-CollectionsAPIDistributedZkTest.test-seed#[A2A827B1B8FD3003]) [    ] o.a.s.c.c.SolrZkClient Using default ZkACLProvider
   [junit4]   2> 95259 INFO  (TEST-CollectionsAPIDistributedZkTest.test-seed#[A2A827B1B8FD3003]) [    ] o.a.s.c.c.SolrZkClient makePath: /solr
   [junit4]   2> 95274 INFO  (TEST-CollectionsAPIDistributedZkTest.test-seed#[A2A827B1B8FD3003]) [    ] o.a.s.c.c.SolrZkClient Using default ZkCredentialsProvider
   [junit4]   2> 95283 INFO  (TEST-CollectionsAPIDistributedZkTest.test-seed#[A2A827B1B8FD3003]) [    ] o.a.s.c.c.ConnectionManager Waiting for client to connect to ZooKeeper
   [junit4]   2> 95286 INFO  (zkCallback-86-thread-1) [    ] o.a.s.c.c.ConnectionManager Watcher org.apache.solr.common.cloud.ConnectionManager@fd5606 name:ZooKeeperConnection Watcher:127.0.0.1:61806/solr got event WatchedEvent state:SyncConnected type:None path:null path:null type:None
   [junit4]   2> 95289 INFO  (TEST-CollectionsAPIDistributedZkTest.test-seed#[A2A827B1B8FD3003]) [    ] o.a.s.c.c.ConnectionManager Client is connected to ZooKeeper
   [junit4]   2> 95290 INFO  (TEST-CollectionsAPIDistributedZkTest.test-seed#[A2A827B1B8FD3003]) [    ] o.a.s.c.c.SolrZkClient Using default ZkACLProvider
   [junit4]   2> 95290 INFO  (TEST-CollectionsAPIDistributedZkTest.test-seed#[A2A827B1B8FD3003]) [    ] o.a.s.c.c.SolrZkClient makePath: /collections/collection1
   [junit4]   2> 95329 INFO  (TEST-CollectionsAPIDistributedZkTest.test-seed#[A2A827B1B8FD3003]) [    ] o.a.s.c.c.SolrZkClient makePath: /collections/collection1/shards
   [junit4]   2> 95358 INFO  (TEST-CollectionsAPIDistributedZkTest.test-seed#[A2A827B1B8FD3003]) [    ] o.a.s.c.c.SolrZkClient makePath: /collections/control_collection
   [junit4]   2> 95373 INFO  (TEST-CollectionsAPIDistributedZkTest.test-seed#[A2A827B1B8FD3003]) [    ] o.a.s.c.c.SolrZkClient makePath: /collections/control_collection/shards
   [junit4]   2> 95403 INFO  (TEST-CollectionsAPIDistributedZkTest.test-seed#[A2A827B1B8FD3003]) [    ] o.a.s.c.AbstractZkTestCase put /Users/jenkins/workspace/Lucene-Solr-trunk-MacOSX/solr/core/src/test-files/solr/collection1/conf/solrconfig-tlog.xml to /configs/conf1/solrconfig.xml
   [junit4]   2> 95403 INFO  (TEST-CollectionsAPIDistributedZkTest.test-seed#[A2A827B1B8FD3003]) [    ] o.a.s.c.c.SolrZkClient makePath: /configs/conf1/solrconfig.xml
   [junit4]   2> 95426 INFO  (TEST-CollectionsAPIDistributedZkTest.test-seed#[A2A827B1B8FD3003]) [    ] o.a.s.c.AbstractZkTestCase put /Users/jenkins/workspace/Lucene-Solr-trunk-MacOSX/solr/core/src/test-files/solr/collection1/conf/schema.xml to /configs/conf1/schema.xml
   [junit4]   2> 95426 INFO  (TEST-CollectionsAPIDistributedZkTest.test-seed#[A2A827B1B8FD3003]) [    ] o.a.s.c.c.SolrZkClient makePath: /configs/conf1/schema.xml
   [junit4]   2> 95440 INFO  (TEST-CollectionsAPIDistributedZkTest.test-seed#[A2A827B1B8FD3003]) [    ] o.a.s.c.AbstractZkTestCase put /Users/jenkins/workspace/Lucene-Solr-trunk-MacOSX/solr/core/src/test-files/solr/collection1/conf/solrconfig.snippet.randomindexconfig.xml to /configs/conf1/solrconfig.snippet.randomindexconfig.xml
   [junit4]   2> 95440 INFO  (TEST-CollectionsAPIDistributedZkTest.test-seed#[A2A827B1B8FD3003]) [    ] o.a.s.c.c.SolrZkClient makePath: /configs/conf1/solrconfig.snippet.randomindexconfig.xml
   [junit4]   2> 95469 INFO  (TEST-CollectionsAPIDistributedZkTest.test-seed#[A2A827B1B8FD3003]) [    ] o.a.s.c.AbstractZkTestCase put /Users/jenkins/workspace/Lucene-Solr-trunk-MacOSX/solr/core/src/test-files/solr/collection1/conf/stopwords.txt to /configs/conf1/stopwords.txt
   [junit4]   2> 95469 INFO  (TEST-CollectionsAPIDistributedZkTest.test-seed#[A2A827B1B8FD3003]) [    ] o.a.s.c.c.SolrZkClient makePath: /configs/conf1/stopwords.txt
   [junit4]   2> 95500 INFO  (TEST-CollectionsAPIDistributedZkTest.test-seed#[A2A827B1B8FD3003]) [    ] o.a.s.c.AbstractZkTestCase put /Users/jenkins/workspace/Lucene-Solr-trunk-MacOSX/solr/core/src/test-files/solr/collection1/conf/protwords.txt to /configs/conf1/protwords.txt
   [junit4]   2> 95501 INFO  (TEST-CollectionsAPIDistributedZkTest.test-seed#[A2A827B1B8FD3003]) [    ] o.a.s.c.c.SolrZkClient makePath: /configs/conf1/protwords.txt
   [junit4]   2> 95518 INFO  (TEST-CollectionsAPIDistributedZkTest.test-seed#[A2A827B1B8FD3003]) [    ] o.a.s.c.AbstractZkTestCase put /Users/jenkins/workspace/Lucene-Solr-trunk-MacOSX/solr/core/src/test-files/solr/collection1/conf/currency.xml to /configs/conf1/currency.xml
   [junit4]   2> 95519 INFO  (TEST-CollectionsAPIDistributedZkTest.test-seed#[A2A827B1B8FD3003]) [    ] o.a.s.c.c.SolrZkClient makePath: /configs/conf1/currency.xml
   [junit4]   2> 95529 INFO  (TEST-CollectionsAPIDistributedZkTest.test-seed#[A2A827B1B8FD3003]) [    ] o.a.s.c.AbstractZkTestCase put /Users/jenkins/workspace/Lucene-Solr-trunk-MacOSX/solr/core/src/test-files/solr/collection1/conf/enumsConfig.xml to /configs/conf1/enumsConfig.xml
   [junit4]   2> 95529 INFO  (TEST-CollectionsAPIDistributedZkTest.test-seed#[A2A827B1B8FD3003]) [    ] o.a.s.c.c.SolrZkClient makePath: /configs/conf1/enumsConfig.xml
   [junit4]   2> 95535 INFO  (TEST-CollectionsAPIDistributedZkTest.test-seed#[A2A827B1B8FD3003]) [    ] o.a.s.c.AbstractZkTestCase put /Users/jenkins/workspace/Lucene-Solr-trunk-MacOSX/solr/core/src/test-files/solr/collection1/conf/open-exchange-rates.json to /configs/conf1/open-exchange-rates.json
   [junit4]   2> 95535 INFO  (TEST-CollectionsAPIDistributedZkTest.test-seed#[A2A827B1B8FD3003]) [    ] o.a.s.c.c.SolrZkClient makePath: /configs/conf1/open-exchange-rates.json
   [junit4]   2> 95543 INFO  (TEST-CollectionsAPIDistributedZkTest.test-seed#[A2A827B1B8FD3003]) [    ] o.a.s.c.AbstractZkTestCase put /Users/jenkins/workspace/Lucene-Solr-trunk-MacOSX/solr/core/src/test-files/solr/collection1/conf/mapping-ISOLatin1Accent.txt to /configs/conf1/mapping-ISOLatin1Accent.txt
   [junit4]   2> 95543 INFO  (TEST-CollectionsAPIDistributedZkTest.test-seed#[A2A827B1B8FD3003]) [    ] o.a.s.c.c.SolrZkClient makePath: /configs/conf1/mapping-ISOLatin1Accent.txt
   [junit4]   2> 95549 INFO  (TEST-CollectionsAPIDistributedZkTest.test-seed#[A2A827B1B8FD3003]) [    ] o.a.s.c.AbstractZkTestCase put /Users/jenkins/workspace/Lucene-Solr-trunk-MacOSX/solr/core/src/test-files/solr/collection1/conf/old_synonyms.txt to /configs/conf1/old_synonyms.txt
   [junit4]   2> 95549 INFO  (TEST-CollectionsAPIDistributedZkTest.test-seed#[A2A827B1B8FD3003]) [    ] o.a.s.c.c.SolrZkClient makePath: /configs/conf1/old_synonyms.txt
   [junit4]   2> 95554 INFO  (TEST-CollectionsAPIDistributedZkTest.test-seed#[A2A827B1B8FD3003]) [    ] o.a.s.c.AbstractZkTestCase put /Users/jenkins/workspace/Lucene-Solr-trunk-MacOSX/solr/core/src/test-files/solr/collection1/conf/synonyms.txt to /configs/conf1/synonyms.txt
   [junit4]   2> 95554 INFO  (TEST-CollectionsAPIDistributedZkTest.test-seed#[A2A827B1B8FD3003]) [    ] o.a.s.c.c.SolrZkClient makePath: /configs/conf1/synonyms.txt
   [junit4]   2> 95586 INFO  (TEST-CollectionsAPIDistributedZkTest.test-seed#[A2A827B1B8FD3003]) [    ] o.a.s.c.c.SolrZkClient Using default ZkCredentialsProvider
   [junit4]   2> 95587 INFO  (TEST-CollectionsAPIDistributedZkTest.test-seed#[A2A827B1B8FD3003]) [    ] o.a.s.c.c.ConnectionManager Waiting for client to connect to ZooKeeper
   [junit4]   2> 95589 INFO  (zkCallback-87-thread-1) [    ] o.a.s.c.c.ConnectionManager Watcher org.apache.solr.common.cloud.ConnectionManager@6ab31d8d name:ZooKeeperConnection Watcher:127.0.0.1:61806/solr got event WatchedEvent state:SyncConnected type:None path:null path:null type:None
   [junit4]   2> 95590 INFO  (TEST-CollectionsAPIDistributedZkTest.test-seed#[A2A827B1B8FD3003]) [    ] o.a.s.c.c.ConnectionManager Client is connected to ZooKeeper
   [junit4]   2> 95590 INFO  (TEST-CollectionsAPIDistributedZkTest.test-seed#[A2A827B1B8FD3003]) [    ] o.a.s.c.c.SolrZkClient Using default ZkACLProvider
   [junit4]   2> 95594 WARN  (NIOServerCxn.Factory:0.0.0.0/0.0.0.0:0) [    ] o.a.z.s.NIOServerCnxn caught end of stream exception
   [junit4]   2> EndOfStreamException: Unable to read additional data from client sessionid 0x15215c890be0002, likely client has closed socket
   [junit4]   2> 	at org.apache.zookeeper.server.NIOServerCnxn.doIO(NIOServerCnxn.java:228)
   [junit4]   2> 	at org.apache.zookeeper.server.NIOServerCnxnFactory.run(NIOServerCnxnFactory.java:208)
   [junit4]   2> 	at java.lang.Thread.run(Thread.java:745)
   [junit4]   2> 95897 INFO  (TEST-CollectionsAPIDistributedZkTest.test-seed#[A2A827B1B8FD3003]) [    ] o.a.s.SolrTestCaseJ4 Writing core.properties file to /Users/jenkins/workspace/Lucene-Solr-trunk-MacOSX/solr/build/solr-core/test/J1/temp/solr.cloud.CollectionsAPIDistributedZkTest_A2A827B1B8FD3003-001/control-001/cores/collection1
   [junit4]   2> 95900 INFO  (TEST-CollectionsAPIDistributedZkTest.test-seed#[A2A827B1B8FD3003]) [    ] o.e.j.s.Server jetty-9.3.6.v20151106
   [junit4]   2> 95904 INFO  (TEST-CollectionsAPIDistributedZkTest.test-seed#[A2A827B1B8FD3003]) [    ] o.e.j.s.h.ContextHandler Started o.e.j.s.ServletContextHandler@407e816f{/,null,AVAILABLE}
   [junit4]   2> 95905 INFO  (TEST-CollectionsAPIDistributedZkTest.test-seed#[A2A827B1B8FD3003]) [    ] o.e.j.u.s.SslContextFactory x509=X509@e914697(solrtest,h=[],w=[]) for SslContextFactory@28519ba8(file:///Users/jenkins/workspace/Lucene-Solr-trunk-MacOSX/solr/server/etc/test/solrtest.keystore,file:///Users/jenkins/workspace/Lucene-Solr-trunk-MacOSX/solr/server/etc/test/solrtest.keystore)
   [junit4]   2> 95909 INFO  (TEST-CollectionsAPIDistributedZkTest.test-seed#[A2A827B1B8FD3003]) [    ] o.e.j.s.ServerConnector Started ServerConnector@5ce4ea19{SSL,[ssl, http/1.1]}{127.0.0.1:61831}
   [junit4]   2> 95909 INFO  (TEST-CollectionsAPIDistributedZkTest.test-seed#[A2A827B1B8FD3003]) [    ] o.e.j.s.Server Started @100266ms
   [junit4]   2> 95909 INFO  (TEST-CollectionsAPIDistributedZkTest.test-seed#[A2A827B1B8FD3003]) [    ] o.a.s.c.s.e.JettySolrRunner Jetty properties: {solr.data.dir=/Users/jenkins/workspace/Lucene-Solr-trunk-MacOSX/solr/build/solr-core/test/J1/temp/solr.cloud.CollectionsAPIDistributedZkTest_A2A827B1B8FD3003-001/tempDir-001/control/data, hostContext=/, hostPort=61831, coreRootDirectory=/Users/jenkins/workspace/Lucene-Solr-trunk-MacOSX/solr/build/solr-core/test/J1/temp/solr.cloud.CollectionsAPIDistributedZkTest_A2A827B1B8FD3003-001/control-001/cores}
   [junit4]   2> 95910 INFO  (TEST-CollectionsAPIDistributedZkTest.test-seed#[A2A827B1B8FD3003]) [    ] o.a.s.s.SolrDispatchFilter SolrDispatchFilter.init(): sun.misc.Launcher$AppClassLoader@74a14482
   [junit4]   2> 95910 INFO  (TEST-CollectionsAPIDistributedZkTest.test-seed#[A2A827B1B8FD3003]) [    ] o.a.s.c.SolrResourceLoader new SolrResourceLoader for directory: '/Users/jenkins/workspace/Lucene-Solr-trunk-MacOSX/solr/build/solr-core/test/J1/temp/solr.cloud.CollectionsAPIDistributedZkTest_A2A827B1B8FD3003-001/control-001'
   [junit4]   2> 95910 INFO  (TEST-CollectionsAPIDistributedZkTest.test-seed#[A2A827B1B8FD3003]) [    ] o.a.s.c.SolrResourceLoader JNDI not configured for solr (NoInitialContextEx)
   [junit4]   2> 95910 INFO  (TEST-CollectionsAPIDistributedZkTest.test-seed#[A2A827B1B8FD3003]) [    ] o.a.s.c.SolrResourceLoader solr home defaulted to 'solr/' (could not find system property or JNDI)
   [junit4]   2> 95910 INFO  (TEST-CollectionsAPIDistributedZkTest.test-seed#[A2A827B1B8FD3003]) [    ] o.a.s.c.c.SolrZkClient Using default ZkCredentialsProvider
   [junit4]   2> 95911 INFO  (TEST-CollectionsAPIDistributedZkTest.test-seed#[A2A827B1B8FD3003]) [    ] o.a.s.c.c.ConnectionManager Waiting for client to connect to ZooKeeper
   [junit4]   2> 95914 INFO  (zkCallback-88-thread-1) [    ] o.a.s.c.c.ConnectionManager Watcher org.apache.solr.common.cloud.ConnectionManager@219be7de name:ZooKeeperConnection Watcher:127.0.0.1:61806/solr got event WatchedEvent state:SyncConnected type:None path:null path:null type:None
   [junit4]   2> 95914 INFO  (TEST-CollectionsAPIDistributedZkTest.test-seed#[A2A827B1B8FD3003]) [    ] o.a.s.c.c.ConnectionManager Client is connected to ZooKeeper
   [junit4]   2> 95914 INFO  (TEST-CollectionsAPIDistributedZkTest.test-seed#[A2A827B1B8FD3003]) [    ] o.a.s.c.c.SolrZkClient Using default ZkACLProvider
   [junit4]   2> 95917 INFO  (TEST-CollectionsAPIDistributedZkTest.test-seed#[A2A827B1B8FD3003]) [    ] o.a.s.s.SolrDispatchFilter Loading solr.xml from SolrHome (not found in ZooKeeper)
   [junit4]   2> 95917 INFO  (TEST-CollectionsAPIDistributedZkTest.test-seed#[A2A827B1B8FD3003]) [    ] o.a.s.c.SolrXmlConfig Loading container configuration from /Users/jenkins/workspace/Lucene-Solr-trunk-MacOSX/solr/build/solr-core/test/J1/temp/solr.cloud.CollectionsAPIDistributedZkTest_A2A827B1B8FD3003-001/control-001/solr.xml
   [junit4]   2> 95938 INFO  (TEST-CollectionsAPIDistributedZkTest.test-seed#[A2A827B1B8FD3003]) [    ] o.a.s.c.CorePropertiesLocator Config-defined core root directory: /Users/jenkins/workspace/Lucene-Solr-trunk-MacOSX/solr/build/solr-core/test/J1/temp/solr.cloud.CollectionsAPIDistributedZkTest_A2A827B1B8FD3003-001/control-001/cores
   [junit4]   2> 95938 INFO  (TEST-CollectionsAPIDistributedZkTest.test-seed#[A2A827B1B8FD3003]) [    ] o.a.s.c.CoreContainer New CoreContainer 1700821052
   [junit4]   2> 95938 INFO  (TEST-CollectionsAPIDistributedZkTest.test-seed#[A2A827B1B8FD3003]) [    ] o.a.s.c.CoreContainer Loading cores into CoreContainer [instanceDir=/Users/jenkins/workspace/Lucene-Solr-trunk-MacOSX/solr/build/solr-core/test/J1/temp/solr.cloud.CollectionsAPIDistributedZkTest_A2A827B1B8FD3003-001/control-001]
   [junit4]   2> 95939 WARN  (TEST-CollectionsAPIDistributedZkTest.test-seed#[A2A827B1B8FD3003]) [    ] o.a.s.c.CoreContainer Couldn't add files from /Users/jenkins/workspace/Lucene-Solr-trunk-MacOSX/solr/build/solr-core/test/J1/temp/solr.cloud.CollectionsAPIDistributedZkTest_A2A827B1B8FD3003-001/control-001/lib to classpath: /Users/jenkins/workspace/Lucene-Solr-trunk-MacOSX/solr/build/solr-core/test/J1/temp/solr.cloud.CollectionsAPIDistributedZkTest_A2A827B1B8FD3003-001/control-001/lib
   [junit4]   2> 95939 INFO  (TEST-CollectionsAPIDistributedZkTest.test-seed#[A2A827B1B8FD3003]) [    ] o.a.s.h.c.HttpShardHandlerFactory created with socketTimeout : 90000,urlScheme : ,connTimeout : 15000,maxConnectionsPerHost : 20,maxConnections : 10000,corePoolSize : 0,maximumPoolSize : 2147483647,maxThreadIdleTime : 5,sizeOfQueue : -1,fairnessPolicy : false,useRetries : false,
   [junit4]   2> 95943 INFO  (TEST-CollectionsAPIDistributedZkTest.test-seed#[A2A827B1B8FD3003]) [    ] o.a.s.u.UpdateShardHandler Creating UpdateShardHandler HTTP client with params: socketTimeout=340000&connTimeout=45000&retry=true
   [junit4]   2> 95944 INFO  (TEST-CollectionsAPIDistributedZkTest.test-seed#[A2A827B1B8FD3003]) [    ] o.a.s.l.LogWatcher SLF4J impl is org.slf4j.impl.Log4jLoggerFactory
   [junit4]   2> 95944 INFO  (TEST-CollectionsAPIDistributedZkTest.test-seed#[A2A827B1B8FD3003]) [    ] o.a.s.l.LogWatcher Registering Log Listener [Log4j (org.slf4j.impl.Log4jLoggerFactory)]
   [junit4]   2> 95944 INFO  (TEST-CollectionsAPIDistributedZkTest.test-seed#[A2A827B1B8FD3003]) [    ] o.a.s.c.ZkContainer Zookeeper client=127.0.0.1:61806/solr
   [junit4]   2> 95944 INFO  (TEST-CollectionsAPIDistributedZkTest.test-seed#[A2A827B1B8FD3003]) [    ] o.a.s.c.ZkController zkHost includes chroot
   [junit4]   2> 95945 INFO  (TEST-CollectionsAPIDistributedZkTest.test-seed#[A2A827B1B8FD3003]) [    ] o.a.s.c.c.SolrZkClient Using default ZkCredentialsProvider
   [junit4]   2> 95945 INFO  (TEST-CollectionsAPIDistributedZkTest.test-seed#[A2A827B1B8FD3003]) [    ] o.a.s.c.c.ConnectionManager Waiting for client to connect to ZooKeeper
   [junit4]   2> 95949 INFO  (zkCallback-91-thread-1) [    ] o.a.s.c.c.ConnectionManager Watcher org.apache.solr.common.cloud.ConnectionManager@33309e0a name:ZooKeeperConnection Watcher:127.0.0.1:61806 got event WatchedEvent state:SyncConnected type:None path:null path:null type:None
   [junit4]   2> 95950 INFO  (TEST-CollectionsAPIDistributedZkTest.test-seed#[A2A827B1B8FD3003]) [    ] o.a.s.c.c.ConnectionManager Client is connected to ZooKeeper
   [junit4]   2> 95950 INFO  (TEST-CollectionsAPIDistributedZkTest.test-seed#[A2A827B1B8FD3003]) [    ] o.a.s.c.c.SolrZkClient Using default ZkACLProvider
   [junit4]   2> 95954 INFO  (TEST-CollectionsAPIDistributedZkTest.test-seed#[A2A827B1B8FD3003]) [n:127.0.0.1:61831_    ] o.a.s.c.c.ConnectionManager Waiting for client to connect to ZooKeeper
   [junit4]   2> 95957 INFO  (zkCallback-92-thread-1-processing-n:127.0.0.1:61831_) [n:127.0.0.1:61831_    ] o.a.s.c.c.ConnectionManager Watcher org.apache.solr.common.cloud.ConnectionManager@7e3736bc name:ZooKeeperConnection Watcher:127.0.0.1:61806/solr got event WatchedEvent state:SyncConnected type:None path:null path:null type:None
   [junit4]   2> 95958 INFO  (TEST-CollectionsAPIDistributedZkTest.test-seed#[A2A827B1B8FD3003]) [n:127.0.0.1:61831_    ] o.a.s.c.c.ConnectionManager Client is connected to ZooKeeper
   [junit4]   2> 95960 INFO  (TEST-CollectionsAPIDistributedZkTest.test-seed#[A2A827B1B8FD3003]) [n:127.0.0.1:61831_    ] o.a.s.c.c.SolrZkClient makePath: /overseer/queue
   [junit4]   2> 95966 INFO  (TEST-CollectionsAPIDistributedZkTest.test-seed#[A2A827B1B8FD3003]) [n:127.0.0.1:61831_    ] o.a.s.c.c.SolrZkClient makePath: /overseer/collection-queue-work
   [junit4]   2> 95973 INFO  (TEST-CollectionsAPIDistributedZkTest.test-seed#[A2A827B1B8FD3003]) [n:127.0.0.1:61831_    ] o.a.s.c.c.SolrZkClient makePath: /overseer/collection-map-running
   [junit4]   2> 95981 INFO  (TEST-CollectionsAPIDistributedZkTest.test-seed#[A2A827B1B8FD3003]) [n:127.0.0.1:61831_    ] o.a.s.c.c.SolrZkClient makePath: /overseer/collection-map-completed
   [junit4]   2> 95987 INFO  (TEST-CollectionsAPIDistributedZkTest.test-seed#[A2A827B1B8FD3003]) [n:127.0.0.1:61831_    ] o.a.s.c.c.SolrZkClient makePath: /overseer/collection-map-failure
   [junit4]   2> 95994 INFO  (TEST-CollectionsAPIDistributedZkTest.test-seed#[A2A827B1B8FD3003]) [n:127.0.0.1:61831_    ] o.a.s.c.c.SolrZkClient makePath: /live_nodes
   [junit4]   2> 95997 INFO  (TEST-CollectionsAPIDistributedZkTest.test-seed#[A2A827B1B8FD3003]) [n:127.0.0.1:61831_    ] o.a.s.c.c.SolrZkClient makePath: /aliases.json
   [junit4]   2> 96001 INFO  (TEST-CollectionsAPIDistributedZkTest.test-seed#[A2A827B1B8FD3003]) [n:127.0.0.1:61831_    ] o.a.s.c.c.SolrZkClient makePath: /clusterstate.json
   [junit4]   2> 96010 INFO  (TEST-CollectionsAPIDistributedZkTest.test-seed#[A2A827B1B8FD3003]) [n:127.0.0.1:61831_    ] o.a.s.c.c.SolrZkClient makePath: /security.json
   [junit4]   2> 96013 INFO  (TEST-CollectionsAPIDistributedZkTest.test-seed#[A2A827B1B8FD3003]) [n:127.0.0.1:61831_    ] o.a.s.c.ZkController Register node as live in ZooKeeper:/live_nodes/127.0.0.1:61831_
   [junit4]   2> 96014 INFO  (TEST-CollectionsAPIDistributedZkTest.test-seed#[A2A827B1B8FD3003]) [n:127.0.0.1:61831_    ] o.a.s.c.c.SolrZkClient makePath: /live_nodes/127.0.0.1:61831_
   [junit4]   2> 96018 INFO  (TEST-CollectionsAPIDistributedZkTest.test-seed#[A2A827B1B8FD3003]) [n:127.0.0.1:61831_    ] o.a.s.c.c.SolrZkClient makePath: /overseer_elect
   [junit4]   2> 96021 INFO  (TEST-CollectionsAPIDistributedZkTest.test-seed#[A2A827B1B8FD3003]) [n:127.0.0.1:61831_    ] o.a.s.c.c.SolrZkClient makePath: /overseer_elect/election
   [junit4]   2> 96028 INFO  (TEST-CollectionsAPIDistributedZkTest.test-seed#[A2A827B1B8FD3003]) [n:127.0.0.1:61831_    ] o.a.s.c.Overseer Overseer (id=null) closing
   [junit4]   2> 96033 INFO  (TEST-CollectionsAPIDistributedZkTest.test-seed#[A2A827B1B8FD3003]) [n:127.0.0.1:61831_    ] o.a.s.c.LeaderElector Joined leadership election with path: /overseer_elect/election/95162493294215173-127.0.0.1:61831_-n_0000000000
   [junit4]   2> 96034 INFO  (TEST-CollectionsAPIDistributedZkTest.test-seed#[A2A827B1B8FD3003]) [n:127.0.0.1:61831_    ] o.a.s.c.OverseerElectionContext I am going to be the leader 127.0.0.1:61831_
   [junit4]   2> 96034 INFO  (TEST-CollectionsAPIDistributedZkTest.test-seed#[A2A827B1B8FD3003]) [n:127.0.0.1:61831_    ] o.a.s.c.c.SolrZkClient makePath: /overseer_elect/leader
   [junit4]   2> 96036 INFO  (TEST-CollectionsAPIDistributedZkTest.test-seed#[A2A827B1B8FD3003]) [n:127.0.0.1:61831_    ] o.a.s.c.Overseer Overseer (id=95162493294215173-127.0.0.1:61831_-n_0000000000) starting
   [junit4]   2> 96041 INFO  (TEST-CollectionsAPIDistributedZkTest.test-seed#[A2A827B1B8FD3003]) [n:127.0.0.1:61831_    ] o.a.s.c.c.SolrZkClient makePath: /overseer/queue-work
   [junit4]   2> 96059 INFO  (TEST-CollectionsAPIDistributedZkTest.test-seed#[A2A827B1B8FD3003]) [n:127.0.0.1:61831_    ] o.a.s.c.OverseerAutoReplicaFailoverThread Starting OverseerAutoReplicaFailoverThread autoReplicaFailoverWorkLoopDelay=10000 autoReplicaFailoverWaitAfterExpiration=10000 autoReplicaFailoverBadNodeExpiration=60000
   [junit4]   2> 96060 INFO  (OverseerCollectionConfigSetProcessor-95162493294215173-127.0.0.1:61831_-n_0000000000) [n:127.0.0.1:61831_    ] o.a.s.c.OverseerTaskProcessor Process current queue of overseer operations
   [junit4]   2> 96061 INFO  (TEST-CollectionsAPIDistributedZkTest.test-seed#[A2A827B1B8FD3003]) [n:127.0.0.1:61831_    ] o.a.s.c.c.ZkStateReader Updating cluster state from ZooKeeper... 
   [junit4]   2> 96061 INFO  (OverseerStateUpdate-95162493294215173-127.0.0.1:61831_-n_0000000000) [n:127.0.0.1:61831_    ] o.a.s.c.Overseer Starting to work on the main queue
   [junit4]   2> 96084 INFO  (TEST-CollectionsAPIDistributedZkTest.test-seed#[A2A827B1B8FD3003]) [n:127.0.0.1:61831_    ] o.a.s.c.CoreContainer Security conf doesn't exist. Skipping setup for authorization module.
   [junit4]   2> 96084 INFO  (TEST-CollectionsAPIDistributedZkTest.test-seed#[A2A827B1B8FD3003]) [n:127.0.0.1:61831_    ] o.a.s.c.CoreContainer No authentication plugin used.
   [junit4]   2> 96086 INFO  (TEST-CollectionsAPIDistributedZkTest.test-seed#[A2A827B1B8FD3003]) [n:127.0.0.1:61831_    ] o.a.s.c.CorePropertiesLocator Looking for core definitions underneath /Users/jenkins/workspace/Lucene-Solr-trunk-MacOSX/solr/build/solr-core/test/J1/temp/solr.cloud.CollectionsAPIDistributedZkTest_A2A827B1B8FD3003-001/control-001/cores
   [junit4]   2> 96090 INFO  (TEST-CollectionsAPIDistributedZkTest.test-seed#[A2A827B1B8FD3003]) [n:127.0.0.1:61831_    ] o.a.s.c.CoreDescriptor Created CoreDescriptor: {name=collection1, config=solrconfig.xml, transient=false, schema=schema.xml, loadOnStartup=true, configSetProperties=configsetprops.json, collection=control_collection, coreNodeName=, dataDir=data/, shard=}
   [junit4]   2> 96090 INFO  (TEST-CollectionsAPIDistributedZkTest.test-seed#[A2A827B1B8FD3003]) [n:127.0.0.1:61831_    ] o.a.s.c.CorePropertiesLocator Found core collection1 in /Users/jenkins/workspace/Lucene-Solr-trunk-MacOSX/solr/build/solr-core/test/J1/temp/solr.cloud.CollectionsAPIDistributedZkTest_A2A827B1B8FD3003-001/control-001/cores/collection1
   [junit4]   2> 96090 INFO  (TEST-CollectionsAPIDistributedZkTest.test-seed#[A2A827B1B8FD3003]) [n:127.0.0.1:61831_    ] o.a.s.c.CorePropertiesLocator Found 1 core definitions
   [junit4]   2> 96092 INFO  (TEST-CollectionsAPIDistributedZkTest.test-seed#[A2A827B1B8FD3003]) [n:127.0.0.1:61831_    ] o.a.s.s.SolrDispatchFilter user.dir=/Users/jenkins/workspace/Lucene-Solr-trunk-MacOSX/solr/build/solr-core/test/J1
   [junit4]   2> 96092 INFO  (TEST-CollectionsAPIDistributedZkTest.test-seed#[A2A827B1B8FD3003]) [n:127.0.0.1:61831_    ] o.a.s.s.SolrDispatchFilter SolrDispatchFilter.init() done
   [junit4]   2> 96094 INFO  (coreLoadExecutor-357-thread-1-processing-n:127.0.0.1:61831_) [n:127.0.0.1:61831_ c:control_collection   x:collection1] o.a.s.c.ZkController publishing state=down
   [junit4]   2> 96094 INFO  (coreLoadExecutor-357-thread-1-processing-n:127.0.0.1:61831_) [n:127.0.0.1:61831_ c:control_collection   x:collection1] o.a.s.c.ZkController numShards not found on descriptor - reading it from system property
   [junit4]   2> 96104 INFO  (OverseerStateUpdate-95162493294215173-127.0.0.1:61831_-n_0000000000) [n:127.0.0.1:61831_    ] o.a.s.c.Overseer processMessage: queueSize: 1, message = {
   [junit4]   2>   "core":"collection1",
   [junit4]   2>   "roles":null,
   [junit4]   2>   "base_url":"https://127.0.0.1:61831",
   [junit4]   2>   "node_name":"127.0.0.1:61831_",
   [junit4]   2>   "numShards":"1",
   [junit4]   2>   "state":"down",
   [junit4]   2>   "shard":null,
   [junit4]   2>   "collection":"control_collection",
   [junit4]   2>   "operation":"state"} current state version: 0
   [junit4]   2> 96105 INFO  (coreLoadExecutor-357-thread-1-processing-n:127.0.0.1:61831_) [n:127.0.0.1:61831_ c:control_collection   x:collection1] o.a.s.c.ZkController look for our core node name
   [junit4]   2> 96108 INFO  (OverseerStateUpdate-95162493294215173-127.0.0.1:61831_-n_0000000000) [n:127.0.0.1:61831_    ] o.a.s.c.o.ReplicaMutator Update state numShards=1 message={
   [junit4]   2>   "core":"collection1",
   [junit4]   2>   "roles":null,
   [junit4]   2>   "base_url":"https://127.0.0.1:61831",
   [junit4]   2>   "node_name":"127.0.0.1:61831_",
   [junit4]   2>   "numShards":"1",
   [junit4]   2>   "state":"down",
   [junit4]   2>   "shard":null,
   [junit4]   2>   "collection":"control_collection",
   [junit4]   2>   "operation":"state"}
   [junit4]   2> 96109 INFO  (OverseerStateUpdate-95162493294215173-127.0.0.1:61831_-n_0000000000) [n:127.0.0.1:61831_    ] o.a.s.c.o.ClusterStateMutator building a new cName: control_collection
   [junit4]   2> 96110 INFO  (OverseerStateUpdate-95162493294215173-127.0.0.1:61831_-n_0000000000) [n:127.0.0.1:61831_    ] o.a.s.c.o.ReplicaMutator Assigning new node to shard shard=shard1
   [junit4]   2> 96113 INFO  (zkCallback-92-thread-1-processing-n:127.0.0.1:61831_) [n:127.0.0.1:61831_    ] o.a.s.c.c.ZkStateReader A cluster state change: [WatchedEvent state:SyncConnected type:NodeDataChanged path:/clusterstate.json], has occurred - updating... (live nodes size: [1])
   [junit4]   2> 97111 INFO  (coreLoadExecutor-357-thread-1-processing-n:127.0.0.1:61831_) [n:127.0.0.1:61831_ c:control_collection   x:collection1] o.a.s.c.ZkController waiting to find shard id in clusterstate for collection1
   [junit4]   2> 97111 INFO  (coreLoadExecutor-357-thread-1-processing-n:127.0.0.1:61831_) [n:127.0.0.1:61831_ c:control_collection   x:collection1] o.a.s.c.ZkController Check for collection zkNode:control_collection
   [junit4]   2> 97112 INFO  (coreLoadExecutor-357-thread-1-processing-n:127.0.0.1:61831_) [n:127.0.0.1:61831_ c:control_collection   x:collection1] o.a.s.c.ZkController Collection zkNode exists
   [junit4]   2> 97112 INFO  (coreLoadExecutor-357-thread-1-processing-n:127.0.0.1:61831_) [n:127.0.0.1:61831_ c:control_collection   x:collection1] o.a.s.c.c.ZkStateReader Load collection config from: [/collections/control_collection]
   [junit4]   2> 97114 INFO  (coreLoadExecutor-357-thread-1-processing-n:127.0.0.1:61831_) [n:127.0.0.1:61831_ c:control_collection   x:collection1] o.a.s.c.c.ZkStateReader path=[/collections/control_collection] [configName]=[conf1] specified config exists in ZooKeeper
   [junit4]   2> 97114 INFO  (coreLoadExecutor-357-thread-1-processing-n:127.0.0.1:61831_) [n:127.0.0.1:61831_ c:control_collection   x:collection1] o.a.s.c.SolrResourceLoader new SolrResourceLoader for directory: '/Users/jenkins/workspace/Lucene-Solr-trunk-MacOSX/solr/build/solr-core/test/J1/temp/solr.cloud.CollectionsAPIDistributedZkTest_A2A827B1B8FD3003-001/control-001/cores/collection1'
   [junit4]   2> 97114 INFO  (coreLoadExecutor-357-thread-1-processing-n:127.0.0.1:61831_) [n:127.0.0.1:61831_ c:control_collection   x:collection1] o.a.s.c.SolrResourceLoader JNDI not configured for solr (NoInitialContextEx)
   [junit4]   2> 97114 INFO  (coreLoadExecutor-357-thread-1-processing-n:127.0.0.1:61831_) [n:127.0.0.1:61831_ c:control_collection   x:collection1] o.a.s.c.SolrResourceLoader solr home defaulted to 'solr/' (could not find system property or JNDI)
   [junit4]   2> 97116 INFO  (coreLoadExecutor-357-thread-1-processing-n:127.0.0.1:61831_) [n:127.0.0.1:61831_ c:control_collection   x:collection1] o.a.s.c.Config loaded config solrconfig.xml with version 0 
   [junit4]   2> 97125 INFO  (coreLoadExecutor-357-thread-1-processing-n:127.0.0.1:61831_) [n:127.0.0.1:61831_ c:control_collection   x:collection1] o.a.s.c.SolrConfig current version of requestparams : -1
   [junit4]   2> 97128 INFO  (coreLoadExecutor-357-thread-1-processing-n:127.0.0.1:61831_) [n:127.0.0.1:61831_ c:control_collection   x:collection1] o.a.s.c.SolrConfig Using Lucene MatchVersion: 6.0.0
   [junit4]   2> 97135 INFO  (coreLoadExecutor-357-thread-1-processing-n:127.0.0.1:61831_) [n:127.0.0.1:61831_ c:control_collection   x:collection1] o.a.s.c.SolrConfig Loaded SolrConfig: solrconfig.xml
   [junit4]   2> 97142 INFO  (coreLoadExecutor-357-thread-1-processing-n:127.0.0.1:61831_) [n:127.0.0.1:61831_ c:control_collection   x:collection1] o.a.s.s.IndexSchema [collection1] Schema name=test
   [junit4]   2> 97261 INFO  (coreLoadExecutor-357-thread-1-processing-n:127.0.0.1:61831_) [n:127.0.0.1:61831_ c:control_collection   x:collection1] o.a.s.s.OpenExchangeRatesOrgProvider Initialized with rates=open-exchange-rates.json, refreshInterval=1440.
   [junit4]   2> 97268 INFO  (coreLoadExecutor-357-thread-1-processing-n:127.0.0.1:61831_) [n:127.0.0.1:61831_ c:control_collection   x:collection1] o.a.s.s.IndexSchema default search field in schema is text
   [junit4]   2> 97269 INFO  (coreLoadExecutor-357-thread-1-processing-n:127.0.0.1:61831_) [n:127.0.0.1:61831_ c:control_collection   x:collection1] o.a.s.s.IndexSchema unique key field: id
   [junit4]   2> 97287 INFO  (coreLoadExecutor-357-thread-1-processing-n:127.0.0.1:61831_) [n:127.0.0.1:61831_ c:control_collection   x:collection1] o.a.s.s.FileExchangeRateProvider Reloading exchange rates from file currency.xml
   [junit4]   2> 97291 INFO  (coreLoadExecutor-357-thread-1-processing-n:127.0.0.1:61831_) [n:127.0.0.1:61831_ c:control_collection   x:collection1] o.a.s.s.FileExchangeRateProvider Reloading exchange rates from file currency.xml
   [junit4]   2> 97294 INFO  (coreLoadExecutor-357-thread-1-processing-n:127.0.0.1:61831_) [n:127.0.0.1:61831_ c:control_collection   x:collection1] o.a.s.s.OpenExchangeRatesOrgProvider Reloading exchange rates from open-exchange-rates.json
   [junit4]   2> 97296 INFO  (coreLoadExecutor-357-thread-1-processing-n:127.0.0.1:61831_) [n:127.0.0.1:61831_ c:control_collection   x:collection1] o.a.s.s.OpenExchangeRatesOrgProvider Reloading exchange rates from open-exchange-rates.json
   [junit4]   2> 97299 INFO  (coreLoadExecutor-357-thread-1-processing-n:127.0.0.1:61831_) [n:127.0.0.1:61831_ c:control_collection   x:collection1] o.a.s.c.ConfigSetProperties Did not find ConfigSet properties, assuming default properties: Can't find resource 'configsetprops.json' in classpath or '/configs/conf1', cwd=/Users/jenkins/workspace/Lucene-Solr-trunk-MacOSX/solr/build/solr-core/test/J1
   [junit4]   2> 97299 INFO  (coreLoadExecutor-357-thread-1-processing-n:127.0.0.1:61831_) [n:127.0.0.1:61831_ c:control_collection   x:collection1] o.a.s.c.CoreContainer Creating SolrCore 'collection1' using configuration from collection control_collection
   [junit4]   2> 97299 INFO  (coreLoadExecutor-357-thread-1-processing-n:127.0.0.1:61831_) [n:127.0.0.1:61831_ c:control_collection s:shard1 r:core_node1 x:collection1] o.a.s.c.SolrCore org.apache.solr.core.MockDirectoryFactory
   [junit4]   2> 97300 INFO  (coreLoadExecutor-357-thread-1-processing-n:127.0.0.1:61831_) [n:127.0.0.1:61831_ c:control_collection s:shard1 r:core_node1 x:collection1] o.a.s.c.SolrCore [[collection1] ] Opening new SolrCore at [/Users/jenkins/workspace/Lucene-Solr-trunk-MacOSX/solr/build/solr-core/test/J1/temp/solr.cloud.CollectionsAPIDistributedZkTest_A2A827B1B8FD3003-001/control-001/cores/collection1], dataDir=[/Users/jenkins/workspace/Lucene-Solr-trunk-MacOSX/solr/build/solr-core/test/J1/temp/solr.cloud.CollectionsAPIDistributedZkTest_A2A827B1B8FD3003-001/control-001/cores/collection1/data/]
   [junit4]   2> 97300 INFO  (coreLoadExecutor-357-thread-1-processing-n:127.0.0.1:61831_) [n:127.0.0.1:61831_ c:control_collection s:shard1 r:core_node1 x:collection1] o.a.s.c.JmxMonitoredMap JMX monitoring is enabled. Adding Solr mbeans to JMX Server: com.sun.jmx.mbeanserver.JmxMBeanServer@31959c8b
   [junit4]   2> 97301 INFO  (coreLoadExecutor-357-thread-1-processing-n:127.0.0.1:61831_) [n:127.0.0.1:61831_ c:control_collection s:shard1 r:core_node1 x:collection1] o.a.s.c.CachingDirectoryFactory return new directory for /Users/jenkins/workspace/Lucene-Solr-trunk-MacOSX/solr/build/solr-core/test/J1/temp/solr.cloud.CollectionsAPIDistributedZkTest_A2A827B1B8FD3003-001/control-001/cores/collection1/data
   [junit4]   2> 97301 INFO  (coreLoadExecutor-357-thread-1-processing-n:127.0.0.1:61831_) [n:127.0.0.1:61831_ c:control_collection s:shard1 r:core_node1 x:collection1] o.a.s.c.SolrCore New index directory detected: old=null new=/Users/jenkins/workspace/Lucene-Solr-trunk-MacOSX/solr/build/solr-core/test/J1/temp/solr.cloud.CollectionsAPIDistributedZkTest_A2A827B1B8FD3003-001/control-001/cores/collection1/data/index/
   [junit4]   2> 97301 WARN  (coreLoadExecutor-357-thread-1-processing-n:127.0.0.1:61831_) [n:127.0.0.1:61831_ c:control_collection s:shard1 r:core_node1 x:collection1] o.a.s.c.SolrCore [collection1] Solr index directory '/Users/jenkins/workspace/Lucene-Solr-trunk-MacOSX/solr/build/solr-core/test/J1/temp/solr.cloud.CollectionsAPIDistributedZkTest_A2A827B1B8FD3003-001/control-001/cores/collection1/data/index' doesn't exist. Creating new index...
   [junit4]   2> 97301 INFO  (coreLoadExecutor-357-thread-1-processing-n:127.0.0.1:61831_) [n:127.0.0.1:61831_ c:control_collection s:shard1 r:core_node1 x:collection1] o.a.s.c.CachingDirectoryFactory return new directory for /Users/jenkins/workspace/Lucene-Solr-trunk-MacOSX/solr/build/solr-core/test/J1/temp/solr.cloud.CollectionsAPIDistributedZkTest_A2A827B1B8FD3003-001/control-001/cores/collection1/data/index
   [junit4]   2> 97301 INFO  (coreLoadExecutor-357-thread-1-processing-n:127.0.0.1:61831_) [n:127.0.0.1:61831_ c:control_collection s:shard1 r:core_node1 x:collection1] o.a.s.u.RandomMergePolicy RandomMergePolicy wrapping class org.apache.lucene.index.LogDocMergePolicy: [LogDocMergePolicy: minMergeSize=1000, mergeFactor=12, maxMergeSize=9223372036854775807, maxMergeSizeForForcedMerge=9223372036854775807, calibrateSizeByDeletes=false, maxMergeDocs=2147483647, maxCFSSegmentSizeMB=8.796093022207999E12, noCFSRatio=0.12709168783086736]
   [junit4]   2> 97302 INFO  (coreLoadExecutor-357-thread-1-processing-n:127.0.0.1:61831_) [n:127.0.0.1:61831_ c:control_collection s:shard1 r:core_node1 x:collection1] o.a.s.c.SolrDeletionPolicy SolrDeletionPolicy.onCommit: commits: num=1
   [junit4]   2> 	commit{dir=MockDirectoryWrapper(RAMDirectory@1838a5b lockFactory=org.apache.lucene.store.SingleInstanceLockFactory@44a179cb),segFN=segments_1,generation=1}
   [junit4]   2> 97302 INFO  (coreLoadExecutor-357-thread-1-processing-n:127.0.0.1:61831_) [n:127.0.0.1:61831_ c:control_collection s:shard1 r:core_node1 x:collection1] o.a.s.c.SolrDeletionPolicy newest commit generation = 1
   [junit4]   2> 97303 INFO  (OldIndexDirectoryCleanupThreadForCore-collection1) [n:127.0.0.1:61831_ c:control_collection s:shard1 r:core_node1 x:collection1] o.a.s.c.SolrCore Looking for old index directories to cleanup for core collection1 in /Users/jenkins/workspace/Lucene-Solr-trunk-MacOSX/solr/build/solr-core/test/J1/temp/solr.cloud.CollectionsAPIDistributedZkTest_A2A827B1B8FD3003-001/control-001/cores/collection1/data/
   [junit4]   2> 97304 WARN  (OldIndexDirectoryCleanupThreadForCore-collection1) [n:127.0.0.1:61831_ c:control_collection s:shard1 r:core_node1 x:collection1] o.a.s.c.DirectoryFactory /Users/jenkins/workspace/Lucene-Solr-trunk-MacOSX/solr/build/solr-core/test/J1/temp/solr.cloud.CollectionsAPIDistributedZkTest_A2A827B1B8FD3003-001/control-001/cores/collection1/data/ does not point to a valid data directory; skipping clean-up of old index directories.
   [junit4]   2> 97307 INFO  (coreLoadExecutor-357-thread-1-processing-n:127.0.0.1:61831_) [n:127.0.0.1:61831_ c:control_collection s:shard1 r:core_node1 x:collection1] o.a.s.u.p.UpdateRequestProcessorChain creating updateRequestProcessorChain "nodistrib"
   [junit4]   2> 97307 INFO  (coreLoadExecutor-357-thread-1-processing-n:127.0.0.1:61831_) [n:127.0.0.1:61831_ c:control_collection s:shard1 r:core_node1 x:collection1] o.a.s.u.p.UpdateRequestProcessorChain creating updateRequestProcessorChain "dedupe"
   [junit4]   2> 97307 INFO  (coreLoadExecutor-357-thread-1-processing-n:127.0.0.1:61831_) [n:127.0.0.1:61831_ c:control_collection s:shard1 r:core_node1 x:collection1] o.a.s.u.p.UpdateRequestProcessorChain inserting DistributedUpdateProcessorFactory into updateRequestProcessorChain "dedupe"
   [junit4]   2> 97307 INFO  (coreLoadExecutor-357-thread-1-processing-n:127.0.0.1:61831_) [n:127.0.0.1:61831_ c:control_collection s:shard1 r:core_node1 x:collection1] o.a.s.u.p.UpdateRequestProcessorChain creating updateRequestProcessorChain "stored_sig"
   [junit4]   2> 97308 INFO  (coreLoadExecutor-357-thread-1-processing-n:127.0.0.1:61831_) [n:127.0.0.1:61831_ c:control_collection s:shard1 r:core_node1 x:collection1] o.a.s.u.p.UpdateRequestProcessorChain inserting DistributedUpdateProcessorFactory into updateRequestProcessorChain "stored_sig"
   [junit4]   2> 97308 INFO  (coreLoadExecutor-357-thread-1-processing-n:127.0.0.1:61831_) [n:127.0.0.1:61831_ c:control_collection s:shard1 r:core_node1 x:collection1] o.a.s.u.p.UpdateRequestProcessorChain creating updateRequestProcessorChain "distrib-dup-test-chain-explicit"
   [junit4]   2> 97308 INFO  (coreLoadExecutor-357-thread-1-processing-n:127.0.0.1:61831_) [n:127.0.0.1:61831_ c:control_collection s:shard1 r:core_node1 x:collection1] o.a.s.u.p.UpdateRequestProcessorChain creating updateRequestProcessorChain "distrib-dup-test-chain-implicit"
   [junit4]   2> 97309 INFO  (coreLoadExecutor-357-thread-1-processing-n:127.0.0.1:61831_) [n:127.0.0.1:61831_ c:control_collection s:shard1 r:core_node1 x:collection1] o.a.s.u.p.UpdateRequestProcessorChain inserting DistributedUpdateProcessorFactory into updateRequestProcessorChain "distrib-dup-test-chain-implicit"
   [junit4]   2> 97309 INFO  (coreLoadExecutor-357-thread-1-processing-n:127.0.0.1:61831_) [n:127.0.0.1:61831_ c:control_collection s:shard1 r:core_node1 x:collection1] o.a.s.c.SolrCore no updateRequestProcessorChain defined as default, creating implicit default
   [junit4]   2> 97309 WARN  (coreLoadExecutor-357-thread-1-processing-n:127.0.0.1:61831_) [n:127.0.0.1:61831_ c:control_collection s:shard1 r:core_node1 x:collection1] o.a.s.c.RequestHandlers INVALID paramSet a in requestHandler {type = requestHandler,name = /dump,class = DumpRequestHandler,args = {defaults={a=A,b=B}}}
   [junit4]   2> 97312 INFO  (coreLoadExecutor-357-thread-1-processing-n:127.0.0.1:61831_) [n:127.0.0.1:61831_ c:control_collection s:shard1 r:core_node1 x:collection1] o.a.s.h.l.XMLLoader xsltCacheLifetimeSeconds=60
   [junit4]   2> 97313 INFO  (coreLoadExecutor-357-thread-1-processing-n:127.0.0.1:61831_) [n:127.0.0.1:61831_ c:control_collection s:shard1 r:core_node1 x:collection1] o.a.s.h.l.XMLLoader xsltCacheLifetimeSeconds=60
   [junit4]   2> 97314 INFO  (coreLoadExecutor-357-thread-1-processing-n:127.0.0.1:61831_) [n:127.0.0.1:61831_ c:control_collection s:shard1 r:core_node1 x:collection1] o.a.s.h.l.XMLLoader xsltCacheLifetimeSeconds=60
   [junit4]   2> 97315 INFO  (coreLoadExecutor-357-thread-1-processing-n:127.0.0.1:61831_) [n:127.0.0.1:61831_ c:control_collection s:shard1 r:core_node1 x:collection1] o.a.s.h.l.XMLLoader xsltCacheLifetimeSeconds=60
   [junit4]   2> 97321 INFO  (coreLoadExecutor-357-thread-1-processing-n:127.0.0.1:61831_) [n:127.0.0.1:61831_ c:control_collection s:shard1 r:core_node1 x:collection1] o.a.s.c.RequestHandlers Registered paths: /admin/mbeans,standard,/dump,/update/csv,/sql,/update/json/docs,/admin/luke,/export,/admin/segments,/get,/admin/system,/replication,/admin/properties,/config,/stream,/schema,/admin/plugins,/admin/logging,/update/json,/admin/threads,/admin/ping,/update,/admin/file
   [junit4]   2> 97321 INFO  (coreLoadExecutor-357-thread-1-processing-n:127.0.0.1:61831_) [n:127.0.0.1:61831_ c:control_collection s:shard1 r:core_node1 x:collection1] o.a.s.c.SolrCore Using default statsCache cache: org.apache.solr.search.stats.LocalStatsCache
   [junit4]   2> 97322 INFO  (coreLoadExecutor-357-thread-1-processing-n:127.0.0.1:61831_) [n:127.0.0.1:61831_ c:control_collection s:shard1 r:core_node1 x:collection1] o.a.s.u.UpdateHandler Using UpdateLog implementation: org.apache.solr.update.UpdateLog
   [junit4]   2> 97322 INFO  (coreLoadExecutor-357-thread-1-processing-n:127.0.0.1:61831_) [n:127.0.0.1:61831_ c:control_collection s:shard1 r:core_node1 x:collection1] o.a.s.u.UpdateLog Initializing UpdateLog: dataDir= defaultSyncLevel=FLUSH numRecordsToKeep=100 maxNumLogsToKeep=10 numVersionBuckets=65536
   [junit4]   2> 97323 INFO  (coreLoadExecutor-357-thread-1-processing-n:127.0.0.1:61831_) [n:127.0.0.1:61831_ c:control_collection s:shard1 r:core_node1 x:collection1] o.a.s.u.CommitTracker Hard AutoCommit: disabled
   [junit4]   2> 97323 INFO  (coreLoadExecutor-357-thread-1-processing-n:127.0.0.1:61831_) [n:127.0.0.1:61831_ c:control_collection s:shard1 r:core_node1 x:collection1] o.a.s.u.CommitTracker Soft AutoCommit: disabled
   [junit4]   2> 97324 INFO  (coreLoadExecutor-357-thread-1-processing-n:127.0.0.1:61831_) [n:127.0.0.1:61831_ c:control_collection s:shard1 r:core_node1 x:collection1] o.a.s.u.RandomMergePolicy RandomMergePolicy wrapping class org.apache.lucene.index.AlcoholicMergePolicy: [AlcoholicMergePolicy: minMergeSize=0, mergeFactor=10, maxMergeSize=2092972568, maxMergeSizeForForcedMerge=9223372036854775807, calibrateSizeByDeletes=true, maxMergeDocs=2147483647, maxCFSSegmentSizeMB=8.796093022207999E12, noCFSRatio=0.1]
   [junit4]   2> 97325 INFO  (coreLoadExecutor-357-thread-1-processing-n:127.0.0.1:61831_) [n:127.0.0.1:61831_ c:control_collection s:shard1 r:core_node1 x:collection1] o.a.s.c.SolrDeletionPolicy SolrDeletionPolicy.onInit: commits: num=1
   [junit4]   2> 	commit{dir=MockDirectoryWrapper(RAMDirectory@1838a5b lockFactory=org.apache.lucene.store.SingleInstanceLockFactory@44a179cb),segFN=segments_1,generation=1}
   [junit4]   2> 97325 INFO  (coreLoadExecutor-357-thread-1-processing-n:127.0.0.1:61831_) [n:127.0.0.1:61831_ c:control_collection s:shard1 r:core_node1 x:collection1] o.a.s.c.SolrDeletionPolicy newest commit generation = 1
   [junit4]   2> 97325 INFO  (coreLoadExecutor-357-thread-1-processing-n:127.0.0.1:61831_) [n:127.0.0.1:61831_ c:control_collection s:shard1 r:core_node1 x:collection1] o.a.s.s.SolrIndexSearcher Opening Searcher@e9aa4be[collection1] main
   [junit4]   2> 97325 INFO  (coreLoadExecutor-357-thread-1-processing-n:127.0.0.1:61831_) [n:127.0.0.1:61831_ c:control_collection s:shard1 r:core_node1 x:collection1] o.a.s.c.c.ZkStateReader Load collection config from: [/collections/control_collection]
   [junit4]   2> 97327 INFO  (coreLoadExecutor-357-thread-1-processing-n:127.0.0.1:61831_) [n:127.0.0.1:61831_ c:control_collection s:shard1 r:core_node1 x:collection1] o.a.s.c.c.ZkStateReader path=[/collections/control_collection] [configName]=[conf1] specified config exists in ZooKeeper
   [junit4]   2> 97327 INFO  (coreLoadExecutor-357-thread-1-processing-n:127.0.0.1:61831_) [n:127.0.0.1:61831_ c:control_collection s:shard1 r:core_node1 x:collection1] o.a.s.r.ManagedResourceStorage Setting up ZooKeeper-based storage for the RestManager with znodeBase: /configs/conf1
   [junit4]   2> 97327 INFO  (coreLoadExecutor-357-thread-1-processing-n:127.0.0.1:61831_) [n:127.0.0.1:61831_ c:control_collection s:shard1 r:core_node1 x:collection1] o.a.s.r.ManagedResourceStorage Configured ZooKeeperStorageIO with znodeBase: /configs/conf1
   [junit4]   2> 97327 INFO  (coreLoadExecutor-357-thread-1-processing-n:127.0.0.1:61831_) [n:127.0.0.1:61831_ c:control_collection s:shard1 r:core_node1 x:collection1] o.a.s.r.RestManager Initializing RestManager with initArgs: {}
   [junit4]   2> 97327 INFO  (coreLoadExecutor-357-thread-1-processing-n:127.0.0.1:61831_) [n:127.0.0.1:61831_ c:control_collection s:shard1 r:core_node1 x:collection1] o.a.s.r.ManagedResourceStorage Reading _rest_managed.json using ZooKeeperStorageIO:path=/configs/conf1
   [junit4]   2> 97328 INFO  (coreLoadExecutor-357-thread-1-processing-n:127.0.0.1:61831_) [n:127.0.0.1:61831_ c:control_collection s:shard1 r:core_node1 x:collection1] o.a.s.r.ManagedResourceStorage No data found for znode /configs/conf1/_rest_managed.json
   [junit4]   2> 97328 INFO  (coreLoadExecutor-357-thread-1-processing-n:127.0.0.1:61831_) [n:127.0.0.1:61831_ c:control_collection s:shard1 r:core_node1 x:collection1] o.a.s.r.ManagedResourceStorage Loaded null at path _rest_managed.json using ZooKeeperStorageIO:path=/configs/conf1
   [junit4]   2> 97328 INFO  (coreLoadExecutor-357-thread-1-processing-n:127.0.0.1:61831_) [n:127.0.0.1:61831_ c:control_collection s:shard1 r:core_node1 x:collection1] o.a.s.r.RestManager Initializing 0 registered ManagedResources
   [junit4]   2> 97329 INFO  (coreLoadExecutor-357-thread-1-processing-n:127.0.0.1:61831_) [n:127.0.0.1:61831_ c:control_collection s:shard1 r:core_node1 x:collection1] o.a.s.h.ReplicationHandler Commits will be reserved for  10000
   [junit4]   2> 97329 INFO  (searcherExecutor-358-thread-1-processing-n:127.0.0.1:61831_ x:collection1 s:shard1 c:control_collection r:core_node1) [n:127.0.0.1:61831_ c:control_collection s:shard1 r:core_node1 x:collection1] o.a.s.c.SolrCore [collection1] Registered new searcher Searcher@e9aa4be[collection1] main{ExitableDirectoryReader(UninvertingDirectoryReader())}
   [junit4]   2> 97329 INFO  (coreLoadExecutor-357-thread-1-processing-n:127.0.0.1:61831_) [n:127.0.0.1:61831_ c:control_collection s:shard1 r:core_node1 x:collection1] o.a.s.u.UpdateLog Looking up max value of version field to seed version buckets
   [junit4]   2> 97329 INFO  (coreLoadExecutor-357-thread-1-processing-n:127.0.0.1:61831_) [n:127.0.0.1:61831_ c:control_collection s:shard1 r:core_node1 x:collection1] o.a.s.u.VersionInfo Refreshing highest value of _version_ for 65536 version buckets from index
   [junit4]   2> 97329 INFO  (coreLoadExecutor-357-thread-1-processing-n:127.0.0.1:61831_) [n:127.0.0.1:61831_ c:control_collection s:shard1 r:core_node1 x:collection1] o.a.s.u.VersionInfo No terms found for _version_, cannot seed version bucket highest value from index
   [junit4]   2> 97329 INFO  (coreLoadExecutor-357-thread-1-processing-n:127.0.0.1:61831_) [n:127.0.0.1:61831_ c:control_collection s:shard1 r:core_node1 x:collection1] o.a.s.u.UpdateLog Could not find max version in index or recent updates, using new clock 1522599894999629824
   [junit4]   2> 97333 INFO  (coreLoadExecutor-357-thread-1-processing-n:127.0.0.1:61831_) [n:127.0.0.1:61831_ c:control_collection s:shard1 r:core_node1 x:collection1] o.a.s.u.UpdateLog Took 3.0ms to seed version buckets with highest version 1522599894999629824
   [junit4]   2> 97333 INFO  (coreLoadExecutor-357-thread-1-processing-n:127.0.0.1:61831_) [n:127.0.0.1:61831_ c:control_collection s:shard1 r:core_node1 x:collection1] o.a.s.c.ZkController watch zkdir /configs/conf1
   [junit4]   2> 97337 INFO  (coreLoadExecutor-357-thread-1-processing-n:127.0.0.1:61831_) [n:127.0.0.1:61831_ c:control_collection s:shard1 r:core_node1 x:collection1] o.a.s.c.CoreContainer registering core: collection1
   [junit4]   2> 97339 INFO  (coreZkRegister-351-thread-1-processing-n:127.0.0.1:61831_ x:collection1 s:shard1 c:control_collection r:core_node1) [n:127.0.0.1:61831_ c:control_collection s:shard1 r:core_node1 x:collection1] o.a.s.c.ZkController Register replica - core:collection1 address:https://127.0.0.1:61831 collection:control_collection shard:shard1
   [junit4]   2> 97341 INFO  (coreZkRegister-351-thread-1-processing-n:127.0.0.1:61831_ x:collection1 s:shard1 c:control_collection r:core_node1) [n:127.0.0.1:61831_ c:control_collection s:shard1 r:core_node1 x:collection1] o.a.s.c.c.SolrZkClient makePath: /collections/control_collection/leader_elect/shard1/election
   [junit4]   2> 97349 INFO  (coreZkRegister-351-thread-1-processing-n:127.0.0.1:61831_ x:collection1 s:shard1 c:control_collection r:core_node1) [n:127.0.0.1:61831_ c:control_collection s:shard1 r:core_node1 x:collection1] o.a.s.c.LeaderElector Joined leadership election with path: /collections/control_collection/leader_elect/shard1/election/95162493294215173-core_node1-n_0000000000
   [junit4]   2> 97350 INFO  (coreZkRegister-351-thread-1-processing-n:127.0.0.1:61831_ x:collection1 s:shard1 c:control_collection r:core_node1) [n:127.0.0.1:61831_ c:control_collection s:shard1 r:core_node1 x:collection1] o.a.s.c.ShardLeaderElectionContext Running the leader process for shard=shard1 and weAreReplacement=false and leaderVoteWait=180000
   [junit4]   2> 97353 INFO  (coreZkRegister-351-thread-1-processing-n:127.0.0.1:61831_ x:collection1 s:shard1 c:control_collection r:core_node1) [n:127.0.0.1:61831_ c:control_collection s:shard1 r:core_node1 x:collection1] o.a.s.c.ShardLeaderElectionContext Enough replicas found to continue.
   [junit4]   2> 97353 INFO  (coreZkRegister-351-thread-1-processing-n:127.0.0.1:61831_ x:collection1 s:shard1 c:control_collection r:core_node1) [n:127.0.0.1:61831_ c:control_collection s:shard1 r:core_node1 x:collection1] o.a.s.c.ShardLeaderElectionContext I may be the new leader - try and sync
   [junit4]   2> 97353 INFO  (coreZkRegister-351-thread-1-processing-n:127.0.0.1:61831_ x:collection1 s:shard1 c:control_collection r:core_node1) [n:127.0.0.1:61831_ c:control_collection s:shard1 r:core_node1 x:collection1] o.a.s.c.SyncStrategy Sync replicas to https://127.0.0.1:61831/collection1/
   [junit4]   2> 97353 INFO  (coreZkRegister-351-thread-1-processing-n:127.0.0.1:61831_ x:collection1 s:shard1 c:control_collection r:core_node1) [n:127.0.0.1:61831_ c:control_collection s:shard1 r:core_node1 x:collection1] o.a.s.c.SyncStrategy Sync Success - now sync replicas to me
   [junit4]   2> 97353 INFO  (coreZkRegister-351-thread-1-processing-n:127.0.0.1:61831_ x:collection1 s:shard1 c:control_collection r:core_node1) [n:127.0.0.1:61831_ c:control_collection s:shard1 r:core_node1 x:collection1] o.a.s.c.SyncStrategy https://127.0.0.1:61831/collection1/ has no replicas
   [junit4]   2> 97354 INFO  (coreZkRegister-351-thread-1-processing-n:127.0.0.1:61831_ x:collection1 s:shard1 c:control_collection r:core_node1) [n:127.0.0.1:61831_ c:control_collection s:shard1 r:core_node1 x:collection1] o.a.s.c.c.SolrZkClient makePath: /collections/control_collection/leaders/shard1
   [junit4]   2> 97355 INFO  (OverseerStateUpdate-95162493294215173-127.0.0.1:61831_-n_0000000000) [n:127.0.0.1:61831_    ] o.a.s.c.Overseer processMessage: queueSize: 1, message = {
   [junit4]   2>   "operation":"leader",
   [junit4]   2>   "shard":"shard1",
   [junit4]   2>   "collection":"control_collection"} current state version: 1
   [junit4]   2> 97359 INFO  (coreZkRegister-351-thread-1-processing-n:127.0.0.1:61831_ x:collection1 s:shard1 c:control_collection r:core_node1) [n:127.0.0.1:61831_ c:control_collection s:shard1 r:core_node1 x:collection1] o.a.s.c.ShardLeaderElectionContextBase Creating leader registration node
   [junit4]   2> 97363 INFO  (coreZkRegister-351-thread-1-processing-n:127.0.0.1:61831_ x:collection1 s:shard1 c:control_collection r:core_node1) [n:127.0.0.1:61831_ c:control_collection s:shard1 r:core_node1 x:collection1] o.a.s.c.ShardLeaderElectionContext I am the new leader: https://127.0.0.1:61831/collection1/ shard1
   [junit4]   2> 97365 INFO  (OverseerStateUpdate-95162493294215173-127.0.0.1:61831_-n_0000000000) [n:127.0.0.1:61831_    ] o.a.s.c.Overseer processMessage: queueSize: 1, message = {
   [junit4]   2>   "operation":"leader",
   [junit4]   2>   "shard":"shard1",
   [junit4]   2>   "collection":"control_collection",
   [junit4]   2>   "base_url":"https://127.0.0.1:61831",
   [junit4]   2>   "core":"collection1",
   [junit4]   2>   "state":"active"} current state version: 1
   [junit4]   2> 97470 INFO  (zkCallback-92-thread-1-processing-n:127.0.0.1:61831_) [n:127.0.0.1:61831_    ] o.a.s.c.c.ZkStateReader A cluster state change: [WatchedEvent state:SyncConnected type:NodeDataChanged path:/clusterstate.json], has occurred - updating... (live nodes size: [1])
   [junit4]   2> 97518 INFO  (coreZkRegister-351-thread-1-processing-n:127.0.0.1:61831_ x:collection1 s:shard1 c:control_collection r:core_node1) [n:127.0.0.1:61831_ c:control_collection s:shard1 r:core_node1 x:collection1] o.a.s.c.ZkController We are https://127.0.0.1:61831/collection1/ and leader is https://127.0.0.1:61831/collection1/
   [junit4]   2> 97518 INFO  (coreZkRegister-351-thread-1-processing-n:127.0.0.1:61831_ x:collection1 s:shard1 c:control_collection r:core_node1) [n:127.0.0.1:61831_ c:control_collection s:shard1 r:core_node1 x:collection1] o.a.s.c.ZkController No LogReplay needed for core=collection1 baseURL=https://127.0.0.1:61831
   [junit4]   2> 97518 INFO  (coreZkRegister-351-thread-1-processing-n:127.0.0.1:61831_ x:collection1 s:shard1 c:control_collection r:core_node1) [n:127.0.0.1:61831_ c:control_collection s:shard1 r:core_node1 x:collection1] o.a.s.c.ZkController I am the leader, no recovery necessary
   [junit4]   2> 97519 INFO  (coreZkRegister-351-thread-1-processing-n:127.0.0.1:61831_ x:collection1 s:shard1 c:control_collection r:core_node1) [n:127.0.0.1:61831_ c:control_collection s:shard1 r:core_node1 x:collection1] o.a.s.c.ZkController publishing state=active
   [junit4]   2> 97519 INFO  (coreZkRegister-351-thread-1-processing-n:127.0.0.1:61831_ x:collection1 s:shard1 c:control_collection r:core_node1) [n:127.0.0.1:61831_ c:control_collection s:shard1 r:core_node1 x:collection1] o.a.s.c.ZkController numShards not found on descriptor - reading it from system property
   [junit4]   2> 97523 INFO  (OverseerStateUpdate-95162493294215173-127.0.0.1:61831_-n_0000000000) [n:127.0.0.1:61831_    ] o.a.s.c.Overseer processMessage: queueSize: 1, message = {
   [junit4]   2>   "core":"collection1",
   [junit4]   2>   "core_node_name":"core_node1",
   [junit4]   2>   "roles":null,
   [junit4]   2>   "base_url":"https://127.0.0.1:61831",
   [junit4]   2>   "node_name":"127.0.0.1:61831_",
   [junit4]   2>   "numShards":"1",
   [junit4]   2>   "state":"active",
   [junit4]   2>   "shard":"shard1",
   [junit4]   2>   "collection":"control_collection",
   [junit4]   2>   "operation":"state"} current state version: 2
   [junit4]   2> 97524 INFO  (OverseerStateUpdate-95162493294215173-127.0.0.1:61831_-n_0000000000) [n:127.0.0.1:61831_    ] o.a.s.c.o.ReplicaMutator Update state numShards=1 message={
   [junit4]   2>   "core":"collection1",
   [junit4]   2>   "core_node_name":"core_node1",
   [junit4]   2>   "roles":null,
   [junit4]   2>   "base_url":"https://127.0.0.1:61831",
   [junit4]   2>   "node_name":"127.0.0.1:61831_",
   [junit4]   2>   "numShards":"1",
   [junit4]   2>   "state":"active",
   [junit4]   2>   "shard":"shard1",
   [junit4]   2>   "collection":"control_collection",
   [junit4]   2>   "operation":"state"}
   [junit4]   2> 97605 INFO  (TEST-CollectionsAPIDistributedZkTest.test-seed#[A2A827B1B8FD3003]) [    ] o.a.s.c.c.SolrZkClient Using default ZkCredentialsProvider
   [junit4]   2> 97605 INFO  (TEST-CollectionsAPIDistributedZkTest.test-seed#[A2A827B1B8FD3003]) [    ] o.a.s.c.c.ConnectionManager Waiting for client to connect to ZooKeeper
   [junit4]   2> 97608 INFO  (zkCallback-94-thread-1) [    ] o.a.s.c.c.ConnectionManager Watcher org.apache.solr.common.cloud.ConnectionManager@705d3d86 name:ZooKeeperConnection Watcher:127.0.0.1:61806/solr got event WatchedEvent state:SyncConnected type:None path:null path:null type:None
   [junit4]   2> 97608 INFO  (TEST-CollectionsAPIDistributedZkTest.test-seed#[A2A827B1B8FD3003]) [    ] o.a.s.c.c.ConnectionManager Client is connected to ZooKeeper
   [junit4]   2> 97609 INFO  (TEST-CollectionsAPIDistributedZkTest.test-seed#[A2A827B1B8FD3003]) [    ] o.a.s.c.c.SolrZkClient Using default ZkACLProvider
   [junit4]   2> 97609 INFO  (TEST-CollectionsAPIDistributedZkTest.test-seed#[A2A827B1B8FD3003]) [    ] o.a.s.c.c.ZkStateReader Updating cluster state from ZooKeeper... 
   [junit4]   2> 97614 INFO  (TEST-CollectionsAPIDistributedZkTest.test-seed#[A2A827B1B8FD3003]) [    ] o.a.s.c.ChaosMonkey monkey: init - expire sessions:false cause connection loss:false
   [junit4]   2> 97615 INFO  (TEST-CollectionsAPIDistributedZkTest.test-seed#[A2A827B1B8FD3003]) [    ] o.a.s.c.AbstractFullDistribZkTestBase Creating collection1 with stateFormat=2
   [junit4]   2> 97615 INFO  (TEST-CollectionsAPIDistributedZkTest.test-seed#[A2A827B1B8FD3003]) [    ] o.a.s.c.c.SolrZkClient Using default ZkCredentialsProvider
   [junit4]   2> 97615 INFO  (TEST-CollectionsAPIDistributedZkTest.test-seed#[A2A827B1B8FD3003]) [    ] o.a.s.c.c.ConnectionManager Waiting for client to connect to ZooKeeper
   [junit4]   2> 97618 INFO  (zkCallback-95-thread-1) [    ] o.a.s.c.c.ConnectionManager Watcher org.apache.solr.common.cloud.ConnectionManager@16ee327 name:ZooKeeperConnection Watcher:127.0.0.1:61806/solr got event WatchedEvent state:SyncConnected type:None path:null path:null type:None
   [junit4]   2> 97618 INFO  (TEST-CollectionsAPIDistributedZkTest.test-seed#[A2A827B1B8FD3003]) [    ] o.a.s.c.c.ConnectionManager Client is connected to ZooKeeper
   [junit4]   2> 97618 INFO  (TEST-CollectionsAPIDistributedZkTest.test-seed#[A2A827B1B8FD3003]) [    ] o.a.s.c.c.SolrZkClient Using default ZkACLProvider
   [junit4]   2> 97623 INFO  (OverseerStateUpdate-95162493294215173-127.0.0.1:61831_-n_0000000000) [n:127.0.0.1:61831_    ] o.a.s.c.Overseer processMessage: queueSize: 1, message = {
   [junit4]   2>   "operation":"create",
   [junit4]   2>   "name":"collection1",
   [junit4]   2>   "numShards":"2",
   [junit4]   2>   "stateFormat":"2"} current state version: 2
   [junit4]   2> 97623 INFO  (OverseerStateUpdate-95162493294215173-127.0.0.1:61831_-n_0000000000) [n:127.0.0.1:61831_    ] o.a.s.c.o.ClusterStateMutator building a new cName: collection1
   [junit4]   2> 97629 INFO  (zkCallback-94-thread-1) [    ] o.a.s.c.c.ZkStateReader A cluster state change: [WatchedEvent state:SyncConnected type:NodeDataChanged path:/clusterstate.json], has occurred - updating... (live nodes size: [1])
   [junit4]   2> 97631 INFO  (zkCallback-92-thread-1-processing-n:127.0.0.1:61831_) [n:127.0.0.1:61831_    ] o.a.s.c.c.ZkStateReader A cluster state change: [WatchedEvent state:SyncConnected type:NodeDataChanged path:/clusterstate.json], has occurred - updating... (live nodes size: [1])
   [junit4]   2> 97731 INFO  (OverseerStateUpdate-95162493294215173-127.0.0.1:61831_-n_0000000000) [n:127.0.0.1:61831_    ] o.a.s.c.o.ZkStateWriter going to create_collection /collections/collection1/state.json
   [junit4]   2> 97854 INFO  (TEST-CollectionsAPIDistributedZkTest.test-seed#[A2A827B1B8FD3003]) [    ] o.a.s.SolrTestCaseJ4 Writing core.properties file to /Users/jenkins/workspace/Lucene-Solr-trunk-MacOSX/solr/build/solr-core/test/J1/temp/solr.cloud.CollectionsAPIDistributedZkTest_A2A827B1B8FD3003-001/shard-1-001/cores/collection1
   [junit4]   2> 97856 INFO  (TEST-CollectionsAPIDistributedZkTest.test-seed#[A2A827B1B8FD3003]) [    ] o.a.s.c.AbstractFullDistribZkTestBase create jetty 1 in directory /Users/jenkins/workspace/Lucene-Solr-trunk-MacOSX/solr/build/solr-core/test/J1/temp/solr.cloud.CollectionsAPIDistributedZkTest_A2A827B1B8FD3003-001/shard-1-001
   [junit4]   2> 97859 INFO  (TEST-CollectionsAPIDistributedZkTest.test-seed#[A2A827B1B8FD3003]) [    ] o.e.j.s.Server jetty-9.3.6.v20151106
   [junit4]   2> 97862 INFO  (TEST-CollectionsAPIDistributedZkTest.test-seed#[A2A827B1B8FD3003]) [    ] o.e.j.s.h.ContextHandler Started o.e.j.s.ServletContextHandler@4e2ff924{/,null,AVAILABLE}
   [junit4]   2> 97864 INFO  (TEST-CollectionsAPIDistributedZkTest.test-seed#[A2A827B1B8FD3003]) [    ] o.e.j.u.s.SslContextFactory x509=X509@74d6f11d(solrtest,h=[],w=[]) for SslContextFactory@7f159df0(file:///Users/jenkins/workspace/Lucene-Solr-trunk-MacOSX/solr/server/etc/test/solrtest.keystore,file:///Users/jenkins/workspace/Lucene-Solr-trunk-MacOSX/solr/server/etc/test/solrtest.keystore)
   [junit4]   2> 97869 INFO  (TEST-CollectionsAPIDistributedZkTest.test-seed#[A2A827B1B8FD3003]) [    ] o.e.j.s.ServerConnector Started ServerConnector@af56537{SSL,[ssl, http/1.1]}{127.0.0.1:61837}
   [junit4]   2> 97869 INFO  (TEST-CollectionsAPIDistributedZkTest.test-seed#[A2A827B1B8FD3003]) [    ] o.e.j.s.Server Started @102225ms
   [junit4]   2> 97869 INFO  (TEST-CollectionsAPIDistributedZkTest.test-seed#[A2A827B1B8FD3003]) [    ] o.a.s.c.s.e.JettySolrRunner Jetty properties: {solr.data.dir=/Users/jenkins/workspace/Lucene-Solr-trunk-MacOSX/solr/build/solr-core/test/J1/temp/solr.cloud.CollectionsAPIDistributedZkTest_A2A827B1B8FD3003-001/tempDir-001/jetty1, solrconfig=solrconfig.xml, hostContext=/, hostPort=61837, coreRootDirectory=/Users/jenkins/workspace/Lucene-Solr-trunk-MacOSX/solr/build/solr-core/test/J1/../../../../../../../../../Users/jenkins/workspace/Lucene-Solr-trunk-MacOSX/solr/build/solr-core/test/J1/temp/solr.cloud.CollectionsAPIDistributedZkTest_A2A827B1B8FD3003-001/shard-1-001/cores}
   [junit4]   2> 97870 INFO  (TEST-CollectionsAPIDistributedZkTest.test-seed#[A2A827B1B8FD3003]) [    ] o.a.s.s.SolrDispatchFilter SolrDispatchFilter.init(): sun.misc.Launcher$AppClassLoader@74a14482
   [junit4]   2> 97870 INFO  (TEST-CollectionsAPIDistributedZkTest.test-seed#[A2A827B1B8FD3003]) [    ] o.a.s.c.SolrResourceLoader new SolrResourceLoader for directory: '/Users/jenkins/workspace/Lucene-Solr-trunk-MacOSX/solr/build/solr-core/test/J1/temp/solr.cloud.CollectionsAPIDistributedZkTest_A2A827B1B8FD3003-001/shard-1-001'
   [junit4]   2> 97870 INFO  (TEST-CollectionsAPIDistributedZkTest.test-seed#[A2A827B1B8FD3003]) [    ] o.a.s.c.SolrResourceLoader JNDI not configured for solr (NoInitialContextEx)
   [junit4]   2> 97870 INFO  (TEST-CollectionsAPIDistributedZkTest.test-seed#[A2A827B1B8FD3003]) [    ] o.a.s.c.SolrResourceLoader solr home defaulted to 'solr/' (could not find system property or JNDI)
   [junit4]   2> 97870 INFO  (TEST-CollectionsAPIDistributedZkTest.test-seed#[A2A827B1B8FD3003]) [    ] o.a.s.c.c.SolrZkClient Using default ZkCredentialsProvider
   [junit4]   2> 97871 INFO  (TEST-CollectionsAPIDistributedZkTest.test-seed#[A2A827B1B8FD3003]) [    ] o.a.s.c.c.ConnectionManager Waiting for client to connect to ZooKeeper
   [junit4]   2> 97874 INFO  (zkCallback-96-thread-1) [    ] o.a.s.c.c.ConnectionManager Watcher org.apache.solr.common.cloud.ConnectionManager@53778fff name:ZooKeeperConnection Watcher:127.0.0.1:61806/solr got event WatchedEvent state:SyncConnected type:None path:null path:null type:None
   [junit4]   2> 97874 INFO  (TEST-CollectionsAPIDistributedZkTest.test-seed#[A2A827B1B8FD3003]) [    ] o.a.s.c.c.ConnectionManager Client is connected to ZooKeeper
   [junit4]   2> 97875 INFO  (TEST-CollectionsAPIDistributedZkTest.test-seed#[A2A827B1B8FD3003]) [    ] o.a.s.c.c.SolrZkClient Using default ZkACLProvider
   [junit4]   2> 97879 INFO  (TEST-CollectionsAPIDistributedZkTest.test-seed#[A2A827B1B8FD3003]) [    ] o.a.s.s.SolrDispatchFilter Loading solr.xml from SolrHome (not found in ZooKeeper)
   [junit4]   2> 97879 INFO  (TEST-CollectionsAPIDistributedZkTest.test-seed#[A2A827B1B8FD3003]) [    ] o.a.s.c.SolrXmlConfig Loading container configuration from /Users/jenkins/workspace/Lucene-Solr-trunk-MacOSX/solr/build/solr-core/test/J1/temp/solr.cloud.CollectionsAPIDistributedZkTest_A2A827B1B8FD3003-001/shard-1-001/solr.xml
   [junit4]   2> 97885 INFO  (TEST-CollectionsAPIDistributedZkTest.test-seed#[A2A827B1B8FD3003]) [    ] o.a.s.c.CorePropertiesLocator Config-defined core root directory: /Users/jenkins/workspace/Lucene-Solr-trunk-MacOSX/solr/build/solr-core/test/J1/../../../../../../../../../Users/jenkins/workspace/Lucene-Solr-trunk-MacOSX/solr/build/solr-core/test/J1/temp/solr.cloud.CollectionsAPIDistributedZkTest_A2A827B1B8FD3003-001/shard-1-001/cores
   [junit4]   2> 97885 INFO  (TEST-CollectionsAPIDistributedZkTest.test-seed#[A2A827B1B8FD3003]) [    ] o.a.s.c.CoreContainer New CoreContainer 2069818175
   [junit4]   2> 97885 INFO  (TEST-CollectionsAPIDistributedZkTest.test-seed#[A2A827B1B8FD3003]) [    ] o.a.s.c.CoreContainer Loading cores into CoreContainer [instanceDir=/Users/jenkins/workspace/Lucene-Solr-trunk-MacOSX/solr/build/solr-core/test/J1/temp/solr.cloud.CollectionsAPIDistributedZkTest_A2A827B1B8FD3003-001/shard-1-001]
   [junit4]   2> 97886 WARN  (TEST-CollectionsAPIDistributedZkTest.test-seed#[A2A827B1B8FD3003]) [    ] o.a.s.c.CoreContainer Couldn't add files from /Users/jenkins/workspace/Lucene-Solr-trunk-MacOSX/solr/build/solr-core/test/J1/temp/solr.cloud.CollectionsAPIDistributedZkTest_A2A827B1B8FD3003-001/shard-1-001/lib to classpath: /Users/jenkins/workspace/Lucene-Solr-trunk-MacOSX/solr/build/solr-core/test/J1/temp/solr.cloud.CollectionsAPIDistributedZkTest_A2A827B1B8FD3003-001/shard-1-001/lib
   [junit4]   2> 97887 INFO  (TEST-CollectionsAPIDistributedZkTest.test-seed#[A2A827B1B8FD3003]) [    ] o.a.s.h.c.HttpShardHandlerFactory created with socketTimeout : 90000,urlScheme : ,connTimeout : 15000,maxConnectionsPerHost : 20,maxConnections : 10000,corePoolSize : 0,maximumPoolSize : 2147483647,maxThreadIdleTime : 5,sizeOfQueue : -1,fairnessPolicy : false,useRetries : false,
   [junit4]   2> 97890 INFO  (TEST-CollectionsAPIDistributedZkTest.test-seed#[A2A827B1B8FD3003]) [    ] o.a.s.u.UpdateShardHandler Creating UpdateShardHandler HTTP client with params: socketTimeout=340000&connTimeout=45000&retry=true
   [junit4]   2> 97893 INFO  (TEST-CollectionsAPIDistributedZkTest.test-seed#[A2A827B1B8FD3003]) [    ] o.a.s.l.LogWatcher SLF4J impl is org.slf4j.impl.Log4jLoggerFactory
   [junit4]   2> 97893 INFO  (TEST-CollectionsAPIDistributedZkTest.test-seed#[A2A827B1B8FD3003]) [    ] o.a.s.l.LogWatcher Registering Log Listener [Log4j (org.slf4j.impl.Log4jLoggerFactory)]
   [junit4]   2> 97893 INFO  (TEST-CollectionsAPIDistributedZkTest.test-seed#[A2A827B1B8FD3003]) [    ] o.a.s.c.ZkContainer Zookeeper client=127.0.0.1:61806/solr
   [junit4]   2> 97893 INFO  (TEST-CollectionsAPIDistributedZkTest.test-seed#[A2A827B1B8FD3003]) [    ] o.a.s.c.ZkController zkHost includes chroot
   [junit4]   2> 97893 INFO  (TEST-CollectionsAPIDistributedZkTest.test-seed#[A2A827B1B8FD3003]) [    ] o.a.s.c.c.SolrZkClient Using default ZkCredentialsProvider
   [junit4]   2> 97894 INFO  (TEST-CollectionsAPIDistributedZkTest.test-seed#[A2A827B1B8FD3003]) [    ] o.a.s.c.c.ConnectionManager Waiting for client to connect to ZooKeeper
   [junit4]   2> 97897 INFO  (zkCallback-99-thread-1) [    ] o.a.s.c.c.ConnectionManager Watcher org.apache.solr.common.cloud.ConnectionManager@1c4b4eab name:ZooKeeperConnection Watcher:127.0.0.1:61806 got event WatchedEvent state:SyncConnected type:None path:null path:null type:None
   [junit4]   2> 97897 INFO  (TEST-CollectionsAPIDistributedZkTest.test-seed#[A2A827B1B8FD3003]) [    ] o.a.s.c.c.ConnectionManager Client is connected to ZooKeeper
   [junit4]   2> 97898 INFO  (TEST-CollectionsAPIDistributedZkTest.test-seed#[A2A827B1B8FD3003]) [    ] o.a.s.c.c.SolrZkClient Using default ZkACLProvider
   [junit4]   2> 97902 INFO  (TEST-CollectionsAPIDistributedZkTest.test-seed#[A2A827B1B8FD3003]) [n:127.0.0.1:61837_    ] o.a.s.c.c.ConnectionManager Waiting for client to connect to ZooKeeper
   [junit4]   2> 97905 INFO  (zkCallback-100-thread-1-processing-n:127.0.0.1:61837_) [n:127.0.0.1:61837_    ] o.a.s.c.c.ConnectionManager Watcher org.apache.solr.common.cloud.ConnectionManager@dad460e name:ZooKeeperConnection Watcher:127.0.0.1:61806/solr got event WatchedEvent state:SyncConnected type:None path:null path:null type:None
   [junit4]   2> 97906 INFO  (TEST-CollectionsAPIDistributedZkTest.test-seed#[A2A827B1B8FD3003]) [n:127.0.0.1:61837_    ] o.a.s.c.c.ConnectionManager Client is connected to ZooKeeper
   [junit4]   2> 97919 INFO  (TEST-CollectionsAPIDistributedZkTest.test-seed#[A2A827B1B8FD3003]) [n:127.0.0.1:61837_    ] o.a.s.c.c.ZkStateReader Updating cluster state from ZooKeeper... 
   [junit4]   2> 98932 INFO  (TEST-CollectionsAPIDistributedZkTest.test-seed#[A2A827B1B8FD3003]) [n:127.0.0.1:61837_    ] o.a.s.c.ZkController Register node as live in ZooKeeper:/live_nodes/127.0.0.1:61837_
   [junit4]   2> 98933 INFO  (TEST-CollectionsAPIDistributedZkTest.test-seed#[A2A827B1B8FD3003]) [n:127.0.0.1:61837_    ] o.a.s.c.c.SolrZkClient makePath: /live_nodes/127.0.0.1:61837_
   [junit4]   2> 98936 INFO  (zkCallback-94-thread-1) [    ] o.a.s.c.c.ZkStateReader A live node change: [WatchedEvent state:SyncConnected type

[...truncated too long message...]

e [gettingstarted] Registered new searcher Searcher@2f101fa0[gettingstarted] main{ExitableDirectoryReader(UninvertingDirectoryReader())}
   [junit4]   2> 869294 INFO  (qtp612336368-5634) [    x:gettingstarted] o.a.s.u.UpdateLog Looking up max value of version field to seed version buckets
   [junit4]   2> 869294 INFO  (qtp612336368-5634) [    x:gettingstarted] o.a.s.u.VersionInfo Refreshing highest value of _version_ for 65536 version buckets from index
   [junit4]   2> 869294 INFO  (qtp612336368-5634) [    x:gettingstarted] o.a.s.u.VersionInfo No terms found for _version_, cannot seed version bucket highest value from index
   [junit4]   2> 869294 INFO  (qtp612336368-5634) [    x:gettingstarted] o.a.s.u.UpdateLog Could not find max version in index or recent updates, using new clock 1522600704049414144
   [junit4]   2> 869296 INFO  (qtp612336368-5634) [    x:gettingstarted] o.a.s.u.UpdateLog Took 2.0ms to seed version buckets with highest version 1522600704049414144
   [junit4]   2> 869296 INFO  (qtp612336368-5634) [    x:gettingstarted] o.a.s.c.CoreContainer registering core: gettingstarted
   [junit4]   2> 869297 INFO  (qtp612336368-5634) [    x:gettingstarted] o.a.s.s.HttpSolrCall [admin] webapp=null path=/admin/cores params={name=gettingstarted&action=CREATE&instanceDir=gettingstarted&wt=json} status=0 QTime=487
   [junit4]   2> 869300 INFO  (TEST-TestSolrCLIRunExample.testSchemalessExample-seed#[A2A827B1B8FD3003]) [    ] o.e.j.s.ServerConnector Stopped ServerConnector@d2f487{HTTP/1.1,[http/1.1]}{127.0.0.1:64700}
   [junit4]   2> 869300 INFO  (TEST-TestSolrCLIRunExample.testSchemalessExample-seed#[A2A827B1B8FD3003]) [    ] o.a.s.c.CoreContainer Shutting down CoreContainer instance=107004660
   [junit4]   2> 869301 INFO  (TEST-TestSolrCLIRunExample.testSchemalessExample-seed#[A2A827B1B8FD3003]) [    x:gettingstarted] o.a.s.c.SolrCore [gettingstarted]  CLOSING SolrCore org.apache.solr.core.SolrCore@507dfa0b
   [junit4]   2> 869301 INFO  (TEST-TestSolrCLIRunExample.testSchemalessExample-seed#[A2A827B1B8FD3003]) [    x:gettingstarted] o.a.s.u.DirectUpdateHandler2 closing DirectUpdateHandler2{commits=0,autocommit maxTime=15000ms,autocommits=0,soft autocommits=0,optimizes=0,rollbacks=0,expungeDeletes=0,docsPending=0,adds=0,deletesById=0,deletesByQuery=0,errors=0,cumulative_adds=0,cumulative_deletesById=0,cumulative_deletesByQuery=0,cumulative_errors=0,transaction_logs_total_size=0,transaction_logs_total_number=0}
   [junit4]   2> 869302 INFO  (TEST-TestSolrCLIRunExample.testSchemalessExample-seed#[A2A827B1B8FD3003]) [    x:gettingstarted] o.a.s.u.SolrCoreState Closing SolrCoreState
   [junit4]   2> 869302 INFO  (TEST-TestSolrCLIRunExample.testSchemalessExample-seed#[A2A827B1B8FD3003]) [    x:gettingstarted] o.a.s.u.DefaultSolrCoreState SolrCoreState ref count has reached 0 - closing IndexWriter
   [junit4]   2> 869302 INFO  (TEST-TestSolrCLIRunExample.testSchemalessExample-seed#[A2A827B1B8FD3003]) [    x:gettingstarted] o.a.s.u.DefaultSolrCoreState closing IndexWriter with IndexWriterCloser
   [junit4]   2> 869303 INFO  (TEST-TestSolrCLIRunExample.testSchemalessExample-seed#[A2A827B1B8FD3003]) [    x:gettingstarted] o.a.s.c.SolrCore [gettingstarted] Closing main searcher on request.
   [junit4]   2> 869316 INFO  (TEST-TestSolrCLIRunExample.testSchemalessExample-seed#[A2A827B1B8FD3003]) [    x:gettingstarted] o.a.s.c.CachingDirectoryFactory Closing MockDirectoryFactory - 2 directories currently being tracked
   [junit4]   2> 869317 INFO  (TEST-TestSolrCLIRunExample.testSchemalessExample-seed#[A2A827B1B8FD3003]) [    x:gettingstarted] o.a.s.c.CachingDirectoryFactory looking to close /Users/jenkins/workspace/Lucene-Solr-trunk-MacOSX/solr/build/solr-core/test/J0/temp/solr.util.TestSolrCLIRunExample_A2A827B1B8FD3003-001/tempDir-003/schemaless/solr/gettingstarted/data [CachedDir<<refCount=0;path=/Users/jenkins/workspace/Lucene-Solr-trunk-MacOSX/solr/build/solr-core/test/J0/temp/solr.util.TestSolrCLIRunExample_A2A827B1B8FD3003-001/tempDir-003/schemaless/solr/gettingstarted/data;done=false>>]
   [junit4]   2> 869317 INFO  (TEST-TestSolrCLIRunExample.testSchemalessExample-seed#[A2A827B1B8FD3003]) [    x:gettingstarted] o.a.s.c.CachingDirectoryFactory Closing directory: /Users/jenkins/workspace/Lucene-Solr-trunk-MacOSX/solr/build/solr-core/test/J0/temp/solr.util.TestSolrCLIRunExample_A2A827B1B8FD3003-001/tempDir-003/schemaless/solr/gettingstarted/data
   [junit4]   2> 869317 INFO  (TEST-TestSolrCLIRunExample.testSchemalessExample-seed#[A2A827B1B8FD3003]) [    x:gettingstarted] o.a.s.c.CachingDirectoryFactory looking to close /Users/jenkins/workspace/Lucene-Solr-trunk-MacOSX/solr/build/solr-core/test/J0/temp/solr.util.TestSolrCLIRunExample_A2A827B1B8FD3003-001/tempDir-003/schemaless/solr/gettingstarted/data/index [CachedDir<<refCount=0;path=/Users/jenkins/workspace/Lucene-Solr-trunk-MacOSX/solr/build/solr-core/test/J0/temp/solr.util.TestSolrCLIRunExample_A2A827B1B8FD3003-001/tempDir-003/schemaless/solr/gettingstarted/data/index;done=false>>]
   [junit4]   2> 869317 INFO  (TEST-TestSolrCLIRunExample.testSchemalessExample-seed#[A2A827B1B8FD3003]) [    x:gettingstarted] o.a.s.c.CachingDirectoryFactory Closing directory: /Users/jenkins/workspace/Lucene-Solr-trunk-MacOSX/solr/build/solr-core/test/J0/temp/solr.util.TestSolrCLIRunExample_A2A827B1B8FD3003-001/tempDir-003/schemaless/solr/gettingstarted/data/index
   [junit4]   2> 869318 INFO  (TEST-TestSolrCLIRunExample.testSchemalessExample-seed#[A2A827B1B8FD3003]) [    x:gettingstarted] o.e.j.s.h.ContextHandler Stopped o.e.j.s.ServletContextHandler@7f2e89e9{/solr,null,UNAVAILABLE}
   [junit4]   2> 869321 INFO  (TEST-TestSolrCLIRunExample.testSchemalessExample-seed#[A2A827B1B8FD3003]) [    ] o.a.s.u.TestSolrCLIRunExample Stopped standalone Solr instance running on port 64700
   [junit4]   2> 869321 INFO  (TEST-TestSolrCLIRunExample.testSchemalessExample-seed#[A2A827B1B8FD3003]) [    ] o.a.s.SolrTestCaseJ4 ###Ending testSchemalessExample
   [junit4]   2> 869321 INFO  (SUITE-TestSolrCLIRunExample-seed#[A2A827B1B8FD3003]-worker) [    ] o.a.s.SolrTestCaseJ4 ###deleteCore
   [junit4]   2> NOTE: leaving temporary files on disk at: /Users/jenkins/workspace/Lucene-Solr-trunk-MacOSX/solr/build/solr-core/test/J0/temp/solr.util.TestSolrCLIRunExample_A2A827B1B8FD3003-001
   [junit4]   2> NOTE: test params are: codec=FastCompressingStoredFields(storedFieldsFormat=CompressingStoredFieldsFormat(compressionMode=FAST, chunkSize=1, maxDocsPerChunk=509, blockSize=1006), termVectorsFormat=CompressingTermVectorsFormat(compressionMode=FAST, chunkSize=1, blockSize=1006)), sim=RandomSimilarityProvider(queryNorm=false,coord=crazy): {}, locale=es_BO, timezone=Australia/NSW
   [junit4]   2> NOTE: Mac OS X 10.8.5 x86_64/Oracle Corporation 1.8.0_66 (64-bit)/cpus=3,threads=1,free=328371024,total=536870912
   [junit4]   2> NOTE: All tests run in this JVM: [CircularListTest, TestCSVLoader, PathHierarchyTokenizerFactoryTest, TestLFUCache, TestHighFrequencyDictionaryFactory, TestGroupingSearch, SolrCoreTest, RecoveryAfterSoftCommitTest, TestDocumentBuilder, TestSchemaVersionResource, RankQueryTest, TestExactStatsCache, TestDistribIDF, CachingDirectoryFactoryTest, TestFastLRUCache, TestReplicationHandler, TestJmxMonitoredMap, CurrencyFieldXmlFileTest, TestFieldTypeResource, ClusterStateUpdateTest, TestCodecSupport, CursorPagingTest, TestFaceting, OutOfBoxZkACLAndCredentialsProvidersTest, SyncSliceTest, CoreAdminRequestStatusTest, MBeansHandlerTest, TestIBSimilarityFactory, RegexBoostProcessorTest, TestMissingGroups, TestDocSet, ChangedSchemaMergeTest, TestPhraseSuggestions, PeerSyncTest, PingRequestHandlerTest, TestRandomRequestDistribution, TestSQLHandler, SampleTest, AsyncCallRequestStatusResponseTest, UUIDFieldTest, HdfsBasicDistributedZkTest, TestCursorMarkWithoutUniqueKey, TestDistributedSearch, PolyFieldTest, TestClassNameShortening, TestCloudSchemaless, TermsComponentTest, TestReloadDeadlock, TestPseudoReturnFields, JSONWriterTest, SolrRequestParserTest, CleanupOldIndexTest, SoftAutoCommitTest, DistributedFacetPivotLongTailTest, TestFieldResource, TestDynamicLoading, TestDownShardTolerantSearch, AnalyticsMergeStrategyTest, FastVectorHighlighterTest, DocValuesTest, TestConfigReload, URLClassifyProcessorTest, CdcrReplicationHandlerTest, SimpleFacetsTest, TestManagedSynonymFilterFactory, UUIDUpdateProcessorFallbackTest, HdfsChaosMonkeySafeLeaderTest, TestComponentsName, TestQuerySenderNoQuery, ResponseHeaderTest, TimeZoneUtilsTest, TestUniqueKeyFieldResource, HdfsSyncSliceTest, InfoHandlerTest, TestPerFieldSimilarityClassic, BlockDirectoryTest, TestSolrCLIRunExample]
   [junit4] Completed [161/573 (2!)] on J0 in 29.77s, 3 tests, 1 error, 1 skipped <<< FAILURES!

[...truncated 1332 lines...]
BUILD FAILED
/Users/jenkins/workspace/Lucene-Solr-trunk-MacOSX/build.xml:784: The following error occurred while executing this line:
/Users/jenkins/workspace/Lucene-Solr-trunk-MacOSX/build.xml:728: The following error occurred while executing this line:
/Users/jenkins/workspace/Lucene-Solr-trunk-MacOSX/build.xml:59: The following error occurred while executing this line:
/Users/jenkins/workspace/Lucene-Solr-trunk-MacOSX/solr/build.xml:233: The following error occurred while executing this line:
/Users/jenkins/workspace/Lucene-Solr-trunk-MacOSX/solr/common-build.xml:516: The following error occurred while executing this line:
/Users/jenkins/workspace/Lucene-Solr-trunk-MacOSX/lucene/common-build.xml:1424: The following error occurred while executing this line:
/Users/jenkins/workspace/Lucene-Solr-trunk-MacOSX/lucene/common-build.xml:981: There were test failures: 573 suites (8 ignored), 2284 tests, 2 errors, 119 ignored (69 assumptions) [seed: A2A827B1B8FD3003]

Total time: 69 minutes 41 seconds
Build step 'Invoke Ant' marked build as failure
Archiving artifacts
[WARNINGS] Skipping publisher since build result is FAILURE
Recording test results
Email was triggered for: Failure - Any
Sending email for trigger: Failure - Any



Mime
View raw message