lucene-dev mailing list archives

Site index · List index
Message view « Date » · « Thread »
Top « Date » · « Thread »
From Policeman Jenkins Server <jenk...@thetaphi.de>
Subject [JENKINS] Lucene-Solr-trunk-Windows (32bit/jdk1.8.0_66) - Build # 5561 - Failure!
Date Sat, 23 Jan 2016 11:27:50 GMT
Build: http://jenkins.thetaphi.de/job/Lucene-Solr-trunk-Windows/5561/
Java: 32bit/jdk1.8.0_66 -client -XX:+UseG1GC

1 tests failed.
FAILED:  org.apache.solr.update.AutoCommitTest.testCommitWithin

Error Message:
Exception during query

Stack Trace:
java.lang.RuntimeException: Exception during query
	at __randomizedtesting.SeedInfo.seed([492941F0730FC0F2:F3FB2E88F0212EE7]:0)
	at org.apache.solr.SolrTestCaseJ4.assertQ(SolrTestCaseJ4.java:755)
	at org.apache.solr.update.AutoCommitTest.testCommitWithin(AutoCommitTest.java:326)
	at sun.reflect.NativeMethodAccessorImpl.invoke0(Native Method)
	at sun.reflect.NativeMethodAccessorImpl.invoke(NativeMethodAccessorImpl.java:62)
	at sun.reflect.DelegatingMethodAccessorImpl.invoke(DelegatingMethodAccessorImpl.java:43)
	at java.lang.reflect.Method.invoke(Method.java:497)
	at com.carrotsearch.randomizedtesting.RandomizedRunner.invoke(RandomizedRunner.java:1764)
	at com.carrotsearch.randomizedtesting.RandomizedRunner$8.evaluate(RandomizedRunner.java:871)
	at com.carrotsearch.randomizedtesting.RandomizedRunner$9.evaluate(RandomizedRunner.java:907)
	at com.carrotsearch.randomizedtesting.RandomizedRunner$10.evaluate(RandomizedRunner.java:921)
	at com.carrotsearch.randomizedtesting.rules.SystemPropertiesRestoreRule$1.evaluate(SystemPropertiesRestoreRule.java:57)
	at org.apache.lucene.util.TestRuleSetupTeardownChained$1.evaluate(TestRuleSetupTeardownChained.java:50)
	at org.apache.lucene.util.AbstractBeforeAfterRule$1.evaluate(AbstractBeforeAfterRule.java:46)
	at org.apache.lucene.util.TestRuleThreadAndTestName$1.evaluate(TestRuleThreadAndTestName.java:49)
	at org.apache.lucene.util.TestRuleIgnoreAfterMaxFailures$1.evaluate(TestRuleIgnoreAfterMaxFailures.java:65)
	at org.apache.lucene.util.TestRuleMarkFailure$1.evaluate(TestRuleMarkFailure.java:48)
	at com.carrotsearch.randomizedtesting.rules.StatementAdapter.evaluate(StatementAdapter.java:36)
	at com.carrotsearch.randomizedtesting.ThreadLeakControl$StatementRunner.run(ThreadLeakControl.java:367)
	at com.carrotsearch.randomizedtesting.ThreadLeakControl.forkTimeoutingTask(ThreadLeakControl.java:809)
	at com.carrotsearch.randomizedtesting.ThreadLeakControl$3.evaluate(ThreadLeakControl.java:460)
	at com.carrotsearch.randomizedtesting.RandomizedRunner.runSingleTest(RandomizedRunner.java:880)
	at com.carrotsearch.randomizedtesting.RandomizedRunner$5.evaluate(RandomizedRunner.java:781)
	at com.carrotsearch.randomizedtesting.RandomizedRunner$6.evaluate(RandomizedRunner.java:816)
	at com.carrotsearch.randomizedtesting.RandomizedRunner$7.evaluate(RandomizedRunner.java:827)
	at com.carrotsearch.randomizedtesting.rules.StatementAdapter.evaluate(StatementAdapter.java:36)
	at com.carrotsearch.randomizedtesting.rules.SystemPropertiesRestoreRule$1.evaluate(SystemPropertiesRestoreRule.java:57)
	at org.apache.lucene.util.AbstractBeforeAfterRule$1.evaluate(AbstractBeforeAfterRule.java:46)
	at com.carrotsearch.randomizedtesting.rules.StatementAdapter.evaluate(StatementAdapter.java:36)
	at org.apache.lucene.util.TestRuleStoreClassName$1.evaluate(TestRuleStoreClassName.java:42)
	at com.carrotsearch.randomizedtesting.rules.NoShadowingOrOverridesOnMethodsRule$1.evaluate(NoShadowingOrOverridesOnMethodsRule.java:40)
	at com.carrotsearch.randomizedtesting.rules.NoShadowingOrOverridesOnMethodsRule$1.evaluate(NoShadowingOrOverridesOnMethodsRule.java:40)
	at com.carrotsearch.randomizedtesting.rules.StatementAdapter.evaluate(StatementAdapter.java:36)
	at com.carrotsearch.randomizedtesting.rules.StatementAdapter.evaluate(StatementAdapter.java:36)
	at com.carrotsearch.randomizedtesting.rules.StatementAdapter.evaluate(StatementAdapter.java:36)
	at org.apache.lucene.util.TestRuleAssertionsRequired$1.evaluate(TestRuleAssertionsRequired.java:54)
	at org.apache.lucene.util.TestRuleMarkFailure$1.evaluate(TestRuleMarkFailure.java:48)
	at org.apache.lucene.util.TestRuleIgnoreAfterMaxFailures$1.evaluate(TestRuleIgnoreAfterMaxFailures.java:65)
	at org.apache.lucene.util.TestRuleIgnoreTestSuites$1.evaluate(TestRuleIgnoreTestSuites.java:55)
	at com.carrotsearch.randomizedtesting.rules.StatementAdapter.evaluate(StatementAdapter.java:36)
	at com.carrotsearch.randomizedtesting.ThreadLeakControl$StatementRunner.run(ThreadLeakControl.java:367)
	at java.lang.Thread.run(Thread.java:745)
Caused by: java.lang.RuntimeException: REQUEST FAILED: xpath=//result[@numFound=1]
	xml response was: <?xml version="1.0" encoding="UTF-8"?>
<response>
<lst name="responseHeader"><int name="status">0</int><int name="QTime">0</int></lst><result name="response" numFound="0" start="0"></result>
</response>

	request was:q=id:529&qt=standard&start=0&rows=20&version=2.2
	at org.apache.solr.SolrTestCaseJ4.assertQ(SolrTestCaseJ4.java:748)
	... 40 more




Build Log:
[...truncated 9510 lines...]
   [junit4] Suite: org.apache.solr.update.AutoCommitTest
   [junit4]   2> Creating dataDir: C:\Users\JenkinsSlave\workspace\Lucene-Solr-trunk-Windows\solr\build\solr-core\test\J1\temp\solr.update.AutoCommitTest_492941F0730FC0F2-001\init-core-data-001
   [junit4]   2> 408804 INFO  (SUITE-AutoCommitTest-seed#[492941F0730FC0F2]-worker) [    ] o.a.s.SolrTestCaseJ4 Randomized ssl (false) and clientAuth (false)
   [junit4]   2> 408806 INFO  (SUITE-AutoCommitTest-seed#[492941F0730FC0F2]-worker) [    ] o.a.s.SolrTestCaseJ4 ####initCore
   [junit4]   2> 408807 INFO  (SUITE-AutoCommitTest-seed#[492941F0730FC0F2]-worker) [    ] o.a.s.c.SolrResourceLoader new SolrResourceLoader for directory: 'C:\Users\JenkinsSlave\workspace\Lucene-Solr-trunk-Windows\solr\core\src\test-files\solr\collection1'
   [junit4]   2> 408807 INFO  (SUITE-AutoCommitTest-seed#[492941F0730FC0F2]-worker) [    ] o.a.s.c.SolrResourceLoader JNDI not configured for solr (NoInitialContextEx)
   [junit4]   2> 408807 INFO  (SUITE-AutoCommitTest-seed#[492941F0730FC0F2]-worker) [    ] o.a.s.c.SolrResourceLoader using system property solr.solr.home: C:\Users\JenkinsSlave\workspace\Lucene-Solr-trunk-Windows\solr\core\src\test-files\solr
   [junit4]   2> 408809 INFO  (SUITE-AutoCommitTest-seed#[492941F0730FC0F2]-worker) [    ] o.a.s.c.SolrResourceLoader Adding 'file:/C:/Users/JenkinsSlave/workspace/Lucene-Solr-trunk-Windows/solr/core/src/test-files/solr/collection1/lib/classes/' to classloader
   [junit4]   2> 408809 INFO  (SUITE-AutoCommitTest-seed#[492941F0730FC0F2]-worker) [    ] o.a.s.c.SolrResourceLoader Adding 'file:/C:/Users/JenkinsSlave/workspace/Lucene-Solr-trunk-Windows/solr/core/src/test-files/solr/collection1/lib/README' to classloader
   [junit4]   2> 408961 INFO  (SUITE-AutoCommitTest-seed#[492941F0730FC0F2]-worker) [    ] o.a.s.c.SolrConfig current version of requestparams : -1
   [junit4]   2> 408996 INFO  (SUITE-AutoCommitTest-seed#[492941F0730FC0F2]-worker) [    ] o.a.s.c.SolrConfig Using Lucene MatchVersion: 6.0.0
   [junit4]   2> 409048 INFO  (SUITE-AutoCommitTest-seed#[492941F0730FC0F2]-worker) [    ] o.a.s.c.SolrConfig Loaded SolrConfig: solrconfig.xml
   [junit4]   2> 409080 INFO  (SUITE-AutoCommitTest-seed#[492941F0730FC0F2]-worker) [    ] o.a.s.s.IndexSchema [null] Schema name=test
   [junit4]   2> 409263 INFO  (SUITE-AutoCommitTest-seed#[492941F0730FC0F2]-worker) [    ] o.a.s.s.OpenExchangeRatesOrgProvider Initialized with rates=open-exchange-rates.json, refreshInterval=1440.
   [junit4]   2> 409281 INFO  (SUITE-AutoCommitTest-seed#[492941F0730FC0F2]-worker) [    ] o.a.s.s.IndexSchema default search field in schema is text
   [junit4]   2> 409283 INFO  (SUITE-AutoCommitTest-seed#[492941F0730FC0F2]-worker) [    ] o.a.s.s.IndexSchema unique key field: id
   [junit4]   2> 409297 INFO  (SUITE-AutoCommitTest-seed#[492941F0730FC0F2]-worker) [    ] o.a.s.s.FileExchangeRateProvider Reloading exchange rates from file currency.xml
   [junit4]   2> 409304 INFO  (SUITE-AutoCommitTest-seed#[492941F0730FC0F2]-worker) [    ] o.a.s.s.FileExchangeRateProvider Reloading exchange rates from file currency.xml
   [junit4]   2> 409308 INFO  (SUITE-AutoCommitTest-seed#[492941F0730FC0F2]-worker) [    ] o.a.s.s.OpenExchangeRatesOrgProvider Reloading exchange rates from open-exchange-rates.json
   [junit4]   2> 409309 INFO  (SUITE-AutoCommitTest-seed#[492941F0730FC0F2]-worker) [    ] o.a.s.s.OpenExchangeRatesOrgProvider Reloading exchange rates from open-exchange-rates.json
   [junit4]   2> 409310 INFO  (SUITE-AutoCommitTest-seed#[492941F0730FC0F2]-worker) [    ] o.a.s.c.SolrResourceLoader JNDI not configured for solr (NoInitialContextEx)
   [junit4]   2> 409310 INFO  (SUITE-AutoCommitTest-seed#[492941F0730FC0F2]-worker) [    ] o.a.s.c.SolrResourceLoader using system property solr.solr.home: C:\Users\JenkinsSlave\workspace\Lucene-Solr-trunk-Windows\solr\core\src\test-files\solr
   [junit4]   2> 409310 INFO  (SUITE-AutoCommitTest-seed#[492941F0730FC0F2]-worker) [    ] o.a.s.c.SolrResourceLoader new SolrResourceLoader for directory: 'C:\Users\JenkinsSlave\workspace\Lucene-Solr-trunk-Windows\solr\core\src\test-files\solr'
   [junit4]   2> 409310 INFO  (SUITE-AutoCommitTest-seed#[492941F0730FC0F2]-worker) [    ] o.a.s.c.SolrResourceLoader JNDI not configured for solr (NoInitialContextEx)
   [junit4]   2> 409311 INFO  (SUITE-AutoCommitTest-seed#[492941F0730FC0F2]-worker) [    ] o.a.s.c.SolrResourceLoader using system property solr.solr.home: C:\Users\JenkinsSlave\workspace\Lucene-Solr-trunk-Windows\solr\core\src\test-files\solr
   [junit4]   2> 409311 INFO  (SUITE-AutoCommitTest-seed#[492941F0730FC0F2]-worker) [    ] o.a.s.c.CoreContainer New CoreContainer 14895204
   [junit4]   2> 409312 INFO  (SUITE-AutoCommitTest-seed#[492941F0730FC0F2]-worker) [    ] o.a.s.c.CoreContainer Loading cores into CoreContainer [instanceDir=C:\Users\JenkinsSlave\workspace\Lucene-Solr-trunk-Windows\solr\core\src\test-files\solr]
   [junit4]   2> 409312 WARN  (SUITE-AutoCommitTest-seed#[492941F0730FC0F2]-worker) [    ] o.a.s.c.CoreContainer Couldn't add files from C:\Users\JenkinsSlave\workspace\Lucene-Solr-trunk-Windows\solr\core\src\test-files\solr\lib to classpath: C:\Users\JenkinsSlave\workspace\Lucene-Solr-trunk-Windows\solr\core\src\test-files\solr\lib
   [junit4]   2> 409312 INFO  (SUITE-AutoCommitTest-seed#[492941F0730FC0F2]-worker) [    ] o.a.s.h.c.HttpShardHandlerFactory created with socketTimeout : 600000,connTimeout : 60000,maxConnectionsPerHost : 20,maxConnections : 10000,corePoolSize : 0,maximumPoolSize : 2147483647,maxThreadIdleTime : 5,sizeOfQueue : -1,fairnessPolicy : false,useRetries : false,
   [junit4]   2> 409356 INFO  (SUITE-AutoCommitTest-seed#[492941F0730FC0F2]-worker) [    ] o.a.s.u.UpdateShardHandler Creating UpdateShardHandler HTTP client with params: socketTimeout=30000&connTimeout=30000&retry=true
   [junit4]   2> 409357 INFO  (SUITE-AutoCommitTest-seed#[492941F0730FC0F2]-worker) [    ] o.a.s.l.LogWatcher SLF4J impl is org.slf4j.impl.Log4jLoggerFactory
   [junit4]   2> 409358 INFO  (SUITE-AutoCommitTest-seed#[492941F0730FC0F2]-worker) [    ] o.a.s.l.LogWatcher Registering Log Listener [Log4j (org.slf4j.impl.Log4jLoggerFactory)]
   [junit4]   2> 409358 INFO  (SUITE-AutoCommitTest-seed#[492941F0730FC0F2]-worker) [    ] o.a.s.c.CoreContainer Security conf doesn't exist. Skipping setup for authorization module.
   [junit4]   2> 409358 INFO  (SUITE-AutoCommitTest-seed#[492941F0730FC0F2]-worker) [    ] o.a.s.c.CoreContainer No authentication plugin used.
   [junit4]   2> 409362 INFO  (SUITE-AutoCommitTest-seed#[492941F0730FC0F2]-worker) [    ] o.a.s.c.CoreDescriptor Created CoreDescriptor: {name=collection1, config=solrconfig.xml, transient=false, schema=schema.xml, loadOnStartup=true, configSetProperties=configsetprops.json, collection=collection1, dataDir=C:\Users\JenkinsSlave\workspace\Lucene-Solr-trunk-Windows\solr\build\solr-core\test\J1\temp\solr.update.AutoCommitTest_492941F0730FC0F2-001\init-core-data-001, shard=shard1}
   [junit4]   2> 409363 INFO  (coreLoadExecutor-903-thread-1) [    ] o.a.s.c.SolrResourceLoader new SolrResourceLoader for directory: 'C:\Users\JenkinsSlave\workspace\Lucene-Solr-trunk-Windows\solr\core\src\test-files\solr\collection1'
   [junit4]   2> 409364 INFO  (coreLoadExecutor-903-thread-1) [    ] o.a.s.c.SolrResourceLoader JNDI not configured for solr (NoInitialContextEx)
   [junit4]   2> 409364 INFO  (coreLoadExecutor-903-thread-1) [    ] o.a.s.c.SolrResourceLoader using system property solr.solr.home: C:\Users\JenkinsSlave\workspace\Lucene-Solr-trunk-Windows\solr\core\src\test-files\solr
   [junit4]   2> 409365 INFO  (coreLoadExecutor-903-thread-1) [    ] o.a.s.c.SolrResourceLoader Adding 'file:/C:/Users/JenkinsSlave/workspace/Lucene-Solr-trunk-Windows/solr/core/src/test-files/solr/collection1/lib/classes/' to classloader
   [junit4]   2> 409365 INFO  (coreLoadExecutor-903-thread-1) [    ] o.a.s.c.SolrResourceLoader Adding 'file:/C:/Users/JenkinsSlave/workspace/Lucene-Solr-trunk-Windows/solr/core/src/test-files/solr/collection1/lib/README' to classloader
   [junit4]   2> 409460 INFO  (coreLoadExecutor-903-thread-1) [    ] o.a.s.c.SolrConfig current version of requestparams : -1
   [junit4]   2> 409475 INFO  (coreLoadExecutor-903-thread-1) [    ] o.a.s.c.SolrConfig Using Lucene MatchVersion: 6.0.0
   [junit4]   2> 409511 INFO  (coreLoadExecutor-903-thread-1) [    ] o.a.s.c.SolrConfig Loaded SolrConfig: solrconfig.xml
   [junit4]   2> 409524 INFO  (coreLoadExecutor-903-thread-1) [    ] o.a.s.s.IndexSchema [collection1] Schema name=test
   [junit4]   2> 409662 INFO  (coreLoadExecutor-903-thread-1) [    ] o.a.s.s.OpenExchangeRatesOrgProvider Initialized with rates=open-exchange-rates.json, refreshInterval=1440.
   [junit4]   2> 409675 INFO  (coreLoadExecutor-903-thread-1) [    ] o.a.s.s.IndexSchema default search field in schema is text
   [junit4]   2> 409676 INFO  (coreLoadExecutor-903-thread-1) [    ] o.a.s.s.IndexSchema unique key field: id
   [junit4]   2> 409696 INFO  (coreLoadExecutor-903-thread-1) [    ] o.a.s.s.FileExchangeRateProvider Reloading exchange rates from file currency.xml
   [junit4]   2> 409701 INFO  (coreLoadExecutor-903-thread-1) [    ] o.a.s.s.FileExchangeRateProvider Reloading exchange rates from file currency.xml
   [junit4]   2> 409708 INFO  (coreLoadExecutor-903-thread-1) [    ] o.a.s.s.OpenExchangeRatesOrgProvider Reloading exchange rates from open-exchange-rates.json
   [junit4]   2> 409708 INFO  (coreLoadExecutor-903-thread-1) [    ] o.a.s.s.OpenExchangeRatesOrgProvider Reloading exchange rates from open-exchange-rates.json
   [junit4]   2> 409719 INFO  (coreLoadExecutor-903-thread-1) [    ] o.a.s.c.ConfigSetProperties Did not find ConfigSet properties, assuming default properties: Can't find resource 'configsetprops.json' in classpath or 'C:\Users\JenkinsSlave\workspace\Lucene-Solr-trunk-Windows\solr\core\src\test-files\solr\collection1'
   [junit4]   2> 409719 INFO  (coreLoadExecutor-903-thread-1) [    ] o.a.s.c.CoreContainer Creating SolrCore 'collection1' using configuration from instancedir C:\Users\JenkinsSlave\workspace\Lucene-Solr-trunk-Windows\solr\core\src\test-files\solr\collection1
   [junit4]   2> 409719 INFO  (coreLoadExecutor-903-thread-1) [    x:collection1] o.a.s.c.SolrCore org.apache.solr.core.MockDirectoryFactory
   [junit4]   2> 409719 INFO  (coreLoadExecutor-903-thread-1) [    x:collection1] o.a.s.c.SolrCore [[collection1] ] Opening new SolrCore at [C:\Users\JenkinsSlave\workspace\Lucene-Solr-trunk-Windows\solr\core\src\test-files\solr\collection1], dataDir=[C:\Users\JenkinsSlave\workspace\Lucene-Solr-trunk-Windows\solr\build\solr-core\test\J1\temp\solr.update.AutoCommitTest_492941F0730FC0F2-001\init-core-data-001\]
   [junit4]   2> 409719 INFO  (coreLoadExecutor-903-thread-1) [    x:collection1] o.a.s.c.JmxMonitoredMap JMX monitoring is enabled. Adding Solr mbeans to JMX Server: com.sun.jmx.mbeanserver.JmxMBeanServer@1d73223
   [junit4]   2> 409720 INFO  (coreLoadExecutor-903-thread-1) [    x:collection1] o.a.s.c.CachingDirectoryFactory return new directory for C:\Users\JenkinsSlave\workspace\Lucene-Solr-trunk-Windows\solr\build\solr-core\test\J1\temp\solr.update.AutoCommitTest_492941F0730FC0F2-001\init-core-data-001\
   [junit4]   2> 409720 INFO  (coreLoadExecutor-903-thread-1) [    x:collection1] o.a.s.c.SolrCore New index directory detected: old=null new=C:\Users\JenkinsSlave\workspace\Lucene-Solr-trunk-Windows\solr\build\solr-core\test\J1\temp\solr.update.AutoCommitTest_492941F0730FC0F2-001\init-core-data-001\index/
   [junit4]   2> 409720 WARN  (coreLoadExecutor-903-thread-1) [    x:collection1] o.a.s.c.SolrCore [collection1] Solr index directory 'C:\Users\JenkinsSlave\workspace\Lucene-Solr-trunk-Windows\solr\build\solr-core\test\J1\temp\solr.update.AutoCommitTest_492941F0730FC0F2-001\init-core-data-001\index' doesn't exist. Creating new index...
   [junit4]   2> 409720 INFO  (coreLoadExecutor-903-thread-1) [    x:collection1] o.a.s.c.CachingDirectoryFactory return new directory for C:\Users\JenkinsSlave\workspace\Lucene-Solr-trunk-Windows\solr\build\solr-core\test\J1\temp\solr.update.AutoCommitTest_492941F0730FC0F2-001\init-core-data-001\index
   [junit4]   2> 409721 INFO  (coreLoadExecutor-903-thread-1) [    x:collection1] o.a.s.u.RandomMergePolicy RandomMergePolicy wrapping class org.apache.lucene.index.LogByteSizeMergePolicy: [LogByteSizeMergePolicy: minMergeSize=1677721, mergeFactor=24, maxMergeSize=2147483648, maxMergeSizeForForcedMerge=9223372036854775807, calibrateSizeByDeletes=false, maxMergeDocs=2147483647, maxCFSSegmentSizeMB=8.796093022207999E12, noCFSRatio=1.0]
   [junit4]   2> 409722 INFO  (coreLoadExecutor-903-thread-1) [    x:collection1] o.a.s.c.SolrDeletionPolicy SolrDeletionPolicy.onCommit: commits: num=1
   [junit4]   2> 	commit{dir=MockDirectoryWrapper(RAMDirectory@1f67b30 lockFactory=org.apache.lucene.store.SingleInstanceLockFactory@78f42e),segFN=segments_1,generation=1}
   [junit4]   2> 409722 INFO  (coreLoadExecutor-903-thread-1) [    x:collection1] o.a.s.c.SolrDeletionPolicy newest commit generation = 1
   [junit4]   2> 409723 INFO  (OldIndexDirectoryCleanupThreadForCore-collection1) [    x:collection1] o.a.s.c.SolrCore Looking for old index directories to cleanup for core collection1 in C:\Users\JenkinsSlave\workspace\Lucene-Solr-trunk-Windows\solr\build\solr-core\test\J1\temp\solr.update.AutoCommitTest_492941F0730FC0F2-001\init-core-data-001\
   [junit4]   2> 409733 INFO  (coreLoadExecutor-903-thread-1) [    x:collection1] o.a.s.u.p.UpdateRequestProcessorChain creating updateRequestProcessorChain "dedupe"
   [junit4]   2> 409738 INFO  (coreLoadExecutor-903-thread-1) [    x:collection1] o.a.s.u.p.UpdateRequestProcessorChain inserting DistributedUpdateProcessorFactory into updateRequestProcessorChain "dedupe"
   [junit4]   2> 409738 INFO  (coreLoadExecutor-903-thread-1) [    x:collection1] o.a.s.u.p.UpdateRequestProcessorChain creating updateRequestProcessorChain "dedupe-allfields"
   [junit4]   2> 409738 INFO  (coreLoadExecutor-903-thread-1) [    x:collection1] o.a.s.u.p.UpdateRequestProcessorChain inserting DistributedUpdateProcessorFactory into updateRequestProcessorChain "dedupe-allfields"
   [junit4]   2> 409738 INFO  (coreLoadExecutor-903-thread-1) [    x:collection1] o.a.s.u.p.UpdateRequestProcessorChain creating updateRequestProcessorChain "stored_sig"
   [junit4]   2> 409739 INFO  (coreLoadExecutor-903-thread-1) [    x:collection1] o.a.s.u.p.UpdateRequestProcessorChain inserting DistributedUpdateProcessorFactory into updateRequestProcessorChain "stored_sig"
   [junit4]   2> 409739 INFO  (coreLoadExecutor-903-thread-1) [    x:collection1] o.a.s.u.p.UpdateRequestProcessorChain creating updateRequestProcessorChain "uniq-fields"
   [junit4]   2> 409739 INFO  (coreLoadExecutor-903-thread-1) [    x:collection1] o.a.s.u.p.UpdateRequestProcessorChain inserting DistributedUpdateProcessorFactory into updateRequestProcessorChain "uniq-fields"
   [junit4]   2> 409739 INFO  (coreLoadExecutor-903-thread-1) [    x:collection1] o.a.s.u.p.UpdateRequestProcessorChain creating updateRequestProcessorChain "distrib-dup-test-chain-explicit"
   [junit4]   2> 409739 INFO  (coreLoadExecutor-903-thread-1) [    x:collection1] o.a.s.u.p.UpdateRequestProcessorChain creating updateRequestProcessorChain "distrib-dup-test-chain-implicit"
   [junit4]   2> 409739 INFO  (coreLoadExecutor-903-thread-1) [    x:collection1] o.a.s.u.p.UpdateRequestProcessorChain inserting DistributedUpdateProcessorFactory into updateRequestProcessorChain "distrib-dup-test-chain-implicit"
   [junit4]   2> 409739 INFO  (coreLoadExecutor-903-thread-1) [    x:collection1] o.a.s.c.SolrCore no updateRequestProcessorChain defined as default, creating implicit default
   [junit4]   2> 409751 INFO  (coreLoadExecutor-903-thread-1) [    x:collection1] o.a.s.h.l.XMLLoader xsltCacheLifetimeSeconds=60
   [junit4]   2> 409754 INFO  (coreLoadExecutor-903-thread-1) [    x:collection1] o.a.s.h.l.XMLLoader xsltCacheLifetimeSeconds=60
   [junit4]   2> 409757 INFO  (coreLoadExecutor-903-thread-1) [    x:collection1] o.a.s.h.l.XMLLoader xsltCacheLifetimeSeconds=60
   [junit4]   2> 409762 INFO  (coreLoadExecutor-903-thread-1) [    x:collection1] o.a.s.h.l.XMLLoader xsltCacheLifetimeSeconds=60
   [junit4]   2> 409779 INFO  (coreLoadExecutor-903-thread-1) [    x:collection1] o.a.s.c.PluginBag requestHandler : 'lazy' created with startup=lazy 
   [junit4]   2> 409786 INFO  (coreLoadExecutor-903-thread-1) [    x:collection1] o.a.s.c.RequestHandlers Registered paths: /admin/mbeans,standard,spellCheckCompRH,lazy,/update/json/docs,/admin/luke,/export,spellCheckWithWordbreak_Direct,tvrh,/get,/admin/properties,/update/json,mltrh,/admin/threads,/search-facet-def,/update/csv,/sql,/search-facet-invariants,/admin/segments,spellCheckCompRH1,/mlt,/admin/system,/replication,dismax,defaults,/config,/stream,/schema,/admin/plugins,/admin/logging,spellCheckWithWordbreak,mock,/admin/ping,/update,/admin/file,/terms,spellCheckCompRH_Direct,/debug/dump
   [junit4]   2> 409786 WARN  (coreLoadExecutor-903-thread-1) [    x:collection1] o.a.s.c.SolrCore solrconfig.xml uses deprecated <admin/gettableFiles>, Please update your config to use the ShowFileRequestHandler.
   [junit4]   2> 409786 INFO  (coreLoadExecutor-903-thread-1) [    x:collection1] o.a.s.c.SolrCore Using default statsCache cache: org.apache.solr.search.stats.LocalStatsCache
   [junit4]   2> 409788 INFO  (coreLoadExecutor-903-thread-1) [    x:collection1] o.a.s.u.UpdateHandler Using UpdateLog implementation: org.apache.solr.update.UpdateLog
   [junit4]   2> 409788 INFO  (coreLoadExecutor-903-thread-1) [    x:collection1] o.a.s.u.UpdateLog Initializing UpdateLog: dataDir= defaultSyncLevel=FLUSH numRecordsToKeep=100 maxNumLogsToKeep=10 numVersionBuckets=65536
   [junit4]   2> 409791 INFO  (coreLoadExecutor-903-thread-1) [    x:collection1] o.a.s.u.CommitTracker Hard AutoCommit: disabled
   [junit4]   2> 409791 INFO  (coreLoadExecutor-903-thread-1) [    x:collection1] o.a.s.u.CommitTracker Soft AutoCommit: disabled
   [junit4]   2> 409792 INFO  (coreLoadExecutor-903-thread-1) [    x:collection1] o.a.s.u.RandomMergePolicy RandomMergePolicy wrapping class org.apache.lucene.index.LogDocMergePolicy: [LogDocMergePolicy: minMergeSize=1000, mergeFactor=46, maxMergeSize=9223372036854775807, maxMergeSizeForForcedMerge=9223372036854775807, calibrateSizeByDeletes=true, maxMergeDocs=2147483647, maxCFSSegmentSizeMB=8.796093022207999E12, noCFSRatio=0.8872410059842329]
   [junit4]   2> 409793 INFO  (coreLoadExecutor-903-thread-1) [    x:collection1] o.a.s.c.SolrDeletionPolicy SolrDeletionPolicy.onInit: commits: num=1
   [junit4]   2> 	commit{dir=MockDirectoryWrapper(RAMDirectory@1f67b30 lockFactory=org.apache.lucene.store.SingleInstanceLockFactory@78f42e),segFN=segments_1,generation=1}
   [junit4]   2> 409793 INFO  (coreLoadExecutor-903-thread-1) [    x:collection1] o.a.s.c.SolrDeletionPolicy newest commit generation = 1
   [junit4]   2> 409793 INFO  (coreLoadExecutor-903-thread-1) [    x:collection1] o.a.s.s.SolrIndexSearcher Opening [Searcher@116cc6f[collection1] main]
   [junit4]   2> 409793 INFO  (coreLoadExecutor-903-thread-1) [    x:collection1] o.a.s.r.RestManager Initializing RestManager with initArgs: {storageIO=org.apache.solr.rest.ManagedResourceStorage$InMemoryStorageIO}
   [junit4]   2> 409794 INFO  (coreLoadExecutor-903-thread-1) [    x:collection1] o.a.s.r.ManagedResourceStorage Reading _rest_managed.json using InMemoryStorage
   [junit4]   2> 409794 INFO  (coreLoadExecutor-903-thread-1) [    x:collection1] o.a.s.r.RestManager Initializing 0 registered ManagedResources
   [junit4]   2> 409794 INFO  (coreLoadExecutor-903-thread-1) [    x:collection1] o.a.s.h.c.SpellCheckComponent Initializing spell checkers
   [junit4]   2> 409834 INFO  (coreLoadExecutor-903-thread-1) [    x:collection1] o.a.s.s.DirectSolrSpellChecker init: {name=direct,classname=DirectSolrSpellChecker,field=lowerfilt,minQueryLength=3}
   [junit4]   2> 410088 INFO  (coreLoadExecutor-903-thread-1) [    x:collection1] o.a.s.h.ReplicationHandler Commits will be reserved for  10000
   [junit4]   2> 410091 INFO  (coreLoadExecutor-903-thread-1) [    x:collection1] o.a.s.u.UpdateLog Looking up max value of version field to seed version buckets
   [junit4]   2> 410091 INFO  (coreLoadExecutor-903-thread-1) [    x:collection1] o.a.s.u.VersionInfo Refreshing highest value of _version_ for 65536 version buckets from index
   [junit4]   2> 410091 INFO  (coreLoadExecutor-903-thread-1) [    x:collection1] o.a.s.u.VersionInfo No terms found for _version_, cannot seed version bucket highest value from index
   [junit4]   2> 410091 INFO  (coreLoadExecutor-903-thread-1) [    x:collection1] o.a.s.u.UpdateLog Could not find max version in index or recent updates, using new clock 1524153029214863360
   [junit4]   2> 410093 INFO  (coreLoadExecutor-903-thread-1) [    x:collection1] o.a.s.u.UpdateLog Took 3.0ms to seed version buckets with highest version 1524153029214863360
   [junit4]   2> 410094 INFO  (coreLoadExecutor-903-thread-1) [    x:collection1] o.a.s.c.CoreContainer registering core: collection1
   [junit4]   2> 410100 INFO  (searcherExecutor-904-thread-1-processing-x:collection1) [    x:collection1] o.a.s.h.c.SpellCheckComponent Loading spell index for spellchecker: default
   [junit4]   2> 410101 INFO  (searcherExecutor-904-thread-1-processing-x:collection1) [    x:collection1] o.a.s.h.c.SpellCheckComponent Loading spell index for spellchecker: direct
   [junit4]   2> 410101 INFO  (searcherExecutor-904-thread-1-processing-x:collection1) [    x:collection1] o.a.s.h.c.SpellCheckComponent Loading spell index for spellchecker: wordbreak
   [junit4]   2> 410101 INFO  (searcherExecutor-904-thread-1-processing-x:collection1) [    x:collection1] o.a.s.h.c.SpellCheckComponent Loading spell index for spellchecker: multipleFields
   [junit4]   2> 410102 INFO  (searcherExecutor-904-thread-1-processing-x:collection1) [    x:collection1] o.a.s.h.c.SpellCheckComponent Loading spell index for spellchecker: jarowinkler
   [junit4]   2> 410102 INFO  (searcherExecutor-904-thread-1-processing-x:collection1) [    x:collection1] o.a.s.h.c.SpellCheckComponent Loading spell index for spellchecker: external
   [junit4]   2> 410103 INFO  (searcherExecutor-904-thread-1-processing-x:collection1) [    x:collection1] o.a.s.h.c.SpellCheckComponent Loading spell index for spellchecker: freq
   [junit4]   2> 410104 INFO  (SUITE-AutoCommitTest-seed#[492941F0730FC0F2]-worker) [    ] o.a.s.SolrTestCaseJ4 ####initCore end
   [junit4]   2> 410104 INFO  (searcherExecutor-904-thread-1-processing-x:collection1) [    x:collection1] o.a.s.h.c.SpellCheckComponent Loading spell index for spellchecker: fqcn
   [junit4]   2> 410105 INFO  (searcherExecutor-904-thread-1-processing-x:collection1) [    x:collection1] o.a.s.h.c.SpellCheckComponent Loading spell index for spellchecker: perDict
   [junit4]   2> 410121 INFO  (searcherExecutor-904-thread-1-processing-x:collection1) [    x:collection1] o.a.s.c.SolrCore [collection1] Registered new searcher Searcher@116cc6f[collection1] main{ExitableDirectoryReader(UninvertingDirectoryReader())}
   [junit4]   2> 410125 INFO  (TEST-AutoCommitTest.testCommitWithin-seed#[492941F0730FC0F2]) [    ] o.a.s.SolrTestCaseJ4 ###Starting testCommitWithin
   [junit4]   2> 410141 INFO  (TEST-AutoCommitTest.testCommitWithin-seed#[492941F0730FC0F2]) [    ] o.a.s.u.p.LogUpdateProcessorFactory [collection1]  webapp=null path=null params={}{deleteByQuery=*:* (-1524153029256806400)} 0 10
   [junit4]   2> 410150 INFO  (TEST-AutoCommitTest.testCommitWithin-seed#[492941F0730FC0F2]) [    ] o.a.s.c.SolrResourceLoader new SolrResourceLoader for directory: 'C:\Users\JenkinsSlave\workspace\Lucene-Solr-trunk-Windows\solr\core\src\test-files\solr\collection1'
   [junit4]   2> 410150 INFO  (TEST-AutoCommitTest.testCommitWithin-seed#[492941F0730FC0F2]) [    ] o.a.s.c.SolrResourceLoader JNDI not configured for solr (NoInitialContextEx)
   [junit4]   2> 410150 INFO  (TEST-AutoCommitTest.testCommitWithin-seed#[492941F0730FC0F2]) [    ] o.a.s.c.SolrResourceLoader using system property solr.solr.home: C:\Users\JenkinsSlave\workspace\Lucene-Solr-trunk-Windows\solr\core\src\test-files\solr
   [junit4]   2> 410150 INFO  (TEST-AutoCommitTest.testCommitWithin-seed#[492941F0730FC0F2]) [    ] o.a.s.c.SolrResourceLoader Adding 'file:/C:/Users/JenkinsSlave/workspace/Lucene-Solr-trunk-Windows/solr/core/src/test-files/solr/collection1/lib/classes/' to classloader
   [junit4]   2> 410150 INFO  (TEST-AutoCommitTest.testCommitWithin-seed#[492941F0730FC0F2]) [    ] o.a.s.c.SolrResourceLoader Adding 'file:/C:/Users/JenkinsSlave/workspace/Lucene-Solr-trunk-Windows/solr/core/src/test-files/solr/collection1/lib/README' to classloader
   [junit4]   2> 410258 INFO  (TEST-AutoCommitTest.testCommitWithin-seed#[492941F0730FC0F2]) [    ] o.a.s.c.SolrConfig current version of requestparams : -1
   [junit4]   2> 410273 INFO  (TEST-AutoCommitTest.testCommitWithin-seed#[492941F0730FC0F2]) [    ] o.a.s.c.SolrConfig Using Lucene MatchVersion: 6.0.0
   [junit4]   2> 410309 INFO  (TEST-AutoCommitTest.testCommitWithin-seed#[492941F0730FC0F2]) [    ] o.a.s.c.SolrConfig Loaded SolrConfig: solrconfig.xml
   [junit4]   2> 410320 INFO  (TEST-AutoCommitTest.testCommitWithin-seed#[492941F0730FC0F2]) [    ] o.a.s.s.IndexSchema [collection1] Schema name=test
   [junit4]   2> 410473 INFO  (TEST-AutoCommitTest.testCommitWithin-seed#[492941F0730FC0F2]) [    ] o.a.s.s.OpenExchangeRatesOrgProvider Initialized with rates=open-exchange-rates.json, refreshInterval=1440.
   [junit4]   2> 410483 INFO  (TEST-AutoCommitTest.testCommitWithin-seed#[492941F0730FC0F2]) [    ] o.a.s.s.IndexSchema default search field in schema is text
   [junit4]   2> 410484 INFO  (TEST-AutoCommitTest.testCommitWithin-seed#[492941F0730FC0F2]) [    ] o.a.s.s.IndexSchema unique key field: id
   [junit4]   2> 410499 INFO  (TEST-AutoCommitTest.testCommitWithin-seed#[492941F0730FC0F2]) [    ] o.a.s.s.FileExchangeRateProvider Reloading exchange rates from file currency.xml
   [junit4]   2> 410503 INFO  (TEST-AutoCommitTest.testCommitWithin-seed#[492941F0730FC0F2]) [    ] o.a.s.s.FileExchangeRateProvider Reloading exchange rates from file currency.xml
   [junit4]   2> 410505 INFO  (TEST-AutoCommitTest.testCommitWithin-seed#[492941F0730FC0F2]) [    ] o.a.s.s.OpenExchangeRatesOrgProvider Reloading exchange rates from open-exchange-rates.json
   [junit4]   2> 410505 INFO  (TEST-AutoCommitTest.testCommitWithin-seed#[492941F0730FC0F2]) [    ] o.a.s.s.OpenExchangeRatesOrgProvider Reloading exchange rates from open-exchange-rates.json
   [junit4]   2> 410534 INFO  (TEST-AutoCommitTest.testCommitWithin-seed#[492941F0730FC0F2]) [    ] o.a.s.c.ConfigSetProperties Did not find ConfigSet properties, assuming default properties: Can't find resource 'configsetprops.json' in classpath or 'C:\Users\JenkinsSlave\workspace\Lucene-Solr-trunk-Windows\solr\core\src\test-files\solr\collection1'
   [junit4]   2> 410534 INFO  (TEST-AutoCommitTest.testCommitWithin-seed#[492941F0730FC0F2]) [    ] o.a.s.c.CoreContainer Reloading SolrCore 'collection1' using configuration from instancedir C:\Users\JenkinsSlave\workspace\Lucene-Solr-trunk-Windows\solr\core\src\test-files\solr\collection1
   [junit4]   2> 410534 INFO  (TEST-AutoCommitTest.testCommitWithin-seed#[492941F0730FC0F2]) [    x:collection1] o.a.s.c.SolrCore [[collection1] ] Opening new SolrCore at [C:\Users\JenkinsSlave\workspace\Lucene-Solr-trunk-Windows\solr\core\src\test-files\solr\collection1], dataDir=[C:\Users\JenkinsSlave\workspace\Lucene-Solr-trunk-Windows\solr\build\solr-core\test\J1\temp\solr.update.AutoCommitTest_492941F0730FC0F2-001\init-core-data-001\]
   [junit4]   2> 410534 INFO  (TEST-AutoCommitTest.testCommitWithin-seed#[492941F0730FC0F2]) [    x:collection1] o.a.s.c.JmxMonitoredMap JMX monitoring is enabled. Adding Solr mbeans to JMX Server: com.sun.jmx.mbeanserver.JmxMBeanServer@1d73223
   [junit4]   2> 410536 INFO  (TEST-AutoCommitTest.testCommitWithin-seed#[492941F0730FC0F2]) [    x:collection1] o.a.s.c.SolrCore New index directory detected: old=null new=C:\Users\JenkinsSlave\workspace\Lucene-Solr-trunk-Windows\solr\build\solr-core\test\J1\temp\solr.update.AutoCommitTest_492941F0730FC0F2-001\init-core-data-001\index/
   [junit4]   2> 410541 INFO  (OldIndexDirectoryCleanupThreadForCore-collection1) [    x:collection1] o.a.s.c.SolrCore Looking for old index directories to cleanup for core collection1 in C:\Users\JenkinsSlave\workspace\Lucene-Solr-trunk-Windows\solr\build\solr-core\test\J1\temp\solr.update.AutoCommitTest_492941F0730FC0F2-001\init-core-data-001\
   [junit4]   2> 410547 INFO  (TEST-AutoCommitTest.testCommitWithin-seed#[492941F0730FC0F2]) [    x:collection1] o.a.s.u.p.UpdateRequestProcessorChain creating updateRequestProcessorChain "dedupe"
   [junit4]   2> 410547 INFO  (TEST-AutoCommitTest.testCommitWithin-seed#[492941F0730FC0F2]) [    x:collection1] o.a.s.u.p.UpdateRequestProcessorChain inserting DistributedUpdateProcessorFactory into updateRequestProcessorChain "dedupe"
   [junit4]   2> 410547 INFO  (TEST-AutoCommitTest.testCommitWithin-seed#[492941F0730FC0F2]) [    x:collection1] o.a.s.u.p.UpdateRequestProcessorChain creating updateRequestProcessorChain "dedupe-allfields"
   [junit4]   2> 410547 INFO  (TEST-AutoCommitTest.testCommitWithin-seed#[492941F0730FC0F2]) [    x:collection1] o.a.s.u.p.UpdateRequestProcessorChain inserting DistributedUpdateProcessorFactory into updateRequestProcessorChain "dedupe-allfields"
   [junit4]   2> 410547 INFO  (TEST-AutoCommitTest.testCommitWithin-seed#[492941F0730FC0F2]) [    x:collection1] o.a.s.u.p.UpdateRequestProcessorChain creating updateRequestProcessorChain "stored_sig"
   [junit4]   2> 410547 INFO  (TEST-AutoCommitTest.testCommitWithin-seed#[492941F0730FC0F2]) [    x:collection1] o.a.s.u.p.UpdateRequestProcessorChain inserting DistributedUpdateProcessorFactory into updateRequestProcessorChain "stored_sig"
   [junit4]   2> 410547 INFO  (TEST-AutoCommitTest.testCommitWithin-seed#[492941F0730FC0F2]) [    x:collection1] o.a.s.u.p.UpdateRequestProcessorChain creating updateRequestProcessorChain "uniq-fields"
   [junit4]   2> 410548 INFO  (TEST-AutoCommitTest.testCommitWithin-seed#[492941F0730FC0F2]) [    x:collection1] o.a.s.u.p.UpdateRequestProcessorChain inserting DistributedUpdateProcessorFactory into updateRequestProcessorChain "uniq-fields"
   [junit4]   2> 410548 INFO  (TEST-AutoCommitTest.testCommitWithin-seed#[492941F0730FC0F2]) [    x:collection1] o.a.s.u.p.UpdateRequestProcessorChain creating updateRequestProcessorChain "distrib-dup-test-chain-explicit"
   [junit4]   2> 410548 INFO  (TEST-AutoCommitTest.testCommitWithin-seed#[492941F0730FC0F2]) [    x:collection1] o.a.s.u.p.UpdateRequestProcessorChain creating updateRequestProcessorChain "distrib-dup-test-chain-implicit"
   [junit4]   2> 410548 INFO  (TEST-AutoCommitTest.testCommitWithin-seed#[492941F0730FC0F2]) [    x:collection1] o.a.s.u.p.UpdateRequestProcessorChain inserting DistributedUpdateProcessorFactory into updateRequestProcessorChain "distrib-dup-test-chain-implicit"
   [junit4]   2> 410548 INFO  (TEST-AutoCommitTest.testCommitWithin-seed#[492941F0730FC0F2]) [    x:collection1] o.a.s.c.SolrCore no updateRequestProcessorChain defined as default, creating implicit default
   [junit4]   2> 410555 INFO  (TEST-AutoCommitTest.testCommitWithin-seed#[492941F0730FC0F2]) [    x:collection1] o.a.s.h.l.XMLLoader xsltCacheLifetimeSeconds=60
   [junit4]   2> 410558 INFO  (TEST-AutoCommitTest.testCommitWithin-seed#[492941F0730FC0F2]) [    x:collection1] o.a.s.h.l.XMLLoader xsltCacheLifetimeSeconds=60
   [junit4]   2> 410562 INFO  (TEST-AutoCommitTest.testCommitWithin-seed#[492941F0730FC0F2]) [    x:collection1] o.a.s.h.l.XMLLoader xsltCacheLifetimeSeconds=60
   [junit4]   2> 410564 INFO  (TEST-AutoCommitTest.testCommitWithin-seed#[492941F0730FC0F2]) [    x:collection1] o.a.s.h.l.XMLLoader xsltCacheLifetimeSeconds=60
   [junit4]   2> 410593 INFO  (TEST-AutoCommitTest.testCommitWithin-seed#[492941F0730FC0F2]) [    x:collection1] o.a.s.c.PluginBag requestHandler : 'lazy' created with startup=lazy 
   [junit4]   2> 410606 INFO  (TEST-AutoCommitTest.testCommitWithin-seed#[492941F0730FC0F2]) [    x:collection1] o.a.s.c.RequestHandlers Registered paths: /admin/mbeans,standard,spellCheckCompRH,lazy,/update/json/docs,/admin/luke,/export,spellCheckWithWordbreak_Direct,tvrh,/get,/admin/properties,/update/json,mltrh,/admin/threads,/search-facet-def,/update/csv,/sql,/search-facet-invariants,/admin/segments,spellCheckCompRH1,/mlt,/admin/system,/replication,dismax,defaults,/config,/stream,/schema,/admin/plugins,/admin/logging,spellCheckWithWordbreak,mock,/admin/ping,/update,/admin/file,/terms,spellCheckCompRH_Direct,/debug/dump
   [junit4]   2> 410606 WARN  (TEST-AutoCommitTest.testCommitWithin-seed#[492941F0730FC0F2]) [    x:collection1] o.a.s.c.SolrCore solrconfig.xml uses deprecated <admin/gettableFiles>, Please update your config to use the ShowFileRequestHandler.
   [junit4]   2> 410607 INFO  (TEST-AutoCommitTest.testCommitWithin-seed#[492941F0730FC0F2]) [    x:collection1] o.a.s.c.SolrCore Using default statsCache cache: org.apache.solr.search.stats.LocalStatsCache
   [junit4]   2> 410616 INFO  (TEST-AutoCommitTest.testCommitWithin-seed#[492941F0730FC0F2]) [    x:collection1] o.a.s.u.CommitTracker Hard AutoCommit: disabled
   [junit4]   2> 410616 INFO  (TEST-AutoCommitTest.testCommitWithin-seed#[492941F0730FC0F2]) [    x:collection1] o.a.s.u.CommitTracker Soft AutoCommit: disabled
   [junit4]   2> 410617 INFO  (TEST-AutoCommitTest.testCommitWithin-seed#[492941F0730FC0F2]) [    x:collection1] o.a.s.s.SolrIndexSearcher Opening [Searcher@2be185[collection1] main]
   [junit4]   2> 410617 INFO  (TEST-AutoCommitTest.testCommitWithin-seed#[492941F0730FC0F2]) [    x:collection1] o.a.s.r.RestManager Initializing RestManager with initArgs: {storageIO=org.apache.solr.rest.ManagedResourceStorage$InMemoryStorageIO}
   [junit4]   2> 410617 INFO  (TEST-AutoCommitTest.testCommitWithin-seed#[492941F0730FC0F2]) [    x:collection1] o.a.s.r.ManagedResourceStorage Reading _rest_managed.json using InMemoryStorage
   [junit4]   2> 410617 INFO  (TEST-AutoCommitTest.testCommitWithin-seed#[492941F0730FC0F2]) [    x:collection1] o.a.s.r.RestManager Initializing 0 registered ManagedResources
   [junit4]   2> 410617 INFO  (TEST-AutoCommitTest.testCommitWithin-seed#[492941F0730FC0F2]) [    x:collection1] o.a.s.h.c.SpellCheckComponent Initializing spell checkers
   [junit4]   2> 410622 INFO  (TEST-AutoCommitTest.testCommitWithin-seed#[492941F0730FC0F2]) [    x:collection1] o.a.s.s.DirectSolrSpellChecker init: {name=direct,classname=DirectSolrSpellChecker,field=lowerfilt,minQueryLength=3}
   [junit4]   2> 410629 INFO  (TEST-AutoCommitTest.testCommitWithin-seed#[492941F0730FC0F2]) [    x:collection1] o.a.s.h.ReplicationHandler Commits will be reserved for  10000
   [junit4]   2> 410630 INFO  (searcherExecutor-909-thread-1-processing-x:collection1) [    x:collection1] o.a.s.h.c.SpellCheckComponent Loading spell index for spellchecker: default
   [junit4]   2> 410630 INFO  (searcherExecutor-909-thread-1-processing-x:collection1) [    x:collection1] o.a.s.h.c.SpellCheckComponent Loading spell index for spellchecker: direct
   [junit4]   2> 410630 INFO  (searcherExecutor-909-thread-1-processing-x:collection1) [    x:collection1] o.a.s.h.c.SpellCheckComponent Loading spell index for spellchecker: wordbreak
   [junit4]   2> 410630 INFO  (searcherExecutor-909-thread-1-processing-x:collection1) [    x:collection1] o.a.s.h.c.SpellCheckComponent Loading spell index for spellchecker: multipleFields
   [junit4]   2> 410631 INFO  (searcherExecutor-909-thread-1-processing-x:collection1) [    x:collection1] o.a.s.h.c.SpellCheckComponent Loading spell index for spellchecker: jarowinkler
   [junit4]   2> 410632 INFO  (searcherExecutor-909-thread-1-processing-x:collection1) [    x:collection1] o.a.s.h.c.SpellCheckComponent Loading spell index for spellchecker: external
   [junit4]   2> 410632 INFO  (searcherExecutor-909-thread-1-processing-x:collection1) [    x:collection1] o.a.s.h.c.SpellCheckComponent Loading spell index for spellchecker: freq
   [junit4]   2> 410633 INFO  (searcherExecutor-909-thread-1-processing-x:collection1) [    x:collection1] o.a.s.h.c.SpellCheckComponent Loading spell index for spellchecker: fqcn
   [junit4]   2> 410634 INFO  (searcherExecutor-909-thread-1-processing-x:collection1) [    x:collection1] o.a.s.h.c.SpellCheckComponent Loading spell index for spellchecker: perDict
   [junit4]   2> 410637 INFO  (searcherExecutor-909-thread-1-processing-x:collection1) [    x:collection1] o.a.s.c.SolrCore [collection1] Registered new searcher Searcher@2be185[collection1] main{ExitableDirectoryReader(UninvertingDirectoryReader())}
   [junit4]   2> 410643 INFO  (TEST-AutoCommitTest.testCommitWithin-seed#[492941F0730FC0F2]) [    x:collection1] o.a.s.u.UpdateLog Looking up max value of version field to seed version buckets
   [junit4]   2> 410643 INFO  (TEST-AutoCommitTest.testCommitWithin-seed#[492941F0730FC0F2]) [    x:collection1] o.a.s.u.VersionInfo Refreshing highest value of _version_ for 65536 version buckets from index
   [junit4]   2> 410643 INFO  (TEST-AutoCommitTest.testCommitWithin-seed#[492941F0730FC0F2]) [    x:collection1] o.a.s.u.VersionInfo No terms found for _version_, cannot seed version bucket highest value from index
   [junit4]   2> 410645 INFO  (TEST-AutoCommitTest.testCommitWithin-seed#[492941F0730FC0F2]) [    x:collection1] o.a.s.u.UpdateLog Took 2.0ms to seed version buckets with highest version 1524153029256806400
   [junit4]   2> 410646 INFO  (TEST-AutoCommitTest.testCommitWithin-seed#[492941F0730FC0F2]) [    x:collection1] o.a.s.u.DefaultSolrCoreState Closing old IndexWriter... core=collection1
   [junit4]   2> 410647 INFO  (TEST-AutoCommitTest.testCommitWithin-seed#[492941F0730FC0F2]) [    x:collection1] o.a.s.u.RandomMergePolicy RandomMergePolicy wrapping class org.apache.lucene.index.TieredMergePolicy: [TieredMergePolicy: maxMergeAtOnce=37, maxMergeAtOnceExplicit=32, maxMergedSegmentMB=13.681640625, floorSegmentMB=0.6181640625, forceMergeDeletesPctAllowed=6.7941026625436605, segmentsPerTier=23.0, maxCFSSegmentSizeMB=8.796093022207999E12, noCFSRatio=0.16328650765395247
   [junit4]   2> 410647 INFO  (TEST-AutoCommitTest.testCommitWithin-seed#[492941F0730FC0F2]) [    x:collection1] o.a.s.c.SolrDeletionPolicy SolrDeletionPolicy.onInit: commits: num=1
   [junit4]   2> 	commit{dir=MockDirectoryWrapper(RAMDirectory@1f67b30 lockFactory=org.apache.lucene.store.SingleInstanceLockFactory@78f42e),segFN=segments_1,generation=1}
   [junit4]   2> 410648 INFO  (TEST-AutoCommitTest.testCommitWithin-seed#[492941F0730FC0F2]) [    x:collection1] o.a.s.c.SolrDeletionPolicy newest commit generation = 1
   [junit4]   2> 410648 INFO  (TEST-AutoCommitTest.testCommitWithin-seed#[492941F0730FC0F2]) [    x:collection1] o.a.s.u.DefaultSolrCoreState New IndexWriter is ready to be used.
   [junit4]   2> 410648 INFO  (TEST-AutoCommitTest.testCommitWithin-seed#[492941F0730FC0F2]) [    x:collection1] o.a.s.s.SolrIndexSearcher Opening [Searcher@6eff5b[collection1] main]
   [junit4]   2> 410648 INFO  (TEST-AutoCommitTest.testCommitWithin-seed#[492941F0730FC0F2]) [    x:collection1] o.a.s.c.CoreContainer replacing core: collection1
   [junit4]   2> 410648 INFO  (TEST-AutoCommitTest.testCommitWithin-seed#[492941F0730FC0F2]) [    x:collection1] o.a.s.c.SolrCore [collection1]  CLOSING SolrCore org.apache.solr.core.SolrCore@114f4cd
   [junit4]   2> 410648 INFO  (TEST-AutoCommitTest.testCommitWithin-seed#[492941F0730FC0F2]) [    x:collection1] o.a.s.u.DirectUpdateHandler2 closing DirectUpdateHandler2{commits=0,autocommits=0,soft autocommits=0,optimizes=0,rollbacks=0,expungeDeletes=0,docsPending=0,adds=0,deletesById=0,deletesByQuery=1,errors=0,cumulative_adds=0,cumulative_deletesById=0,cumulative_deletesByQuery=1,cumulative_errors=0,transaction_logs_total_size=0,transaction_logs_total_number=0}
   [junit4]   2> 410648 INFO  (TEST-AutoCommitTest.testCommitWithin-seed#[492941F0730FC0F2]) [    x:collection1] o.a.s.c.SolrCore [collection1] Closing main searcher on request.
   [junit4]   2> 410677 INFO  (searcherExecutor-909-thread-1-processing-x:collection1) [    x:collection1] o.a.s.c.SolrCore [collection1] Registered new searcher Searcher@6eff5b[collection1] main{ExitableDirectoryReader(UninvertingDirectoryReader())}
   [junit4]   2> 410687 INFO  (TEST-AutoCommitTest.testCommitWithin-seed#[492941F0730FC0F2]) [    x:collection1] o.a.s.u.p.LogUpdateProcessorFactory [collection1] {add=[529 (1524153029828280320)]} 0 12
   [junit4]   2> 410687 INFO  (TEST-AutoCommitTest.testCommitWithin-seed#[492941F0730FC0F2]) [    x:collection1] o.a.s.c.S.Request [collection1]  webapp=null path=null params={q=id:529&qt=standard&start=0&rows=20&version=2.2} hits=0 status=0 QTime=0
   [junit4]   2> 410689 INFO  (TEST-AutoCommitTest.testCommitWithin-seed#[492941F0730FC0F2]) [    x:collection1] o.a.s.u.p.LogUpdateProcessorFactory [collection1] {add=[530 (1524153029840863232)]} 0 15
   [junit4]   2> 410690 INFO  (TEST-AutoCommitTest.testCommitWithin-seed#[492941F0730FC0F2]) [    x:collection1] o.a.s.c.S.Request [collection1]  webapp=null path=null params={q=id:530&qt=standard&start=0&rows=20&version=2.2} hits=0 status=0 QTime=0
   [junit4]   2> 410692 INFO  (TEST-AutoCommitTest.testCommitWithin-seed#[492941F0730FC0F2]) [    x:collection1] o.a.s.u.p.LogUpdateProcessorFactory [collection1] {delete=[529 (-1524153029844008960)]} 0 17
   [junit4]   2> 410692 INFO  (TEST-AutoCommitTest.testCommitWithin-seed#[492941F0730FC0F2]) [    x:collection1] o.a.s.c.S.Request [collection1]  webapp=null path=null params={q=id:529&qt=standard&start=0&rows=20&version=2.2} hits=0 status=0 QTime=0
   [junit4]   2> 410693 ERROR (TEST-AutoCommitTest.testCommitWithin-seed#[492941F0730FC0F2]) [    x:collection1] o.a.s.SolrTestCaseJ4 REQUEST FAILED: xpath=//result[@numFound=1]
   [junit4]   2> 	xml response was: <?xml version="1.0" encoding="UTF-8"?>
   [junit4]   2> <response>
   [junit4]   2> <lst name="responseHeader"><int name="status">0</int><int name="QTime">0</int></lst><result name="response" numFound="0" start="0"></result>
   [junit4]   2> </response>
   [junit4]   2> 
   [junit4]   2> 	request was:q=id:529&qt=standard&start=0&rows=20&version=2.2
   [junit4]   2> 410694 ERROR (TEST-AutoCommitTest.testCommitWithin-seed#[492941F0730FC0F2]) [    x:collection1] o.a.s.SolrTestCaseJ4 REQUEST FAILED: q=id:529&qt=standard&start=0&rows=20&version=2.2:java.lang.RuntimeException: REQUEST FAILED: xpath=//result[@numFound=1]
   [junit4]   2> 	xml response was: <?xml version="1.0" encoding="UTF-8"?>
   [junit4]   2> <response>
   [junit4]   2> <lst name="responseHeader"><int name="status">0</int><int name="QTime">0</int></lst><result name="response" numFound="0" start="0"></result>
   [junit4]   2> </response>
   [junit4]   2> 
   [junit4]   2> 	request was:q=id:529&qt=standard&start=0&rows=20&version=2.2
   [junit4]   2> 	at org.apache.solr.SolrTestCaseJ4.assertQ(SolrTestCaseJ4.java:748)
   [junit4]   2> 	at org.apache.solr.update.AutoCommitTest.testCommitWithin(AutoCommitTest.java:326)
   [junit4]   2> 	at sun.reflect.NativeMethodAccessorImpl.invoke0(Native Method)
   [junit4]   2> 	at sun.reflect.NativeMethodAccessorImpl.invoke(NativeMethodAccessorImpl.java:62)
   [junit4]   2> 	at sun.reflect.DelegatingMethodAccessorImpl.invoke(DelegatingMethodAccessorImpl.java:43)
   [junit4]   2> 	at java.lang.reflect.Method.invoke(Method.java:497)
   [junit4]   2> 	at com.carrotsearch.randomizedtesting.RandomizedRunner.invoke(RandomizedRunner.java:1764)
   [junit4]   2> 	at com.carrotsearch.randomizedtesting.RandomizedRunner$8.evaluate(RandomizedRunner.java:871)
   [junit4]   2> 	at com.carrotsearch.randomizedtesting.RandomizedRunner$9.evaluate(RandomizedRunner.java:907)
   [junit4]   2> 	at com.carrotsearch.randomizedtesting.RandomizedRunner$10.evaluate(RandomizedRunner.java:921)
   [junit4]   2> 	at com.carrotsearch.randomizedtesting.rules.SystemPropertiesRestoreRule$1.evaluate(SystemPropertiesRestoreRule.java:57)
   [junit4]   2> 	at org.apache.lucene.util.TestRuleSetupTeardownChained$1.evaluate(TestRuleSetupTeardownChained.java:50)
   [junit4]   2> 	at org.apache.lucene.util.AbstractBeforeAfterRule$1.evaluate(AbstractBeforeAfterRule.java:46)
   [junit4]   2> 	at org.apache.lucene.util.TestRuleThreadAndTestName$1.evaluate(TestRuleThreadAndTestName.java:49)
   [junit4]   2> 	at org.apache.lucene.util.TestRuleIgnoreAfterMaxFailures$1.evaluate(TestRuleIgnoreAfterMaxFailures.java:65)
   [junit4]   2> 	at org.apache.lucene.util.TestRuleMarkFailure$1.evaluate(TestRuleMarkFailure.java:48)
   [junit4]   2> 	at com.carrotsearch.randomizedtesting.rules.StatementAdapter.evaluate(StatementAdapter.java:36)
   [junit4]   2> 	at com.carrotsearch.randomizedtesting.ThreadLeakControl$StatementRunner.run(ThreadLeakControl.java:367)
   [junit4]   2> 	at com.carrotsearch.randomizedtesting.ThreadLeakControl.forkTimeoutingTask(ThreadLeakControl.java:809)
   [junit4]   2> 	at com.carrotsearch.randomizedtesting.ThreadLeakControl$3.evaluate(ThreadLeakControl.java:460)
   [junit4]   2> 	at com.carrotsearch.randomizedtesting.RandomizedRunner.runSingleTest(RandomizedRunner.java:880)
   [junit4]   2> 	at com.carrotsearch.randomizedtesting.RandomizedRunner$5.evaluate(RandomizedRunner.java:781)
   [junit4]   2> 	at com.carrotsearch.randomizedtesting.RandomizedRunner$6.evaluate(RandomizedRunner.java:816)
   [junit4]   2> 	at com.carrotsearch.randomizedtesting.RandomizedRunner$7.evaluate(RandomizedRunner.java:827)
   [junit4]   2> 	at com.carrotsearch.randomizedtesting.rules.StatementAdapter.evaluate(StatementAdapter.java:36)
   [junit4]   2> 	at com.carrotsearch.randomizedtesting.rules.SystemPropertiesRestoreRule$1.evaluate(SystemPropertiesRestoreRule.java:57)
   [junit4]   2> 	at org.apache.lucene.util.AbstractBeforeAfterRule$1.evaluate(AbstractBeforeAfterRule.java:46)
   [junit4]   2> 	at com.carrotsearch.randomizedtesting.rules.StatementAdapter.evaluate(StatementAdapter.java:36)
   [junit4]   2> 	at org.apache.lucene.util.TestRuleStoreClassName$1.evaluate(TestRuleStoreClassName.java:42)
   [junit4]   2> 	at com.carrotsearch.randomizedtesting.rules.NoShadowingOrOverridesOnMethodsRule$1.evaluate(NoShadowingOrOverridesOnMethodsRule.java:40)
   [junit4]   2> 	at com.carrotsearch.randomizedtesting.rules.NoShadowingOrOverridesOnMethodsRule$1.evaluate(NoShadowingOrOverridesOnMethodsRule.java:40)
   [junit4]   2> 	at com.carrotsearch.randomizedtesting.rules.StatementAdapter.evaluate(StatementAdapter.java:36)
   [junit4]   2> 	at com.carrotsearch.randomizedtesting.rules.StatementAdapter.evaluate(StatementAdapter.java:36)
   [junit4]   2> 	at com.carrotsearch.randomizedtesting.rules.StatementAdapter.evaluate(StatementAdapter.java:36)
   [junit4]   2> 	at org.apache.lucene.util.TestRuleAssertionsRequired$1.evaluate(TestRuleAssertionsRequired.java:54)
   [junit4]   2> 	at org.apache.lucene.util.TestRuleMarkFailure$1.evaluate(TestRuleMarkFailure.java:48)
   [junit4]   2> 	at org.apache.lucene.util.TestRuleIgnoreAfterMaxFailures$1.evaluate(TestRuleIgnoreAfterMaxFailures.java:65)
   [junit4]   2> 	at org.apache.lucene.util.TestRuleIgnoreTestSuites$1.evaluate(TestRuleIgnoreTestSuites.java:55)
   [junit4]   2> 	at com.carrotsearch.randomizedtesting.rules.StatementAdapter.evaluate(StatementAdapter.java:36)
   [junit4]   2> 	at com.carrotsearch.randomizedtesting.ThreadLeakControl$StatementRunner.run(ThreadLeakControl.java:367)
   [junit4]   2> 	at java.lang.Thread.run(Thread.java:745)
   [junit4]   2> 
   [junit4]   2> 410694 INFO  (TEST-AutoCommitTest.testCommitWithin-seed#[492941F0730FC0F2]) [    x:collection1] o.a.s.SolrTestCaseJ4 ###Ending testCommitWithin
   [junit4]   2> NOTE: reproduce with: ant test  -Dtestcase=AutoCommitTest -Dtests.method=testCommitWithin -Dtests.seed=492941F0730FC0F2 -Dtests.slow=true -Dtests.locale=nn-NO -Dtests.timezone=America/Cambridge_Bay -Dtests.asserts=true -Dtests.file.encoding=UTF-8
   [junit4] ERROR   0.64s J1 | AutoCommitTest.testCommitWithin <<<
   [junit4]    > Throwable #1: java.lang.RuntimeException: Exception during query
   [junit4]    > 	at __randomizedtesting.SeedInfo.seed([492941F0730FC0F2:F3FB2E88F0212EE7]:0)
   [junit4]    > 	at org.apache.solr.SolrTestCaseJ4.assertQ(SolrTestCaseJ4.java:755)
   [junit4]    > 	at org.apache.solr.update.AutoCommitTest.testCommitWithin(AutoCommitTest.java:326)
   [junit4]    > 	at java.lang.Thread.run(Thread.java:745)
   [junit4]    > Caused by: java.lang.RuntimeException: REQUEST FAILED: xpath=//result[@numFound=1]
   [junit4]    > 	xml response was: <?xml version="1.0" encoding="UTF-8"?>
   [junit4]    > <response>
   [junit4]    > <lst name="responseHeader"><int name="status">0</int><int name="QTime">0</int></lst><result name="response" numFound="0" start="0"></result>
   [junit4]    > </response>
   [junit4]    > 	request was:q=id:529&qt=standard&start=0&rows=20&version=2.2
   [junit4]    > 	at org.apache.solr.SolrTestCaseJ4.assertQ(SolrTestCaseJ4.java:748)
   [junit4]    > 	... 40 more
   [junit4]   2> 410747 INFO  (TEST-AutoCommitTest.testMaxDocs-seed#[492941F0730FC0F2]) [    x:collection1] o.a.s.SolrTestCaseJ4 ###Starting testMaxDocs
   [junit4]   2> 410779 INFO  (TEST-AutoCommitTest.testMaxDocs-seed#[492941F0730FC0F2]) [    x:collection1] o.a.s.s.SolrIndexSearcher Opening [Searcher@9fa44e[collection1] realtime]
   [junit4]   2> 410779 INFO  (TEST-AutoCommitTest.testMaxDocs-seed#[492941F0730FC0F2]) [    x:collection1] o.a.s.u.p.LogUpdateProcessorFactory [collection1]  webapp=null path=null params={}{deleteByQuery=*:* (-1524153029903777792)} 0 36
   [junit4]   2> 410780 INFO  (TEST-AutoCommitTest.testMaxDocs-seed#[492941F0730FC0F2]) [    x:collection1] o.a.s.c.SolrResourceLoader new SolrResourceLoader for directory: 'C:\Users\JenkinsSlave\workspace\Lucene-Solr-trunk-Windows\solr\core\src\test-files\solr\collection1'
   [junit4]   2> 410780 INFO  (TEST-AutoCommitTest.testMaxDocs-seed#[492941F0730FC0F2]) [    x:collection1] o.a.s.c.SolrResourceLoader JNDI not configured for solr (NoInitialContextEx)
   [junit4]   2> 410780 INFO  (TEST-AutoCommitTest.testMaxDocs-seed#[492941F0730FC0F2]) [    x:collection1] o.a.s.c.SolrResourceLoader using system property solr.solr.home: C:\Users\JenkinsSlave\workspace\Lucene-Solr-trunk-Windows\solr\core\src\test-files\solr
   [junit4]   2> 410781 INFO  (TEST-AutoCommitTest.testMaxDocs-seed#[492941F0730FC0F2]) [    x:collection1] o.a.s.c.SolrResourceLoader Adding 'file:/C:/Users/JenkinsSlave/workspace/Lucene-Solr-trunk-Windows/solr/core/src/test-files/solr/collection1/lib/classes/' to classloader
   [junit4]   2> 410782 INFO  (TEST-AutoCommitTest.testMaxDocs-seed#[492941F0730FC0F2]) [    x:collection1] o.a.s.c.SolrResourceLoader Adding 'file:/C:/Users/JenkinsSlave/workspace/Lucene-Solr-trunk-Windows/solr/core/src/test-files/solr/collection1/lib/README' to classloader
   [junit4]   2> 410865 INFO  (TEST-AutoCommitTest.testMaxDocs-seed#[492941F0730FC0F2]) [    x:collection1] o.a.s.c.SolrConfig current version of requestparams : -1
   [junit4]   2> 410874 INFO  (TEST-AutoCommitTest.testMaxDocs-seed#[492941F0730FC0F2]) [    x:collection1] o.a.s.c.SolrConfig Using Lucene MatchVersion: 6.0.0
   [junit4]   2> 410893 INFO  (TEST-AutoCommitTest.testMaxDocs-seed#[492941F0730FC0F2]) [    x:collection1] o.a.s.c.SolrConfig Loaded SolrConfig: solrconfig.xml
   [junit4]   2> 410900 INFO  (TEST-AutoCommitTest.testMaxDocs-seed#[492941F0730FC0F2]) [    x:collection1] o.a.s.s.IndexSchema [collection1] Schema name=test
   [junit4]   2> 411090 INFO  (TEST-AutoCommitTest.testMaxDocs-seed#[492941F0730FC0F2]) [    x:collection1] o.a.s.s.OpenExchangeRatesOrgProvider Initialized with rates=open-exchange-rates.json, refreshInterval=1440.
   [junit4]   2> 411100 INFO  (TEST-AutoCommitTest.testMaxDocs-seed#[492941F0730FC0F2]) [    x:collection1] o.a.s.s.IndexSchema default search field in schema is text
   [junit4]   2> 411101 INFO  (TEST-AutoCommitTest.testMaxDocs-seed#[492941F0730FC0F2]) [    x:collection1] o.a.s.s.IndexSchema unique key field: id
   [junit4]   2> 411111 INFO  (TEST-AutoCommitTest.testMaxDocs-seed#[492941F0730FC0F2]) [    x:collection1] o.a.s.s.FileExchangeRateProvider Reloading exchange rates from file currency.xml
   [junit4]   2> 411114 INFO  (TEST-AutoCommitTest.testMaxDocs-seed#[492941F0730FC0F2]) [    x:collection1] o.a.s.s.FileExchangeRateProvider Reloading exchange rates from file currency.xml
   [junit4]   2> 411119 INFO  (TEST-AutoCommitTest.testMaxDocs-seed#[492941F0730FC0F2]) [    x:collection1] o.a.s.s.OpenExchangeRatesOrgProvider Reloading exchange rates from open-exchange-rates.json
   [junit4]   2> 411119 INFO  (TEST-AutoCommitTest.testMaxDocs-seed#[492941F0730FC0F2]) [    x:collection1] o.a.s.s.OpenExchangeRatesOrgProvider Reloading exchange rates from open-exchange-rates.json
   [junit4]   2> 411144 INFO  (TEST-AutoCommitTest.testMaxDocs-seed#[492941F0730FC0F2]) [    x:collection1] o.a.s.c.ConfigSetProperties Did not find ConfigSet properties, assuming default properties: Can't find resource 'configsetprops.json' in classpath or 'C:\Users\JenkinsSlave\workspace\Lucene-Solr-trunk-Windows\solr\core\src\test-files\solr\collection1'
   [junit4]   2> 411144 INFO  (TEST-AutoCommitTest.testMaxDocs-seed#[492941F0730FC0F2]) [    x:collection1] o.a.s.c.CoreContainer Reloading SolrCore 'collection1' using configuration from instancedir C:\Users\JenkinsSlave\workspace\Lucene-Solr-trunk-Windows\solr\core\src\test-files\solr\collection1
   [junit4]   2> 411145 INFO  (TEST-AutoCommitTest.testMaxDocs-seed#[492941F0730FC0F2]) [    x:collection1] o.a.s.c.SolrCore [[collection1] ] Opening new SolrCore at [C:\Users\JenkinsSlave\workspace\Lucene-Solr-trunk-Windows\solr\core\src\test-files\solr\collection1], dataDir=[C:\Users\JenkinsSlave\workspace\Lucene-Solr-trunk-Windows\solr\build\solr-core\test\J1\temp\solr.update.AutoCommitTest_492941F0730FC0F2-001\init-core-data-001\]
   [junit4]   2> 411145 INFO  (TEST-AutoCommitTest.testMaxDocs-seed#[492941F0730FC0F2]) [    x:collection1] o.a.s.c.JmxMonitoredMap JMX monitoring is enabled. Adding Solr mbeans to JMX Server: com.sun.jmx.mbeanserver.JmxMBeanServer@1d73223
   [junit4]   2> 411145 INFO  (TEST-AutoCommitTest.testMaxDocs-seed#[492941F0730FC0F2]) [    x:collection1] o.a.s.c.SolrCore New index directory detected: old=null new=C:\Users\JenkinsSlave\workspace\Lucene-Solr-trunk-Windows\solr\build\solr-core\test\J1\temp\solr.update.AutoCommitTest_492941F0730FC0F2-001\init-core-data-001\index/
   [junit4]   2> 411150 INFO  (OldIndexDirectoryCleanupThreadForCore-collection1) [    x:collection1] o.a.s.c.SolrCore Looking for old index directories to cleanup for core collection1 in C:\Users\JenkinsSlave\workspace\Lucene-Solr-trunk-Windows\solr\build\solr-core\test\J1\temp\solr.update.AutoCommitTest_492941F0730FC0F2-001\init-core-data-001\
   [junit4]   2> 411152 INFO  (TEST-AutoCommitTest.testMaxDocs-seed#[492941F0730FC0F2]) [    x:collection1] o.a.s.u.p.UpdateRequestProcessorChain creating updateRequestProcessorChain "dedupe"
   [junit4]   2> 411153 INFO  (TEST-AutoCommitTest.testMaxDocs-seed#[492941F0730FC0F2]) [    x:collection1] o.a.s.u.p.UpdateRequestProcessorChain inserting DistributedUpdateProcessorFactory into updateRequestProcessorChain "dedupe"
   [junit4]   2> 411153 INFO  (TEST-AutoCommitTest.testMaxDocs-seed#[492941F0730FC0F2]) [    x:collection1] o.a.s.u.p.UpdateRequestProcessorChain creating updateRequestProcessorChain "dedupe-allfields"
   [junit4]   2> 411153 INFO  (TEST-AutoCommitTest.testMaxDocs-seed#[492941F0730FC0F2]) [    x:collection1] o.a.s.u.p.UpdateRequestProcessorChain inserting DistributedUpdateProcessorFactory into updateRequestProcessorChain "dedupe-allfields"
   [junit4]   2> 411153 INFO  (TEST-AutoCommitTest.testMaxDocs-seed#[492941F0730FC0F2]) [    x:collection1] o.a.s.u.p.UpdateRequestProcessorChain creating updateRequestProcessorChain "stored_sig"
   [junit4]   2> 411153 INFO  (TEST-AutoCommitTest.testMaxDocs-seed#[492941F0730FC0F2]) [    x:collection1] o.a.s.u.p.UpdateRequestProcessorChain inserting DistributedUpdateProcessorFactory into updateRequestProcessorChain "stored_sig"
   [junit4]   2> 411153 INFO  (TEST-AutoCommitTest.testMaxDocs-seed#[492941F0730FC0F2]) [    x:collection1] o.a.s.u.p.UpdateRequestProcessorChain creating updateRequestProcessorChain "uniq-fields"
   [junit4]   2> 411153 INFO  (TEST-AutoCommitTest.testMaxDocs-seed#[492941F0730FC0F2]) [    x:collection1] o.a.s.u.p.UpdateRequestProcessorChain inserting DistributedUpdateProcessorFactory into updateRequestProcessorChain "uniq-fields"
   [junit4]   2> 411153 INFO  (TEST-AutoCommitTest.testMaxDocs-seed#[492941F0730FC0F2]) [    x:collection1] o.a.s.u.p.UpdateRequestProcessorChain creating updateRequestProcessorChain "distrib-dup-test-chain-explicit"
   [junit4]   2> 411153 INFO  (TEST-AutoCommitTest.testMaxDocs-seed#[492941F0730FC0F2]) [    x:collection1] o.a.s.u.p.UpdateRequestProcessorChain creating updateRequestProcessorChain "distrib-dup-test-chain-implicit"
   [junit4]   2> 411154 INFO  (TEST-AutoCommitTest.testMaxDocs-seed#[492941F0730FC0F2]) [    x:collection1] o.a.s.u.p.UpdateRequestProcessorChain inserting DistributedUpdateProcessorFactory into updateRequestProcessorChain "distrib-dup-test-chain-implicit"
   [junit4]   2> 411154 INFO  (TEST-AutoCommitTest.testMaxDocs-seed#[492941F0730FC0F2]) [    x:collection1] o.a.s.c.SolrCore no updateRequestProcessorChain defined as default, creating implicit default
   [junit4]   2> 411171 INFO  (TEST-AutoCommitTest.testMaxDocs-seed#[492941F0730FC0F2]) [    x:collection1] o.a.s.h.l.XMLLoader xsltCacheLifetimeSeconds=60
   [junit4]   2> 411173 INFO  (TEST-AutoCommitTest.testMaxDocs-seed#[492941F0730FC0F2]) [    x:collection1] o.a.s.h.l.XMLLoader xsltCacheLifetimeSeconds=60
   [junit4]   2> 411175 INFO  (TEST-AutoCommitTest.testMaxDocs-seed#[492941F0730FC0F2]) [    x:collection1] o.a.s.h.l.XMLLoader xsltCacheLifetimeSeconds=60
   [junit4]   2> 411182 INFO  (TEST-AutoCommitTest.testMaxDocs-seed#[492941F0730FC0F2]) [    x:collection1] o.a.s.h.l.XMLLoader xsltCacheLifetimeSeconds=60
   [junit4]   2> 411243 INFO  (TEST-AutoCommitTest.testMaxDocs-seed#[492941F0730FC0F2]) [    x:collection1] o.a.s.c.PluginBag requestHandler : 'lazy' created with startup=lazy 
   [junit4]   2> 411251 INFO  (TEST-AutoCommitTest.testMaxDocs-seed#[492941F0730FC0F2]) [    x:collection1] o.a.s.c.RequestHandlers Registered paths: /admin/mbeans,standard,spellCheckCompRH,lazy,/update/json/docs,/admin/luke,/export,spellCheckWithWordbreak_Direct,tvrh,/get,/admin/properties,/update/json,mltrh,/admin/threads,/search-facet-def,/update/csv,/sql,/search-facet-invariants,/admin/segments,spellCheckCompRH1,/mlt,/admin/system,/replication,dismax,defaults,/config,/stream,/schema,/admin/plugins,/admin/logging,spellCheckWithWordbreak,mock,/admin/ping,/update,/admin/file,/terms,spellCheckCompRH_Direct,/debug/dump
   [junit4]   2> 411252 WARN  (TEST-AutoCommitTest.testMaxDocs-seed#[492941F0730FC0F2]) [    x:collection1] o.a.s.c.SolrCore solrconfig.xml uses deprecated <admin/gettableFiles>, Please update your config to use the ShowFileRequestHandler.
   [junit4]   2> 411252 INFO  (TEST-AutoCommitTest.testMaxDocs-seed#[492941F0730FC0F2]) [    x:collection1] o.a.s.c.SolrCore Using default statsCache cache: org.apache.solr.search.stats.LocalStatsCache
   [junit4]   2> 411253 INFO  (TEST-AutoCommitTest.testMaxDocs-seed#[492941F0730FC0F2]) [    x:collection1] o.a.s.u.CommitTracker Hard AutoCommit: disabled
   [junit4]   2> 411253 INFO  (TEST-AutoCommitTest.testMaxDocs-seed#[492941F0730FC0F2]) [    x:collection1] o.a.s.u.CommitTracker Soft AutoCommit: disabled
   [junit4]   2> 411254 INFO  (TEST-AutoCommitTest.testMaxDocs-seed#[492941F0730FC0F2]) [    x:collection1] o.a.s.s.SolrIndexSearcher Opening [Searcher@11183f6[collection1] main]
   [junit4]   2> 411254 INFO  (TEST-AutoCommitTest.testMaxDocs-seed#[492941F0730FC0F2]) [    x:collection1] o.a.s.r.RestManager Initializing RestManager with initArgs: {storageIO=org.apache.solr.rest.ManagedResourceStorage$InMemoryStorageIO}
   [junit4]   2> 411254 INFO  (TEST-AutoCommitTest.testMaxDocs-seed#[492941F0730FC0F2]) [    x:collection1] o.a.s.r.ManagedResourceStorage Reading _rest_managed.json using InMemoryStorage
   [junit4]   2> 411254 INFO  (TEST-AutoCommitTest.testMaxDocs-seed#[492941F0730FC0F2]) [    x:collection1] o.a.s.r.RestManager Initializing 0 registered ManagedResources
   [junit4]   2> 411254 INFO  (TEST-AutoCommitTest.testMaxDocs-seed#[492941F0730FC0F2]) [    x:collection1] o.a.s.h.c.SpellCheckComponent Initializing spell checkers
   [junit4]   2> 411256 INFO  (TEST-AutoCommitTest.testMaxDocs-seed#[492941F0730FC0F2]) [    x:collection1] o.a.s.s.DirectSolrSpellChecker init: {name=direct,classname=DirectSolrSpellChecker,field=lowerfilt,minQueryLength=3}
   [junit4]   2> 411262 INFO  (TEST-AutoCommitTest.testMaxDocs-seed#[492941F0730FC0F2]) [    x:collection1] o.a.s.h.ReplicationHandler Commits will be reserved for  10000
   [junit4]   2> 411285 INFO  (searcherExecutor-913-thread-1-processing-x:collection1) [    x:collection1] o.a.s.h.c.SpellCheckComponent Loading spell index for spellchecker: default
   [junit4]   2> 411286 INFO  (TEST-AutoCommitTest.testMaxDocs-seed#[492941F0730FC0F2]) [    x:collection1] o.a.s.u.UpdateLog Looking up max value of version field to seed version buckets
   [junit4]   2> 411287 INFO  (searcherExecutor-913-thread-1-processing-x:collection1) [    x:collection1] o.a.s.h.c.SpellCheckComponent Loading spell index for spellchecker: direct
   [junit4]   2> 411287 INFO  (searcherExecutor-913-thread-1-processing-x:collection1) [    x:collection1] o.a.s.h.c.SpellCheckComponent Loading spell index for spellchecker: wordbreak
   [junit4]   2> 411287 INFO  (searcherExecutor-913-thread-1-processing-x:collection1) [    x:collection1] o.a.s.h.c.SpellCheckComponent Loading spell index for spellchecker: multipleFields
   [junit4]   2> 411287 INFO  (searcherExecutor-913-thread-1-processing-x:collection1) [    x:collection1] o.a.s.h.c.SpellCheckComponent Loading spell index for spellchecker: jarowinkler
   [junit4]   2> 411288 INFO  (searcherExecutor-913-thread-1-processing-x:collection1) [    x:collection1] o.a.s.h.c.SpellCheckComponent Loading spell index for spellchecker: external
   [junit4]   2> 411288 INFO  (searcherExecutor-913-thread-1-processing-x:collection1) [    x:collection1] o.a.s.h.c.SpellCheckComponent Loading spell index for spellchecker: freq
   [junit4]   2> 411288 INFO  (searcherExecutor-913-thread-1-processing-x:collection1) [    x:collection1] o.a.s.h.c.SpellCheckComponent Loading spell index for spellchecker: fqcn
   [junit4]   2> 411289 INFO  (searcherExecutor-913-thread-1-processing-x:collection1) [    x:collection1] o.a.s.h.c.SpellCheckComponent Loading spell index for spellchecker: perDict
   [junit4]   2> 411290 INFO  (searcherExecutor-913-thread-1-processing-x:collection1) [    x:collection1] o.a.s.c.SolrCore [collection1] Registered new searcher Searcher@11183f6[collection1] main{ExitableDirectoryReader(UninvertingDirectoryReader())}
   [junit4]   2> 411292 INFO  (TEST-AutoCommitTest.testMaxDocs-seed#[492941F0730FC0F2]) [    x:collection1] o.a.s.u.VersionInfo Refreshing highest value of _version_ for 65536 version buckets from index
   [junit4]   2> 411292 INFO  (TEST-AutoCommitTest.testMaxDocs-seed#[492941F0730FC0F2]) [    x:collection1] o.a.s.u.VersionInfo No terms found for _version_, cannot seed version bucket highest value from index
   [junit4]   2> 411294 INFO  (TEST-AutoCommitTest.testMaxDocs-seed#[492941F0730FC0F2]) [    x:collection1] o.a.s.u.UpdateLog Took 8.0ms to seed version buckets with highest version 1524153029903777792
   [junit4]   2> 411295 INFO  (TEST-AutoCommitTest.testMaxDocs-seed#[492941F0730FC0F2]) [    x:collection1] o.a.s.u.DefaultSolrCoreState Closing old IndexWriter... core=collection1
   [junit4]   2> 411295 INFO  (TEST-AutoCommitTest.testMaxDocs-seed#[492941F0730FC0F2]) [    x:collection1] o.a.s.c.SolrDeletionPolicy SolrDeletionPolicy.onCommit: commits: num=2
   [junit4]   2> 	commit{dir=MockDirectoryWrapper(RAMDirectory@1f67b30 lockFactory=org.apache.lucene.store.SingleInstanceLockFactory@78f42e),segFN=segments_1,generation=1}
   [junit4]   2> 	commit{dir=MockDirectoryWrapper(RAMDirectory@1f67b30 lockFactory=org.apache.lucene.store.SingleInstanceLockFactory@78f42e),segFN=segments_2,generation=2}
   [junit4]   2> 411295 INFO  (TEST-AutoCommitTest.testMaxDocs-seed#[492941F0730FC0F2]) [    x:collection1] o.a.s.c.SolrDeletionPolicy newest commit generation = 2
   [junit4]   2> 411295 INFO  (TEST-AutoCommitTest.testMaxDocs-seed#[492941F0730FC0F2]) [    x:collection1] o.a.s.u.RandomMergePolicy RandomMergePolicy wrapping class org.apache.lucene.index.TieredMergePolicy: [TieredMergePolicy: maxMergeAtOnce=20, maxMergeAtOnceExplicit=19, maxMergedSegmentMB=51.22265625, floorSegmentMB=0.4443359375, forceMergeDeletesPctAllowed=3.4055906131796743, segmentsPerTier=33.0, maxCFSSegmentSizeMB=8.796093022207999E12, noCFSRatio=0.0
   [junit4]   2> 411296 INFO  (TEST-AutoCommitTest.testMaxDocs-seed#[492941F0730FC0F2]) [    x:collection1] o.a.s.c.SolrDeletionPolicy SolrDeletionPolicy.onInit: commits: num=1
   [junit4]   2> 	commit{dir=MockDirectoryWrapper(RAMDirectory@1f67b30 lockFactory=org.apache.lucene.store.SingleInstanceLockFactory@78f42e),segFN=segments_2,generation=2}
   [junit4]   2> 411296 INFO  (TEST-AutoCommitTest.testMaxDocs-seed#[492941F0730FC0F2]) [    x:collection1] o.a.s.c.SolrDeletionPolicy newest commit generation = 2
   [junit4]   2> 411296 INFO  (TEST-AutoCommitTest.testMaxDocs-seed#[492941F0730FC0F2]) [    x:collection1] o.a.s.u.DefaultSolrCoreState New IndexWriter is ready to be used.
   [junit4]   2> 411296 INFO  (TEST-AutoCommitTest.testMaxDocs-seed#[492941F0730FC0F2]) [    x:collection1] o.a.s.s.SolrIndexSearcher Opening [Searcher@ef1ef7[collection1] main]
   [junit4]   2> 411298 INFO  (searcherExecutor-913-thread-1-processing-x:collection1) [    x:collection1] o.a.s.c.SolrCore [collection1] Registered new searcher Searcher@ef1ef7[collection1] main{ExitableDirectoryReader(UninvertingDirectoryReader())}
   [junit4]   2> 411299 INFO  (TEST-AutoCommitTest.testMaxDocs-seed#[492941F0730FC0F2]) [    x:collection1] o.a.s.c.CoreContainer replacing core: collection1
   [junit4]   2> 411299 INFO  (TEST-AutoCommitTest.testMaxDocs-seed#[492941F0730FC0F2]) [    x:collection1] o.a.s.c.SolrCore [collection1]  CLOSING SolrCore org.apache.solr.core.SolrCore@1f1258e
   [junit4]   2> 411299 INFO  (TEST-AutoCommitTest.testMaxDocs-seed#[492941F0730FC0F2]) [    x:collection1] o.a.s.u.DirectUpdateHandler2 closing DirectUpdateHandler2{commits=0,autocommits=0,soft autocommits=0,optimizes=0,rollbacks=0,expungeDeletes=0,docsPending=2,adds=2,deletesById=1,deletesByQuery=1,errors=0,cumulative_adds=2,cumulative_deletesById=1,cumulative_deletesByQuery=1,cumulative_errors=0,transaction_logs_total_size=0,transaction_logs_total_number=0}
   [junit4]   2> 411300 INFO  (TEST-AutoCommitTest.testMaxDocs-seed#[492941F0730FC0F2]) [    x:collection1] o.a.s.c.SolrCore [collection1] Closing main searcher on request.
   [junit4]   2> 411367 INFO  (TEST-AutoCommitTest.testMaxDocs-seed#[492941F0730FC0F2]) [    x:collection1] o.a.s.u.p.LogUpdateProcessorFactory [collection1] {add=[0 (1524153030552846336)]} 0 1
   [junit4]   2> 411368 INFO  (TEST-AutoCommitTest.testMaxDocs-seed#[492941F0730FC0F2]) [    x:collection1] o.a.s.u.p.LogUpdateProcessorFactory [collection1] {add=[1 (1524153030553894912)]} 0 2
   [junit4]   2> 411370 INFO  (TEST-AutoCommitTest.testMaxDocs-seed#[492941F0730FC0F2]) [    x:collection1] o.a.s.u.p.LogUpdateProcessorFactory [collection1] {add=[2 (1524153030553894913)]} 0 4
   [junit4]   2> 411370 INFO  (TEST-AutoCommitTest.testMaxDocs-seed#[492941F0730FC0F2]) [    x:collection1] o.a.s.u.p.LogUpdateProcessorFactory [collection1] {add=[3 (1524153030555992064)]} 0 4
   [junit4]   2> 411371 INFO  (TEST-AutoCommitTest.testMaxDocs-seed#[492941F0730FC0F2]) [    x:collection1] o.a.s.u.p.LogUpdateProcessorFactory [collection1] {add=[4 (1524153030555992065)]} 0 5
   [junit4]   2> 411422 INFO  (TEST-AutoCommitTest.testMaxDocs-seed#[492941F0730FC0F2]) [    x:collection1] o.a.s.u.p.LogUpdateProcessorFactory [collection1] {add=[5 (1524153030557040640)]} 0 60
   [junit4]   2> 411424 INFO  (TEST-AutoCommitTest.testMaxDocs-seed#[492941F0730FC0F2]) [    x:collection1] o.a.s.u.p.LogUpdateProcessorFactory [collection1] {add=[6 (1524153030611566592)]} 0 61
   [junit4]   2> 411425 INFO  (TEST-AutoCommitTest.testMaxDocs-seed#[492941F0730FC0F2]) [    x:collection1] o.a.s.u.p.LogUpdateProcessorFactory [collection1] {add=[7 (1524153030612615168)]} 0 63
   [junit4]   2> 411425 INFO  (TEST-AutoCommitTest.testMaxDocs-seed#[492941F0730FC0F2]) [    x:collection1] o.a.s.u.p.LogUpdateProcessorFactory [collection1] {add=[8 (1524153030613663744)]} 0 64
   [junit4]   2> 411427 INFO  (TEST-AutoCommitTest.testMaxDocs-seed#[492941F0730FC0F2]) [    x:collection1] o.a.s.u.p.LogUpdateProcessorFactory [collection1] {add=[9 (1524153030614712320)]} 0 66
   [junit4]   2> 411427 INFO  (TEST-AutoCommitTest.testMaxDocs-seed#[492941F0730FC0F2]) [    x:collection1] o.a.s.u.p.LogUpdateProcessorFactory [collection1] {add=[10 (1524153030615760896)]} 0 66
   [junit4]   2> 411429 INFO  (TEST-AutoCommitTest.testMaxDocs-seed#[492941F0730FC0F2]) [    x:collection1] o.a.s.u.p.LogUpdateProcessorFactory [collection1] {add=[11 (1524153030616809472)]} 0 67
   [junit4]   2> 411430 INFO  (TEST-AutoCommitTest.testMaxDocs-seed#[492941F0730FC0F2]) [    x:collection1] o.a.s.u.p.LogUpdateProcessorFactory [collection1] {add=[12 (1524153030617858048)]} 0 69
   [junit4]   2> 411432 INFO  (TEST-AutoCommitTest.testMaxDocs-seed#[492941F0730FC0F2]) [    x:collection1] o.a.s.u.p.LogUpdateProcessorFactory [collection1] {add=[13 (1524153030621003776)]} 0 70
   [junit4]   2> 411432 INFO  (TEST-AutoCommitTest.testMaxDocs-seed#[492941F0730FC0F2]) [    x:collection1] o.a.s.c.S.Request [collection1]  webapp=null path=null params={q=id:1&qt=standard&start=0&rows=20&version=2.2} hits=0 status=0 QTime=0
   [junit4]   2> 411434 INFO  (TEST-AutoCommitTest.testMaxDocs-seed#[492941F0730FC0F2]) [    x:collection1] o.a.s.u.p.LogUpdateProcessorFactory [collection1] {add=[14 (1524153030623100928)]} 0 73
   [junit4]   2> 411444 INFO  (commitScheduler-916-thread-1) [    x:collection1] o.a.s.u.DirectUpdateHandler2 start commit{,optimize=false,openSearcher=true,waitSearcher=true,expungeDeletes=false,softCommit=true,prepareCommit=false}
   [junit4]   2> 411458 INFO  (commitScheduler-916-thread-1) [    x:collection1] o.a.s.s.SolrIndexSearcher Opening [Searcher@98aa05[collection1] main]
   [junit4]   2> 411461 INFO  (commitScheduler-916-thread-1) [    x:collection1] o.a.s.u.DirectUpdateHandler2 end_commit_flush
   [junit4]   2> 411493 INFO  (searcherExecutor-913-thread-1-processing-x:collection1) [    x:collection1] o.a.s.c.SolrCore [collection1] Registered new searcher Searcher@98aa05[collection1] main{ExitableDirectoryReader(UninvertingDirectoryReader(Uninverting(_1(6.0.0):c15)))}
   [junit4]   2> 411669 INFO  (TEST-AutoCommitTest.testMaxDocs-seed#[492941F0730FC0F2]) [    x:collection1] o.a.s.u.p.LogUpdateProcessorFactory [collection1] {add=[15 (1524153030866370560)]} 0 326
   [junit4]   2> 411670 INFO  (TEST-AutoCommitTest.testMaxDocs-seed#[492941F0730FC0F2]) [    x:collection1] o.a.s.c.S.Request [collection1]  webapp=null path=null params={q=id:14&qt=standard&start=0&rows=20&version=2.2} hits=1 status=0 QTime=0
   [junit4]   2> 411674 INFO  (TEST-AutoCommitTest.testMaxDocs-seed#[492941F0730FC0F2]) [    x:collection1] o.a.s.c.S.Request [collection1]  webapp=null path=null params={q=id:15&qt=standard&start=0&rows=20&version=2.2} hits=0 status=0 QTime=0
   [junit4]   2> 411675 INFO  (TEST-AutoCommitTest.testMaxDocs-seed#[492941F0730FC0F2]) [    x:collection1] o.a.s.SolrTestCaseJ4 ###Ending testMaxDocs
   [junit4]   2> 411678 INFO  (TEST-AutoCommitTest.testMaxTime-seed#[492941F0730FC0F2]) [    x:collection1] o.a.s.SolrTestCaseJ4 ###Starting testMaxTime
   [junit4]   2> 411693 INFO  (TEST-AutoCommitTest.testMaxTime-seed#[492941F0730FC0F2]) [    x:collection1] o.a.s.s.SolrIndexSearcher Opening [Searcher@f738bf[collection1] realtime]
   [junit4]   2> 411693 INFO  (TEST-AutoCommitTest.testMaxTime-seed#[492941F0730FC0F2]) [    x:collection1] o.a.s.u.p.LogUpdateProcessorFactory [collection1]  webapp=null path=null params={}{deleteByQuery=*:* (-1524153030878953472)} 0 15
   [junit4]   2> 411693 INFO  (TEST-AutoCommitTest.testMaxTime-seed#[492941F0730FC0F2]) [    x:collection1] o.a.s.c.SolrResourceLoader new SolrResourceLoader for directory: 'C:\Users\JenkinsSlave\workspace\Lucene-Solr-trunk-Windows\solr\core\src\test-files\solr\collection1'
   [junit4]   2> 411693 INFO  (TEST-AutoCommitTest.testMaxTime-seed#[492941F0730FC0F2]) [    x:collection1] o.a.s.c.SolrResourceLoader JNDI not configured for solr (NoInitialContextEx)
   [junit4]   2> 411694 INFO  (TEST-AutoCommitTest.testMaxTime-seed#[492941F0730FC0F2]) [    x:collection1] o.a.s.c.SolrResourceLoader using system property solr.solr.home: C:\Users\JenkinsSlave\workspace\Lucene-Solr-trunk-Windows\solr\core\src\test-files\solr
   [junit4]   2> 411695 INFO  (TEST-AutoCommitTest.testMaxTime-seed#[492941F0730FC0F2]) [    x:collection1] o.a.s.c.SolrResourceLoader Adding 'file:/C:/Users/JenkinsSlave/workspace/Lucene-Solr-trunk-Windows/solr/core/src/test-files/solr/collection1/lib/classes/' to classloader
   [junit4]   2> 411696 INFO  (TEST-AutoCommitTest.testMaxTime-seed#[492941F0730FC0F2]) [    x:collection1] o.a.s.c.SolrResourceLoader Adding 'file:/C:/Users/JenkinsSlave/workspace/Lucene-Solr-trunk-Windows/solr/core/src/test-files/solr/collection1/lib/README' to classloader
   [junit4]   2> 411779 INFO  (TEST-AutoCommitTest.testMaxTime-seed#[492941F0730FC0F2]) [    x:collection1] o.a.s.c.SolrConfig current version of requestparams : -1
   [junit4]   2> 411792 INFO  (TEST-AutoCommitTest.testMaxTime-seed#[492941F0730FC0F2]) [    x:collection1] o.a.s.c.SolrConfig Using Lucene MatchVersion: 6.0.0
   [junit4]   2> 411818 INFO  (TEST-AutoCommitTest.testMaxTime-seed#[492941F0730FC0F2]) [    x:collection1] o.a.s.c.SolrConfig Loaded SolrConfig: solrconfig.xml
   [junit4]   2> 411847 INFO  (TEST-AutoCommitTest.testMaxTime-seed#[492941F0730FC0F2]) [    x:collection1] o.a.s.s.IndexSchema [collection1] Schema name=test
   [junit4]   2> 412028 INFO  (TEST-AutoCommitTest.testMaxTime-seed#[492941F0730FC0F2]) [    x:collection1] o.a.s.s.OpenExchangeRatesOrgProvider Initialized with rates=open-exchange-rates.json, refreshInterval=1440.
   [junit4]   2> 412045 INFO  (TEST-AutoCommitTest.testMaxTime-seed#[492941F0730FC0F2]) [    x:collection1] o.a.s.s.IndexSchema default search field in schema is text
   [junit4]   2> 412046 INFO  (TEST-AutoCommitTest.testMaxTime-seed#[492941F0730FC0F2]) [    x:collection1] o.a.s.s.IndexSchema unique key field: id
   [junit4]   2> 412055 INFO  (TEST-AutoCommitTest.testMaxTime-seed#[492941F0730FC0F2]) [    x:collection1] o.a.s.s.FileExchangeRateProvider Reloading exchange rates from file currency.xml
   [junit4]   2> 412057 INFO  (TEST-AutoCommitTest.testMaxTime-seed#[492941F0730FC0F2]) [    x:collection1] o.a.s.s.FileExchangeRateProvider Reloading exchange rates from file currency.xml
   [junit4]   2> 412059 INFO  (TEST-AutoCommitTest.testMaxTime-seed#[492941F0730FC0F2]) [    x:collection1] o.a.s.s.OpenExchangeRatesOrgProvider Reloading exchange rates from open-exchange-rates.json
   [junit4]   2> 412059 INFO  (TEST-AutoCommitTest.testMaxTime-seed#[492941F0730FC0F2]) [    x:collection1] o.a.s.s.OpenExchangeRatesOrgProvider Reloading exchange rates from open-exchange-rates.json
   [junit4]   2> 412066 INFO  (TEST-AutoCommitTest.testMaxTime-seed#[492941F0730FC0F2]) [    x:collection1] o.a.s.c.ConfigSetProperties Did not find ConfigSet properties, assuming default properties: Can't find resource 'configsetprops.json' in classpath or 'C:\Users\JenkinsSlave\workspace\Lucene-Solr-trunk-Windows\solr\core\src\test-files\solr\collection1'
   [junit4]   2> 412066 INFO  (TEST-AutoCommitTest.testMaxTime-seed#[492941F0730FC0F2]) [    x:collection1] o.a.s.c.CoreContainer Reloading SolrCore 'collection1' using configuration from instancedir C:\Users\JenkinsSlave\workspace\Lucene-Solr-trunk-Windows\solr\core\src\test-files\solr\collection1
   [junit4]   2> 412067 INFO  (TEST-AutoCommitTest.testMaxTime-seed#[492941F0730FC0F2]) [    x:collection1] o.a.s.c.SolrCore [[collection1] ] Opening new SolrCore at [C:\Users\JenkinsSlave\workspace\Lucene-Solr-trunk-Windows\solr\core\src\test-files\solr\collection1], dataDir=[C:\Users\JenkinsSlave\workspace\Lucene-Solr-trunk-Windows\solr\build\solr-core\test\J1\temp\solr.update.AutoCommitTest_492941F0730FC0F2-001\init-core-data-001\]
   [junit4]   2> 412067 INFO  (TEST-AutoCommitTest.testMaxTime-seed#[492941F0730FC0F2]) [    x:collection1] o.a.s.c.JmxMonitoredMap JMX monitoring is enabled. Adding Solr mbeans to JMX Server: com.sun.jmx.mbeanserver.JmxMBeanServer@1d73223
   [junit4]   2> 412067 INFO  (TEST-AutoCommitTest.testMaxTime-seed#[492941F0730FC0F2]) [    x:collection1] o.a.s.c.SolrCore New index directory detected: old=null new=C:\Users\JenkinsSlave\workspace\Lucene-Solr-trunk-Windows\solr\build\solr-core\test\J1\temp\solr.update.AutoCommitTest_492941F0730FC0F2-001\init-core-data-001\index/
   [junit4]   2> 412067 INFO  (OldIndexDirectoryCleanupThreadForCore-collection1) [    x:collection1] o.a.s.c.SolrCore Looking for old index directories to cleanup for core collection1 in C:\Users\JenkinsSlave\workspace\Lucene-Solr-trunk-Windows\solr\build\solr-core\test\J1\temp\solr.update.AutoCommitTest_492941F0730FC0F2-001\init-core-data-001\
   [junit4]   2> 412073 INFO  (TEST-AutoCommitTest.testMaxTime-seed#[492941F0730FC0F2]) [    x:collection1] o.a.s.u.p.UpdateRequestProcessorChain creating updateRequestProcessorChain "dedupe"
   [junit4]   2> 412074 INFO  (TEST-AutoCommitTest.testMaxTime-seed#[492941F0730FC0F2]) [    x:collection1] o.a.s.u.p.UpdateRequestProcessorChain inserting DistributedUpdateProcessorFactory into updateRequestProcessorChain "dedupe"
   [junit4]   2> 412074 INFO  (TEST-AutoCommitTest.testMaxTime-seed#[492941F0730FC0F2]) [    x:collection1] o.a.s.u.p.UpdateRequestProcessorChain creating updateRequestProcessorChain "dedupe-allfields"
   [junit4]   2> 412074 INFO  (TEST-AutoCommitTest.testMaxTime-seed#[492941F0730FC0F2]) [    x:collection1] o.a.s.u.p.UpdateRequestProcessorChain inserting DistributedUpdateProcessorFactory into updateRequestProcessorChain "dedupe-allfields"
   [junit4]   2> 412074 INFO  (TEST-AutoCommitTest.testMaxTime-seed#[492941F0730FC0F2]) [    x:collection1] o.a.s.u.p.UpdateRequestProcessorChain creating updateRequestProcessorChain "stored_sig"
   [junit4]   2> 412075 INFO  (TEST-AutoCommitTest.testMaxTime-seed#[492941F0730FC0F2]) [    x:collection1] o.a.s.u.p.UpdateRequestProcessorChain inserting DistributedUpdateProcessorFactory into updateRequestProcessorChain "stored_sig"
   [junit4]   2> 412075 INFO  (TEST-AutoCommitTest.testMaxTime-seed#[492941F0730FC0F2]) [    x:collection1] o.a.s.u.p.UpdateRequestProcessorChain creating updateRequestProcessorChain "uniq-fields"
   [junit4]   2> 412075 INFO  (TEST-AutoCommitTest.testMaxTime-seed#[492941F0730FC0F2]) [    x:collection1] o.a.s.u.p.UpdateRequestProcessorChain inserting DistributedUpdateProcessorFactory into updateRequestProcessorChain "uniq-fields"
   [junit4]   2> 412075 INFO  (TEST-AutoCommitTest.testMaxTime-seed#[492941F0730FC0F2]) [    x:collection1] o.a.s.u.p.UpdateRequestProcessorChain creating updateRequestProcessorChain "distrib-dup-test-chain-explicit"
   [junit4]   2> 412075 INFO  (TEST-AutoCommitTest.testMaxTime-seed#[492941F0730FC0F2]) [    x:collection1] o.a.s.u.p.UpdateRequestProcessorChain creating updateRequestProcessorChain "distrib-dup-test-chain-implicit"
   [junit4]   2> 412075 INFO  (TEST-AutoCommitTest.testMaxTime-seed#[492941F0730FC0F2]) [    x:collection1] o.a.s.u.p.UpdateRequestProcessorChain inserting DistributedUpdateProcessorFactory into updateRequestProcessorChain "distrib-dup-test-chain-implicit"
   [junit4]   2> 412075 INFO  (TEST-AutoCommitTest.testMaxTime-seed#[492941F0730FC0F2]) [    x:collection1] o.a.s.c.SolrCore no updateRequestProcessorChain defined as default, creating implicit default
   [junit4]   2> 412080 INFO  (TEST-AutoCommitTest.testMaxTime-seed#[492941F0730FC0F2]) [    x:collection1] o.a.s.h.l.XMLLoader xsltCacheLifetimeSeconds=60
   [junit4]   2> 412082 INFO  (TEST-AutoCommitTest.testMaxTime-seed#[492941F0730FC0F2]) [    x:collection1] o.a.s.h.l.XMLLoader xsltCacheLifetimeSeconds=60
   [junit4]   2> 412083 INFO  (TEST-AutoCommitTest.testMaxTime-seed#[492941F0730FC0F2]) [    x:collection1] o.a.s.h.l.XMLLoader xsltCacheLifetimeSeconds=60
   [junit4]   2> 412086 INFO  (TEST-AutoCommitTest.testMaxTime-seed#[492941F0730FC0F2]) [    x:collection1] o.a.s.h.l.XMLLoader xsltCacheLifetimeSeconds=60
   [junit4]   2> 412095 INFO  (TEST-AutoCommitTest.testMaxTime-seed#[492941F0730FC0F2]) [    x:collection1] o.a.s.c.PluginBag requestHandler : 'lazy' created with startup=lazy 
   [junit4]   2> 412099 INFO  (TEST-AutoCommitTest.testMaxTime-seed#[492941F0730FC0F2]) [    x:collection1] o.a.s.c.RequestHandlers Registered paths: /admin/mbeans,standard,spellCheckCompRH,lazy,/update/json/docs,/admin/luke,/export,spellCheckWithWordbreak_Direct,tvrh,/get,/admin/properties,/update/json,mltrh,/admin/threads,/search-facet-def,/update/csv,/sql,/search-facet-invariants,/admin/segments,spellCheckCompRH1,/mlt,/admin/system,/replication,dismax,defaults,/config,/stream,/schema,/admin/plugins,/admin/logging,spellCheckWithWordbreak,mock,/admin/ping,/update,/admin/file,/terms,spellCheckCompRH_Direct,/debug/dump
   [junit4]   2> 412100 WARN  (TEST-AutoCommitTest.testMaxTime-seed#[492941F0730FC0F2]) [    x:collection1] o.a.s.c.SolrCore solrconfig.xml uses deprecated <admin/gettableFiles>, Please update your config to use the ShowFileRequestHandler.
   [junit4]   2> 412100 INFO  (TEST-AutoCommitTest.testMaxTime-seed#[492941F0730FC0F2]) [    x:collection1] o.a.s.c.SolrCore Using default statsCache cache: org.apache.solr.search.stats.LocalStatsCache
   [junit4]   2> 412100 INFO  (TEST-AutoCommitTest.testMaxTime-seed#[492941F0730FC0F2]) [    x:collection1] o.a.s.u.CommitTracker Hard AutoCommit: disabled
   [junit4]   2> 412101 INFO  (TEST-AutoCommitTest.testMaxTime-seed#[492941F0730FC0F2]) [    x:collection1] o.a.s.u.CommitTracker Soft AutoCommit: disabled
   [junit4]   2> 412101 INFO  (TEST-AutoCommitTest.testMaxTime-seed#[492941F0730FC0F2]) [    x:collection1] o.a.s.s.SolrIndexSearcher Opening [Searcher@1714326[collection1] main]
   [junit4]   2> 412101 INFO  (TEST-AutoCommitTest.testMaxTime-seed#[492941F0730FC0F2]) [    x:collection1] o.a.s.r.RestManager Initializing RestManager with initArgs: {storageIO=org.apache.solr.rest.ManagedResourceStorage$InMemoryStorageIO}
   [junit4]   2> 412102 INFO  (TEST-AutoCommitTest.testMaxTime-seed#[492941F0730FC0F2]) [    x:collection1] o.a.s.r.ManagedResourceStorage Reading _rest_managed.json using InMemoryStorage
   [junit4]   2> 412102 INFO  (TEST-AutoCommitTest.testMaxTime-seed#[492941F0730FC0F2]) [    x:collection1] o.a.s.r.RestManager Initializing 0 registered ManagedResources
   [junit4]   2> 412102 INFO  (TEST-AutoCommitTest.testMaxTime-seed#[492941F0730FC0F2]) [    x:collection1] o.a.s.h.c.SpellCheckComponent Initializing spell checkers
   [junit4]   2> 412103 INFO  (TEST-AutoCommitTest.testMaxTime-seed#[492941F0730FC0F2]) [    x:collection1] o.a.s.s.DirectSolrSpellChecker init: {name=direct,classname=DirectSolrSpellChecker,field=lowerfilt,minQueryLength=3}
   [junit4]   2> 412108 INFO  (TEST-AutoCommitTest.testMaxTime-seed#[492941F0730FC0F2]) [    x:collection1] o.a.s.h.ReplicationHandler Commits will be reserved for  10000
   [junit4]   2> 412108 INFO  (searcherExecutor-917-thread-1-processing-x:collection1) [    x:collection1] o.a.s.h.c.SpellCheckComponent Loading spell index for spellchecker: default
   [junit4]   2> 412109 INFO  (searcherExecutor-917-thread-1-processing-x:collection1) [    x:collection1] o.a.s.h.c.SpellCheckComponent Loading spell index for spellchecker: direct
   [junit4]   2> 412109 INFO  (searcherExecutor-917-thread-1-processing-x:collection1) [    x:collection1] o.a.s.h.c.SpellCheckComponent Loading spell index for spellchecker: wordbreak
   [junit4]   2> 412109 INFO  (searcherExecutor-917-thread-1-p

[...truncated too long message...]

:collection1] o.a.s.u.p.LogUpdateProcessorFactory [collection1] {add=[500 (1524153033590571008)]} 0 2355
   [junit4]   2> 414266 INFO  (TEST-AutoCommitTest.testMaxTime-seed#[492941F0730FC0F2]) [    x:collection1] o.a.s.u.p.LogUpdateProcessorFactory [collection1] {add=[500 (1524153033591619584)]} 0 2356
   [junit4]   2> 414267 INFO  (TEST-AutoCommitTest.testMaxTime-seed#[492941F0730FC0F2]) [    x:collection1] o.a.s.u.p.LogUpdateProcessorFactory [collection1] {add=[500 (1524153033592668160)]} 0 2356
   [junit4]   2> 414268 INFO  (TEST-AutoCommitTest.testMaxTime-seed#[492941F0730FC0F2]) [    x:collection1] o.a.s.u.p.LogUpdateProcessorFactory [collection1] {add=[500 (1524153033593716736)]} 0 2358
   [junit4]   2> 414270 INFO  (TEST-AutoCommitTest.testMaxTime-seed#[492941F0730FC0F2]) [    x:collection1] o.a.s.u.p.LogUpdateProcessorFactory [collection1] {add=[500 (1524153033595813888)]} 0 2360
   [junit4]   2> 414271 INFO  (TEST-AutoCommitTest.testMaxTime-seed#[492941F0730FC0F2]) [    x:collection1] o.a.s.u.p.LogUpdateProcessorFactory [collection1] {add=[500 (1524153033596862464)]} 0 2361
   [junit4]   2> 414272 INFO  (TEST-AutoCommitTest.testMaxTime-seed#[492941F0730FC0F2]) [    x:collection1] o.a.s.u.p.LogUpdateProcessorFactory [collection1] {add=[500 (1524153033597911040)]} 0 2362
   [junit4]   2> 414273 INFO  (TEST-AutoCommitTest.testMaxTime-seed#[492941F0730FC0F2]) [    x:collection1] o.a.s.c.S.Request [collection1]  webapp=null path=null params={q=id:500&qt=standard&start=0&rows=20&version=2.2} hits=0 status=0 QTime=0
   [junit4]   2> 415182 INFO  (commitScheduler-920-thread-1) [    x:collection1] o.a.s.u.DirectUpdateHandler2 start commit{,optimize=false,openSearcher=true,waitSearcher=true,expungeDeletes=false,softCommit=true,prepareCommit=false}
   [junit4]   2> 415189 INFO  (commitScheduler-920-thread-1) [    x:collection1] o.a.s.s.SolrIndexSearcher Opening [Searcher@1113a49[collection1] main]
   [junit4]   2> 415191 INFO  (searcherExecutor-917-thread-1-processing-x:collection1) [    x:collection1] o.a.s.c.SolrCore [collection1] Registered new searcher Searcher@1113a49[collection1] main{ExitableDirectoryReader(UninvertingDirectoryReader(Uninverting(_4(6.0.0):c1) Uninverting(_5(6.0.0):c11/9:delGen=1)))}
   [junit4]   2> 415192 INFO  (commitScheduler-920-thread-1) [    x:collection1] o.a.s.u.DirectUpdateHandler2 end_commit_flush
   [junit4]   2> 415287 INFO  (TEST-AutoCommitTest.testMaxTime-seed#[492941F0730FC0F2]) [    x:collection1] o.a.s.u.p.LogUpdateProcessorFactory [collection1] {add=[531 (1524153034662215680)]} 0 3488
   [junit4]   2> 415320 INFO  (TEST-AutoCommitTest.testMaxTime-seed#[492941F0730FC0F2]) [    x:collection1] o.a.s.c.S.Request [collection1]  webapp=null path=null params={q=id:500&qt=standard&start=0&rows=20&version=2.2} hits=1 status=0 QTime=35
   [junit4]   2> 415353 INFO  (TEST-AutoCommitTest.testMaxTime-seed#[492941F0730FC0F2]) [    x:collection1] o.a.s.SolrTestCaseJ4 ###Ending testMaxTime
   [junit4]   2> 415353 INFO  (SUITE-AutoCommitTest-seed#[492941F0730FC0F2]-worker) [    x:collection1] o.a.s.SolrTestCaseJ4 ###deleteCore
   [junit4]   2> 415353 INFO  (SUITE-AutoCommitTest-seed#[492941F0730FC0F2]-worker) [    x:collection1] o.a.s.c.CoreContainer Shutting down CoreContainer instance=14895204
   [junit4]   2> 415354 INFO  (SUITE-AutoCommitTest-seed#[492941F0730FC0F2]-worker) [    x:collection1] o.a.s.c.SolrCore [collection1]  CLOSING SolrCore org.apache.solr.core.SolrCore@8eb9de
   [junit4]   2> 415354 INFO  (SUITE-AutoCommitTest-seed#[492941F0730FC0F2]-worker) [    x:collection1] o.a.s.u.DirectUpdateHandler2 closing DirectUpdateHandler2{commits=3,autocommits=0,soft autocommit maxTime=1000ms,soft autocommits=3,optimizes=0,rollbacks=0,expungeDeletes=0,docsPending=14,adds=1,deletesById=0,deletesByQuery=0,errors=0,cumulative_adds=14,cumulative_deletesById=1,cumulative_deletesByQuery=0,cumulative_errors=0,transaction_logs_total_size=0,transaction_logs_total_number=0}
   [junit4]   2> 415354 INFO  (SUITE-AutoCommitTest-seed#[492941F0730FC0F2]-worker) [    x:collection1] o.a.s.u.SolrCoreState Closing SolrCoreState
   [junit4]   2> 415354 INFO  (SUITE-AutoCommitTest-seed#[492941F0730FC0F2]-worker) [    x:collection1] o.a.s.u.DefaultSolrCoreState SolrCoreState ref count has reached 0 - closing IndexWriter
   [junit4]   2> 415354 INFO  (SUITE-AutoCommitTest-seed#[492941F0730FC0F2]-worker) [    x:collection1] o.a.s.u.DefaultSolrCoreState closing IndexWriter with IndexWriterCloser
   [junit4]   2> 415355 INFO  (SUITE-AutoCommitTest-seed#[492941F0730FC0F2]-worker) [    x:collection1] o.a.s.u.DirectUpdateHandler2 Committing on IndexWriter close.
   [junit4]   2> 415392 INFO  (SUITE-AutoCommitTest-seed#[492941F0730FC0F2]-worker) [    x:collection1] o.a.s.c.SolrDeletionPolicy SolrDeletionPolicy.onCommit: commits: num=2
   [junit4]   2> 	commit{dir=MockDirectoryWrapper(RAMDirectory@1f67b30 lockFactory=org.apache.lucene.store.SingleInstanceLockFactory@78f42e),segFN=segments_3,generation=3}
   [junit4]   2> 	commit{dir=MockDirectoryWrapper(RAMDirectory@1f67b30 lockFactory=org.apache.lucene.store.SingleInstanceLockFactory@78f42e),segFN=segments_4,generation=4}
   [junit4]   2> 415392 INFO  (SUITE-AutoCommitTest-seed#[492941F0730FC0F2]-worker) [    x:collection1] o.a.s.c.SolrDeletionPolicy newest commit generation = 4
   [junit4]   2> 415440 INFO  (SUITE-AutoCommitTest-seed#[492941F0730FC0F2]-worker) [    x:collection1] o.a.s.c.SolrCore [collection1] Closing main searcher on request.
   [junit4]   2> 415522 INFO  (SUITE-AutoCommitTest-seed#[492941F0730FC0F2]-worker) [    x:collection1] o.a.s.c.CachingDirectoryFactory Closing MockDirectoryFactory - 2 directories currently being tracked
   [junit4]   2> 415522 INFO  (SUITE-AutoCommitTest-seed#[492941F0730FC0F2]-worker) [    x:collection1] o.a.s.c.CachingDirectoryFactory looking to close C:\Users\JenkinsSlave\workspace\Lucene-Solr-trunk-Windows\solr\build\solr-core\test\J1\temp\solr.update.AutoCommitTest_492941F0730FC0F2-001\init-core-data-001\ [CachedDir<<refCount=0;path=C:\Users\JenkinsSlave\workspace\Lucene-Solr-trunk-Windows\solr\build\solr-core\test\J1\temp\solr.update.AutoCommitTest_492941F0730FC0F2-001\init-core-data-001\;done=false>>]
   [junit4]   2> 415522 INFO  (SUITE-AutoCommitTest-seed#[492941F0730FC0F2]-worker) [    x:collection1] o.a.s.c.CachingDirectoryFactory Closing directory: C:\Users\JenkinsSlave\workspace\Lucene-Solr-trunk-Windows\solr\build\solr-core\test\J1\temp\solr.update.AutoCommitTest_492941F0730FC0F2-001\init-core-data-001\
   [junit4]   2> 415522 INFO  (SUITE-AutoCommitTest-seed#[492941F0730FC0F2]-worker) [    x:collection1] o.a.s.c.CachingDirectoryFactory looking to close C:\Users\JenkinsSlave\workspace\Lucene-Solr-trunk-Windows\solr\build\solr-core\test\J1\temp\solr.update.AutoCommitTest_492941F0730FC0F2-001\init-core-data-001\index [CachedDir<<refCount=0;path=C:\Users\JenkinsSlave\workspace\Lucene-Solr-trunk-Windows\solr\build\solr-core\test\J1\temp\solr.update.AutoCommitTest_492941F0730FC0F2-001\init-core-data-001\index;done=false>>]
   [junit4]   2> 415522 INFO  (SUITE-AutoCommitTest-seed#[492941F0730FC0F2]-worker) [    x:collection1] o.a.s.c.CachingDirectoryFactory Closing directory: C:\Users\JenkinsSlave\workspace\Lucene-Solr-trunk-Windows\solr\build\solr-core\test\J1\temp\solr.update.AutoCommitTest_492941F0730FC0F2-001\init-core-data-001\index
   [junit4]   2> NOTE: leaving temporary files on disk at: C:\Users\JenkinsSlave\workspace\Lucene-Solr-trunk-Windows\solr\build\solr-core\test\J1\temp\solr.update.AutoCommitTest_492941F0730FC0F2-001
   [junit4]   2> NOTE: test params are: codec=Asserting(Lucene60), sim=ClassicSimilarity, locale=nn-NO, timezone=America/Cambridge_Bay
   [junit4]   2> NOTE: Windows 7 6.1 x86/Oracle Corporation 1.8.0_66 (32-bit)/cpus=3,threads=1,free=173647168,total=340787200
   [junit4]   2> NOTE: All tests run in this JVM: [EchoParamsTest, JavabinLoaderTest, CollectionsAPIDistributedZkTest, OutOfBoxZkACLAndCredentialsProvidersTest, MinimalSchemaTest, TestZkChroot, TestReversedWildcardFilterFactory, DistributedTermsComponentTest, TestPerFieldSimilarity, BadIndexSchemaTest, DistributedFacetPivotSmallAdvancedTest, TestRawTransformer, NotRequiredUniqueKeyTest, HighlighterConfigTest, DefaultValueUpdateProcessorTest, CopyFieldTest, DistribCursorPagingTest, TestDistributedStatsComponentCardinality, TestFuzzyAnalyzedSuggestions, SuggesterTSTTest, TermVectorComponentDistributedTest, TestSuggestSpellingConverter, SpellingQueryConverterTest, ConnectionManagerTest, AutoCommitTest]
   [junit4] Completed [68/577 (1!)] on J1 in 6.82s, 3 tests, 1 error <<< FAILURES!

[...truncated 1665 lines...]
BUILD FAILED
C:\Users\JenkinsSlave\workspace\Lucene-Solr-trunk-Windows\build.xml:784: The following error occurred while executing this line:
C:\Users\JenkinsSlave\workspace\Lucene-Solr-trunk-Windows\build.xml:728: The following error occurred while executing this line:
C:\Users\JenkinsSlave\workspace\Lucene-Solr-trunk-Windows\build.xml:59: The following error occurred while executing this line:
C:\Users\JenkinsSlave\workspace\Lucene-Solr-trunk-Windows\solr\build.xml:233: The following error occurred while executing this line:
C:\Users\JenkinsSlave\workspace\Lucene-Solr-trunk-Windows\solr\common-build.xml:524: The following error occurred while executing this line:
C:\Users\JenkinsSlave\workspace\Lucene-Solr-trunk-Windows\lucene\common-build.xml:1415: The following error occurred while executing this line:
C:\Users\JenkinsSlave\workspace\Lucene-Solr-trunk-Windows\lucene\common-build.xml:972: There were test failures: 577 suites (8 ignored), 2316 tests, 1 error, 124 ignored (80 assumptions) [seed: 492941F0730FC0F2]

Total time: 70 minutes 50 seconds
Build step 'Invoke Ant' marked build as failure
Archiving artifacts
[WARNINGS] Skipping publisher since build result is FAILURE
Recording test results
Email was triggered for: Failure - Any
Sending email for trigger: Failure - Any



Mime
View raw message