lucene-dev mailing list archives

Site index · List index
Message view « Date » · « Thread »
Top « Date » · « Thread »
From Policeman Jenkins Server <jenk...@thetaphi.de>
Subject [JENKINS] Lucene-Solr-5.x-MacOSX (64bit/jdk1.7.0) - Build # 2948 - Failure!
Date Fri, 08 Jan 2016 12:51:32 GMT
Build: http://jenkins.thetaphi.de/job/Lucene-Solr-5.x-MacOSX/2948/
Java: 64bit/jdk1.7.0 -XX:-UseCompressedOops -XX:+UseSerialGC

3 tests failed.
FAILED:  org.apache.solr.handler.TestReplicationHandler.doTestIndexAndConfigReplication

Error Message:
1

Stack Trace:
java.lang.AssertionError: 1
	at __randomizedtesting.SeedInfo.seed([FB2B7B5566BB2A95:EF63200045BC978B]:0)
	at org.apache.solr.core.CachingDirectoryFactory.close(CachingDirectoryFactory.java:202)
	at org.apache.solr.core.SolrCore.close(SolrCore.java:1255)
	at org.apache.solr.core.SolrCores.close(SolrCores.java:125)
	at org.apache.solr.core.CoreContainer.shutdown(CoreContainer.java:582)
	at org.apache.solr.servlet.SolrDispatchFilter.destroy(SolrDispatchFilter.java:175)
	at org.eclipse.jetty.servlet.FilterHolder.destroyInstance(FilterHolder.java:173)
	at org.eclipse.jetty.servlet.FilterHolder.doStop(FilterHolder.java:151)
	at org.eclipse.jetty.util.component.AbstractLifeCycle.stop(AbstractLifeCycle.java:89)
	at org.eclipse.jetty.servlet.ServletHandler.doStop(ServletHandler.java:241)
	at org.eclipse.jetty.util.component.AbstractLifeCycle.stop(AbstractLifeCycle.java:89)
	at org.eclipse.jetty.util.component.ContainerLifeCycle.stop(ContainerLifeCycle.java:143)
	at org.eclipse.jetty.util.component.ContainerLifeCycle.doStop(ContainerLifeCycle.java:162)
	at org.eclipse.jetty.server.handler.AbstractHandler.doStop(AbstractHandler.java:73)
	at org.eclipse.jetty.server.session.SessionHandler.doStop(SessionHandler.java:127)
	at org.eclipse.jetty.util.component.AbstractLifeCycle.stop(AbstractLifeCycle.java:89)
	at org.eclipse.jetty.util.component.ContainerLifeCycle.stop(ContainerLifeCycle.java:143)
	at org.eclipse.jetty.util.component.ContainerLifeCycle.doStop(ContainerLifeCycle.java:162)
	at org.eclipse.jetty.server.handler.AbstractHandler.doStop(AbstractHandler.java:73)
	at org.eclipse.jetty.server.handler.ContextHandler.doStop(ContextHandler.java:835)
	at org.eclipse.jetty.servlet.ServletContextHandler.doStop(ServletContextHandler.java:215)
	at org.eclipse.jetty.util.component.AbstractLifeCycle.stop(AbstractLifeCycle.java:89)
	at org.eclipse.jetty.util.component.ContainerLifeCycle.stop(ContainerLifeCycle.java:143)
	at org.eclipse.jetty.util.component.ContainerLifeCycle.doStop(ContainerLifeCycle.java:162)
	at org.eclipse.jetty.server.handler.AbstractHandler.doStop(AbstractHandler.java:73)
	at org.eclipse.jetty.server.Server.doStop(Server.java:456)
	at org.eclipse.jetty.util.component.AbstractLifeCycle.stop(AbstractLifeCycle.java:89)
	at org.apache.solr.client.solrj.embedded.JettySolrRunner.stop(JettySolrRunner.java:444)
	at org.apache.solr.handler.TestReplicationHandler.tearDown(TestReplicationHandler.java:137)
	at sun.reflect.NativeMethodAccessorImpl.invoke0(Native Method)
	at sun.reflect.NativeMethodAccessorImpl.invoke(NativeMethodAccessorImpl.java:57)
	at sun.reflect.DelegatingMethodAccessorImpl.invoke(DelegatingMethodAccessorImpl.java:43)
	at java.lang.reflect.Method.invoke(Method.java:606)
	at com.carrotsearch.randomizedtesting.RandomizedRunner.invoke(RandomizedRunner.java:1764)
	at com.carrotsearch.randomizedtesting.RandomizedRunner$10.evaluate(RandomizedRunner.java:929)
	at com.carrotsearch.randomizedtesting.rules.SystemPropertiesRestoreRule$1.evaluate(SystemPropertiesRestoreRule.java:57)
	at org.apache.lucene.util.TestRuleSetupTeardownChained$1.evaluate(TestRuleSetupTeardownChained.java:50)
	at org.apache.lucene.util.AbstractBeforeAfterRule$1.evaluate(AbstractBeforeAfterRule.java:46)
	at org.apache.lucene.util.TestRuleThreadAndTestName$1.evaluate(TestRuleThreadAndTestName.java:49)
	at org.apache.lucene.util.TestRuleIgnoreAfterMaxFailures$1.evaluate(TestRuleIgnoreAfterMaxFailures.java:65)
	at org.apache.lucene.util.TestRuleMarkFailure$1.evaluate(TestRuleMarkFailure.java:48)
	at com.carrotsearch.randomizedtesting.rules.StatementAdapter.evaluate(StatementAdapter.java:36)
	at com.carrotsearch.randomizedtesting.ThreadLeakControl$StatementRunner.run(ThreadLeakControl.java:367)
	at com.carrotsearch.randomizedtesting.ThreadLeakControl.forkTimeoutingTask(ThreadLeakControl.java:809)
	at com.carrotsearch.randomizedtesting.ThreadLeakControl$3.evaluate(ThreadLeakControl.java:460)
	at com.carrotsearch.randomizedtesting.RandomizedRunner.runSingleTest(RandomizedRunner.java:880)
	at com.carrotsearch.randomizedtesting.RandomizedRunner$5.evaluate(RandomizedRunner.java:781)
	at com.carrotsearch.randomizedtesting.RandomizedRunner$6.evaluate(RandomizedRunner.java:816)
	at com.carrotsearch.randomizedtesting.RandomizedRunner$7.evaluate(RandomizedRunner.java:827)
	at com.carrotsearch.randomizedtesting.rules.StatementAdapter.evaluate(StatementAdapter.java:36)
	at com.carrotsearch.randomizedtesting.rules.SystemPropertiesRestoreRule$1.evaluate(SystemPropertiesRestoreRule.java:57)
	at org.apache.lucene.util.AbstractBeforeAfterRule$1.evaluate(AbstractBeforeAfterRule.java:46)
	at com.carrotsearch.randomizedtesting.rules.StatementAdapter.evaluate(StatementAdapter.java:36)
	at org.apache.lucene.util.TestRuleStoreClassName$1.evaluate(TestRuleStoreClassName.java:42)
	at com.carrotsearch.randomizedtesting.rules.NoShadowingOrOverridesOnMethodsRule$1.evaluate(NoShadowingOrOverridesOnMethodsRule.java:40)
	at com.carrotsearch.randomizedtesting.rules.NoShadowingOrOverridesOnMethodsRule$1.evaluate(NoShadowingOrOverridesOnMethodsRule.java:40)
	at com.carrotsearch.randomizedtesting.rules.StatementAdapter.evaluate(StatementAdapter.java:36)
	at com.carrotsearch.randomizedtesting.rules.StatementAdapter.evaluate(StatementAdapter.java:36)
	at com.carrotsearch.randomizedtesting.rules.StatementAdapter.evaluate(StatementAdapter.java:36)
	at org.apache.lucene.util.TestRuleAssertionsRequired$1.evaluate(TestRuleAssertionsRequired.java:54)
	at org.apache.lucene.util.TestRuleMarkFailure$1.evaluate(TestRuleMarkFailure.java:48)
	at org.apache.lucene.util.TestRuleIgnoreAfterMaxFailures$1.evaluate(TestRuleIgnoreAfterMaxFailures.java:65)
	at org.apache.lucene.util.TestRuleIgnoreTestSuites$1.evaluate(TestRuleIgnoreTestSuites.java:55)
	at com.carrotsearch.randomizedtesting.rules.StatementAdapter.evaluate(StatementAdapter.java:36)
	at com.carrotsearch.randomizedtesting.ThreadLeakControl$StatementRunner.run(ThreadLeakControl.java:367)
	at java.lang.Thread.run(Thread.java:745)


FAILED:  junit.framework.TestSuite.org.apache.solr.handler.TestReplicationHandler

Error Message:
10 threads leaked from SUITE scope at org.apache.solr.handler.TestReplicationHandler:     1) Thread[id=1486, name=qtp1209557008-1486, state=TIMED_WAITING, group=TGRP-TestReplicationHandler]         at sun.misc.Unsafe.park(Native Method)         at java.util.concurrent.locks.LockSupport.parkNanos(LockSupport.java:226)         at java.util.concurrent.locks.AbstractQueuedSynchronizer$ConditionObject.awaitNanos(AbstractQueuedSynchronizer.java:2082)         at org.eclipse.jetty.util.BlockingArrayQueue.poll(BlockingArrayQueue.java:389)         at org.eclipse.jetty.util.thread.QueuedThreadPool.idleJobPoll(QueuedThreadPool.java:531)         at org.eclipse.jetty.util.thread.QueuedThreadPool.access$700(QueuedThreadPool.java:47)         at org.eclipse.jetty.util.thread.QueuedThreadPool$3.run(QueuedThreadPool.java:590)         at java.lang.Thread.run(Thread.java:745)    2) Thread[id=1487, name=qtp1209557008-1487, state=TIMED_WAITING, group=TGRP-TestReplicationHandler]         at sun.misc.Unsafe.park(Native Method)         at java.util.concurrent.locks.LockSupport.parkNanos(LockSupport.java:226)         at java.util.concurrent.locks.AbstractQueuedSynchronizer$ConditionObject.awaitNanos(AbstractQueuedSynchronizer.java:2082)         at org.eclipse.jetty.util.BlockingArrayQueue.poll(BlockingArrayQueue.java:389)         at org.eclipse.jetty.util.thread.QueuedThreadPool.idleJobPoll(QueuedThreadPool.java:531)         at org.eclipse.jetty.util.thread.QueuedThreadPool.access$700(QueuedThreadPool.java:47)         at org.eclipse.jetty.util.thread.QueuedThreadPool$3.run(QueuedThreadPool.java:590)         at java.lang.Thread.run(Thread.java:745)    3) Thread[id=1484, name=qtp1209557008-1484, state=TIMED_WAITING, group=TGRP-TestReplicationHandler]         at sun.misc.Unsafe.park(Native Method)         at java.util.concurrent.locks.LockSupport.parkNanos(LockSupport.java:226)         at java.util.concurrent.locks.AbstractQueuedSynchronizer$ConditionObject.awaitNanos(AbstractQueuedSynchronizer.java:2082)         at org.eclipse.jetty.util.BlockingArrayQueue.poll(BlockingArrayQueue.java:389)         at org.eclipse.jetty.util.thread.QueuedThreadPool.idleJobPoll(QueuedThreadPool.java:531)         at org.eclipse.jetty.util.thread.QueuedThreadPool.access$700(QueuedThreadPool.java:47)         at org.eclipse.jetty.util.thread.QueuedThreadPool$3.run(QueuedThreadPool.java:590)         at java.lang.Thread.run(Thread.java:745)    4) Thread[id=1489, name=org.eclipse.jetty.server.session.HashSessionManager@76772d90Timer, state=TIMED_WAITING, group=TGRP-TestReplicationHandler]         at sun.misc.Unsafe.park(Native Method)         at java.util.concurrent.locks.LockSupport.parkNanos(LockSupport.java:226)         at java.util.concurrent.locks.AbstractQueuedSynchronizer$ConditionObject.awaitNanos(AbstractQueuedSynchronizer.java:2082)         at java.util.concurrent.ScheduledThreadPoolExecutor$DelayedWorkQueue.take(ScheduledThreadPoolExecutor.java:1090)         at java.util.concurrent.ScheduledThreadPoolExecutor$DelayedWorkQueue.take(ScheduledThreadPoolExecutor.java:807)         at java.util.concurrent.ThreadPoolExecutor.getTask(ThreadPoolExecutor.java:1068)         at java.util.concurrent.ThreadPoolExecutor.runWorker(ThreadPoolExecutor.java:1130)         at java.util.concurrent.ThreadPoolExecutor$Worker.run(ThreadPoolExecutor.java:615)         at java.lang.Thread.run(Thread.java:745)    5) Thread[id=1485, name=qtp1209557008-1485, state=TIMED_WAITING, group=TGRP-TestReplicationHandler]         at sun.misc.Unsafe.park(Native Method)         at java.util.concurrent.locks.LockSupport.parkNanos(LockSupport.java:226)         at java.util.concurrent.locks.AbstractQueuedSynchronizer$ConditionObject.awaitNanos(AbstractQueuedSynchronizer.java:2082)         at org.eclipse.jetty.util.BlockingArrayQueue.poll(BlockingArrayQueue.java:389)         at org.eclipse.jetty.util.thread.QueuedThreadPool.idleJobPoll(QueuedThreadPool.java:531)         at org.eclipse.jetty.util.thread.QueuedThreadPool.access$700(QueuedThreadPool.java:47)         at org.eclipse.jetty.util.thread.QueuedThreadPool$3.run(QueuedThreadPool.java:590)         at java.lang.Thread.run(Thread.java:745)    6) Thread[id=1488, name=Scheduler-1708016757, state=TIMED_WAITING, group=TGRP-TestReplicationHandler]         at sun.misc.Unsafe.park(Native Method)         at java.util.concurrent.locks.LockSupport.parkNanos(LockSupport.java:226)         at java.util.concurrent.locks.AbstractQueuedSynchronizer$ConditionObject.awaitNanos(AbstractQueuedSynchronizer.java:2082)         at java.util.concurrent.ScheduledThreadPoolExecutor$DelayedWorkQueue.take(ScheduledThreadPoolExecutor.java:1090)         at java.util.concurrent.ScheduledThreadPoolExecutor$DelayedWorkQueue.take(ScheduledThreadPoolExecutor.java:807)         at java.util.concurrent.ThreadPoolExecutor.getTask(ThreadPoolExecutor.java:1068)         at java.util.concurrent.ThreadPoolExecutor.runWorker(ThreadPoolExecutor.java:1130)         at java.util.concurrent.ThreadPoolExecutor$Worker.run(ThreadPoolExecutor.java:615)         at java.lang.Thread.run(Thread.java:745)    7) Thread[id=1506, name=qtp1209557008-1506, state=TIMED_WAITING, group=TGRP-TestReplicationHandler]         at sun.misc.Unsafe.park(Native Method)         at java.util.concurrent.locks.LockSupport.parkNanos(LockSupport.java:226)         at java.util.concurrent.locks.AbstractQueuedSynchronizer$ConditionObject.awaitNanos(AbstractQueuedSynchronizer.java:2082)         at org.eclipse.jetty.util.BlockingArrayQueue.poll(BlockingArrayQueue.java:389)         at org.eclipse.jetty.util.thread.QueuedThreadPool.idleJobPoll(QueuedThreadPool.java:531)         at org.eclipse.jetty.util.thread.QueuedThreadPool.access$700(QueuedThreadPool.java:47)         at org.eclipse.jetty.util.thread.QueuedThreadPool$3.run(QueuedThreadPool.java:590)         at java.lang.Thread.run(Thread.java:745)    8) Thread[id=1480, name=qtp1209557008-1480, state=TIMED_WAITING, group=TGRP-TestReplicationHandler]         at sun.misc.Unsafe.park(Native Method)         at java.util.concurrent.locks.LockSupport.parkNanos(LockSupport.java:226)         at java.util.concurrent.locks.AbstractQueuedSynchronizer$ConditionObject.awaitNanos(AbstractQueuedSynchronizer.java:2082)         at org.eclipse.jetty.util.BlockingArrayQueue.poll(BlockingArrayQueue.java:389)         at org.eclipse.jetty.util.thread.QueuedThreadPool.idleJobPoll(QueuedThreadPool.java:531)         at org.eclipse.jetty.util.thread.QueuedThreadPool.access$700(QueuedThreadPool.java:47)         at org.eclipse.jetty.util.thread.QueuedThreadPool$3.run(QueuedThreadPool.java:590)         at java.lang.Thread.run(Thread.java:745)    9) Thread[id=1482, name=qtp1209557008-1482, state=TIMED_WAITING, group=TGRP-TestReplicationHandler]         at sun.misc.Unsafe.park(Native Method)         at java.util.concurrent.locks.LockSupport.parkNanos(LockSupport.java:226)         at java.util.concurrent.locks.AbstractQueuedSynchronizer$ConditionObject.awaitNanos(AbstractQueuedSynchronizer.java:2082)         at org.eclipse.jetty.util.BlockingArrayQueue.poll(BlockingArrayQueue.java:389)         at org.eclipse.jetty.util.thread.QueuedThreadPool.idleJobPoll(QueuedThreadPool.java:531)         at org.eclipse.jetty.util.thread.QueuedThreadPool.access$700(QueuedThreadPool.java:47)         at org.eclipse.jetty.util.thread.QueuedThreadPool$3.run(QueuedThreadPool.java:590)         at java.lang.Thread.run(Thread.java:745)   10) Thread[id=1483, name=qtp1209557008-1483, state=TIMED_WAITING, group=TGRP-TestReplicationHandler]         at sun.misc.Unsafe.park(Native Method)         at java.util.concurrent.locks.LockSupport.parkNanos(LockSupport.java:226)         at java.util.concurrent.locks.AbstractQueuedSynchronizer$ConditionObject.awaitNanos(AbstractQueuedSynchronizer.java:2082)         at org.eclipse.jetty.util.BlockingArrayQueue.poll(BlockingArrayQueue.java:389)         at org.eclipse.jetty.util.thread.QueuedThreadPool.idleJobPoll(QueuedThreadPool.java:531)         at org.eclipse.jetty.util.thread.QueuedThreadPool.access$700(QueuedThreadPool.java:47)         at org.eclipse.jetty.util.thread.QueuedThreadPool$3.run(QueuedThreadPool.java:590)         at java.lang.Thread.run(Thread.java:745)

Stack Trace:
com.carrotsearch.randomizedtesting.ThreadLeakError: 10 threads leaked from SUITE scope at org.apache.solr.handler.TestReplicationHandler: 
   1) Thread[id=1486, name=qtp1209557008-1486, state=TIMED_WAITING, group=TGRP-TestReplicationHandler]
        at sun.misc.Unsafe.park(Native Method)
        at java.util.concurrent.locks.LockSupport.parkNanos(LockSupport.java:226)
        at java.util.concurrent.locks.AbstractQueuedSynchronizer$ConditionObject.awaitNanos(AbstractQueuedSynchronizer.java:2082)
        at org.eclipse.jetty.util.BlockingArrayQueue.poll(BlockingArrayQueue.java:389)
        at org.eclipse.jetty.util.thread.QueuedThreadPool.idleJobPoll(QueuedThreadPool.java:531)
        at org.eclipse.jetty.util.thread.QueuedThreadPool.access$700(QueuedThreadPool.java:47)
        at org.eclipse.jetty.util.thread.QueuedThreadPool$3.run(QueuedThreadPool.java:590)
        at java.lang.Thread.run(Thread.java:745)
   2) Thread[id=1487, name=qtp1209557008-1487, state=TIMED_WAITING, group=TGRP-TestReplicationHandler]
        at sun.misc.Unsafe.park(Native Method)
        at java.util.concurrent.locks.LockSupport.parkNanos(LockSupport.java:226)
        at java.util.concurrent.locks.AbstractQueuedSynchronizer$ConditionObject.awaitNanos(AbstractQueuedSynchronizer.java:2082)
        at org.eclipse.jetty.util.BlockingArrayQueue.poll(BlockingArrayQueue.java:389)
        at org.eclipse.jetty.util.thread.QueuedThreadPool.idleJobPoll(QueuedThreadPool.java:531)
        at org.eclipse.jetty.util.thread.QueuedThreadPool.access$700(QueuedThreadPool.java:47)
        at org.eclipse.jetty.util.thread.QueuedThreadPool$3.run(QueuedThreadPool.java:590)
        at java.lang.Thread.run(Thread.java:745)
   3) Thread[id=1484, name=qtp1209557008-1484, state=TIMED_WAITING, group=TGRP-TestReplicationHandler]
        at sun.misc.Unsafe.park(Native Method)
        at java.util.concurrent.locks.LockSupport.parkNanos(LockSupport.java:226)
        at java.util.concurrent.locks.AbstractQueuedSynchronizer$ConditionObject.awaitNanos(AbstractQueuedSynchronizer.java:2082)
        at org.eclipse.jetty.util.BlockingArrayQueue.poll(BlockingArrayQueue.java:389)
        at org.eclipse.jetty.util.thread.QueuedThreadPool.idleJobPoll(QueuedThreadPool.java:531)
        at org.eclipse.jetty.util.thread.QueuedThreadPool.access$700(QueuedThreadPool.java:47)
        at org.eclipse.jetty.util.thread.QueuedThreadPool$3.run(QueuedThreadPool.java:590)
        at java.lang.Thread.run(Thread.java:745)
   4) Thread[id=1489, name=org.eclipse.jetty.server.session.HashSessionManager@76772d90Timer, state=TIMED_WAITING, group=TGRP-TestReplicationHandler]
        at sun.misc.Unsafe.park(Native Method)
        at java.util.concurrent.locks.LockSupport.parkNanos(LockSupport.java:226)
        at java.util.concurrent.locks.AbstractQueuedSynchronizer$ConditionObject.awaitNanos(AbstractQueuedSynchronizer.java:2082)
        at java.util.concurrent.ScheduledThreadPoolExecutor$DelayedWorkQueue.take(ScheduledThreadPoolExecutor.java:1090)
        at java.util.concurrent.ScheduledThreadPoolExecutor$DelayedWorkQueue.take(ScheduledThreadPoolExecutor.java:807)
        at java.util.concurrent.ThreadPoolExecutor.getTask(ThreadPoolExecutor.java:1068)
        at java.util.concurrent.ThreadPoolExecutor.runWorker(ThreadPoolExecutor.java:1130)
        at java.util.concurrent.ThreadPoolExecutor$Worker.run(ThreadPoolExecutor.java:615)
        at java.lang.Thread.run(Thread.java:745)
   5) Thread[id=1485, name=qtp1209557008-1485, state=TIMED_WAITING, group=TGRP-TestReplicationHandler]
        at sun.misc.Unsafe.park(Native Method)
        at java.util.concurrent.locks.LockSupport.parkNanos(LockSupport.java:226)
        at java.util.concurrent.locks.AbstractQueuedSynchronizer$ConditionObject.awaitNanos(AbstractQueuedSynchronizer.java:2082)
        at org.eclipse.jetty.util.BlockingArrayQueue.poll(BlockingArrayQueue.java:389)
        at org.eclipse.jetty.util.thread.QueuedThreadPool.idleJobPoll(QueuedThreadPool.java:531)
        at org.eclipse.jetty.util.thread.QueuedThreadPool.access$700(QueuedThreadPool.java:47)
        at org.eclipse.jetty.util.thread.QueuedThreadPool$3.run(QueuedThreadPool.java:590)
        at java.lang.Thread.run(Thread.java:745)
   6) Thread[id=1488, name=Scheduler-1708016757, state=TIMED_WAITING, group=TGRP-TestReplicationHandler]
        at sun.misc.Unsafe.park(Native Method)
        at java.util.concurrent.locks.LockSupport.parkNanos(LockSupport.java:226)
        at java.util.concurrent.locks.AbstractQueuedSynchronizer$ConditionObject.awaitNanos(AbstractQueuedSynchronizer.java:2082)
        at java.util.concurrent.ScheduledThreadPoolExecutor$DelayedWorkQueue.take(ScheduledThreadPoolExecutor.java:1090)
        at java.util.concurrent.ScheduledThreadPoolExecutor$DelayedWorkQueue.take(ScheduledThreadPoolExecutor.java:807)
        at java.util.concurrent.ThreadPoolExecutor.getTask(ThreadPoolExecutor.java:1068)
        at java.util.concurrent.ThreadPoolExecutor.runWorker(ThreadPoolExecutor.java:1130)
        at java.util.concurrent.ThreadPoolExecutor$Worker.run(ThreadPoolExecutor.java:615)
        at java.lang.Thread.run(Thread.java:745)
   7) Thread[id=1506, name=qtp1209557008-1506, state=TIMED_WAITING, group=TGRP-TestReplicationHandler]
        at sun.misc.Unsafe.park(Native Method)
        at java.util.concurrent.locks.LockSupport.parkNanos(LockSupport.java:226)
        at java.util.concurrent.locks.AbstractQueuedSynchronizer$ConditionObject.awaitNanos(AbstractQueuedSynchronizer.java:2082)
        at org.eclipse.jetty.util.BlockingArrayQueue.poll(BlockingArrayQueue.java:389)
        at org.eclipse.jetty.util.thread.QueuedThreadPool.idleJobPoll(QueuedThreadPool.java:531)
        at org.eclipse.jetty.util.thread.QueuedThreadPool.access$700(QueuedThreadPool.java:47)
        at org.eclipse.jetty.util.thread.QueuedThreadPool$3.run(QueuedThreadPool.java:590)
        at java.lang.Thread.run(Thread.java:745)
   8) Thread[id=1480, name=qtp1209557008-1480, state=TIMED_WAITING, group=TGRP-TestReplicationHandler]
        at sun.misc.Unsafe.park(Native Method)
        at java.util.concurrent.locks.LockSupport.parkNanos(LockSupport.java:226)
        at java.util.concurrent.locks.AbstractQueuedSynchronizer$ConditionObject.awaitNanos(AbstractQueuedSynchronizer.java:2082)
        at org.eclipse.jetty.util.BlockingArrayQueue.poll(BlockingArrayQueue.java:389)
        at org.eclipse.jetty.util.thread.QueuedThreadPool.idleJobPoll(QueuedThreadPool.java:531)
        at org.eclipse.jetty.util.thread.QueuedThreadPool.access$700(QueuedThreadPool.java:47)
        at org.eclipse.jetty.util.thread.QueuedThreadPool$3.run(QueuedThreadPool.java:590)
        at java.lang.Thread.run(Thread.java:745)
   9) Thread[id=1482, name=qtp1209557008-1482, state=TIMED_WAITING, group=TGRP-TestReplicationHandler]
        at sun.misc.Unsafe.park(Native Method)
        at java.util.concurrent.locks.LockSupport.parkNanos(LockSupport.java:226)
        at java.util.concurrent.locks.AbstractQueuedSynchronizer$ConditionObject.awaitNanos(AbstractQueuedSynchronizer.java:2082)
        at org.eclipse.jetty.util.BlockingArrayQueue.poll(BlockingArrayQueue.java:389)
        at org.eclipse.jetty.util.thread.QueuedThreadPool.idleJobPoll(QueuedThreadPool.java:531)
        at org.eclipse.jetty.util.thread.QueuedThreadPool.access$700(QueuedThreadPool.java:47)
        at org.eclipse.jetty.util.thread.QueuedThreadPool$3.run(QueuedThreadPool.java:590)
        at java.lang.Thread.run(Thread.java:745)
  10) Thread[id=1483, name=qtp1209557008-1483, state=TIMED_WAITING, group=TGRP-TestReplicationHandler]
        at sun.misc.Unsafe.park(Native Method)
        at java.util.concurrent.locks.LockSupport.parkNanos(LockSupport.java:226)
        at java.util.concurrent.locks.AbstractQueuedSynchronizer$ConditionObject.awaitNanos(AbstractQueuedSynchronizer.java:2082)
        at org.eclipse.jetty.util.BlockingArrayQueue.poll(BlockingArrayQueue.java:389)
        at org.eclipse.jetty.util.thread.QueuedThreadPool.idleJobPoll(QueuedThreadPool.java:531)
        at org.eclipse.jetty.util.thread.QueuedThreadPool.access$700(QueuedThreadPool.java:47)
        at org.eclipse.jetty.util.thread.QueuedThreadPool$3.run(QueuedThreadPool.java:590)
        at java.lang.Thread.run(Thread.java:745)
	at __randomizedtesting.SeedInfo.seed([FB2B7B5566BB2A95]:0)


FAILED:  junit.framework.TestSuite.org.apache.solr.handler.TestReplicationHandler

Error Message:
There are still zombie threads that couldn't be terminated:    1) Thread[id=1489, name=org.eclipse.jetty.server.session.HashSessionManager@76772d90Timer, state=TIMED_WAITING, group=TGRP-TestReplicationHandler]         at sun.misc.Unsafe.park(Native Method)         at java.util.concurrent.locks.LockSupport.parkNanos(LockSupport.java:226)         at java.util.concurrent.locks.AbstractQueuedSynchronizer$ConditionObject.awaitNanos(AbstractQueuedSynchronizer.java:2082)         at java.util.concurrent.ScheduledThreadPoolExecutor$DelayedWorkQueue.take(ScheduledThreadPoolExecutor.java:1090)         at java.util.concurrent.ScheduledThreadPoolExecutor$DelayedWorkQueue.take(ScheduledThreadPoolExecutor.java:807)         at java.util.concurrent.ThreadPoolExecutor.getTask(ThreadPoolExecutor.java:1068)         at java.util.concurrent.ThreadPoolExecutor.runWorker(ThreadPoolExecutor.java:1130)         at java.util.concurrent.ThreadPoolExecutor$Worker.run(ThreadPoolExecutor.java:615)         at java.lang.Thread.run(Thread.java:745)    2) Thread[id=1488, name=Scheduler-1708016757, state=TIMED_WAITING, group=TGRP-TestReplicationHandler]         at sun.misc.Unsafe.park(Native Method)         at java.util.concurrent.locks.LockSupport.parkNanos(LockSupport.java:226)         at java.util.concurrent.locks.AbstractQueuedSynchronizer$ConditionObject.awaitNanos(AbstractQueuedSynchronizer.java:2082)         at java.util.concurrent.ScheduledThreadPoolExecutor$DelayedWorkQueue.take(ScheduledThreadPoolExecutor.java:1090)         at java.util.concurrent.ScheduledThreadPoolExecutor$DelayedWorkQueue.take(ScheduledThreadPoolExecutor.java:807)         at java.util.concurrent.ThreadPoolExecutor.getTask(ThreadPoolExecutor.java:1068)         at java.util.concurrent.ThreadPoolExecutor.runWorker(ThreadPoolExecutor.java:1130)         at java.util.concurrent.ThreadPoolExecutor$Worker.run(ThreadPoolExecutor.java:615)         at java.lang.Thread.run(Thread.java:745)

Stack Trace:
com.carrotsearch.randomizedtesting.ThreadLeakError: There are still zombie threads that couldn't be terminated:
   1) Thread[id=1489, name=org.eclipse.jetty.server.session.HashSessionManager@76772d90Timer, state=TIMED_WAITING, group=TGRP-TestReplicationHandler]
        at sun.misc.Unsafe.park(Native Method)
        at java.util.concurrent.locks.LockSupport.parkNanos(LockSupport.java:226)
        at java.util.concurrent.locks.AbstractQueuedSynchronizer$ConditionObject.awaitNanos(AbstractQueuedSynchronizer.java:2082)
        at java.util.concurrent.ScheduledThreadPoolExecutor$DelayedWorkQueue.take(ScheduledThreadPoolExecutor.java:1090)
        at java.util.concurrent.ScheduledThreadPoolExecutor$DelayedWorkQueue.take(ScheduledThreadPoolExecutor.java:807)
        at java.util.concurrent.ThreadPoolExecutor.getTask(ThreadPoolExecutor.java:1068)
        at java.util.concurrent.ThreadPoolExecutor.runWorker(ThreadPoolExecutor.java:1130)
        at java.util.concurrent.ThreadPoolExecutor$Worker.run(ThreadPoolExecutor.java:615)
        at java.lang.Thread.run(Thread.java:745)
   2) Thread[id=1488, name=Scheduler-1708016757, state=TIMED_WAITING, group=TGRP-TestReplicationHandler]
        at sun.misc.Unsafe.park(Native Method)
        at java.util.concurrent.locks.LockSupport.parkNanos(LockSupport.java:226)
        at java.util.concurrent.locks.AbstractQueuedSynchronizer$ConditionObject.awaitNanos(AbstractQueuedSynchronizer.java:2082)
        at java.util.concurrent.ScheduledThreadPoolExecutor$DelayedWorkQueue.take(ScheduledThreadPoolExecutor.java:1090)
        at java.util.concurrent.ScheduledThreadPoolExecutor$DelayedWorkQueue.take(ScheduledThreadPoolExecutor.java:807)
        at java.util.concurrent.ThreadPoolExecutor.getTask(ThreadPoolExecutor.java:1068)
        at java.util.concurrent.ThreadPoolExecutor.runWorker(ThreadPoolExecutor.java:1130)
        at java.util.concurrent.ThreadPoolExecutor$Worker.run(ThreadPoolExecutor.java:615)
        at java.lang.Thread.run(Thread.java:745)
	at __randomizedtesting.SeedInfo.seed([FB2B7B5566BB2A95]:0)




Build Log:
[...truncated 9862 lines...]
   [junit4] Suite: org.apache.solr.handler.TestReplicationHandler
   [junit4]   2> Creating dataDir: /Users/jenkins/workspace/Lucene-Solr-5.x-MacOSX/solr/build/solr-core/test/J0/temp/solr.handler.TestReplicationHandler_FB2B7B5566BB2A95-001/init-core-data-001
   [junit4]   2> 131085 INFO  (TEST-TestReplicationHandler.doTestReplicateAfterStartupWithNoActivity-seed#[FB2B7B5566BB2A95]) [    ] o.a.s.SolrTestCaseJ4 ###Starting doTestReplicateAfterStartupWithNoActivity
   [junit4]   2> 131086 INFO  (TEST-TestReplicationHandler.doTestReplicateAfterStartupWithNoActivity-seed#[FB2B7B5566BB2A95]) [    ] o.a.s.SolrTestCaseJ4 Writing core.properties file to /Users/jenkins/workspace/Lucene-Solr-5.x-MacOSX/solr/build/solr-core/test/J0/temp/solr.handler.TestReplicationHandler_FB2B7B5566BB2A95-001/solr-instance-001/collection1
   [junit4]   2> 131094 INFO  (TEST-TestReplicationHandler.doTestReplicateAfterStartupWithNoActivity-seed#[FB2B7B5566BB2A95]) [    ] o.e.j.s.Server jetty-9.2.13.v20150730
   [junit4]   2> 131097 INFO  (TEST-TestReplicationHandler.doTestReplicateAfterStartupWithNoActivity-seed#[FB2B7B5566BB2A95]) [    ] o.e.j.s.h.ContextHandler Started o.e.j.s.ServletContextHandler@6cb547bc{/solr,null,AVAILABLE}
   [junit4]   2> 131099 INFO  (TEST-TestReplicationHandler.doTestReplicateAfterStartupWithNoActivity-seed#[FB2B7B5566BB2A95]) [    ] o.e.j.s.ServerConnector Started ServerConnector@7178bf65{HTTP/1.1}{127.0.0.1:52191}
   [junit4]   2> 131099 INFO  (TEST-TestReplicationHandler.doTestReplicateAfterStartupWithNoActivity-seed#[FB2B7B5566BB2A95]) [    ] o.e.j.s.Server Started @135546ms
   [junit4]   2> 131099 INFO  (TEST-TestReplicationHandler.doTestReplicateAfterStartupWithNoActivity-seed#[FB2B7B5566BB2A95]) [    ] o.a.s.c.s.e.JettySolrRunner Jetty properties: {hostContext=/solr, solr.data.dir=/Users/jenkins/workspace/Lucene-Solr-5.x-MacOSX/solr/build/solr-core/test/J0/temp/solr.handler.TestReplicationHandler_FB2B7B5566BB2A95-001/solr-instance-001/collection1/data, hostPort=52191}
   [junit4]   2> 131100 INFO  (TEST-TestReplicationHandler.doTestReplicateAfterStartupWithNoActivity-seed#[FB2B7B5566BB2A95]) [    ] o.a.s.s.SolrDispatchFilter SolrDispatchFilter.init(): sun.misc.Launcher$AppClassLoader@3b756db3
   [junit4]   2> 131100 INFO  (TEST-TestReplicationHandler.doTestReplicateAfterStartupWithNoActivity-seed#[FB2B7B5566BB2A95]) [    ] o.a.s.c.SolrResourceLoader new SolrResourceLoader for directory: '/Users/jenkins/workspace/Lucene-Solr-5.x-MacOSX/solr/build/solr-core/test/J0/temp/solr.handler.TestReplicationHandler_FB2B7B5566BB2A95-001/solr-instance-001'
   [junit4]   2> 131100 INFO  (TEST-TestReplicationHandler.doTestReplicateAfterStartupWithNoActivity-seed#[FB2B7B5566BB2A95]) [    ] o.a.s.c.SolrResourceLoader JNDI not configured for solr (NoInitialContextEx)
   [junit4]   2> 131100 INFO  (TEST-TestReplicationHandler.doTestReplicateAfterStartupWithNoActivity-seed#[FB2B7B5566BB2A95]) [    ] o.a.s.c.SolrResourceLoader solr home defaulted to 'solr/' (could not find system property or JNDI)
   [junit4]   2> 131100 INFO  (TEST-TestReplicationHandler.doTestReplicateAfterStartupWithNoActivity-seed#[FB2B7B5566BB2A95]) [    ] o.a.s.c.SolrXmlConfig Loading container configuration from /Users/jenkins/workspace/Lucene-Solr-5.x-MacOSX/solr/build/solr-core/test/J0/temp/solr.handler.TestReplicationHandler_FB2B7B5566BB2A95-001/solr-instance-001/solr.xml
   [junit4]   2> 131130 INFO  (TEST-TestReplicationHandler.doTestReplicateAfterStartupWithNoActivity-seed#[FB2B7B5566BB2A95]) [    ] o.a.s.c.CorePropertiesLocator Config-defined core root directory: /Users/jenkins/workspace/Lucene-Solr-5.x-MacOSX/solr/build/solr-core/test/J0/temp/solr.handler.TestReplicationHandler_FB2B7B5566BB2A95-001/solr-instance-001/.
   [junit4]   2> 131130 INFO  (TEST-TestReplicationHandler.doTestReplicateAfterStartupWithNoActivity-seed#[FB2B7B5566BB2A95]) [    ] o.a.s.c.CoreContainer New CoreContainer 1759106212
   [junit4]   2> 131130 INFO  (TEST-TestReplicationHandler.doTestReplicateAfterStartupWithNoActivity-seed#[FB2B7B5566BB2A95]) [    ] o.a.s.c.CoreContainer Loading cores into CoreContainer [instanceDir=/Users/jenkins/workspace/Lucene-Solr-5.x-MacOSX/solr/build/solr-core/test/J0/temp/solr.handler.TestReplicationHandler_FB2B7B5566BB2A95-001/solr-instance-001]
   [junit4]   2> 131130 WARN  (TEST-TestReplicationHandler.doTestReplicateAfterStartupWithNoActivity-seed#[FB2B7B5566BB2A95]) [    ] o.a.s.c.CoreContainer Couldn't add files from /Users/jenkins/workspace/Lucene-Solr-5.x-MacOSX/solr/build/solr-core/test/J0/temp/solr.handler.TestReplicationHandler_FB2B7B5566BB2A95-001/solr-instance-001/lib to classpath: /Users/jenkins/workspace/Lucene-Solr-5.x-MacOSX/solr/build/solr-core/test/J0/temp/solr.handler.TestReplicationHandler_FB2B7B5566BB2A95-001/solr-instance-001/lib
   [junit4]   2> 131131 INFO  (TEST-TestReplicationHandler.doTestReplicateAfterStartupWithNoActivity-seed#[FB2B7B5566BB2A95]) [    ] o.a.s.h.c.HttpShardHandlerFactory created with socketTimeout : 90000,urlScheme : ,connTimeout : 15000,maxConnectionsPerHost : 20,maxConnections : 10000,corePoolSize : 0,maximumPoolSize : 2147483647,maxThreadIdleTime : 5,sizeOfQueue : -1,fairnessPolicy : false,useRetries : false,
   [junit4]   2> 131133 INFO  (TEST-TestReplicationHandler.doTestReplicateAfterStartupWithNoActivity-seed#[FB2B7B5566BB2A95]) [    ] o.a.s.u.UpdateShardHandler Creating UpdateShardHandler HTTP client with params: socketTimeout=340000&connTimeout=45000&retry=true
   [junit4]   2> 131133 INFO  (TEST-TestReplicationHandler.doTestReplicateAfterStartupWithNoActivity-seed#[FB2B7B5566BB2A95]) [    ] o.a.s.l.LogWatcher SLF4J impl is org.slf4j.impl.Log4jLoggerFactory
   [junit4]   2> 131134 INFO  (TEST-TestReplicationHandler.doTestReplicateAfterStartupWithNoActivity-seed#[FB2B7B5566BB2A95]) [    ] o.a.s.l.LogWatcher Registering Log Listener [Log4j (org.slf4j.impl.Log4jLoggerFactory)]
   [junit4]   2> 131134 INFO  (TEST-TestReplicationHandler.doTestReplicateAfterStartupWithNoActivity-seed#[FB2B7B5566BB2A95]) [    ] o.a.s.c.CoreContainer Security conf doesn't exist. Skipping setup for authorization module.
   [junit4]   2> 131134 INFO  (TEST-TestReplicationHandler.doTestReplicateAfterStartupWithNoActivity-seed#[FB2B7B5566BB2A95]) [    ] o.a.s.c.CoreContainer No authentication plugin used.
   [junit4]   2> 131136 INFO  (TEST-TestReplicationHandler.doTestReplicateAfterStartupWithNoActivity-seed#[FB2B7B5566BB2A95]) [    ] o.a.s.c.CorePropertiesLocator Looking for core definitions underneath /Users/jenkins/workspace/Lucene-Solr-5.x-MacOSX/solr/build/solr-core/test/J0/temp/solr.handler.TestReplicationHandler_FB2B7B5566BB2A95-001/solr-instance-001/.
   [junit4]   2> 131138 INFO  (TEST-TestReplicationHandler.doTestReplicateAfterStartupWithNoActivity-seed#[FB2B7B5566BB2A95]) [    ] o.a.s.c.CoreDescriptor Created CoreDescriptor: {config=solrconfig.xml, configSetProperties=configsetprops.json, loadOnStartup=true, dataDir=data/, name=collection1, schema=schema.xml, transient=false}
   [junit4]   2> 131138 INFO  (TEST-TestReplicationHandler.doTestReplicateAfterStartupWithNoActivity-seed#[FB2B7B5566BB2A95]) [    ] o.a.s.c.CorePropertiesLocator Found core collection1 in /Users/jenkins/workspace/Lucene-Solr-5.x-MacOSX/solr/build/solr-core/test/J0/temp/solr.handler.TestReplicationHandler_FB2B7B5566BB2A95-001/solr-instance-001/./collection1
   [junit4]   2> 131138 INFO  (TEST-TestReplicationHandler.doTestReplicateAfterStartupWithNoActivity-seed#[FB2B7B5566BB2A95]) [    ] o.a.s.c.CorePropertiesLocator Found 1 core definitions
   [junit4]   2> 131138 INFO  (coreLoadExecutor-493-thread-1) [    ] o.a.s.c.SolrResourceLoader new SolrResourceLoader for directory: '/Users/jenkins/workspace/Lucene-Solr-5.x-MacOSX/solr/build/solr-core/test/J0/temp/solr.handler.TestReplicationHandler_FB2B7B5566BB2A95-001/solr-instance-001/collection1'
   [junit4]   2> 131139 INFO  (TEST-TestReplicationHandler.doTestReplicateAfterStartupWithNoActivity-seed#[FB2B7B5566BB2A95]) [    ] o.a.s.s.SolrDispatchFilter user.dir=/Users/jenkins/workspace/Lucene-Solr-5.x-MacOSX/solr/build/solr-core/test/J0
   [junit4]   2> 131139 INFO  (TEST-TestReplicationHandler.doTestReplicateAfterStartupWithNoActivity-seed#[FB2B7B5566BB2A95]) [    ] o.a.s.s.SolrDispatchFilter SolrDispatchFilter.init() done
   [junit4]   2> 131139 INFO  (coreLoadExecutor-493-thread-1) [    ] o.a.s.c.SolrResourceLoader JNDI not configured for solr (NoInitialContextEx)
   [junit4]   2> 131139 INFO  (coreLoadExecutor-493-thread-1) [    ] o.a.s.c.SolrResourceLoader solr home defaulted to 'solr/' (could not find system property or JNDI)
   [junit4]   2> 131149 INFO  (coreLoadExecutor-493-thread-1) [    ] o.a.s.c.SolrConfig current version of requestparams : -1
   [junit4]   2> 131160 INFO  (coreLoadExecutor-493-thread-1) [    ] o.a.s.c.SolrConfig Using Lucene MatchVersion: 5.5.0
   [junit4]   2> 131185 INFO  (coreLoadExecutor-493-thread-1) [    ] o.a.s.c.SolrConfig Loaded SolrConfig: solrconfig.xml
   [junit4]   2> 131189 INFO  (coreLoadExecutor-493-thread-1) [    ] o.a.s.s.IndexSchema [collection1] Schema name=test
   [junit4]   2> 131195 INFO  (coreLoadExecutor-493-thread-1) [    ] o.a.s.s.IndexSchema unique key field: id
   [junit4]   2> 131198 INFO  (coreLoadExecutor-493-thread-1) [    ] o.a.s.c.ConfigSetProperties Did not find ConfigSet properties, assuming default properties: Can't find resource 'configsetprops.json' in classpath or '/Users/jenkins/workspace/Lucene-Solr-5.x-MacOSX/solr/build/solr-core/test/J0/temp/solr.handler.TestReplicationHandler_FB2B7B5566BB2A95-001/solr-instance-001/collection1'
   [junit4]   2> 131198 INFO  (coreLoadExecutor-493-thread-1) [    ] o.a.s.c.CoreContainer Creating SolrCore 'collection1' using configuration from instancedir /Users/jenkins/workspace/Lucene-Solr-5.x-MacOSX/solr/build/solr-core/test/J0/temp/solr.handler.TestReplicationHandler_FB2B7B5566BB2A95-001/solr-instance-001/./collection1
   [junit4]   2> 131199 INFO  (coreLoadExecutor-493-thread-1) [    x:collection1] o.a.s.c.SolrCore org.apache.solr.core.MockDirectoryFactory
   [junit4]   2> 131199 INFO  (coreLoadExecutor-493-thread-1) [    x:collection1] o.a.s.c.SolrCore [[collection1] ] Opening new SolrCore at [/Users/jenkins/workspace/Lucene-Solr-5.x-MacOSX/solr/build/solr-core/test/J0/temp/solr.handler.TestReplicationHandler_FB2B7B5566BB2A95-001/solr-instance-001/collection1], dataDir=[/Users/jenkins/workspace/Lucene-Solr-5.x-MacOSX/solr/build/solr-core/test/J0/temp/solr.handler.TestReplicationHandler_FB2B7B5566BB2A95-001/solr-instance-001/./collection1/data/]
   [junit4]   2> 131199 INFO  (coreLoadExecutor-493-thread-1) [    x:collection1] o.a.s.c.SolrCore JMX monitoring not detected for core: collection1
   [junit4]   2> 131199 INFO  (coreLoadExecutor-493-thread-1) [    x:collection1] o.a.s.c.CachingDirectoryFactory return new directory for /Users/jenkins/workspace/Lucene-Solr-5.x-MacOSX/solr/build/solr-core/test/J0/temp/solr.handler.TestReplicationHandler_FB2B7B5566BB2A95-001/solr-instance-001/./collection1/data
   [junit4]   2> 131199 INFO  (coreLoadExecutor-493-thread-1) [    x:collection1] o.a.s.c.SolrCore New index directory detected: old=null new=/Users/jenkins/workspace/Lucene-Solr-5.x-MacOSX/solr/build/solr-core/test/J0/temp/solr.handler.TestReplicationHandler_FB2B7B5566BB2A95-001/solr-instance-001/./collection1/data/index/
   [junit4]   2> 131199 WARN  (coreLoadExecutor-493-thread-1) [    x:collection1] o.a.s.c.SolrCore [collection1] Solr index directory '/Users/jenkins/workspace/Lucene-Solr-5.x-MacOSX/solr/build/solr-core/test/J0/temp/solr.handler.TestReplicationHandler_FB2B7B5566BB2A95-001/solr-instance-001/./collection1/data/index' doesn't exist. Creating new index...
   [junit4]   2> 131200 INFO  (coreLoadExecutor-493-thread-1) [    x:collection1] o.a.s.c.CachingDirectoryFactory return new directory for /Users/jenkins/workspace/Lucene-Solr-5.x-MacOSX/solr/build/solr-core/test/J0/temp/solr.handler.TestReplicationHandler_FB2B7B5566BB2A95-001/solr-instance-001/./collection1/data/index
   [junit4]   2> 131200 INFO  (coreLoadExecutor-493-thread-1) [    x:collection1] o.a.s.u.RandomMergePolicy RandomMergePolicy wrapping class org.apache.lucene.index.LogDocMergePolicy: [LogDocMergePolicy: minMergeSize=1000, mergeFactor=47, maxMergeSize=9223372036854775807, maxMergeSizeForForcedMerge=9223372036854775807, calibrateSizeByDeletes=false, maxMergeDocs=2147483647, maxCFSSegmentSizeMB=8.796093022207999E12, noCFSRatio=0.13976473282650997]
   [junit4]   2> 131201 INFO  (coreLoadExecutor-493-thread-1) [    x:collection1] o.a.s.c.SolrDeletionPolicy SolrDeletionPolicy.onCommit: commits: num=1
   [junit4]   2> 	commit{dir=MockDirectoryWrapper(RAMDirectory@5cbcb6e4 lockFactory=org.apache.lucene.store.SingleInstanceLockFactory@698b624c),segFN=segments_1,generation=1}
   [junit4]   2> 131201 INFO  (coreLoadExecutor-493-thread-1) [    x:collection1] o.a.s.c.SolrDeletionPolicy newest commit generation = 1
   [junit4]   2> 131201 INFO  (OldIndexDirectoryCleanupThreadForCore-collection1) [    x:collection1] o.a.s.c.SolrCore Looking for old index directories to cleanup for core collection1 in /Users/jenkins/workspace/Lucene-Solr-5.x-MacOSX/solr/build/solr-core/test/J0/temp/solr.handler.TestReplicationHandler_FB2B7B5566BB2A95-001/solr-instance-001/./collection1/data/
   [junit4]   2> 131203 INFO  (coreLoadExecutor-493-thread-1) [    x:collection1] o.a.s.c.SolrCore no updateRequestProcessorChain defined as default, creating implicit default
   [junit4]   2> 131208 INFO  (coreLoadExecutor-493-thread-1) [    x:collection1] o.a.s.h.l.XMLLoader xsltCacheLifetimeSeconds=60
   [junit4]   2> 131209 INFO  (coreLoadExecutor-493-thread-1) [    x:collection1] o.a.s.h.l.XMLLoader xsltCacheLifetimeSeconds=60
   [junit4]   2> 131210 INFO  (coreLoadExecutor-493-thread-1) [    x:collection1] o.a.s.h.l.XMLLoader xsltCacheLifetimeSeconds=60
   [junit4]   2> 131211 INFO  (coreLoadExecutor-493-thread-1) [    x:collection1] o.a.s.h.l.XMLLoader xsltCacheLifetimeSeconds=60
   [junit4]   2> 131219 INFO  (coreLoadExecutor-493-thread-1) [    x:collection1] o.a.s.c.PluginBag requestHandler : 'lazy' created with startup=lazy 
   [junit4]   2> 131219 INFO  (coreLoadExecutor-493-thread-1) [    x:collection1] o.a.s.c.RequestHandlers Registered paths: lazy,/admin/properties,/replication,/config,/admin/logging,/schema,/update/json/docs,/admin/luke,/admin/threads,/update/csv,standard,defaults,/admin/system,/admin/plugins,/admin/mbeans,/get,/admin/file,/admin/segments,/admin/ping,/update/json,/update
   [junit4]   2> 131220 INFO  (coreLoadExecutor-493-thread-1) [    x:collection1] o.a.s.c.SolrCore Using default statsCache cache: org.apache.solr.search.stats.LocalStatsCache
   [junit4]   2> 131220 INFO  (coreLoadExecutor-493-thread-1) [    x:collection1] o.a.s.u.CommitTracker Hard AutoCommit: disabled
   [junit4]   2> 131220 INFO  (coreLoadExecutor-493-thread-1) [    x:collection1] o.a.s.u.CommitTracker Soft AutoCommit: disabled
   [junit4]   2> 131220 INFO  (coreLoadExecutor-493-thread-1) [    x:collection1] o.a.s.u.RandomMergePolicy RandomMergePolicy wrapping class org.apache.lucene.index.AlcoholicMergePolicy: [AlcoholicMergePolicy: minMergeSize=0, mergeFactor=10, maxMergeSize=1873061874, maxMergeSizeForForcedMerge=9223372036854775807, calibrateSizeByDeletes=true, maxMergeDocs=2147483647, maxCFSSegmentSizeMB=8.796093022207999E12, noCFSRatio=0.1]
   [junit4]   2> 131221 INFO  (coreLoadExecutor-493-thread-1) [    x:collection1] o.a.s.c.SolrDeletionPolicy SolrDeletionPolicy.onInit: commits: num=1
   [junit4]   2> 	commit{dir=MockDirectoryWrapper(RAMDirectory@5cbcb6e4 lockFactory=org.apache.lucene.store.SingleInstanceLockFactory@698b624c),segFN=segments_1,generation=1}
   [junit4]   2> 131221 INFO  (coreLoadExecutor-493-thread-1) [    x:collection1] o.a.s.c.SolrDeletionPolicy newest commit generation = 1
   [junit4]   2> 131221 INFO  (coreLoadExecutor-493-thread-1) [    x:collection1] o.a.s.s.SolrIndexSearcher Opening Searcher@4bfb3772[collection1] main
   [junit4]   2> 131221 INFO  (coreLoadExecutor-493-thread-1) [    x:collection1] o.a.s.r.ManagedResourceStorage File-based storage initialized to use dir: /Users/jenkins/workspace/Lucene-Solr-5.x-MacOSX/solr/build/solr-core/test/J0/temp/solr.handler.TestReplicationHandler_FB2B7B5566BB2A95-001/solr-instance-001/collection1/conf
   [junit4]   2> 131221 INFO  (coreLoadExecutor-493-thread-1) [    x:collection1] o.a.s.r.RestManager Initializing RestManager with initArgs: {storageDir=/Users/jenkins/workspace/Lucene-Solr-5.x-MacOSX/solr/build/solr-core/test/J0/temp/solr.handler.TestReplicationHandler_FB2B7B5566BB2A95-001/solr-instance-001/collection1/conf}
   [junit4]   2> 131221 INFO  (coreLoadExecutor-493-thread-1) [    x:collection1] o.a.s.r.ManagedResourceStorage Reading _rest_managed.json using file:dir=/Users/jenkins/workspace/Lucene-Solr-5.x-MacOSX/solr/build/solr-core/test/J0/temp/solr.handler.TestReplicationHandler_FB2B7B5566BB2A95-001/solr-instance-001/collection1/conf
   [junit4]   2> 131222 INFO  (coreLoadExecutor-493-thread-1) [    x:collection1] o.a.s.r.RestManager Initializing 0 registered ManagedResources
   [junit4]   2> 131222 INFO  (coreLoadExecutor-493-thread-1) [    x:collection1] o.a.s.h.ReplicationHandler Replication enabled for following config files: schema.xml,xslt/dummy.xsl
   [junit4]   2> 131222 INFO  (coreLoadExecutor-493-thread-1) [    x:collection1] o.a.s.h.ReplicationHandler Commits will be reserved for  10000
   [junit4]   2> 131222 INFO  (searcherExecutor-494-thread-1-processing-x:collection1) [    x:collection1] o.a.s.c.SolrCore [collection1] Registered new searcher Searcher@4bfb3772[collection1] main{ExitableDirectoryReader(UninvertingDirectoryReader())}
   [junit4]   2> 131222 INFO  (coreLoadExecutor-493-thread-1) [    x:collection1] o.a.s.c.CoreContainer registering core: collection1
   [junit4]   2> 131642 INFO  (TEST-TestReplicationHandler.doTestReplicateAfterStartupWithNoActivity-seed#[FB2B7B5566BB2A95]) [    ] o.a.s.SolrTestCaseJ4 Writing core.properties file to /Users/jenkins/workspace/Lucene-Solr-5.x-MacOSX/solr/build/solr-core/test/J0/temp/solr.handler.TestReplicationHandler_FB2B7B5566BB2A95-001/solr-instance-002/collection1
   [junit4]   2> 131649 INFO  (TEST-TestReplicationHandler.doTestReplicateAfterStartupWithNoActivity-seed#[FB2B7B5566BB2A95]) [    ] o.e.j.s.Server jetty-9.2.13.v20150730
   [junit4]   2> 131652 INFO  (TEST-TestReplicationHandler.doTestReplicateAfterStartupWithNoActivity-seed#[FB2B7B5566BB2A95]) [    ] o.e.j.s.h.ContextHandler Started o.e.j.s.ServletContextHandler@11a670b5{/solr,null,AVAILABLE}
   [junit4]   2> 131653 INFO  (TEST-TestReplicationHandler.doTestReplicateAfterStartupWithNoActivity-seed#[FB2B7B5566BB2A95]) [    ] o.e.j.s.ServerConnector Started ServerConnector@46318420{HTTP/1.1}{127.0.0.1:52192}
   [junit4]   2> 131653 INFO  (TEST-TestReplicationHandler.doTestReplicateAfterStartupWithNoActivity-seed#[FB2B7B5566BB2A95]) [    ] o.e.j.s.Server Started @136100ms
   [junit4]   2> 131653 INFO  (TEST-TestReplicationHandler.doTestReplicateAfterStartupWithNoActivity-seed#[FB2B7B5566BB2A95]) [    ] o.a.s.c.s.e.JettySolrRunner Jetty properties: {hostContext=/solr, solr.data.dir=/Users/jenkins/workspace/Lucene-Solr-5.x-MacOSX/solr/build/solr-core/test/J0/temp/solr.handler.TestReplicationHandler_FB2B7B5566BB2A95-001/solr-instance-002/collection1/data, hostPort=52192}
   [junit4]   2> 131654 INFO  (TEST-TestReplicationHandler.doTestReplicateAfterStartupWithNoActivity-seed#[FB2B7B5566BB2A95]) [    ] o.a.s.s.SolrDispatchFilter SolrDispatchFilter.init(): sun.misc.Launcher$AppClassLoader@3b756db3
   [junit4]   2> 131654 INFO  (TEST-TestReplicationHandler.doTestReplicateAfterStartupWithNoActivity-seed#[FB2B7B5566BB2A95]) [    ] o.a.s.c.SolrResourceLoader new SolrResourceLoader for directory: '/Users/jenkins/workspace/Lucene-Solr-5.x-MacOSX/solr/build/solr-core/test/J0/temp/solr.handler.TestReplicationHandler_FB2B7B5566BB2A95-001/solr-instance-002'
   [junit4]   2> 131654 INFO  (TEST-TestReplicationHandler.doTestReplicateAfterStartupWithNoActivity-seed#[FB2B7B5566BB2A95]) [    ] o.a.s.c.SolrResourceLoader JNDI not configured for solr (NoInitialContextEx)
   [junit4]   2> 131654 INFO  (TEST-TestReplicationHandler.doTestReplicateAfterStartupWithNoActivity-seed#[FB2B7B5566BB2A95]) [    ] o.a.s.c.SolrResourceLoader solr home defaulted to 'solr/' (could not find system property or JNDI)
   [junit4]   2> 131655 INFO  (TEST-TestReplicationHandler.doTestReplicateAfterStartupWithNoActivity-seed#[FB2B7B5566BB2A95]) [    ] o.a.s.c.SolrXmlConfig Loading container configuration from /Users/jenkins/workspace/Lucene-Solr-5.x-MacOSX/solr/build/solr-core/test/J0/temp/solr.handler.TestReplicationHandler_FB2B7B5566BB2A95-001/solr-instance-002/solr.xml
   [junit4]   2> 131679 INFO  (TEST-TestReplicationHandler.doTestReplicateAfterStartupWithNoActivity-seed#[FB2B7B5566BB2A95]) [    ] o.a.s.c.CorePropertiesLocator Config-defined core root directory: /Users/jenkins/workspace/Lucene-Solr-5.x-MacOSX/solr/build/solr-core/test/J0/temp/solr.handler.TestReplicationHandler_FB2B7B5566BB2A95-001/solr-instance-002/.
   [junit4]   2> 131679 INFO  (TEST-TestReplicationHandler.doTestReplicateAfterStartupWithNoActivity-seed#[FB2B7B5566BB2A95]) [    ] o.a.s.c.CoreContainer New CoreContainer 1272986442
   [junit4]   2> 131679 INFO  (TEST-TestReplicationHandler.doTestReplicateAfterStartupWithNoActivity-seed#[FB2B7B5566BB2A95]) [    ] o.a.s.c.CoreContainer Loading cores into CoreContainer [instanceDir=/Users/jenkins/workspace/Lucene-Solr-5.x-MacOSX/solr/build/solr-core/test/J0/temp/solr.handler.TestReplicationHandler_FB2B7B5566BB2A95-001/solr-instance-002]
   [junit4]   2> 131679 WARN  (TEST-TestReplicationHandler.doTestReplicateAfterStartupWithNoActivity-seed#[FB2B7B5566BB2A95]) [    ] o.a.s.c.CoreContainer Couldn't add files from /Users/jenkins/workspace/Lucene-Solr-5.x-MacOSX/solr/build/solr-core/test/J0/temp/solr.handler.TestReplicationHandler_FB2B7B5566BB2A95-001/solr-instance-002/lib to classpath: /Users/jenkins/workspace/Lucene-Solr-5.x-MacOSX/solr/build/solr-core/test/J0/temp/solr.handler.TestReplicationHandler_FB2B7B5566BB2A95-001/solr-instance-002/lib
   [junit4]   2> 131680 INFO  (TEST-TestReplicationHandler.doTestReplicateAfterStartupWithNoActivity-seed#[FB2B7B5566BB2A95]) [    ] o.a.s.h.c.HttpShardHandlerFactory created with socketTimeout : 90000,urlScheme : ,connTimeout : 15000,maxConnectionsPerHost : 20,maxConnections : 10000,corePoolSize : 0,maximumPoolSize : 2147483647,maxThreadIdleTime : 5,sizeOfQueue : -1,fairnessPolicy : false,useRetries : false,
   [junit4]   2> 131682 INFO  (TEST-TestReplicationHandler.doTestReplicateAfterStartupWithNoActivity-seed#[FB2B7B5566BB2A95]) [    ] o.a.s.u.UpdateShardHandler Creating UpdateShardHandler HTTP client with params: socketTimeout=340000&connTimeout=45000&retry=true
   [junit4]   2> 131683 INFO  (TEST-TestReplicationHandler.doTestReplicateAfterStartupWithNoActivity-seed#[FB2B7B5566BB2A95]) [    ] o.a.s.l.LogWatcher SLF4J impl is org.slf4j.impl.Log4jLoggerFactory
   [junit4]   2> 131683 INFO  (TEST-TestReplicationHandler.doTestReplicateAfterStartupWithNoActivity-seed#[FB2B7B5566BB2A95]) [    ] o.a.s.l.LogWatcher Registering Log Listener [Log4j (org.slf4j.impl.Log4jLoggerFactory)]
   [junit4]   2> 131683 INFO  (TEST-TestReplicationHandler.doTestReplicateAfterStartupWithNoActivity-seed#[FB2B7B5566BB2A95]) [    ] o.a.s.c.CoreContainer Security conf doesn't exist. Skipping setup for authorization module.
   [junit4]   2> 131683 INFO  (TEST-TestReplicationHandler.doTestReplicateAfterStartupWithNoActivity-seed#[FB2B7B5566BB2A95]) [    ] o.a.s.c.CoreContainer No authentication plugin used.
   [junit4]   2> 131684 INFO  (TEST-TestReplicationHandler.doTestReplicateAfterStartupWithNoActivity-seed#[FB2B7B5566BB2A95]) [    ] o.a.s.c.CorePropertiesLocator Looking for core definitions underneath /Users/jenkins/workspace/Lucene-Solr-5.x-MacOSX/solr/build/solr-core/test/J0/temp/solr.handler.TestReplicationHandler_FB2B7B5566BB2A95-001/solr-instance-002/.
   [junit4]   2> 131685 INFO  (TEST-TestReplicationHandler.doTestReplicateAfterStartupWithNoActivity-seed#[FB2B7B5566BB2A95]) [    ] o.a.s.c.CoreDescriptor Created CoreDescriptor: {schema=schema.xml, config=solrconfig.xml, configSetProperties=configsetprops.json, name=collection1, transient=false, dataDir=data/, loadOnStartup=true}
   [junit4]   2> 131685 INFO  (TEST-TestReplicationHandler.doTestReplicateAfterStartupWithNoActivity-seed#[FB2B7B5566BB2A95]) [    ] o.a.s.c.CorePropertiesLocator Found core collection1 in /Users/jenkins/workspace/Lucene-Solr-5.x-MacOSX/solr/build/solr-core/test/J0/temp/solr.handler.TestReplicationHandler_FB2B7B5566BB2A95-001/solr-instance-002/./collection1
   [junit4]   2> 131686 INFO  (TEST-TestReplicationHandler.doTestReplicateAfterStartupWithNoActivity-seed#[FB2B7B5566BB2A95]) [    ] o.a.s.c.CorePropertiesLocator Found 1 core definitions
   [junit4]   2> 131686 INFO  (coreLoadExecutor-503-thread-1) [    ] o.a.s.c.SolrResourceLoader new SolrResourceLoader for directory: '/Users/jenkins/workspace/Lucene-Solr-5.x-MacOSX/solr/build/solr-core/test/J0/temp/solr.handler.TestReplicationHandler_FB2B7B5566BB2A95-001/solr-instance-002/collection1'
   [junit4]   2> 131687 INFO  (TEST-TestReplicationHandler.doTestReplicateAfterStartupWithNoActivity-seed#[FB2B7B5566BB2A95]) [    ] o.a.s.s.SolrDispatchFilter user.dir=/Users/jenkins/workspace/Lucene-Solr-5.x-MacOSX/solr/build/solr-core/test/J0
   [junit4]   2> 131687 INFO  (coreLoadExecutor-503-thread-1) [    ] o.a.s.c.SolrResourceLoader JNDI not configured for solr (NoInitialContextEx)
   [junit4]   2> 131687 INFO  (TEST-TestReplicationHandler.doTestReplicateAfterStartupWithNoActivity-seed#[FB2B7B5566BB2A95]) [    ] o.a.s.s.SolrDispatchFilter SolrDispatchFilter.init() done
   [junit4]   2> 131687 INFO  (coreLoadExecutor-503-thread-1) [    ] o.a.s.c.SolrResourceLoader solr home defaulted to 'solr/' (could not find system property or JNDI)
   [junit4]   2> 131704 INFO  (coreLoadExecutor-503-thread-1) [    ] o.a.s.c.SolrConfig current version of requestparams : -1
   [junit4]   2> 131714 INFO  (coreLoadExecutor-503-thread-1) [    ] o.a.s.c.SolrConfig Using Lucene MatchVersion: 5.5.0
   [junit4]   2> 131740 INFO  (coreLoadExecutor-503-thread-1) [    ] o.a.s.c.SolrConfig Loaded SolrConfig: solrconfig.xml
   [junit4]   2> 131744 INFO  (coreLoadExecutor-503-thread-1) [    ] o.a.s.s.IndexSchema [collection1] Schema name=test
   [junit4]   2> 131751 INFO  (coreLoadExecutor-503-thread-1) [    ] o.a.s.s.IndexSchema unique key field: id
   [junit4]   2> 131754 INFO  (coreLoadExecutor-503-thread-1) [    ] o.a.s.c.ConfigSetProperties Did not find ConfigSet properties, assuming default properties: Can't find resource 'configsetprops.json' in classpath or '/Users/jenkins/workspace/Lucene-Solr-5.x-MacOSX/solr/build/solr-core/test/J0/temp/solr.handler.TestReplicationHandler_FB2B7B5566BB2A95-001/solr-instance-002/collection1'
   [junit4]   2> 131754 INFO  (coreLoadExecutor-503-thread-1) [    ] o.a.s.c.CoreContainer Creating SolrCore 'collection1' using configuration from instancedir /Users/jenkins/workspace/Lucene-Solr-5.x-MacOSX/solr/build/solr-core/test/J0/temp/solr.handler.TestReplicationHandler_FB2B7B5566BB2A95-001/solr-instance-002/./collection1
   [junit4]   2> 131754 INFO  (coreLoadExecutor-503-thread-1) [    x:collection1] o.a.s.c.SolrCore org.apache.solr.core.MockDirectoryFactory
   [junit4]   2> 131755 INFO  (coreLoadExecutor-503-thread-1) [    x:collection1] o.a.s.c.SolrCore [[collection1] ] Opening new SolrCore at [/Users/jenkins/workspace/Lucene-Solr-5.x-MacOSX/solr/build/solr-core/test/J0/temp/solr.handler.TestReplicationHandler_FB2B7B5566BB2A95-001/solr-instance-002/collection1], dataDir=[/Users/jenkins/workspace/Lucene-Solr-5.x-MacOSX/solr/build/solr-core/test/J0/temp/solr.handler.TestReplicationHandler_FB2B7B5566BB2A95-001/solr-instance-002/./collection1/data/]
   [junit4]   2> 131755 INFO  (coreLoadExecutor-503-thread-1) [    x:collection1] o.a.s.c.SolrCore JMX monitoring not detected for core: collection1
   [junit4]   2> 131755 INFO  (coreLoadExecutor-503-thread-1) [    x:collection1] o.a.s.c.CachingDirectoryFactory return new directory for /Users/jenkins/workspace/Lucene-Solr-5.x-MacOSX/solr/build/solr-core/test/J0/temp/solr.handler.TestReplicationHandler_FB2B7B5566BB2A95-001/solr-instance-002/./collection1/data
   [junit4]   2> 131755 INFO  (coreLoadExecutor-503-thread-1) [    x:collection1] o.a.s.c.SolrCore New index directory detected: old=null new=/Users/jenkins/workspace/Lucene-Solr-5.x-MacOSX/solr/build/solr-core/test/J0/temp/solr.handler.TestReplicationHandler_FB2B7B5566BB2A95-001/solr-instance-002/./collection1/data/index/
   [junit4]   2> 131755 WARN  (coreLoadExecutor-503-thread-1) [    x:collection1] o.a.s.c.SolrCore [collection1] Solr index directory '/Users/jenkins/workspace/Lucene-Solr-5.x-MacOSX/solr/build/solr-core/test/J0/temp/solr.handler.TestReplicationHandler_FB2B7B5566BB2A95-001/solr-instance-002/./collection1/data/index' doesn't exist. Creating new index...
   [junit4]   2> 131755 INFO  (coreLoadExecutor-503-thread-1) [    x:collection1] o.a.s.c.CachingDirectoryFactory return new directory for /Users/jenkins/workspace/Lucene-Solr-5.x-MacOSX/solr/build/solr-core/test/J0/temp/solr.handler.TestReplicationHandler_FB2B7B5566BB2A95-001/solr-instance-002/./collection1/data/index
   [junit4]   2> 131755 INFO  (coreLoadExecutor-503-thread-1) [    x:collection1] o.a.s.u.RandomMergePolicy RandomMergePolicy wrapping class org.apache.lucene.index.LogDocMergePolicy: [LogDocMergePolicy: minMergeSize=1000, mergeFactor=47, maxMergeSize=9223372036854775807, maxMergeSizeForForcedMerge=9223372036854775807, calibrateSizeByDeletes=false, maxMergeDocs=2147483647, maxCFSSegmentSizeMB=8.796093022207999E12, noCFSRatio=0.13976473282650997]
   [junit4]   2> 131756 INFO  (coreLoadExecutor-503-thread-1) [    x:collection1] o.a.s.c.SolrDeletionPolicy SolrDeletionPolicy.onCommit: commits: num=1
   [junit4]   2> 	commit{dir=MockDirectoryWrapper(RAMDirectory@1629d171 lockFactory=org.apache.lucene.store.SingleInstanceLockFactory@13755d15),segFN=segments_1,generation=1}
   [junit4]   2> 131756 INFO  (coreLoadExecutor-503-thread-1) [    x:collection1] o.a.s.c.SolrDeletionPolicy newest commit generation = 1
   [junit4]   2> 131757 INFO  (OldIndexDirectoryCleanupThreadForCore-collection1) [    x:collection1] o.a.s.c.SolrCore Looking for old index directories to cleanup for core collection1 in /Users/jenkins/workspace/Lucene-Solr-5.x-MacOSX/solr/build/solr-core/test/J0/temp/solr.handler.TestReplicationHandler_FB2B7B5566BB2A95-001/solr-instance-002/./collection1/data/
   [junit4]   2> 131758 INFO  (coreLoadExecutor-503-thread-1) [    x:collection1] o.a.s.c.SolrCore no updateRequestProcessorChain defined as default, creating implicit default
   [junit4]   2> 131765 INFO  (coreLoadExecutor-503-thread-1) [    x:collection1] o.a.s.h.l.XMLLoader xsltCacheLifetimeSeconds=60
   [junit4]   2> 131766 INFO  (coreLoadExecutor-503-thread-1) [    x:collection1] o.a.s.h.l.XMLLoader xsltCacheLifetimeSeconds=60
   [junit4]   2> 131767 INFO  (coreLoadExecutor-503-thread-1) [    x:collection1] o.a.s.h.l.XMLLoader xsltCacheLifetimeSeconds=60
   [junit4]   2> 131768 INFO  (coreLoadExecutor-503-thread-1) [    x:collection1] o.a.s.h.l.XMLLoader xsltCacheLifetimeSeconds=60
   [junit4]   2> 131769 INFO  (coreLoadExecutor-503-thread-1) [    x:collection1] o.a.s.c.PluginBag requestHandler : 'lazy' created with startup=lazy 
   [junit4]   2> 131769 INFO  (coreLoadExecutor-503-thread-1) [    x:collection1] o.a.s.c.RequestHandlers Registered paths: lazy,/admin/properties,/replication,/config,/admin/logging,/schema,/update/json/docs,/admin/luke,/admin/threads,/update/csv,standard,defaults,/admin/system,/admin/plugins,/admin/mbeans,/get,/admin/file,/admin/segments,/admin/ping,/update/json,/update
   [junit4]   2> 131770 INFO  (coreLoadExecutor-503-thread-1) [    x:collection1] o.a.s.c.SolrCore Using default statsCache cache: org.apache.solr.search.stats.LocalStatsCache
   [junit4]   2> 131771 INFO  (coreLoadExecutor-503-thread-1) [    x:collection1] o.a.s.u.CommitTracker Hard AutoCommit: disabled
   [junit4]   2> 131771 INFO  (coreLoadExecutor-503-thread-1) [    x:collection1] o.a.s.u.CommitTracker Soft AutoCommit: disabled
   [junit4]   2> 131771 INFO  (coreLoadExecutor-503-thread-1) [    x:collection1] o.a.s.u.RandomMergePolicy RandomMergePolicy wrapping class org.apache.lucene.index.AlcoholicMergePolicy: [AlcoholicMergePolicy: minMergeSize=0, mergeFactor=10, maxMergeSize=1873061874, maxMergeSizeForForcedMerge=9223372036854775807, calibrateSizeByDeletes=true, maxMergeDocs=2147483647, maxCFSSegmentSizeMB=8.796093022207999E12, noCFSRatio=0.1]
   [junit4]   2> 131772 INFO  (coreLoadExecutor-503-thread-1) [    x:collection1] o.a.s.c.SolrDeletionPolicy SolrDeletionPolicy.onInit: commits: num=1
   [junit4]   2> 	commit{dir=MockDirectoryWrapper(RAMDirectory@1629d171 lockFactory=org.apache.lucene.store.SingleInstanceLockFactory@13755d15),segFN=segments_1,generation=1}
   [junit4]   2> 131772 INFO  (coreLoadExecutor-503-thread-1) [    x:collection1] o.a.s.c.SolrDeletionPolicy newest commit generation = 1
   [junit4]   2> 131772 INFO  (coreLoadExecutor-503-thread-1) [    x:collection1] o.a.s.s.SolrIndexSearcher Opening Searcher@cd2c5ee[collection1] main
   [junit4]   2> 131772 INFO  (coreLoadExecutor-503-thread-1) [    x:collection1] o.a.s.r.ManagedResourceStorage File-based storage initialized to use dir: /Users/jenkins/workspace/Lucene-Solr-5.x-MacOSX/solr/build/solr-core/test/J0/temp/solr.handler.TestReplicationHandler_FB2B7B5566BB2A95-001/solr-instance-002/collection1/conf
   [junit4]   2> 131772 INFO  (coreLoadExecutor-503-thread-1) [    x:collection1] o.a.s.r.RestManager Initializing RestManager with initArgs: {storageDir=/Users/jenkins/workspace/Lucene-Solr-5.x-MacOSX/solr/build/solr-core/test/J0/temp/solr.handler.TestReplicationHandler_FB2B7B5566BB2A95-001/solr-instance-002/collection1/conf}
   [junit4]   2> 131772 INFO  (coreLoadExecutor-503-thread-1) [    x:collection1] o.a.s.r.ManagedResourceStorage Reading _rest_managed.json using file:dir=/Users/jenkins/workspace/Lucene-Solr-5.x-MacOSX/solr/build/solr-core/test/J0/temp/solr.handler.TestReplicationHandler_FB2B7B5566BB2A95-001/solr-instance-002/collection1/conf
   [junit4]   2> 131772 INFO  (coreLoadExecutor-503-thread-1) [    x:collection1] o.a.s.r.RestManager Initializing 0 registered ManagedResources
   [junit4]   2> 131776 INFO  (coreLoadExecutor-503-thread-1) [    x:collection1] o.a.s.h.ReplicationHandler Poll scheduled at an interval of 1000ms
   [junit4]   2> 131776 INFO  (searcherExecutor-504-thread-1-processing-x:collection1) [    x:collection1] o.a.s.c.SolrCore [collection1] Registered new searcher Searcher@cd2c5ee[collection1] main{ExitableDirectoryReader(UninvertingDirectoryReader())}
   [junit4]   2> 131776 INFO  (coreLoadExecutor-503-thread-1) [    x:collection1] o.a.s.c.CoreContainer registering core: collection1
   [junit4]   2> 131780 INFO  (qtp904933311-794) [    x:collection1] o.a.s.c.S.Request [collection1]  webapp=/solr path=/replication params={version=2&command=indexversion&qt=/replication&wt=javabin} status=0 QTime=0
   [junit4]   2> 132190 INFO  (TEST-TestReplicationHandler.doTestReplicateAfterStartupWithNoActivity-seed#[FB2B7B5566BB2A95]) [    ] o.e.j.s.ServerConnector Stopped ServerConnector@46318420{HTTP/1.1}{127.0.0.1:0}
   [junit4]   2> 132190 INFO  (TEST-TestReplicationHandler.doTestReplicateAfterStartupWithNoActivity-seed#[FB2B7B5566BB2A95]) [    ] o.a.s.c.CoreContainer Shutting down CoreContainer instance=1272986442
   [junit4]   2> 132191 INFO  (TEST-TestReplicationHandler.doTestReplicateAfterStartupWithNoActivity-seed#[FB2B7B5566BB2A95]) [    x:collection1] o.a.s.c.SolrCore [collection1]  CLOSING SolrCore org.apache.solr.core.SolrCore@5809c898
   [junit4]   2> 132191 INFO  (TEST-TestReplicationHandler.doTestReplicateAfterStartupWithNoActivity-seed#[FB2B7B5566BB2A95]) [    x:collection1] o.a.s.u.DirectUpdateHandler2 closing DirectUpdateHandler2{commits=0,autocommits=0,soft autocommits=0,optimizes=0,rollbacks=0,expungeDeletes=0,docsPending=0,adds=0,deletesById=0,deletesByQuery=0,errors=0,cumulative_adds=0,cumulative_deletesById=0,cumulative_deletesByQuery=0,cumulative_errors=0}
   [junit4]   2> 132192 INFO  (TEST-TestReplicationHandler.doTestReplicateAfterStartupWithNoActivity-seed#[FB2B7B5566BB2A95]) [    x:collection1] o.a.s.u.SolrCoreState Closing SolrCoreState
   [junit4]   2> 132192 INFO  (TEST-TestReplicationHandler.doTestReplicateAfterStartupWithNoActivity-seed#[FB2B7B5566BB2A95]) [    x:collection1] o.a.s.u.DefaultSolrCoreState SolrCoreState ref count has reached 0 - closing IndexWriter
   [junit4]   2> 132192 INFO  (TEST-TestReplicationHandler.doTestReplicateAfterStartupWithNoActivity-seed#[FB2B7B5566BB2A95]) [    x:collection1] o.a.s.u.DefaultSolrCoreState closing IndexWriter with IndexWriterCloser
   [junit4]   2> 132193 INFO  (TEST-TestReplicationHandler.doTestReplicateAfterStartupWithNoActivity-seed#[FB2B7B5566BB2A95]) [    x:collection1] o.a.s.c.SolrCore [collection1] Closing main searcher on request.
   [junit4]   2> 132193 INFO  (TEST-TestReplicationHandler.doTestReplicateAfterStartupWithNoActivity-seed#[FB2B7B5566BB2A95]) [    x:collection1] o.a.s.c.CachingDirectoryFactory Closing MockDirectoryFactory - 2 directories currently being tracked
   [junit4]   2> 132193 INFO  (TEST-TestReplicationHandler.doTestReplicateAfterStartupWithNoActivity-seed#[FB2B7B5566BB2A95]) [    x:collection1] o.a.s.c.CachingDirectoryFactory looking to close /Users/jenkins/workspace/Lucene-Solr-5.x-MacOSX/solr/build/solr-core/test/J0/temp/solr.handler.TestReplicationHandler_FB2B7B5566BB2A95-001/solr-instance-002/./collection1/data [CachedDir<<refCount=0;path=/Users/jenkins/workspace/Lucene-Solr-5.x-MacOSX/solr/build/solr-core/test/J0/temp/solr.handler.TestReplicationHandler_FB2B7B5566BB2A95-001/solr-instance-002/./collection1/data;done=false>>]
   [junit4]   2> 132193 INFO  (TEST-TestReplicationHandler.doTestReplicateAfterStartupWithNoActivity-seed#[FB2B7B5566BB2A95]) [    x:collection1] o.a.s.c.CachingDirectoryFactory Closing directory: /Users/jenkins/workspace/Lucene-Solr-5.x-MacOSX/solr/build/solr-core/test/J0/temp/solr.handler.TestReplicationHandler_FB2B7B5566BB2A95-001/solr-instance-002/./collection1/data
   [junit4]   2> 132193 INFO  (TEST-TestReplicationHandler.doTestReplicateAfterStartupWithNoActivity-seed#[FB2B7B5566BB2A95]) [    x:collection1] o.a.s.c.CachingDirectoryFactory looking to close /Users/jenkins/workspace/Lucene-Solr-5.x-MacOSX/solr/build/solr-core/test/J0/temp/solr.handler.TestReplicationHandler_FB2B7B5566BB2A95-001/solr-instance-002/./collection1/data/index [CachedDir<<refCount=0;path=/Users/jenkins/workspace/Lucene-Solr-5.x-MacOSX/solr/build/solr-core/test/J0/temp/solr.handler.TestReplicationHandler_FB2B7B5566BB2A95-001/solr-instance-002/./collection1/data/index;done=false>>]
   [junit4]   2> 132193 INFO  (TEST-TestReplicationHandler.doTestReplicateAfterStartupWithNoActivity-seed#[FB2B7B5566BB2A95]) [    x:collection1] o.a.s.c.CachingDirectoryFactory Closing directory: /Users/jenkins/workspace/Lucene-Solr-5.x-MacOSX/solr/build/solr-core/test/J0/temp/solr.handler.TestReplicationHandler_FB2B7B5566BB2A95-001/solr-instance-002/./collection1/data/index
   [junit4]   2> 132194 INFO  (TEST-TestReplicationHandler.doTestReplicateAfterStartupWithNoActivity-seed#[FB2B7B5566BB2A95]) [    x:collection1] o.e.j.s.h.ContextHandler Stopped o.e.j.s.ServletContextHandler@11a670b5{/solr,null,UNAVAILABLE}
   [junit4]   2> 132210 INFO  (qtp904933311-796) [    x:collection1] o.a.s.u.DirectUpdateHandler2 [collection1] REMOVING ALL DOCUMENTS FROM INDEX
   [junit4]   2> 132211 INFO  (qtp904933311-796) [    x:collection1] o.a.s.u.p.LogUpdateProcessorFactory [collection1]  webapp=/solr path=/update params={version=2&wt=javabin}{deleteByQuery=*:*} 0 12
   [junit4]   2> 132216 INFO  (qtp904933311-797) [    x:collection1] o.a.s.u.DirectUpdateHandler2 start commit{,optimize=false,openSearcher=true,waitSearcher=true,expungeDeletes=false,softCommit=false,prepareCommit=false}
   [junit4]   2> 132217 INFO  (qtp904933311-797) [    x:collection1] o.a.s.c.SolrDeletionPolicy SolrDeletionPolicy.onCommit: commits: num=2
   [junit4]   2> 	commit{dir=MockDirectoryWrapper(RAMDirectory@5cbcb6e4 lockFactory=org.apache.lucene.store.SingleInstanceLockFactory@698b624c),segFN=segments_1,generation=1}
   [junit4]   2> 	commit{dir=MockDirectoryWrapper(RAMDirectory@5cbcb6e4 lockFactory=org.apache.lucene.store.SingleInstanceLockFactory@698b624c),segFN=segments_2,generation=2}
   [junit4]   2> 132217 INFO  (qtp904933311-797) [    x:collection1] o.a.s.c.SolrDeletionPolicy newest commit generation = 2
   [junit4]   2> 132218 INFO  (qtp904933311-797) [    x:collection1] o.a.s.s.SolrIndexSearcher Opening Searcher@163cae7b[collection1] main
   [junit4]   2> 132218 INFO  (qtp904933311-797) [    x:collection1] o.a.s.u.DirectUpdateHandler2 end_commit_flush
   [junit4]   2> 132218 INFO  (searcherExecutor-494-thread-1-processing-x:collection1) [    x:collection1] o.a.s.c.SolrCore [collection1] Registered new searcher Searcher@163cae7b[collection1] main{ExitableDirectoryReader(UninvertingDirectoryReader())}
   [junit4]   2> 132218 INFO  (qtp904933311-797) [    x:collection1] o.a.s.u.p.LogUpdateProcessorFactory [collection1]  webapp=/solr path=/update params={commit=true&version=2&waitSearcher=true&softCommit=false&wt=javabin}{commit=} 0 2
   [junit4]   2> 132221 INFO  (TEST-TestReplicationHandler.doTestReplicateAfterStartupWithNoActivity-seed#[FB2B7B5566BB2A95]) [    ] o.e.j.s.ServerConnector Stopped ServerConnector@7178bf65{HTTP/1.1}{127.0.0.1:0}
   [junit4]   2> 132222 INFO  (TEST-TestReplicationHandler.doTestReplicateAfterStartupWithNoActivity-seed#[FB2B7B5566BB2A95]) [    ] o.a.s.c.CoreContainer Shutting down CoreContainer instance=1759106212
   [junit4]   2> 132222 INFO  (TEST-TestReplicationHandler.doTestReplicateAfterStartupWithNoActivity-seed#[FB2B7B5566BB2A95]) [    x:collection1] o.a.s.c.SolrCore [collection1]  CLOSING SolrCore org.apache.solr.core.SolrCore@7559983d
   [junit4]   2> 132222 INFO  (TEST-TestReplicationHandler.doTestReplicateAfterStartupWithNoActivity-seed#[FB2B7B5566BB2A95]) [    x:collection1] o.a.s.u.DirectUpdateHandler2 closing DirectUpdateHandler2{commits=1,autocommits=0,soft autocommits=0,optimizes=0,rollbacks=0,expungeDeletes=0,docsPending=0,adds=0,deletesById=0,deletesByQuery=0,errors=0,cumulative_adds=0,cumulative_deletesById=0,cumulative_deletesByQuery=1,cumulative_errors=0}
   [junit4]   2> 132223 INFO  (TEST-TestReplicationHandler.doTestReplicateAfterStartupWithNoActivity-seed#[FB2B7B5566BB2A95]) [    x:collection1] o.a.s.u.SolrCoreState Closing SolrCoreState
   [junit4]   2> 132223 INFO  (TEST-TestReplicationHandler.doTestReplicateAfterStartupWithNoActivity-seed#[FB2B7B5566BB2A95]) [    x:collection1] o.a.s.u.DefaultSolrCoreState SolrCoreState ref count has reached 0 - closing IndexWriter
   [junit4]   2> 132223 INFO  (TEST-TestReplicationHandler.doTestReplicateAfterStartupWithNoActivity-seed#[FB2B7B5566BB2A95]) [    x:collection1] o.a.s.u.DefaultSolrCoreState closing IndexWriter with IndexWriterCloser
   [junit4]   2> 132223 INFO  (TEST-TestReplicationHandler.doTestReplicateAfterStartupWithNoActivity-seed#[FB2B7B5566BB2A95]) [    x:collection1] o.a.s.c.SolrCore [collection1] Closing main searcher on request.
   [junit4]   2> 132223 INFO  (TEST-TestReplicationHandler.doTestReplicateAfterStartupWithNoActivity-seed#[FB2B7B5566BB2A95]) [    x:collection1] o.a.s.c.CachingDirectoryFactory Closing MockDirectoryFactory - 2 directories currently being tracked
   [junit4]   2> 132223 INFO  (TEST-TestReplicationHandler.doTestReplicateAfterStartupWithNoActivity-seed#[FB2B7B5566BB2A95]) [    x:collection1] o.a.s.c.CachingDirectoryFactory looking to close /Users/jenkins/workspace/Lucene-Solr-5.x-MacOSX/solr/build/solr-core/test/J0/temp/solr.handler.TestReplicationHandler_FB2B7B5566BB2A95-001/solr-instance-001/./collection1/data [CachedDir<<refCount=0;path=/Users/jenkins/workspace/Lucene-Solr-5.x-MacOSX/solr/build/solr-core/test/J0/temp/solr.handler.TestReplicationHandler_FB2B7B5566BB2A95-001/solr-instance-001/./collection1/data;done=false>>]
   [junit4]   2> 132223 INFO  (TEST-TestReplicationHandler.doTestReplicateAfterStartupWithNoActivity-seed#[FB2B7B5566BB2A95]) [    x:collection1] o.a.s.c.CachingDirectoryFactory Closing directory: /Users/jenkins/workspace/Lucene-Solr-5.x-MacOSX/solr/build/solr-core/test/J0/temp/solr.handler.TestReplicationHandler_FB2B7B5566BB2A95-001/solr-instance-001/./collection1/data
   [junit4]   2> 132223 INFO  (TEST-TestReplicationHandler.doTestReplicateAfterStartupWithNoActivity-seed#[FB2B7B5566BB2A95]) [    x:collection1] o.a.s.c.CachingDirectoryFactory looking to close /Users/jenkins/workspace/Lucene-Solr-5.x-MacOSX/solr/build/solr-core/test/J0/temp/solr.handler.TestReplicationHandler_FB2B7B5566BB2A95-001/solr-instance-001/./collection1/data/index [CachedDir<<refCount=0;path=/Users/jenkins/workspace/Lucene-Solr-5.x-MacOSX/solr/build/solr-core/test/J0/temp/solr.handler.TestReplicationHandler_FB2B7B5566BB2A95-001/solr-instance-001/./collection1/data/index;done=false>>]
   [junit4]   2> 132223 INFO  (TEST-TestReplicationHandler.doTestReplicateAfterStartupWithNoActivity-seed#[FB2B7B5566BB2A95]) [    x:collection1] o.a.s.c.CachingDirectoryFactory Closing directory: /Users/jenkins/workspace/Lucene-Solr-5.x-MacOSX/solr/build/solr-core/test/J0/temp/solr.handler.TestReplicationHandler_FB2B7B5566BB2A95-001/solr-instance-001/./collection1/data/index
   [junit4]   2> 132224 INFO  (TEST-TestReplicationHandler.doTestReplicateAfterStartupWithNoActivity-seed#[FB2B7B5566BB2A95]) [    x:collection1] o.e.j.s.h.ContextHandler Stopped o.e.j.s.ServletContextHandler@6cb547bc{/solr,null,UNAVAILABLE}
   [junit4]   2> 132227 INFO  (TEST-TestReplicationHandler.doTestReplicateAfterStartupWithNoActivity-seed#[FB2B7B5566BB2A95]) [    ] o.e.j.s.Server jetty-9.2.13.v20150730
   [junit4]   2> 132230 INFO  (TEST-TestReplicationHandler.doTestReplicateAfterStartupWithNoActivity-seed#[FB2B7B5566BB2A95]) [    ] o.e.j.s.h.ContextHandler Started o.e.j.s.ServletContextHandler@6efb6f47{/solr,null,AVAILABLE}
   [junit4]   2> 132230 INFO  (TEST-TestReplicationHandler.doTestReplicateAfterStartupWithNoActivity-seed#[FB2B7B5566BB2A95]) [    ] o.e.j.s.ServerConnector Started ServerConnector@3d46d73d{HTTP/1.1}{127.0.0.1:52195}
   [junit4]   2> 132230 INFO  (TEST-TestReplicationHandler.doTestReplicateAfterStartupWithNoActivity-seed#[FB2B7B5566BB2A95]) [    ] o.e.j.s.Server Started @136677ms
   [junit4]   2> 132231 INFO  (TEST-TestReplicationHandler.doTestReplicateAfterStartupWithNoActivity-seed#[FB2B7B5566BB2A95]) [    ] o.a.s.c.s.e.JettySolrRunner Jetty properties: {hostPort=52195, hostContext=/solr, solr.data.dir=/Users/jenkins/workspace/Lucene-Solr-5.x-MacOSX/solr/build/solr-core/test/J0/temp/solr.handler.TestReplicationHandler_FB2B7B5566BB2A95-001/solr-instance-001/collection1/data}
   [junit4]   2> 132231 INFO  (TEST-TestReplicationHandler.doTestReplicateAfterStartupWithNoActivity-seed#[FB2B7B5566BB2A95]) [    ] o.a.s.s.SolrDispatchFilter SolrDispatchFilter.init(): sun.misc.Launcher$AppClassLoader@3b756db3
   [junit4]   2> 132231 INFO  (TEST-TestReplicationHandler.doTestReplicateAfterStartupWithNoActivity-seed#[FB2B7B5566BB2A95]) [    ] o.a.s.c.SolrResourceLoader new SolrResourceLoader for directory: '/Users/jenkins/workspace/Lucene-Solr-5.x-MacOSX/solr/build/solr-core/test/J0/temp/solr.handler.TestReplicationHandler_FB2B7B5566BB2A95-001/solr-instance-001'
   [junit4]   2> 132231 INFO  (TEST-TestReplicationHandler.doTestReplicateAfterStartupWithNoActivity-seed#[FB2B7B5566BB2A95]) [    ] o.a.s.c.SolrResourceLoader JNDI not configured for solr (NoInitialContextEx)
   [junit4]   2> 132231 INFO  (TEST-TestReplicationHandler.doTestReplicateAfterStartupWithNoActivity-seed#[FB2B7B5566BB2A95]) [    ] o.a.s.c.SolrResourceLoader solr home defaulted to 'solr/' (could not find system property or JNDI)
   [junit4]   2> 132231 INFO  (TEST-TestReplicationHandler.doTestReplicateAfterStartupWithNoActivity-seed#[FB2B7B5566BB2A95]) [    ] o.a.s.c.SolrXmlConfig Loading container configuration from /Users/jenkins/workspace/Lucene-Solr-5.x-MacOSX/solr/build/solr-core/test/J0/temp/solr.handler.TestReplicationHandler_FB2B7B5566BB2A95-001/solr-instance-001/solr.xml
   [junit4]   2> 132262 INFO  (TEST-TestReplicationHandler.doTestReplicateAfterStartupWithNoActivity-seed#[FB2B7B5566BB2A95]) [    ] o.a.s.c.CorePropertiesLocator Config-defined core root directory: /Users/jenkins/workspace/Lucene-Solr-5.x-MacOSX/solr/build/solr-core/test/J0/temp/solr.handler.TestReplicationHandler_FB2B7B5566BB2A95-001/solr-instance-001/.
   [junit4]   2> 132262 INFO  (TEST-TestReplicationHandler.doTestReplicateAfterStartupWithNoActivity-seed#[FB2B7B5566BB2A95]) [    ] o.a.s.c.CoreContainer New CoreContainer 1988462236
   [junit4]   2> 132262 INFO  (TEST-TestReplicationHandler.doTestReplicateAfterStartupWithNoActivity-seed#[FB2B7B5566BB2A95]) [    ] o.a.s.c.CoreContainer Loading cores into CoreContainer [instanceDir=/Users/jenkins/workspace/Lucene-Solr-5.x-MacOSX/solr/build/solr-core/test/J0/temp/solr.handler.TestReplicationHandler_FB2B7B5566BB2A95-001/solr-instance-001]
   [junit4]   2> 132262 WARN  (TEST-TestReplicationHandler.doTestReplicateAfterStartupWithNoActivity-seed#[FB2B7B5566BB2A95]) [    ] o.a.s.c.CoreContainer Couldn't add files from /Users/jenkins/workspace/Lucene-Solr-5.x-MacOSX/solr/build/solr-core/test/J0/temp/solr.handler.TestReplicationHandler_FB2B7B5566BB2A95-001/solr-instance-001/lib to classpath: /Users/jenkins/workspace/Lucene-Solr-5.x-MacOSX/solr/build/solr-core/test/J0/temp/solr.handler.TestReplicationHandler_FB2B7B5566BB2A95-001/solr-instance-001/lib
   [junit4]   2> 132262 INFO  (TEST-TestReplicationHandler.doTestReplicateAfterStartupWithNoActivity-seed#[FB2B7B5566BB2A95]) [    ] o.a.s.h.c.HttpShardHandlerFactory created with socketTimeout : 90000,urlScheme : ,connTimeout : 15000,maxConnectionsPerHost : 20,maxConnections : 10000,corePoolSize : 0,maximumPoolSize : 2147483647,maxThreadIdleTime : 5,sizeOfQueue : -1,fairnessPolicy : false,useRetries : false,
   [junit4]   2> 132264 INFO  (TEST-TestReplicationHandler.doTestReplicateAfterStartupWithNoActivity-seed#[FB2B7B5566BB2A95]) [    ] o.a.s.u.UpdateShardHandler Creating UpdateShardHandler HTTP client with params: socketTimeout=340000&connTimeout=45000&retry=true
   [junit4]   2> 132265 INFO  (TEST-TestReplicationHandler.doTestReplicateAfterStartupWithNoActivity-seed#[FB2B7B5566BB2A95]) [    ] o.a.s.l.LogWatcher SLF4J impl is org.slf4j.impl.Log4jLoggerFactory
   [junit4]   2> 132265 INFO  (TEST-TestReplicationHandler.doTestReplicateAfterStartupWithNoActivity-seed#[FB2B7B5566BB2A95]) [    ] o.a.s.l.LogWatcher Registering Log Listener [Log4j (org.slf4j.impl.Log4jLoggerFactory)]
   [junit4]   2> 132265 INFO  (TEST-TestReplicationHandler.doTestReplicateAfterStartupWithNoActivity-seed#[FB2B7B5566BB2A95]) [    ] o.a.s.c.CoreContainer Security conf doesn't exist. Skipping setup for authorization module.
   [junit4]   2> 132265 INFO  (TEST-TestReplicationHandler.doTestReplicateAfterStartupWithNoActivity-seed#[FB2B7B5566BB2A95]) [    ] o.a.s.c.CoreContainer No authentication plugin used.
   [junit4]   2> 132266 INFO  (TEST-TestReplicationHandler.doTestReplicateAfterStartupWithNoActivity-seed#[FB2B7B5566BB2A95]) [    ] o.a.s.c.CorePropertiesLocator Looking for core definitions underneath /Users/jenkins/workspace/Lucene-Solr-5.x-MacOSX/solr/build/solr-core/test/J0/temp/solr.handler.TestReplicationHandler_FB2B7B5566BB2A95-001/solr-instance-001/.
   [junit4]   2> 132268 INFO  (TEST-TestReplicationHandler.doTestReplicateAfterStartupWithNoActivity-seed#[FB2B7B5566BB2A95]) [    ] o.a.s.c.CoreDescriptor Created CoreDescriptor: {name=collection1, loadOnStartup=true, configSetProperties=configsetprops.json, config=solrconfig.xml, dataDir=data/, schema=schema.xml, transient=false}
   [junit4]   2> 132275 INFO  (TEST-TestReplicationHandler.doTestReplicateAfterStartupWithNoActivity-seed#[FB2B7B5566BB2A95]) [    ] o.a.s.c.CorePropertiesLocator Found core collection1 in /Users/jenkins/workspace/Lucene-Solr-5.x-MacOSX/solr/build/solr-core/test/J0/temp/solr.handler.TestReplicationHandler_FB2B7B5566BB2A95-001/solr-instance-001/./collection1
   [junit4]   2> 132275 INFO  (TEST-TestReplicationHandler.doTestReplicateAfterStartupWithNoActivity-seed#[FB2B7B5566BB2A95]) [    ] o.a.s.c.CorePropertiesLocator Found 1 core definitions
   [junit4]   2> 132276 INFO  (coreLoadExecutor-514-thread-1) [    ] o.a.s.c.SolrResourceLoader new SolrResourceLoader for directory: '/Users/jenkins/workspace/Lucene-Solr-5.x-MacOSX/solr/build/solr-core/test/J0/temp/solr.handler.TestReplicationHandler_FB2B7B5566BB2A95-001/solr-instance-001/collection1'
   [junit4]   2> 132276 INFO  (TEST-TestReplicationHandler.doTestReplicateAfterStartupWithNoActivity-seed#[FB2B7B5566BB2A95]) [    ] o.a.s.s.SolrDispatchFilter user.dir=/Users/jenkins/workspace/Lucene-Solr-5.x-MacOSX/solr/build/solr-core/test/J0
   [junit4]   2> 132277 INFO  (TEST-TestReplicationHandler.doTestReplicateAfterStartupWithNoActivity-seed#[FB2B7B5566BB2A95]) [    ] o.a.s.s.SolrDispatchFilter SolrDispatchFilter.init() done
   [junit4]   2> 132277 INFO  (coreLoadExecutor-514-thread-1) [    ] o.a.s.c.SolrResourceLoader JNDI not configured for solr (NoInitialContextEx)
   [junit4]   2> 132277 INFO  (coreLoadExecutor-514-thread-1) [    ] o.a.s.c.SolrResourceLoader solr home defaulted to 'solr/' (could not find system property or JNDI)
   [junit4]   2> 132287 INFO  (coreLoadExecutor-514-thread-1) [    ] o.a.s.c.SolrConfig current version of requestparams : -1
   [junit4]   2> 132298 INFO  (coreLoadExecutor-514-thread-1) [    ] o.a.s.c.SolrConfig Using Lucene MatchVersion: 5.5.0
   [junit4]   2> 132324 INFO  (coreLoadExecutor-514-thread-1) [    ] o.a.s.c.SolrConfig Loaded SolrConfig: solrconfig.xml
   [junit4]   2> 132328 INFO  (coreLoadExecutor-514-thread-1) [    ] o.a.s.s.IndexSchema [collection1] Schema name=test
   [junit4]   2> 132335 INFO  (coreLoadExecutor-514-thread-1) [    ] o.a.s.s.IndexSchema unique key field: id
   [junit4]   2> 132338 INFO  (coreLoadExecutor-514-thread-1) [    ] o.a.s.c.ConfigSetProperties Did not find ConfigSet properties, assuming default properties: Can't find resource 'configsetprops.json' in classpath or '/Users/jenkins/workspace/Lucene-Solr-5.x-MacOSX/solr/build/solr-core/test/J0/temp/solr.handler.TestReplicationHandler_FB2B7B5566BB2A95-001/solr-instance-001/collection1'
   [junit4]   2> 132338 INFO  (coreLoadExecutor-514-thread-1) [    ] o.a.s.c.CoreContainer Creating SolrCore 'collection1' using configuration from instancedir /Users/jenkins/workspace/Lucene-Solr-5.x-MacOSX/solr/build/solr-core/test/J0/temp/solr.handler.TestReplicationHandler_FB2B7B5566BB2A95-001/solr-instance-001/./collection1
   [junit4]   2> 132338 INFO  (coreLoadExecutor-514-thread-1) [    x:collection1] o.a.s.c.SolrCore solr.StandardDirectoryFactory
   [junit4]   2> 132350 INFO  (coreLoadExecutor-514-thread-1) [    x:collection1] o.a.s.c.SolrCore [[collection1] ] Opening new SolrCore at [/Users/jenkins/workspace/Lucene-Solr-5.x-MacOSX/solr/build/solr-core/test/J0/temp/solr.handler.TestReplicationHandler_FB2B7B5566BB2A95-001/solr-instance-001/collection1], dataDir=[/Users/jenkins/workspace/Lucene-Solr-5.x-MacOSX/solr/build/solr-core/test/J0/temp/solr.handler.TestReplicationHandler_FB2B7B5566BB2A95-001/solr-instance-001/./collection1/data/]
   [junit4]   2> 132350 INFO  (coreLoadExecutor-514-thread-1) [    x:collection1] o.a.s.c.SolrCore JMX monitoring not detected for core: collection1
   [junit4]   2> 132351 INFO  (coreLoadExecutor-514-thread-1) [    x:collection1] o.a.s.c.CachingDirectoryFactory return new directory for /Users/jenkins/workspace/Lucene-Solr-5.x-MacOSX/solr/build/solr-core/test/J0/temp/solr.handler.TestReplicationHandler_FB2B7B5566BB2A95-001/solr-instance-001/collection1/data
   [junit4]   2> 132351 INFO  (coreLoadExecutor-514-thread-1) [    x:collection1] o.a.s.c.SolrCore New index directory detected: old=null new=/Users/jenkins/workspace/Lucene-Solr-5.x-MacOSX/solr/build/solr-core/test/J0/temp/solr.handler.TestReplicationHandler_FB2B7B5566BB2A95-001/solr-instance-001/./collection1/data/index/
   [junit4]   2> 132351 WARN  (coreLoadExecutor-514-thread-1) [    x:collection1] o.a.s.c.SolrCore [collection1] Solr index directory '/Users/jenkins/workspace/Lucene-Solr-5.x-MacOSX/solr/build/solr-core/test/J0/temp/solr.handler.TestReplicationHandler_FB2B7B5566BB2A95-001/solr-instance-001/./collection1/data/index' doesn't exist. Creating new index...
   [junit4]   2> 132353 INFO  (coreLoadExecutor-514-thread-1) [    x:collection1] o.a.s.c.CachingDirectoryFactory return new directory for /Users/jenkins/workspace/Lucene-Solr-5.x-MacOSX/solr/build/solr-core/test/J0/temp/solr.handler.TestReplicationHandler_FB2B7B5566BB2A95-001/solr-instance-001/collection1/data/index
   [junit4]   2> 132354 INFO  (coreLoadExecutor-514-thread-1) [    x:collection1] o.a.s.u.RandomMergePolicy RandomMergePolicy wrapping class org.apache.lucene.index.TieredMergePolicy: [TieredMergePolicy: maxMergeAtOnce=37, maxMergeAtOnceExplicit=42, maxMergedSegmentMB=42.1787109375, floorSegmentMB=1.69921875, forceMergeDeletesPctAllowed=24.947886676780694, segmentsPerTier=42.0, maxCFSSegmentSizeMB=8.796093022207999E12, noCFSRatio=1.0
   [junit4]   2> 132370 INFO  (coreLoadExecutor-514-thread-1) [    x:collection1] o.a.s.c.SolrDeletionPolicy SolrDeletionPolicy.onCommit: commits: num=1
   [junit4]   2> 	commit{dir=/Users/jenkins/workspace/Lucene-Solr-5.x-MacOSX/solr/build/solr-core/test/J0/temp/solr.handler.TestReplicationHandler_FB2B7B5566BB2A95-001/solr-instance-001/collection1/data/index,segFN=segments_1,generation=1}
   [junit4]   2> 132370 INFO  (coreLoadExecutor-514-thread-1) [    x:collection1] o.a.s.c.SolrDeletionPolicy newest commit generation = 1
   [junit4]   2> 132370 INFO  (OldIndexDirectoryCleanupThreadForCore-collection1) [    x:collection1] o.a.s.c.SolrCore Looking for old index directories to cleanup for core collection1 in /Users/jenkins/workspace/Lucene-Solr-5.x-MacOSX/solr/build/solr-core/test/J0/temp/solr.handler.TestReplicationHandler_FB2B7B5566BB2A95-001/solr-instance-001/./collection1/data/
   [junit4]   2> 132372 INFO  (coreLoadExecutor-514-thread-1) [    x:collection1] o.a.s.c.SolrCore no updateRequestProcessorChain defined as default, creating implicit default
   [junit4]   2> 132378 INFO  (coreLoadExecutor-514-thread-1) [    x:collection1] o.a.s.h.l.XMLLoader xsltCacheLifetimeSeconds=60
   [junit4]   2> 132379 INFO  (coreLoadExecutor-514-thread-1) [    x:collection1] o.a.s.h.l.XMLLoader xsltCacheLifetimeSeconds=60
   [junit4]   2> 132380 INFO  (coreLoadExecutor-514-thread-1) [    x:collection1] o.a.s.h.l.XMLLoader xsltCacheLifetimeSeconds=60
   [junit4]   2> 132381 INFO  (coreLoadExecutor-514-thread-1) [    x:collection1] o.a.s.h.l.XMLLoader xsltCacheLifetimeSeconds=60
   [junit4]   2> 132384 INFO  (coreLoadExecutor-514-thread-1) [    x:collection1] o.a.s.c.PluginBag requestHandler : 'lazy' created with startup=lazy 
   [junit4]   2> 132384 INFO  (coreLoadExecutor-514-thread-1) [    x:collection1] o.a.s.c.RequestHandlers Registered paths: lazy,/admin/properties,/replication,/config,/admin/logging,/schema,/update/json/docs,/admin/luke,/admin/threads,/update/csv,standard,defaults,/admin/system,/admin/plugins,/admin/mbeans,/get,/admin/file,/admin/segments,/admin/ping,/update/json,/update
   [junit4]   2> 132385 INFO  (coreLoadExecutor-514-thread-1) [    x:collection1] o.a.s.c.SolrCore Using default statsCache cache: org.apache.solr.search.stats.LocalStatsCache
   [junit4]   2> 132385 INFO  (coreLoadExecutor-514-thread-1) [    x:collection1] o.a.s.u.CommitTracker Hard AutoCommit: disabled
   [junit4]   2> 132385 INFO  (coreLoadExecutor-514-thread-1) [    x:collection1] o.a.s.u.CommitTracker Soft AutoCommit: disabled
   [junit4]   2> 132386 INFO  (coreLoadExecutor-514-thread-1) [    x:collection1] o.a.s.u.RandomMergePolicy RandomMergePolicy wrapping class org.apache.lucene.index.AlcoholicMergePolicy: [AlcoholicMergePolicy: minMergeSize=0, mergeFactor=10, maxMergeSize=1873061874, maxMergeSizeForForcedMerge=9223372036854775807, calibrateSizeByDeletes=true, maxMergeDocs=2147483647, maxCFSSegmentSizeMB=8.796093022207999E12, noCFSRatio=0.1]
   [junit4]   2> 132387 INFO  (coreLoadExecutor-514-thread-1) [    x:collection1] o.a.s.c.SolrDeletionPolicy SolrDeletionPolicy.onInit: commits: num=1
   [junit4]   2> 	commit{dir=/Users/jenkins/workspace/Lucene-Solr-5.x-MacOSX/solr/build/solr-core/test/J0/temp/solr.handler.TestReplicationHandler_FB2B7B5566BB2A95-001/solr-instance-001/collection1/data/index,segFN=segments_1,generation=1}
   [junit4]   2> 132387 INFO  (coreLoadExecutor-514-thread-1) [    x:collection1] o.a.s.c.SolrDeletionPolicy newest commit generation = 1
   [junit4]   2> 132387 INFO  (coreLoadExecutor-514-thread-1) [    x:collection1] o.a.s.s.SolrIndexSearcher Opening Searcher@2e4263ee[collection1] main
   [junit4]   2> 132388 INFO  (coreLoadExecutor-514-thread-1) [    x:collection1] o.a.s.r.ManagedResourceStorage File-based storage initialized to use dir: /Users/jenkins/workspace/Lucene-Solr-5.x-MacOSX/solr/build/solr-core/test/J0/temp/solr.handler.TestReplicationHandler_FB2B7B5566BB2A95-001/solr-instance-001/collection1/conf
   [junit4]   2> 132388 INFO  (coreLoadExecutor-514-thread-1) [    x:collection1] o.a.s.r.RestManager Initializing RestManager with initArgs: {storageDir=/Users/jenkins/workspace/Lucene-Solr-5.x-MacOSX/solr/build/solr-core/test/J0/temp/solr.handler.TestReplicationHandler_FB2B7B5566BB2A95-001/solr-instance-001/collection1/conf}
   [junit4]   2> 132388 INFO  (coreLoadExecutor-514-thread-1) [    x:collection1] o.a.s.r.ManagedResourceStorage Reading _rest_managed.json using file:dir=/Users/jenkins/workspace/Lucene-Solr-5.x-MacOSX/solr/build/solr-core/test/J0/temp/solr.handler.TestReplicationHandler_FB2B7B5566BB2A95-001/solr-instance-001/collection1/conf
   [junit4]   2> 132388 INFO  (coreLoadExecutor-514-thread-1) [    x:collection1] o.a.s.r.RestManager Initializing 0 registered ManagedResources
   [junit4]   2> 132389 INFO  (coreLoadExecutor-514-thread-1) [    x:collection1] o.a.s.h.ReplicationHandler Replication enabled for following config files: schema.xml
   [junit4]   2> 132389 INFO  (coreLoadExecutor-514-thread-1) [    x:collection1] o.a.s.h.ReplicationHandler Commits will be reserved for  10000
   [junit4]   2> 132389 INFO  (searcherExecutor-515-thread-1-processing-x:collection1) [    x:collection

[...truncated too long message...]

.ThreadPoolExecutor.getTask(ThreadPoolExecutor.java:1068)
   [junit4]    >         at java.util.concurrent.ThreadPoolExecutor.runWorker(ThreadPoolExecutor.java:1130)
   [junit4]    >         at java.util.concurrent.ThreadPoolExecutor$Worker.run(ThreadPoolExecutor.java:615)
   [junit4]    >         at java.lang.Thread.run(Thread.java:745)
   [junit4]    >    5) Thread[id=1485, name=qtp1209557008-1485, state=TIMED_WAITING, group=TGRP-TestReplicationHandler]
   [junit4]    >         at sun.misc.Unsafe.park(Native Method)
   [junit4]    >         at java.util.concurrent.locks.LockSupport.parkNanos(LockSupport.java:226)
   [junit4]    >         at java.util.concurrent.locks.AbstractQueuedSynchronizer$ConditionObject.awaitNanos(AbstractQueuedSynchronizer.java:2082)
   [junit4]    >         at org.eclipse.jetty.util.BlockingArrayQueue.poll(BlockingArrayQueue.java:389)
   [junit4]    >         at org.eclipse.jetty.util.thread.QueuedThreadPool.idleJobPoll(QueuedThreadPool.java:531)
   [junit4]    >         at org.eclipse.jetty.util.thread.QueuedThreadPool.access$700(QueuedThreadPool.java:47)
   [junit4]    >         at org.eclipse.jetty.util.thread.QueuedThreadPool$3.run(QueuedThreadPool.java:590)
   [junit4]    >         at java.lang.Thread.run(Thread.java:745)
   [junit4]    >    6) Thread[id=1488, name=Scheduler-1708016757, state=TIMED_WAITING, group=TGRP-TestReplicationHandler]
   [junit4]    >         at sun.misc.Unsafe.park(Native Method)
   [junit4]    >         at java.util.concurrent.locks.LockSupport.parkNanos(LockSupport.java:226)
   [junit4]    >         at java.util.concurrent.locks.AbstractQueuedSynchronizer$ConditionObject.awaitNanos(AbstractQueuedSynchronizer.java:2082)
   [junit4]    >         at java.util.concurrent.ScheduledThreadPoolExecutor$DelayedWorkQueue.take(ScheduledThreadPoolExecutor.java:1090)
   [junit4]    >         at java.util.concurrent.ScheduledThreadPoolExecutor$DelayedWorkQueue.take(ScheduledThreadPoolExecutor.java:807)
   [junit4]    >         at java.util.concurrent.ThreadPoolExecutor.getTask(ThreadPoolExecutor.java:1068)
   [junit4]    >         at java.util.concurrent.ThreadPoolExecutor.runWorker(ThreadPoolExecutor.java:1130)
   [junit4]    >         at java.util.concurrent.ThreadPoolExecutor$Worker.run(ThreadPoolExecutor.java:615)
   [junit4]    >         at java.lang.Thread.run(Thread.java:745)
   [junit4]    >    7) Thread[id=1506, name=qtp1209557008-1506, state=TIMED_WAITING, group=TGRP-TestReplicationHandler]
   [junit4]    >         at sun.misc.Unsafe.park(Native Method)
   [junit4]    >         at java.util.concurrent.locks.LockSupport.parkNanos(LockSupport.java:226)
   [junit4]    >         at java.util.concurrent.locks.AbstractQueuedSynchronizer$ConditionObject.awaitNanos(AbstractQueuedSynchronizer.java:2082)
   [junit4]    >         at org.eclipse.jetty.util.BlockingArrayQueue.poll(BlockingArrayQueue.java:389)
   [junit4]    >         at org.eclipse.jetty.util.thread.QueuedThreadPool.idleJobPoll(QueuedThreadPool.java:531)
   [junit4]    >         at org.eclipse.jetty.util.thread.QueuedThreadPool.access$700(QueuedThreadPool.java:47)
   [junit4]    >         at org.eclipse.jetty.util.thread.QueuedThreadPool$3.run(QueuedThreadPool.java:590)
   [junit4]    >         at java.lang.Thread.run(Thread.java:745)
   [junit4]    >    8) Thread[id=1480, name=qtp1209557008-1480, state=TIMED_WAITING, group=TGRP-TestReplicationHandler]
   [junit4]    >         at sun.misc.Unsafe.park(Native Method)
   [junit4]    >         at java.util.concurrent.locks.LockSupport.parkNanos(LockSupport.java:226)
   [junit4]    >         at java.util.concurrent.locks.AbstractQueuedSynchronizer$ConditionObject.awaitNanos(AbstractQueuedSynchronizer.java:2082)
   [junit4]    >         at org.eclipse.jetty.util.BlockingArrayQueue.poll(BlockingArrayQueue.java:389)
   [junit4]    >         at org.eclipse.jetty.util.thread.QueuedThreadPool.idleJobPoll(QueuedThreadPool.java:531)
   [junit4]    >         at org.eclipse.jetty.util.thread.QueuedThreadPool.access$700(QueuedThreadPool.java:47)
   [junit4]    >         at org.eclipse.jetty.util.thread.QueuedThreadPool$3.run(QueuedThreadPool.java:590)
   [junit4]    >         at java.lang.Thread.run(Thread.java:745)
   [junit4]    >    9) Thread[id=1482, name=qtp1209557008-1482, state=TIMED_WAITING, group=TGRP-TestReplicationHandler]
   [junit4]    >         at sun.misc.Unsafe.park(Native Method)
   [junit4]    >         at java.util.concurrent.locks.LockSupport.parkNanos(LockSupport.java:226)
   [junit4]    >         at java.util.concurrent.locks.AbstractQueuedSynchronizer$ConditionObject.awaitNanos(AbstractQueuedSynchronizer.java:2082)
   [junit4]    >         at org.eclipse.jetty.util.BlockingArrayQueue.poll(BlockingArrayQueue.java:389)
   [junit4]    >         at org.eclipse.jetty.util.thread.QueuedThreadPool.idleJobPoll(QueuedThreadPool.java:531)
   [junit4]    >         at org.eclipse.jetty.util.thread.QueuedThreadPool.access$700(QueuedThreadPool.java:47)
   [junit4]    >         at org.eclipse.jetty.util.thread.QueuedThreadPool$3.run(QueuedThreadPool.java:590)
   [junit4]    >         at java.lang.Thread.run(Thread.java:745)
   [junit4]    >   10) Thread[id=1483, name=qtp1209557008-1483, state=TIMED_WAITING, group=TGRP-TestReplicationHandler]
   [junit4]    >         at sun.misc.Unsafe.park(Native Method)
   [junit4]    >         at java.util.concurrent.locks.LockSupport.parkNanos(LockSupport.java:226)
   [junit4]    >         at java.util.concurrent.locks.AbstractQueuedSynchronizer$ConditionObject.awaitNanos(AbstractQueuedSynchronizer.java:2082)
   [junit4]    >         at org.eclipse.jetty.util.BlockingArrayQueue.poll(BlockingArrayQueue.java:389)
   [junit4]    >         at org.eclipse.jetty.util.thread.QueuedThreadPool.idleJobPoll(QueuedThreadPool.java:531)
   [junit4]    >         at org.eclipse.jetty.util.thread.QueuedThreadPool.access$700(QueuedThreadPool.java:47)
   [junit4]    >         at org.eclipse.jetty.util.thread.QueuedThreadPool$3.run(QueuedThreadPool.java:590)
   [junit4]    >         at java.lang.Thread.run(Thread.java:745)
   [junit4]    > 	at __randomizedtesting.SeedInfo.seed([FB2B7B5566BB2A95]:0)Throwable #2: com.carrotsearch.randomizedtesting.ThreadLeakError: There are still zombie threads that couldn't be terminated:
   [junit4]    >    1) Thread[id=1489, name=org.eclipse.jetty.server.session.HashSessionManager@76772d90Timer, state=TIMED_WAITING, group=TGRP-TestReplicationHandler]
   [junit4]    >         at sun.misc.Unsafe.park(Native Method)
   [junit4]    >         at java.util.concurrent.locks.LockSupport.parkNanos(LockSupport.java:226)
   [junit4]    >         at java.util.concurrent.locks.AbstractQueuedSynchronizer$ConditionObject.awaitNanos(AbstractQueuedSynchronizer.java:2082)
   [junit4]    >         at java.util.concurrent.ScheduledThreadPoolExecutor$DelayedWorkQueue.take(ScheduledThreadPoolExecutor.java:1090)
   [junit4]    >         at java.util.concurrent.ScheduledThreadPoolExecutor$DelayedWorkQueue.take(ScheduledThreadPoolExecutor.java:807)
   [junit4]    >         at java.util.concurrent.ThreadPoolExecutor.getTask(ThreadPoolExecutor.java:1068)
   [junit4]    >         at java.util.concurrent.ThreadPoolExecutor.runWorker(ThreadPoolExecutor.java:1130)
   [junit4]    >         at java.util.concurrent.ThreadPoolExecutor$Worker.run(ThreadPoolExecutor.java:615)
   [junit4]    >         at java.lang.Thread.run(Thread.java:745)
   [junit4]    >    2) Thread[id=1488, name=Scheduler-1708016757, state=TIMED_WAITING, group=TGRP-TestReplicationHandler]
   [junit4]    >         at sun.misc.Unsafe.park(Native Method)
   [junit4]    >         at java.util.concurrent.locks.LockSupport.parkNanos(LockSupport.java:226)
   [junit4]    >         at java.util.concurrent.locks.AbstractQueuedSynchronizer$ConditionObject.awaitNanos(AbstractQueuedSynchronizer.java:2082)
   [junit4]    >         at java.util.concurrent.ScheduledThreadPoolExecutor$DelayedWorkQueue.take(ScheduledThreadPoolExecutor.java:1090)
   [junit4]    >         at java.util.concurrent.ScheduledThreadPoolExecutor$DelayedWorkQueue.take(ScheduledThreadPoolExecutor.java:807)
   [junit4]    >         at java.util.concurrent.ThreadPoolExecutor.getTask(ThreadPoolExecutor.java:1068)
   [junit4]    >         at java.util.concurrent.ThreadPoolExecutor.runWorker(ThreadPoolExecutor.java:1130)
   [junit4]    >         at java.util.concurrent.ThreadPoolExecutor$Worker.run(ThreadPoolExecutor.java:615)
   [junit4]    >         at java.lang.Thread.run(Thread.java:745)
   [junit4]    > 	at __randomizedtesting.SeedInfo.seed([FB2B7B5566BB2A95]:0)
   [junit4] Completed [52/563 (1!)] on J0 in 137.94s, 13 tests, 1 failure, 2 errors <<< FAILURES!

[...truncated 1578 lines...]
BUILD FAILED
/Users/jenkins/workspace/Lucene-Solr-5.x-MacOSX/build.xml:794: The following error occurred while executing this line:
/Users/jenkins/workspace/Lucene-Solr-5.x-MacOSX/build.xml:738: The following error occurred while executing this line:
/Users/jenkins/workspace/Lucene-Solr-5.x-MacOSX/build.xml:59: The following error occurred while executing this line:
/Users/jenkins/workspace/Lucene-Solr-5.x-MacOSX/solr/build.xml:233: The following error occurred while executing this line:
/Users/jenkins/workspace/Lucene-Solr-5.x-MacOSX/solr/common-build.xml:526: The following error occurred while executing this line:
/Users/jenkins/workspace/Lucene-Solr-5.x-MacOSX/lucene/common-build.xml:1444: The following error occurred while executing this line:
/Users/jenkins/workspace/Lucene-Solr-5.x-MacOSX/lucene/common-build.xml:1000: There were test failures: 563 suites (7 ignored), 2236 tests, 2 suite-level errors, 1 failure, 1533 ignored (26 assumptions) [seed: FB2B7B5566BB2A95]

Total time: 48 minutes 46 seconds
Build step 'Invoke Ant' marked build as failure
Archiving artifacts
[WARNINGS] Skipping publisher since build result is FAILURE
Recording test results
Email was triggered for: Failure - Any
Sending email for trigger: Failure - Any



Mime
View raw message