lucene-dev mailing list archives

Site index · List index
Message view « Date » · « Thread »
Top « Date » · « Thread »
From Policeman Jenkins Server <jenk...@thetaphi.de>
Subject [JENKINS-EA] Lucene-Solr-trunk-Linux (32bit/jdk-9-ea+95) - Build # 15623 - Still Failing!
Date Sat, 23 Jan 2016 13:32:00 GMT
Build: http://jenkins.thetaphi.de/job/Lucene-Solr-trunk-Linux/15623/
Java: 32bit/jdk-9-ea+95 -server -XX:+UseG1GC -XX:-CompactStrings

2 tests failed.
FAILED:  org.apache.lucene.search.TestLatLonPointQueries.testAllLatEqual

Error Message:
Captured an uncaught exception in thread: Thread[id=38, name=T2, state=RUNNABLE, group=TGRP-TestLatLonPointQueries]

Stack Trace:
com.carrotsearch.randomizedtesting.UncaughtExceptionError: Captured an uncaught exception
in thread: Thread[id=38, name=T2, state=RUNNABLE, group=TGRP-TestLatLonPointQueries]
Caused by: java.lang.AssertionError: some hits were wrong
	at __randomizedtesting.SeedInfo.seed([43A6134EAE421688]:0)
	at org.junit.Assert.fail(Assert.java:93)
	at org.apache.lucene.util.BaseGeoPointTestCase$VerifyHits.test(BaseGeoPointTestCase.java:552)
	at org.apache.lucene.util.BaseGeoPointTestCase$2._run(BaseGeoPointTestCase.java:756)
	at org.apache.lucene.util.BaseGeoPointTestCase$2.run(BaseGeoPointTestCase.java:623)


FAILED:  org.apache.lucene.search.TestLatLonPointQueries.testMultiValued

Error Message:
some hits were wrong

Stack Trace:
java.lang.AssertionError: some hits were wrong
	at __randomizedtesting.SeedInfo.seed([43A6134EAE421688:9786777C608056C0]:0)
	at org.junit.Assert.fail(Assert.java:93)
	at org.apache.lucene.util.BaseGeoPointTestCase.testMultiValued(BaseGeoPointTestCase.java:322)
	at sun.reflect.NativeMethodAccessorImpl.invoke0(Native Method)
	at sun.reflect.NativeMethodAccessorImpl.invoke(NativeMethodAccessorImpl.java:62)
	at sun.reflect.DelegatingMethodAccessorImpl.invoke(DelegatingMethodAccessorImpl.java:43)
	at java.lang.reflect.Method.invoke(Method.java:520)
	at com.carrotsearch.randomizedtesting.RandomizedRunner.invoke(RandomizedRunner.java:1764)
	at com.carrotsearch.randomizedtesting.RandomizedRunner$8.evaluate(RandomizedRunner.java:871)
	at com.carrotsearch.randomizedtesting.RandomizedRunner$9.evaluate(RandomizedRunner.java:907)
	at com.carrotsearch.randomizedtesting.RandomizedRunner$10.evaluate(RandomizedRunner.java:921)
	at org.apache.lucene.util.TestRuleSetupTeardownChained$1.evaluate(TestRuleSetupTeardownChained.java:50)
	at org.apache.lucene.util.AbstractBeforeAfterRule$1.evaluate(AbstractBeforeAfterRule.java:46)
	at org.apache.lucene.util.TestRuleThreadAndTestName$1.evaluate(TestRuleThreadAndTestName.java:49)
	at org.apache.lucene.util.TestRuleIgnoreAfterMaxFailures$1.evaluate(TestRuleIgnoreAfterMaxFailures.java:65)
	at org.apache.lucene.util.TestRuleMarkFailure$1.evaluate(TestRuleMarkFailure.java:48)
	at com.carrotsearch.randomizedtesting.rules.StatementAdapter.evaluate(StatementAdapter.java:36)
	at com.carrotsearch.randomizedtesting.ThreadLeakControl$StatementRunner.run(ThreadLeakControl.java:367)
	at com.carrotsearch.randomizedtesting.ThreadLeakControl.forkTimeoutingTask(ThreadLeakControl.java:809)
	at com.carrotsearch.randomizedtesting.ThreadLeakControl$3.evaluate(ThreadLeakControl.java:460)
	at com.carrotsearch.randomizedtesting.RandomizedRunner.runSingleTest(RandomizedRunner.java:880)
	at com.carrotsearch.randomizedtesting.RandomizedRunner$5.evaluate(RandomizedRunner.java:781)
	at com.carrotsearch.randomizedtesting.RandomizedRunner$6.evaluate(RandomizedRunner.java:816)
	at com.carrotsearch.randomizedtesting.RandomizedRunner$7.evaluate(RandomizedRunner.java:827)
	at org.apache.lucene.util.AbstractBeforeAfterRule$1.evaluate(AbstractBeforeAfterRule.java:46)
	at com.carrotsearch.randomizedtesting.rules.StatementAdapter.evaluate(StatementAdapter.java:36)
	at org.apache.lucene.util.TestRuleStoreClassName$1.evaluate(TestRuleStoreClassName.java:42)
	at com.carrotsearch.randomizedtesting.rules.NoShadowingOrOverridesOnMethodsRule$1.evaluate(NoShadowingOrOverridesOnMethodsRule.java:40)
	at com.carrotsearch.randomizedtesting.rules.NoShadowingOrOverridesOnMethodsRule$1.evaluate(NoShadowingOrOverridesOnMethodsRule.java:40)
	at com.carrotsearch.randomizedtesting.rules.StatementAdapter.evaluate(StatementAdapter.java:36)
	at com.carrotsearch.randomizedtesting.rules.StatementAdapter.evaluate(StatementAdapter.java:36)
	at com.carrotsearch.randomizedtesting.rules.StatementAdapter.evaluate(StatementAdapter.java:36)
	at org.apache.lucene.util.TestRuleAssertionsRequired$1.evaluate(TestRuleAssertionsRequired.java:54)
	at org.apache.lucene.util.TestRuleMarkFailure$1.evaluate(TestRuleMarkFailure.java:48)
	at org.apache.lucene.util.TestRuleIgnoreAfterMaxFailures$1.evaluate(TestRuleIgnoreAfterMaxFailures.java:65)
	at org.apache.lucene.util.TestRuleIgnoreTestSuites$1.evaluate(TestRuleIgnoreTestSuites.java:55)
	at com.carrotsearch.randomizedtesting.rules.StatementAdapter.evaluate(StatementAdapter.java:36)
	at com.carrotsearch.randomizedtesting.ThreadLeakControl$StatementRunner.run(ThreadLeakControl.java:367)
	at java.lang.Thread.run(Thread.java:747)




Build Log:
[...truncated 7558 lines...]
   [junit4] Suite: org.apache.lucene.search.TestLatLonPointQueries
   [junit4]   1> T2: id=5877 should match but did not
   [junit4]   1>   small=true query=PointInRectQuery:field=point: Lower Left: [-163.30478339373528,-54.51148239703092]
Upper Right: [-162.84001478098585,-53.56733731235755] docID=7361
   [junit4]   1>   lat=-54.2498867377104 lon=-162.84001478649196
   [junit4]   1>   deleted?=false
   [junit4]   2> ng1 23, 2016 5:31:09 MANÁ com.carrotsearch.randomizedtesting.RandomizedRunner$QueueUncaughtExceptionsHandler
uncaughtException
   [junit4]   2> WARNING: Uncaught exception in thread: Thread[T2,5,TGRP-TestLatLonPointQueries]
   [junit4]   2> java.lang.AssertionError: some hits were wrong
   [junit4]   2> 	at __randomizedtesting.SeedInfo.seed([43A6134EAE421688]:0)
   [junit4]   2> 	at org.junit.Assert.fail(Assert.java:93)
   [junit4]   2> 	at org.apache.lucene.util.BaseGeoPointTestCase$VerifyHits.test(BaseGeoPointTestCase.java:552)
   [junit4]   2> 	at org.apache.lucene.util.BaseGeoPointTestCase$2._run(BaseGeoPointTestCase.java:756)
   [junit4]   2> 	at org.apache.lucene.util.BaseGeoPointTestCase$2.run(BaseGeoPointTestCase.java:623)
   [junit4]   2> 
   [junit4]   2> NOTE: reproduce with: ant test  -Dtestcase=TestLatLonPointQueries -Dtests.method=testAllLatEqual
-Dtests.seed=43A6134EAE421688 -Dtests.multiplier=3 -Dtests.slow=true -Dtests.locale=nmg -Dtests.timezone=US/Pacific-New
-Dtests.asserts=true -Dtests.file.encoding=UTF-8
   [junit4] ERROR   3.49s J0 | TestLatLonPointQueries.testAllLatEqual <<<
   [junit4]    > Throwable #1: java.lang.AssertionError
   [junit4]    > 	at org.apache.lucene.util.BaseGeoPointTestCase.verify(BaseGeoPointTestCase.java:770)
   [junit4]    > 	at org.apache.lucene.util.BaseGeoPointTestCase.testAllLatEqual(BaseGeoPointTestCase.java:150)
   [junit4]    > 	at java.lang.Thread.run(Thread.java:747)Throwable #2: com.carrotsearch.randomizedtesting.UncaughtExceptionError:
Captured an uncaught exception in thread: Thread[id=38, name=T2, state=RUNNABLE, group=TGRP-TestLatLonPointQueries]
   [junit4]    > Caused by: java.lang.AssertionError: some hits were wrong
   [junit4]    > 	at __randomizedtesting.SeedInfo.seed([43A6134EAE421688]:0)
   [junit4]    > 	at org.apache.lucene.util.BaseGeoPointTestCase$VerifyHits.test(BaseGeoPointTestCase.java:552)
   [junit4]    > 	at org.apache.lucene.util.BaseGeoPointTestCase$2._run(BaseGeoPointTestCase.java:756)
   [junit4]    > 	at org.apache.lucene.util.BaseGeoPointTestCase$2.run(BaseGeoPointTestCase.java:623)
   [junit4] IGNOR/A 0.00s J0 | TestLatLonPointQueries.testRandomBig
   [junit4]    > Assumption #1: 'nightly' test group is disabled (@Nightly())
   [junit4]   1> TEST-TestLatLonPointQueries.testMultiValued-seed#[43A6134EAE421688]: id=21829
docID=21829 should match but did not
   [junit4]   1>   rect=GeoRect(lon=-162.95893246297518 TO -162.71594981944216 lat=-53.78554047542089
TO -53.26703577175306)
   [junit4]   1>   lat=-55.027054287128045 lon=-162.61383593497555
   [junit4]   1>   lat=-53.67036752999413 lon=-162.71594979840359
   [junit4]   1>   result1=false result2=true
   [junit4]   2> NOTE: reproduce with: ant test  -Dtestcase=TestLatLonPointQueries -Dtests.method=testMultiValued
-Dtests.seed=43A6134EAE421688 -Dtests.multiplier=3 -Dtests.slow=true -Dtests.locale=nmg -Dtests.timezone=US/Pacific-New
-Dtests.asserts=true -Dtests.file.encoding=UTF-8
   [junit4] FAILURE 5.36s J0 | TestLatLonPointQueries.testMultiValued <<<
   [junit4]    > Throwable #1: java.lang.AssertionError: some hits were wrong
   [junit4]    > 	at __randomizedtesting.SeedInfo.seed([43A6134EAE421688:9786777C608056C0]:0)
   [junit4]    > 	at org.apache.lucene.util.BaseGeoPointTestCase.testMultiValued(BaseGeoPointTestCase.java:322)
   [junit4]    > 	at java.lang.Thread.run(Thread.java:747)
   [junit4]   2> NOTE: test params are: codec=Asserting(Lucene60): {id=FSTOrd50}, docValues:{id=DocValuesFormat(name=Asserting)},
sim=ClassicSimilarity, locale=nmg, timezone=US/Pacific-New
   [junit4]   2> NOTE: Linux 3.19.0-42-generic i386/Oracle Corporation 9-ea (32-bit)/cpus=12,threads=1,free=142496280,total=185597952
   [junit4]   2> NOTE: All tests run in this JVM: [TestIDVersionPostingsFormat, TestLatLonPointQueries]
   [junit4] Completed [12/13 (1!)] on J0 in 20.26s, 8 tests, 1 failure, 1 error, 1 skipped
<<< FAILURES!

[...truncated 15 lines...]
BUILD FAILED
/home/jenkins/workspace/Lucene-Solr-trunk-Linux/build.xml:675: The following error occurred
while executing this line:
/home/jenkins/workspace/Lucene-Solr-trunk-Linux/build.xml:619: The following error occurred
while executing this line:
/home/jenkins/workspace/Lucene-Solr-trunk-Linux/build.xml:57: The following error occurred
while executing this line:
/home/jenkins/workspace/Lucene-Solr-trunk-Linux/lucene/build.xml:475: The following error
occurred while executing this line:
/home/jenkins/workspace/Lucene-Solr-trunk-Linux/lucene/common-build.xml:2145: The following
error occurred while executing this line:
/home/jenkins/workspace/Lucene-Solr-trunk-Linux/lucene/module-build.xml:58: The following
error occurred while executing this line:
/home/jenkins/workspace/Lucene-Solr-trunk-Linux/lucene/common-build.xml:1415: The following
error occurred while executing this line:
/home/jenkins/workspace/Lucene-Solr-trunk-Linux/lucene/common-build.xml:972: There were test
failures: 13 suites, 97 tests, 1 error, 1 failure, 6 ignored (6 assumptions) [seed: 43A6134EAE421688]

Total time: 21 minutes 33 seconds
Build step 'Invoke Ant' marked build as failure
Archiving artifacts
[WARNINGS] Skipping publisher since build result is FAILURE
Recording test results
Email was triggered for: Failure - Any
Sending email for trigger: Failure - Any



Mime
View raw message