lucene-dev mailing list archives

Site index · List index
Message view « Date » · « Thread »
Top « Date » · « Thread »
From Policeman Jenkins Server <jenk...@thetaphi.de>
Subject [JENKINS] Lucene-Solr-trunk-Solaris (64bit/jdk1.8.0) - Build # 329 - Failure!
Date Tue, 12 Jan 2016 01:40:09 GMT
Build: http://jenkins.thetaphi.de/job/Lucene-Solr-trunk-Solaris/329/
Java: 64bit/jdk1.8.0 -XX:-UseCompressedOops -XX:+UseSerialGC

1 tests failed.
FAILED:  org.apache.solr.cloud.AsyncMigrateRouteKeyTest.test

Error Message:
There are still nodes recoverying - waited for 15 seconds

Stack Trace:
java.lang.AssertionError: There are still nodes recoverying - waited for 15 seconds
	at __randomizedtesting.SeedInfo.seed([2A1A548F279236AB:A24E6B55896E5B53]:0)
	at org.junit.Assert.fail(Assert.java:93)
	at org.apache.solr.cloud.AbstractDistribZkTestBase.waitForRecoveriesToFinish(AbstractDistribZkTestBase.java:175)
	at org.apache.solr.cloud.AbstractFullDistribZkTestBase.waitForRecoveriesToFinish(AbstractFullDistribZkTestBase.java:857)
	at org.apache.solr.cloud.AbstractFullDistribZkTestBase.waitForThingsToLevelOut(AbstractFullDistribZkTestBase.java:1413)
	at org.apache.solr.cloud.AsyncMigrateRouteKeyTest.test(AsyncMigrateRouteKeyTest.java:42)
	at sun.reflect.NativeMethodAccessorImpl.invoke0(Native Method)
	at sun.reflect.NativeMethodAccessorImpl.invoke(NativeMethodAccessorImpl.java:62)
	at sun.reflect.DelegatingMethodAccessorImpl.invoke(DelegatingMethodAccessorImpl.java:43)
	at java.lang.reflect.Method.invoke(Method.java:497)
	at com.carrotsearch.randomizedtesting.RandomizedRunner.invoke(RandomizedRunner.java:1764)
	at com.carrotsearch.randomizedtesting.RandomizedRunner$8.evaluate(RandomizedRunner.java:871)
	at com.carrotsearch.randomizedtesting.RandomizedRunner$9.evaluate(RandomizedRunner.java:907)
	at com.carrotsearch.randomizedtesting.RandomizedRunner$10.evaluate(RandomizedRunner.java:921)
	at org.apache.solr.BaseDistributedSearchTestCase$ShardsRepeatRule$ShardsFixedStatement.callStatement(BaseDistributedSearchTestCase.java:965)
	at org.apache.solr.BaseDistributedSearchTestCase$ShardsRepeatRule$ShardsStatement.evaluate(BaseDistributedSearchTestCase.java:940)
	at com.carrotsearch.randomizedtesting.rules.SystemPropertiesRestoreRule$1.evaluate(SystemPropertiesRestoreRule.java:57)
	at org.apache.lucene.util.TestRuleSetupTeardownChained$1.evaluate(TestRuleSetupTeardownChained.java:50)
	at org.apache.lucene.util.AbstractBeforeAfterRule$1.evaluate(AbstractBeforeAfterRule.java:46)
	at org.apache.lucene.util.TestRuleThreadAndTestName$1.evaluate(TestRuleThreadAndTestName.java:49)
	at org.apache.lucene.util.TestRuleIgnoreAfterMaxFailures$1.evaluate(TestRuleIgnoreAfterMaxFailures.java:65)
	at org.apache.lucene.util.TestRuleMarkFailure$1.evaluate(TestRuleMarkFailure.java:48)
	at com.carrotsearch.randomizedtesting.rules.StatementAdapter.evaluate(StatementAdapter.java:36)
	at com.carrotsearch.randomizedtesting.ThreadLeakControl$StatementRunner.run(ThreadLeakControl.java:367)
	at com.carrotsearch.randomizedtesting.ThreadLeakControl.forkTimeoutingTask(ThreadLeakControl.java:809)
	at com.carrotsearch.randomizedtesting.ThreadLeakControl$3.evaluate(ThreadLeakControl.java:460)
	at com.carrotsearch.randomizedtesting.RandomizedRunner.runSingleTest(RandomizedRunner.java:880)
	at com.carrotsearch.randomizedtesting.RandomizedRunner$5.evaluate(RandomizedRunner.java:781)
	at com.carrotsearch.randomizedtesting.RandomizedRunner$6.evaluate(RandomizedRunner.java:816)
	at com.carrotsearch.randomizedtesting.RandomizedRunner$7.evaluate(RandomizedRunner.java:827)
	at com.carrotsearch.randomizedtesting.rules.StatementAdapter.evaluate(StatementAdapter.java:36)
	at com.carrotsearch.randomizedtesting.rules.SystemPropertiesRestoreRule$1.evaluate(SystemPropertiesRestoreRule.java:57)
	at org.apache.lucene.util.AbstractBeforeAfterRule$1.evaluate(AbstractBeforeAfterRule.java:46)
	at com.carrotsearch.randomizedtesting.rules.StatementAdapter.evaluate(StatementAdapter.java:36)
	at org.apache.lucene.util.TestRuleStoreClassName$1.evaluate(TestRuleStoreClassName.java:42)
	at com.carrotsearch.randomizedtesting.rules.NoShadowingOrOverridesOnMethodsRule$1.evaluate(NoShadowingOrOverridesOnMethodsRule.java:40)
	at com.carrotsearch.randomizedtesting.rules.NoShadowingOrOverridesOnMethodsRule$1.evaluate(NoShadowingOrOverridesOnMethodsRule.java:40)
	at com.carrotsearch.randomizedtesting.rules.StatementAdapter.evaluate(StatementAdapter.java:36)
	at com.carrotsearch.randomizedtesting.rules.StatementAdapter.evaluate(StatementAdapter.java:36)
	at com.carrotsearch.randomizedtesting.rules.StatementAdapter.evaluate(StatementAdapter.java:36)
	at org.apache.lucene.util.TestRuleAssertionsRequired$1.evaluate(TestRuleAssertionsRequired.java:54)
	at org.apache.lucene.util.TestRuleMarkFailure$1.evaluate(TestRuleMarkFailure.java:48)
	at org.apache.lucene.util.TestRuleIgnoreAfterMaxFailures$1.evaluate(TestRuleIgnoreAfterMaxFailures.java:65)
	at org.apache.lucene.util.TestRuleIgnoreTestSuites$1.evaluate(TestRuleIgnoreTestSuites.java:55)
	at com.carrotsearch.randomizedtesting.rules.StatementAdapter.evaluate(StatementAdapter.java:36)
	at com.carrotsearch.randomizedtesting.ThreadLeakControl$StatementRunner.run(ThreadLeakControl.java:367)
	at java.lang.Thread.run(Thread.java:745)




Build Log:
[...truncated 9803 lines...]
   [junit4] Suite: org.apache.solr.cloud.AsyncMigrateRouteKeyTest
   [junit4]   2> Creating dataDir: /export/home/jenkins/workspace/Lucene-Solr-trunk-Solaris/solr/build/solr-core/test/J0/temp/solr.cloud.AsyncMigrateRouteKeyTest_2A1A548F279236AB-001/init-core-data-001
   [junit4]   2> 955555 INFO  (SUITE-AsyncMigrateRouteKeyTest-seed#[2A1A548F279236AB]-worker) [    ] o.a.s.BaseDistributedSearchTestCase Setting hostContext system property: /
   [junit4]   2> 955557 INFO  (TEST-AsyncMigrateRouteKeyTest.test-seed#[2A1A548F279236AB]) [    ] o.a.s.c.ZkTestServer STARTING ZK TEST SERVER
   [junit4]   2> 955558 INFO  (Thread-3497) [    ] o.a.s.c.ZkTestServer client port:0.0.0.0/0.0.0.0:0
   [junit4]   2> 955558 INFO  (Thread-3497) [    ] o.a.s.c.ZkTestServer Starting server
   [junit4]   2> 955658 INFO  (TEST-AsyncMigrateRouteKeyTest.test-seed#[2A1A548F279236AB]) [    ] o.a.s.c.ZkTestServer start zk server on port:48021
   [junit4]   2> 955658 INFO  (TEST-AsyncMigrateRouteKeyTest.test-seed#[2A1A548F279236AB]) [    ] o.a.s.c.c.SolrZkClient Using default ZkCredentialsProvider
   [junit4]   2> 955658 INFO  (TEST-AsyncMigrateRouteKeyTest.test-seed#[2A1A548F279236AB]) [    ] o.a.s.c.c.ConnectionManager Waiting for client to connect to ZooKeeper
   [junit4]   2> 955661 INFO  (zkCallback-1338-thread-1) [    ] o.a.s.c.c.ConnectionManager Watcher org.apache.solr.common.cloud.ConnectionManager@39aa73be name:ZooKeeperConnection Watcher:127.0.0.1:48021 got event WatchedEvent state:SyncConnected type:None path:null path:null type:None
   [junit4]   2> 955661 INFO  (TEST-AsyncMigrateRouteKeyTest.test-seed#[2A1A548F279236AB]) [    ] o.a.s.c.c.ConnectionManager Client is connected to ZooKeeper
   [junit4]   2> 955662 INFO  (TEST-AsyncMigrateRouteKeyTest.test-seed#[2A1A548F279236AB]) [    ] o.a.s.c.c.SolrZkClient Using default ZkACLProvider
   [junit4]   2> 955662 INFO  (TEST-AsyncMigrateRouteKeyTest.test-seed#[2A1A548F279236AB]) [    ] o.a.s.c.c.SolrZkClient makePath: /solr
   [junit4]   2> 955665 INFO  (TEST-AsyncMigrateRouteKeyTest.test-seed#[2A1A548F279236AB]) [    ] o.a.s.c.c.SolrZkClient Using default ZkCredentialsProvider
   [junit4]   2> 955665 INFO  (TEST-AsyncMigrateRouteKeyTest.test-seed#[2A1A548F279236AB]) [    ] o.a.s.c.c.ConnectionManager Waiting for client to connect to ZooKeeper
   [junit4]   2> 955666 INFO  (zkCallback-1339-thread-1) [    ] o.a.s.c.c.ConnectionManager Watcher org.apache.solr.common.cloud.ConnectionManager@4228dc22 name:ZooKeeperConnection Watcher:127.0.0.1:48021/solr got event WatchedEvent state:SyncConnected type:None path:null path:null type:None
   [junit4]   2> 955666 INFO  (TEST-AsyncMigrateRouteKeyTest.test-seed#[2A1A548F279236AB]) [    ] o.a.s.c.c.ConnectionManager Client is connected to ZooKeeper
   [junit4]   2> 955667 INFO  (TEST-AsyncMigrateRouteKeyTest.test-seed#[2A1A548F279236AB]) [    ] o.a.s.c.c.SolrZkClient Using default ZkACLProvider
   [junit4]   2> 955667 INFO  (TEST-AsyncMigrateRouteKeyTest.test-seed#[2A1A548F279236AB]) [    ] o.a.s.c.c.SolrZkClient makePath: /collections/collection1
   [junit4]   2> 955670 INFO  (TEST-AsyncMigrateRouteKeyTest.test-seed#[2A1A548F279236AB]) [    ] o.a.s.c.c.SolrZkClient makePath: /collections/collection1/shards
   [junit4]   2> 955671 INFO  (TEST-AsyncMigrateRouteKeyTest.test-seed#[2A1A548F279236AB]) [    ] o.a.s.c.c.SolrZkClient makePath: /collections/control_collection
   [junit4]   2> 955674 INFO  (TEST-AsyncMigrateRouteKeyTest.test-seed#[2A1A548F279236AB]) [    ] o.a.s.c.c.SolrZkClient makePath: /collections/control_collection/shards
   [junit4]   2> 955676 INFO  (TEST-AsyncMigrateRouteKeyTest.test-seed#[2A1A548F279236AB]) [    ] o.a.s.c.AbstractZkTestCase put /export/home/jenkins/workspace/Lucene-Solr-trunk-Solaris/solr/core/src/test-files/solr/collection1/conf/solrconfig-tlog.xml to /configs/conf1/solrconfig.xml
   [junit4]   2> 955677 INFO  (TEST-AsyncMigrateRouteKeyTest.test-seed#[2A1A548F279236AB]) [    ] o.a.s.c.c.SolrZkClient makePath: /configs/conf1/solrconfig.xml
   [junit4]   2> 955680 INFO  (TEST-AsyncMigrateRouteKeyTest.test-seed#[2A1A548F279236AB]) [    ] o.a.s.c.AbstractZkTestCase put /export/home/jenkins/workspace/Lucene-Solr-trunk-Solaris/solr/core/src/test-files/solr/collection1/conf/schema15.xml to /configs/conf1/schema.xml
   [junit4]   2> 955680 INFO  (TEST-AsyncMigrateRouteKeyTest.test-seed#[2A1A548F279236AB]) [    ] o.a.s.c.c.SolrZkClient makePath: /configs/conf1/schema.xml
   [junit4]   2> 955683 INFO  (TEST-AsyncMigrateRouteKeyTest.test-seed#[2A1A548F279236AB]) [    ] o.a.s.c.AbstractZkTestCase put /export/home/jenkins/workspace/Lucene-Solr-trunk-Solaris/solr/core/src/test-files/solr/collection1/conf/solrconfig.snippet.randomindexconfig.xml to /configs/conf1/solrconfig.snippet.randomindexconfig.xml
   [junit4]   2> 955683 INFO  (TEST-AsyncMigrateRouteKeyTest.test-seed#[2A1A548F279236AB]) [    ] o.a.s.c.c.SolrZkClient makePath: /configs/conf1/solrconfig.snippet.randomindexconfig.xml
   [junit4]   2> 955686 INFO  (TEST-AsyncMigrateRouteKeyTest.test-seed#[2A1A548F279236AB]) [    ] o.a.s.c.AbstractZkTestCase put /export/home/jenkins/workspace/Lucene-Solr-trunk-Solaris/solr/core/src/test-files/solr/collection1/conf/stopwords.txt to /configs/conf1/stopwords.txt
   [junit4]   2> 955686 INFO  (TEST-AsyncMigrateRouteKeyTest.test-seed#[2A1A548F279236AB]) [    ] o.a.s.c.c.SolrZkClient makePath: /configs/conf1/stopwords.txt
   [junit4]   2> 955689 INFO  (TEST-AsyncMigrateRouteKeyTest.test-seed#[2A1A548F279236AB]) [    ] o.a.s.c.AbstractZkTestCase put /export/home/jenkins/workspace/Lucene-Solr-trunk-Solaris/solr/core/src/test-files/solr/collection1/conf/protwords.txt to /configs/conf1/protwords.txt
   [junit4]   2> 955693 INFO  (TEST-AsyncMigrateRouteKeyTest.test-seed#[2A1A548F279236AB]) [    ] o.a.s.c.c.SolrZkClient makePath: /configs/conf1/protwords.txt
   [junit4]   2> 955695 INFO  (TEST-AsyncMigrateRouteKeyTest.test-seed#[2A1A548F279236AB]) [    ] o.a.s.c.AbstractZkTestCase put /export/home/jenkins/workspace/Lucene-Solr-trunk-Solaris/solr/core/src/test-files/solr/collection1/conf/currency.xml to /configs/conf1/currency.xml
   [junit4]   2> 955695 INFO  (TEST-AsyncMigrateRouteKeyTest.test-seed#[2A1A548F279236AB]) [    ] o.a.s.c.c.SolrZkClient makePath: /configs/conf1/currency.xml
   [junit4]   2> 955698 INFO  (TEST-AsyncMigrateRouteKeyTest.test-seed#[2A1A548F279236AB]) [    ] o.a.s.c.AbstractZkTestCase put /export/home/jenkins/workspace/Lucene-Solr-trunk-Solaris/solr/core/src/test-files/solr/collection1/conf/enumsConfig.xml to /configs/conf1/enumsConfig.xml
   [junit4]   2> 955698 INFO  (TEST-AsyncMigrateRouteKeyTest.test-seed#[2A1A548F279236AB]) [    ] o.a.s.c.c.SolrZkClient makePath: /configs/conf1/enumsConfig.xml
   [junit4]   2> 955701 INFO  (TEST-AsyncMigrateRouteKeyTest.test-seed#[2A1A548F279236AB]) [    ] o.a.s.c.AbstractZkTestCase put /export/home/jenkins/workspace/Lucene-Solr-trunk-Solaris/solr/core/src/test-files/solr/collection1/conf/open-exchange-rates.json to /configs/conf1/open-exchange-rates.json
   [junit4]   2> 955701 INFO  (TEST-AsyncMigrateRouteKeyTest.test-seed#[2A1A548F279236AB]) [    ] o.a.s.c.c.SolrZkClient makePath: /configs/conf1/open-exchange-rates.json
   [junit4]   2> 955704 INFO  (TEST-AsyncMigrateRouteKeyTest.test-seed#[2A1A548F279236AB]) [    ] o.a.s.c.AbstractZkTestCase put /export/home/jenkins/workspace/Lucene-Solr-trunk-Solaris/solr/core/src/test-files/solr/collection1/conf/mapping-ISOLatin1Accent.txt to /configs/conf1/mapping-ISOLatin1Accent.txt
   [junit4]   2> 955704 INFO  (TEST-AsyncMigrateRouteKeyTest.test-seed#[2A1A548F279236AB]) [    ] o.a.s.c.c.SolrZkClient makePath: /configs/conf1/mapping-ISOLatin1Accent.txt
   [junit4]   2> 955707 INFO  (TEST-AsyncMigrateRouteKeyTest.test-seed#[2A1A548F279236AB]) [    ] o.a.s.c.AbstractZkTestCase put /export/home/jenkins/workspace/Lucene-Solr-trunk-Solaris/solr/core/src/test-files/solr/collection1/conf/old_synonyms.txt to /configs/conf1/old_synonyms.txt
   [junit4]   2> 955707 INFO  (TEST-AsyncMigrateRouteKeyTest.test-seed#[2A1A548F279236AB]) [    ] o.a.s.c.c.SolrZkClient makePath: /configs/conf1/old_synonyms.txt
   [junit4]   2> 955710 INFO  (TEST-AsyncMigrateRouteKeyTest.test-seed#[2A1A548F279236AB]) [    ] o.a.s.c.AbstractZkTestCase put /export/home/jenkins/workspace/Lucene-Solr-trunk-Solaris/solr/core/src/test-files/solr/collection1/conf/synonyms.txt to /configs/conf1/synonyms.txt
   [junit4]   2> 955711 INFO  (TEST-AsyncMigrateRouteKeyTest.test-seed#[2A1A548F279236AB]) [    ] o.a.s.c.c.SolrZkClient makePath: /configs/conf1/synonyms.txt
   [junit4]   2> 955917 INFO  (TEST-AsyncMigrateRouteKeyTest.test-seed#[2A1A548F279236AB]) [    ] o.a.s.SolrTestCaseJ4 Writing core.properties file to /export/home/jenkins/workspace/Lucene-Solr-trunk-Solaris/solr/build/solr-core/test/J0/temp/solr.cloud.AsyncMigrateRouteKeyTest_2A1A548F279236AB-001/control-001/cores/collection1
   [junit4]   2> 955918 INFO  (TEST-AsyncMigrateRouteKeyTest.test-seed#[2A1A548F279236AB]) [    ] o.e.j.s.Server jetty-9.2.13.v20150730
   [junit4]   2> 955920 INFO  (TEST-AsyncMigrateRouteKeyTest.test-seed#[2A1A548F279236AB]) [    ] o.e.j.s.h.ContextHandler Started o.e.j.s.ServletContextHandler@39d2ad6f{/,null,AVAILABLE}
   [junit4]   2> 955922 INFO  (TEST-AsyncMigrateRouteKeyTest.test-seed#[2A1A548F279236AB]) [    ] o.e.j.s.ServerConnector Started ServerConnector@63060233{HTTP/1.1}{127.0.0.1:34028}
   [junit4]   2> 955922 INFO  (TEST-AsyncMigrateRouteKeyTest.test-seed#[2A1A548F279236AB]) [    ] o.e.j.s.Server Started @958786ms
   [junit4]   2> 955922 INFO  (TEST-AsyncMigrateRouteKeyTest.test-seed#[2A1A548F279236AB]) [    ] o.a.s.c.s.e.JettySolrRunner Jetty properties: {solr.data.dir=/export/home/jenkins/workspace/Lucene-Solr-trunk-Solaris/solr/build/solr-core/test/J0/temp/solr.cloud.AsyncMigrateRouteKeyTest_2A1A548F279236AB-001/tempDir-001/control/data, hostContext=/, hostPort=34028, coreRootDirectory=/export/home/jenkins/workspace/Lucene-Solr-trunk-Solaris/solr/build/solr-core/test/J0/temp/solr.cloud.AsyncMigrateRouteKeyTest_2A1A548F279236AB-001/control-001/cores}
   [junit4]   2> 955922 INFO  (TEST-AsyncMigrateRouteKeyTest.test-seed#[2A1A548F279236AB]) [    ] o.a.s.s.SolrDispatchFilter SolrDispatchFilter.init(): sun.misc.Launcher$AppClassLoader@659e0bfd
   [junit4]   2> 955922 INFO  (TEST-AsyncMigrateRouteKeyTest.test-seed#[2A1A548F279236AB]) [    ] o.a.s.c.SolrResourceLoader new SolrResourceLoader for directory: '/export/home/jenkins/workspace/Lucene-Solr-trunk-Solaris/solr/build/solr-core/test/J0/temp/solr.cloud.AsyncMigrateRouteKeyTest_2A1A548F279236AB-001/control-001'
   [junit4]   2> 955923 INFO  (TEST-AsyncMigrateRouteKeyTest.test-seed#[2A1A548F279236AB]) [    ] o.a.s.c.SolrResourceLoader JNDI not configured for solr (NoInitialContextEx)
   [junit4]   2> 955923 INFO  (TEST-AsyncMigrateRouteKeyTest.test-seed#[2A1A548F279236AB]) [    ] o.a.s.c.SolrResourceLoader solr home defaulted to 'solr/' (could not find system property or JNDI)
   [junit4]   2> 955923 INFO  (TEST-AsyncMigrateRouteKeyTest.test-seed#[2A1A548F279236AB]) [    ] o.a.s.c.c.SolrZkClient Using default ZkCredentialsProvider
   [junit4]   2> 955923 INFO  (TEST-AsyncMigrateRouteKeyTest.test-seed#[2A1A548F279236AB]) [    ] o.a.s.c.c.ConnectionManager Waiting for client to connect to ZooKeeper
   [junit4]   2> 955926 INFO  (zkCallback-1340-thread-1) [    ] o.a.s.c.c.ConnectionManager Watcher org.apache.solr.common.cloud.ConnectionManager@704d8f1d name:ZooKeeperConnection Watcher:127.0.0.1:48021/solr got event WatchedEvent state:SyncConnected type:None path:null path:null type:None
   [junit4]   2> 955926 INFO  (TEST-AsyncMigrateRouteKeyTest.test-seed#[2A1A548F279236AB]) [    ] o.a.s.c.c.ConnectionManager Client is connected to ZooKeeper
   [junit4]   2> 955926 INFO  (TEST-AsyncMigrateRouteKeyTest.test-seed#[2A1A548F279236AB]) [    ] o.a.s.c.c.SolrZkClient Using default ZkACLProvider
   [junit4]   2> 955928 INFO  (TEST-AsyncMigrateRouteKeyTest.test-seed#[2A1A548F279236AB]) [    ] o.a.s.s.SolrDispatchFilter Loading solr.xml from SolrHome (not found in ZooKeeper)
   [junit4]   2> 955928 INFO  (TEST-AsyncMigrateRouteKeyTest.test-seed#[2A1A548F279236AB]) [    ] o.a.s.c.SolrXmlConfig Loading container configuration from /export/home/jenkins/workspace/Lucene-Solr-trunk-Solaris/solr/build/solr-core/test/J0/temp/solr.cloud.AsyncMigrateRouteKeyTest_2A1A548F279236AB-001/control-001/solr.xml
   [junit4]   2> 955950 INFO  (TEST-AsyncMigrateRouteKeyTest.test-seed#[2A1A548F279236AB]) [    ] o.a.s.c.CorePropertiesLocator Config-defined core root directory: /export/home/jenkins/workspace/Lucene-Solr-trunk-Solaris/solr/build/solr-core/test/J0/temp/solr.cloud.AsyncMigrateRouteKeyTest_2A1A548F279236AB-001/control-001/cores
   [junit4]   2> 955950 INFO  (TEST-AsyncMigrateRouteKeyTest.test-seed#[2A1A548F279236AB]) [    ] o.a.s.c.CoreContainer New CoreContainer 248477629
   [junit4]   2> 955950 INFO  (TEST-AsyncMigrateRouteKeyTest.test-seed#[2A1A548F279236AB]) [    ] o.a.s.c.CoreContainer Loading cores into CoreContainer [instanceDir=/export/home/jenkins/workspace/Lucene-Solr-trunk-Solaris/solr/build/solr-core/test/J0/temp/solr.cloud.AsyncMigrateRouteKeyTest_2A1A548F279236AB-001/control-001]
   [junit4]   2> 955950 WARN  (TEST-AsyncMigrateRouteKeyTest.test-seed#[2A1A548F279236AB]) [    ] o.a.s.c.CoreContainer Couldn't add files from /export/home/jenkins/workspace/Lucene-Solr-trunk-Solaris/solr/build/solr-core/test/J0/temp/solr.cloud.AsyncMigrateRouteKeyTest_2A1A548F279236AB-001/control-001/lib to classpath: /export/home/jenkins/workspace/Lucene-Solr-trunk-Solaris/solr/build/solr-core/test/J0/temp/solr.cloud.AsyncMigrateRouteKeyTest_2A1A548F279236AB-001/control-001/lib
   [junit4]   2> 955950 INFO  (TEST-AsyncMigrateRouteKeyTest.test-seed#[2A1A548F279236AB]) [    ] o.a.s.h.c.HttpShardHandlerFactory created with socketTimeout : 90000,urlScheme : ,connTimeout : 15000,maxConnectionsPerHost : 20,maxConnections : 10000,corePoolSize : 0,maximumPoolSize : 2147483647,maxThreadIdleTime : 5,sizeOfQueue : -1,fairnessPolicy : false,useRetries : false,
   [junit4]   2> 955952 INFO  (TEST-AsyncMigrateRouteKeyTest.test-seed#[2A1A548F279236AB]) [    ] o.a.s.u.UpdateShardHandler Creating UpdateShardHandler HTTP client with params: socketTimeout=340000&connTimeout=45000&retry=true
   [junit4]   2> 955952 INFO  (TEST-AsyncMigrateRouteKeyTest.test-seed#[2A1A548F279236AB]) [    ] o.a.s.l.LogWatcher SLF4J impl is org.slf4j.impl.Log4jLoggerFactory
   [junit4]   2> 955952 INFO  (TEST-AsyncMigrateRouteKeyTest.test-seed#[2A1A548F279236AB]) [    ] o.a.s.l.LogWatcher Registering Log Listener [Log4j (org.slf4j.impl.Log4jLoggerFactory)]
   [junit4]   2> 955952 INFO  (TEST-AsyncMigrateRouteKeyTest.test-seed#[2A1A548F279236AB]) [    ] o.a.s.c.ZkContainer Zookeeper client=127.0.0.1:48021/solr
   [junit4]   2> 955952 INFO  (TEST-AsyncMigrateRouteKeyTest.test-seed#[2A1A548F279236AB]) [    ] o.a.s.c.ZkController zkHost includes chroot
   [junit4]   2> 955952 INFO  (TEST-AsyncMigrateRouteKeyTest.test-seed#[2A1A548F279236AB]) [    ] o.a.s.c.c.SolrZkClient Using default ZkCredentialsProvider
   [junit4]   2> 955953 INFO  (TEST-AsyncMigrateRouteKeyTest.test-seed#[2A1A548F279236AB]) [    ] o.a.s.c.c.ConnectionManager Waiting for client to connect to ZooKeeper
   [junit4]   2> 955955 INFO  (zkCallback-1343-thread-1) [    ] o.a.s.c.c.ConnectionManager Watcher org.apache.solr.common.cloud.ConnectionManager@38efed54 name:ZooKeeperConnection Watcher:127.0.0.1:48021 got event WatchedEvent state:SyncConnected type:None path:null path:null type:None
   [junit4]   2> 955955 INFO  (TEST-AsyncMigrateRouteKeyTest.test-seed#[2A1A548F279236AB]) [    ] o.a.s.c.c.ConnectionManager Client is connected to ZooKeeper
   [junit4]   2> 955955 INFO  (TEST-AsyncMigrateRouteKeyTest.test-seed#[2A1A548F279236AB]) [    ] o.a.s.c.c.SolrZkClient Using default ZkACLProvider
   [junit4]   2> 955957 INFO  (TEST-AsyncMigrateRouteKeyTest.test-seed#[2A1A548F279236AB]) [n:127.0.0.1:34028_    ] o.a.s.c.c.ConnectionManager Waiting for client to connect to ZooKeeper
   [junit4]   2> 955959 INFO  (zkCallback-1344-thread-1-processing-n:127.0.0.1:34028_) [n:127.0.0.1:34028_    ] o.a.s.c.c.ConnectionManager Watcher org.apache.solr.common.cloud.ConnectionManager@18b31b3e name:ZooKeeperConnection Watcher:127.0.0.1:48021/solr got event WatchedEvent state:SyncConnected type:None path:null path:null type:None
   [junit4]   2> 955959 INFO  (TEST-AsyncMigrateRouteKeyTest.test-seed#[2A1A548F279236AB]) [n:127.0.0.1:34028_    ] o.a.s.c.c.ConnectionManager Client is connected to ZooKeeper
   [junit4]   2> 955961 INFO  (TEST-AsyncMigrateRouteKeyTest.test-seed#[2A1A548F279236AB]) [n:127.0.0.1:34028_    ] o.a.s.c.c.SolrZkClient makePath: /overseer/queue
   [junit4]   2> 955963 INFO  (TEST-AsyncMigrateRouteKeyTest.test-seed#[2A1A548F279236AB]) [n:127.0.0.1:34028_    ] o.a.s.c.c.SolrZkClient makePath: /overseer/collection-queue-work
   [junit4]   2> 955967 INFO  (TEST-AsyncMigrateRouteKeyTest.test-seed#[2A1A548F279236AB]) [n:127.0.0.1:34028_    ] o.a.s.c.c.SolrZkClient makePath: /overseer/collection-map-running
   [junit4]   2> 955970 INFO  (TEST-AsyncMigrateRouteKeyTest.test-seed#[2A1A548F279236AB]) [n:127.0.0.1:34028_    ] o.a.s.c.c.SolrZkClient makePath: /overseer/collection-map-completed
   [junit4]   2> 955974 INFO  (TEST-AsyncMigrateRouteKeyTest.test-seed#[2A1A548F279236AB]) [n:127.0.0.1:34028_    ] o.a.s.c.c.SolrZkClient makePath: /overseer/collection-map-failure
   [junit4]   2> 955977 INFO  (TEST-AsyncMigrateRouteKeyTest.test-seed#[2A1A548F279236AB]) [n:127.0.0.1:34028_    ] o.a.s.c.c.SolrZkClient makePath: /live_nodes
   [junit4]   2> 955980 INFO  (TEST-AsyncMigrateRouteKeyTest.test-seed#[2A1A548F279236AB]) [n:127.0.0.1:34028_    ] o.a.s.c.c.SolrZkClient makePath: /aliases.json
   [junit4]   2> 955982 INFO  (TEST-AsyncMigrateRouteKeyTest.test-seed#[2A1A548F279236AB]) [n:127.0.0.1:34028_    ] o.a.s.c.c.SolrZkClient makePath: /clusterstate.json
   [junit4]   2> 955984 INFO  (TEST-AsyncMigrateRouteKeyTest.test-seed#[2A1A548F279236AB]) [n:127.0.0.1:34028_    ] o.a.s.c.c.SolrZkClient makePath: /security.json
   [junit4]   2> 955986 INFO  (TEST-AsyncMigrateRouteKeyTest.test-seed#[2A1A548F279236AB]) [n:127.0.0.1:34028_    ] o.a.s.c.ZkController Register node as live in ZooKeeper:/live_nodes/127.0.0.1:34028_
   [junit4]   2> 955987 INFO  (TEST-AsyncMigrateRouteKeyTest.test-seed#[2A1A548F279236AB]) [n:127.0.0.1:34028_    ] o.a.s.c.c.SolrZkClient makePath: /live_nodes/127.0.0.1:34028_
   [junit4]   2> 955989 INFO  (TEST-AsyncMigrateRouteKeyTest.test-seed#[2A1A548F279236AB]) [n:127.0.0.1:34028_    ] o.a.s.c.c.SolrZkClient makePath: /overseer_elect
   [junit4]   2> 955992 INFO  (TEST-AsyncMigrateRouteKeyTest.test-seed#[2A1A548F279236AB]) [n:127.0.0.1:34028_    ] o.a.s.c.c.SolrZkClient makePath: /overseer_elect/election
   [junit4]   2> 955994 INFO  (TEST-AsyncMigrateRouteKeyTest.test-seed#[2A1A548F279236AB]) [n:127.0.0.1:34028_    ] o.a.s.c.Overseer Overseer (id=null) closing
   [junit4]   2> 955995 INFO  (TEST-AsyncMigrateRouteKeyTest.test-seed#[2A1A548F279236AB]) [n:127.0.0.1:34028_    ] o.a.s.c.LeaderElector Joined leadership election with path: /overseer_elect/election/95195015224229892-127.0.0.1:34028_-n_0000000000
   [junit4]   2> 955996 INFO  (TEST-AsyncMigrateRouteKeyTest.test-seed#[2A1A548F279236AB]) [n:127.0.0.1:34028_    ] o.a.s.c.OverseerElectionContext I am going to be the leader 127.0.0.1:34028_
   [junit4]   2> 955996 INFO  (TEST-AsyncMigrateRouteKeyTest.test-seed#[2A1A548F279236AB]) [n:127.0.0.1:34028_    ] o.a.s.c.c.SolrZkClient makePath: /overseer_elect/leader
   [junit4]   2> 956000 INFO  (TEST-AsyncMigrateRouteKeyTest.test-seed#[2A1A548F279236AB]) [n:127.0.0.1:34028_    ] o.a.s.c.Overseer Overseer (id=95195015224229892-127.0.0.1:34028_-n_0000000000) starting
   [junit4]   2> 956004 INFO  (TEST-AsyncMigrateRouteKeyTest.test-seed#[2A1A548F279236AB]) [n:127.0.0.1:34028_    ] o.a.s.c.c.SolrZkClient makePath: /overseer/queue-work
   [junit4]   2> 956016 INFO  (TEST-AsyncMigrateRouteKeyTest.test-seed#[2A1A548F279236AB]) [n:127.0.0.1:34028_    ] o.a.s.c.OverseerAutoReplicaFailoverThread Starting OverseerAutoReplicaFailoverThread autoReplicaFailoverWorkLoopDelay=10000 autoReplicaFailoverWaitAfterExpiration=30000 autoReplicaFailoverBadNodeExpiration=60000
   [junit4]   2> 956017 INFO  (TEST-AsyncMigrateRouteKeyTest.test-seed#[2A1A548F279236AB]) [n:127.0.0.1:34028_    ] o.a.s.c.c.ZkStateReader Updating cluster state from ZooKeeper... 
   [junit4]   2> 956019 INFO  (OverseerStateUpdate-95195015224229892-127.0.0.1:34028_-n_0000000000) [n:127.0.0.1:34028_    ] o.a.s.c.Overseer Starting to work on the main queue
   [junit4]   2> 956022 INFO  (OverseerCollectionConfigSetProcessor-95195015224229892-127.0.0.1:34028_-n_0000000000) [n:127.0.0.1:34028_    ] o.a.s.c.OverseerTaskProcessor Process current queue of overseer operations
   [junit4]   2> 956041 INFO  (TEST-AsyncMigrateRouteKeyTest.test-seed#[2A1A548F279236AB]) [n:127.0.0.1:34028_    ] o.a.s.c.CoreContainer Security conf doesn't exist. Skipping setup for authorization module.
   [junit4]   2> 956041 INFO  (TEST-AsyncMigrateRouteKeyTest.test-seed#[2A1A548F279236AB]) [n:127.0.0.1:34028_    ] o.a.s.c.CoreContainer No authentication plugin used.
   [junit4]   2> 956043 INFO  (TEST-AsyncMigrateRouteKeyTest.test-seed#[2A1A548F279236AB]) [n:127.0.0.1:34028_    ] o.a.s.c.CorePropertiesLocator Looking for core definitions underneath /export/home/jenkins/workspace/Lucene-Solr-trunk-Solaris/solr/build/solr-core/test/J0/temp/solr.cloud.AsyncMigrateRouteKeyTest_2A1A548F279236AB-001/control-001/cores
   [junit4]   2> 956044 INFO  (TEST-AsyncMigrateRouteKeyTest.test-seed#[2A1A548F279236AB]) [n:127.0.0.1:34028_    ] o.a.s.c.CoreDescriptor Created CoreDescriptor: {name=collection1, config=solrconfig.xml, transient=false, schema=schema.xml, loadOnStartup=true, configSetProperties=configsetprops.json, collection=control_collection, coreNodeName=, dataDir=data/, shard=}
   [junit4]   2> 956044 INFO  (TEST-AsyncMigrateRouteKeyTest.test-seed#[2A1A548F279236AB]) [n:127.0.0.1:34028_    ] o.a.s.c.CorePropertiesLocator Found core collection1 in /export/home/jenkins/workspace/Lucene-Solr-trunk-Solaris/solr/build/solr-core/test/J0/temp/solr.cloud.AsyncMigrateRouteKeyTest_2A1A548F279236AB-001/control-001/cores/collection1
   [junit4]   2> 956044 INFO  (TEST-AsyncMigrateRouteKeyTest.test-seed#[2A1A548F279236AB]) [n:127.0.0.1:34028_    ] o.a.s.c.CorePropertiesLocator Found 1 core definitions
   [junit4]   2> 956045 INFO  (TEST-AsyncMigrateRouteKeyTest.test-seed#[2A1A548F279236AB]) [n:127.0.0.1:34028_    ] o.a.s.s.SolrDispatchFilter user.dir=/export/home/jenkins/workspace/Lucene-Solr-trunk-Solaris/solr/build/solr-core/test/J0
   [junit4]   2> 956046 INFO  (TEST-AsyncMigrateRouteKeyTest.test-seed#[2A1A548F279236AB]) [n:127.0.0.1:34028_    ] o.a.s.s.SolrDispatchFilter SolrDispatchFilter.init() done
   [junit4]   2> 956047 INFO  (coreLoadExecutor-3491-thread-1-processing-n:127.0.0.1:34028_) [n:127.0.0.1:34028_ c:control_collection   x:collection1] o.a.s.c.ZkController publishing state=down
   [junit4]   2> 956047 INFO  (coreLoadExecutor-3491-thread-1-processing-n:127.0.0.1:34028_) [n:127.0.0.1:34028_ c:control_collection   x:collection1] o.a.s.c.ZkController numShards not found on descriptor - reading it from system property
   [junit4]   2> 956049 INFO  (OverseerStateUpdate-95195015224229892-127.0.0.1:34028_-n_0000000000) [n:127.0.0.1:34028_    ] o.a.s.c.Overseer processMessage: queueSize: 1, message = {
   [junit4]   2>   "core":"collection1",
   [junit4]   2>   "roles":null,
   [junit4]   2>   "base_url":"http://127.0.0.1:34028",
   [junit4]   2>   "node_name":"127.0.0.1:34028_",
   [junit4]   2>   "numShards":"1",
   [junit4]   2>   "state":"down",
   [junit4]   2>   "shard":null,
   [junit4]   2>   "collection":"control_collection",
   [junit4]   2>   "operation":"state"} current state version: 0
   [junit4]   2> 956050 INFO  (OverseerStateUpdate-95195015224229892-127.0.0.1:34028_-n_0000000000) [n:127.0.0.1:34028_    ] o.a.s.c.o.ReplicaMutator Update state numShards=1 message={
   [junit4]   2>   "core":"collection1",
   [junit4]   2>   "roles":null,
   [junit4]   2>   "base_url":"http://127.0.0.1:34028",
   [junit4]   2>   "node_name":"127.0.0.1:34028_",
   [junit4]   2>   "numShards":"1",
   [junit4]   2>   "state":"down",
   [junit4]   2>   "shard":null,
   [junit4]   2>   "collection":"control_collection",
   [junit4]   2>   "operation":"state"}
   [junit4]   2> 956051 INFO  (coreLoadExecutor-3491-thread-1-processing-n:127.0.0.1:34028_) [n:127.0.0.1:34028_ c:control_collection   x:collection1] o.a.s.c.ZkController look for our core node name
   [junit4]   2> 956051 INFO  (OverseerStateUpdate-95195015224229892-127.0.0.1:34028_-n_0000000000) [n:127.0.0.1:34028_    ] o.a.s.c.o.ClusterStateMutator building a new cName: control_collection
   [junit4]   2> 956052 INFO  (OverseerStateUpdate-95195015224229892-127.0.0.1:34028_-n_0000000000) [n:127.0.0.1:34028_    ] o.a.s.c.o.ReplicaMutator Assigning new node to shard shard=shard1
   [junit4]   2> 956055 INFO  (zkCallback-1344-thread-1-processing-n:127.0.0.1:34028_) [n:127.0.0.1:34028_    ] o.a.s.c.c.ZkStateReader A cluster state change: [WatchedEvent state:SyncConnected type:NodeDataChanged path:/clusterstate.json], has occurred - updating... (live nodes size: [1])
   [junit4]   2> 957053 INFO  (coreLoadExecutor-3491-thread-1-processing-n:127.0.0.1:34028_) [n:127.0.0.1:34028_ c:control_collection   x:collection1] o.a.s.c.ZkController waiting to find shard id in clusterstate for collection1
   [junit4]   2> 957053 INFO  (coreLoadExecutor-3491-thread-1-processing-n:127.0.0.1:34028_) [n:127.0.0.1:34028_ c:control_collection   x:collection1] o.a.s.c.ZkController Check for collection zkNode:control_collection
   [junit4]   2> 957054 INFO  (coreLoadExecutor-3491-thread-1-processing-n:127.0.0.1:34028_) [n:127.0.0.1:34028_ c:control_collection   x:collection1] o.a.s.c.ZkController Collection zkNode exists
   [junit4]   2> 957054 INFO  (coreLoadExecutor-3491-thread-1-processing-n:127.0.0.1:34028_) [n:127.0.0.1:34028_ c:control_collection   x:collection1] o.a.s.c.c.ZkStateReader Load collection config from: [/collections/control_collection]
   [junit4]   2> 957056 INFO  (coreLoadExecutor-3491-thread-1-processing-n:127.0.0.1:34028_) [n:127.0.0.1:34028_ c:control_collection   x:collection1] o.a.s.c.c.ZkStateReader path=[/collections/control_collection] [configName]=[conf1] specified config exists in ZooKeeper
   [junit4]   2> 957056 INFO  (coreLoadExecutor-3491-thread-1-processing-n:127.0.0.1:34028_) [n:127.0.0.1:34028_ c:control_collection   x:collection1] o.a.s.c.SolrResourceLoader new SolrResourceLoader for directory: '/export/home/jenkins/workspace/Lucene-Solr-trunk-Solaris/solr/build/solr-core/test/J0/temp/solr.cloud.AsyncMigrateRouteKeyTest_2A1A548F279236AB-001/control-001/cores/collection1'
   [junit4]   2> 957056 INFO  (coreLoadExecutor-3491-thread-1-processing-n:127.0.0.1:34028_) [n:127.0.0.1:34028_ c:control_collection   x:collection1] o.a.s.c.SolrResourceLoader JNDI not configured for solr (NoInitialContextEx)
   [junit4]   2> 957056 INFO  (coreLoadExecutor-3491-thread-1-processing-n:127.0.0.1:34028_) [n:127.0.0.1:34028_ c:control_collection   x:collection1] o.a.s.c.SolrResourceLoader solr home defaulted to 'solr/' (could not find system property or JNDI)
   [junit4]   2> 957058 INFO  (coreLoadExecutor-3491-thread-1-processing-n:127.0.0.1:34028_) [n:127.0.0.1:34028_ c:control_collection   x:collection1] o.a.s.c.Config loaded config solrconfig.xml with version 0 
   [junit4]   2> 957063 INFO  (coreLoadExecutor-3491-thread-1-processing-n:127.0.0.1:34028_) [n:127.0.0.1:34028_ c:control_collection   x:collection1] o.a.s.c.SolrConfig current version of requestparams : -1
   [junit4]   2> 957068 INFO  (coreLoadExecutor-3491-thread-1-processing-n:127.0.0.1:34028_) [n:127.0.0.1:34028_ c:control_collection   x:collection1] o.a.s.c.SolrConfig Using Lucene MatchVersion: 6.0.0
   [junit4]   2> 957075 INFO  (coreLoadExecutor-3491-thread-1-processing-n:127.0.0.1:34028_) [n:127.0.0.1:34028_ c:control_collection   x:collection1] o.a.s.c.SolrConfig Loaded SolrConfig: solrconfig.xml
   [junit4]   2> 957080 INFO  (coreLoadExecutor-3491-thread-1-processing-n:127.0.0.1:34028_) [n:127.0.0.1:34028_ c:control_collection   x:collection1] o.a.s.s.IndexSchema [collection1] Schema name=test
   [junit4]   2> 957151 INFO  (coreLoadExecutor-3491-thread-1-processing-n:127.0.0.1:34028_) [n:127.0.0.1:34028_ c:control_collection   x:collection1] o.a.s.s.IndexSchema default search field in schema is text
   [junit4]   2> 957152 INFO  (coreLoadExecutor-3491-thread-1-processing-n:127.0.0.1:34028_) [n:127.0.0.1:34028_ c:control_collection   x:collection1] o.a.s.s.IndexSchema unique key field: id
   [junit4]   2> 957152 INFO  (coreLoadExecutor-3491-thread-1-processing-n:127.0.0.1:34028_) [n:127.0.0.1:34028_ c:control_collection   x:collection1] o.a.s.s.FileExchangeRateProvider Reloading exchange rates from file currency.xml
   [junit4]   2> 957156 INFO  (coreLoadExecutor-3491-thread-1-processing-n:127.0.0.1:34028_) [n:127.0.0.1:34028_ c:control_collection   x:collection1] o.a.s.s.FileExchangeRateProvider Reloading exchange rates from file currency.xml
   [junit4]   2> 957181 INFO  (coreLoadExecutor-3491-thread-1-processing-n:127.0.0.1:34028_) [n:127.0.0.1:34028_ c:control_collection   x:collection1] o.a.s.c.ConfigSetProperties Did not find ConfigSet properties, assuming default properties: Can't find resource 'configsetprops.json' in classpath or '/configs/conf1', cwd=/export/home/jenkins/workspace/Lucene-Solr-trunk-Solaris/solr/build/solr-core/test/J0
   [junit4]   2> 957181 INFO  (coreLoadExecutor-3491-thread-1-processing-n:127.0.0.1:34028_) [n:127.0.0.1:34028_ c:control_collection   x:collection1] o.a.s.c.CoreContainer Creating SolrCore 'collection1' using configuration from collection control_collection
   [junit4]   2> 957181 INFO  (coreLoadExecutor-3491-thread-1-processing-n:127.0.0.1:34028_) [n:127.0.0.1:34028_ c:control_collection s:shard1 r:core_node1 x:collection1] o.a.s.c.SolrCore org.apache.solr.core.MockDirectoryFactory
   [junit4]   2> 957181 INFO  (coreLoadExecutor-3491-thread-1-processing-n:127.0.0.1:34028_) [n:127.0.0.1:34028_ c:control_collection s:shard1 r:core_node1 x:collection1] o.a.s.c.SolrCore [[collection1] ] Opening new SolrCore at [/export/home/jenkins/workspace/Lucene-Solr-trunk-Solaris/solr/build/solr-core/test/J0/temp/solr.cloud.AsyncMigrateRouteKeyTest_2A1A548F279236AB-001/control-001/cores/collection1], dataDir=[/export/home/jenkins/workspace/Lucene-Solr-trunk-Solaris/solr/build/solr-core/test/J0/temp/solr.cloud.AsyncMigrateRouteKeyTest_2A1A548F279236AB-001/control-001/cores/collection1/data/]
   [junit4]   2> 957181 INFO  (coreLoadExecutor-3491-thread-1-processing-n:127.0.0.1:34028_) [n:127.0.0.1:34028_ c:control_collection s:shard1 r:core_node1 x:collection1] o.a.s.c.JmxMonitoredMap JMX monitoring is enabled. Adding Solr mbeans to JMX Server: com.sun.jmx.mbeanserver.JmxMBeanServer@5e1bd012
   [junit4]   2> 957182 INFO  (coreLoadExecutor-3491-thread-1-processing-n:127.0.0.1:34028_) [n:127.0.0.1:34028_ c:control_collection s:shard1 r:core_node1 x:collection1] o.a.s.c.CachingDirectoryFactory return new directory for /export/home/jenkins/workspace/Lucene-Solr-trunk-Solaris/solr/build/solr-core/test/J0/temp/solr.cloud.AsyncMigrateRouteKeyTest_2A1A548F279236AB-001/control-001/cores/collection1/data
   [junit4]   2> 957182 INFO  (coreLoadExecutor-3491-thread-1-processing-n:127.0.0.1:34028_) [n:127.0.0.1:34028_ c:control_collection s:shard1 r:core_node1 x:collection1] o.a.s.c.SolrCore New index directory detected: old=null new=/export/home/jenkins/workspace/Lucene-Solr-trunk-Solaris/solr/build/solr-core/test/J0/temp/solr.cloud.AsyncMigrateRouteKeyTest_2A1A548F279236AB-001/control-001/cores/collection1/data/index/
   [junit4]   2> 957182 WARN  (coreLoadExecutor-3491-thread-1-processing-n:127.0.0.1:34028_) [n:127.0.0.1:34028_ c:control_collection s:shard1 r:core_node1 x:collection1] o.a.s.c.SolrCore [collection1] Solr index directory '/export/home/jenkins/workspace/Lucene-Solr-trunk-Solaris/solr/build/solr-core/test/J0/temp/solr.cloud.AsyncMigrateRouteKeyTest_2A1A548F279236AB-001/control-001/cores/collection1/data/index' doesn't exist. Creating new index...
   [junit4]   2> 957182 INFO  (coreLoadExecutor-3491-thread-1-processing-n:127.0.0.1:34028_) [n:127.0.0.1:34028_ c:control_collection s:shard1 r:core_node1 x:collection1] o.a.s.c.CachingDirectoryFactory return new directory for /export/home/jenkins/workspace/Lucene-Solr-trunk-Solaris/solr/build/solr-core/test/J0/temp/solr.cloud.AsyncMigrateRouteKeyTest_2A1A548F279236AB-001/control-001/cores/collection1/data/index
   [junit4]   2> 957182 INFO  (coreLoadExecutor-3491-thread-1-processing-n:127.0.0.1:34028_) [n:127.0.0.1:34028_ c:control_collection s:shard1 r:core_node1 x:collection1] o.a.s.u.RandomMergePolicy RandomMergePolicy wrapping class org.apache.lucene.index.TieredMergePolicy: [TieredMergePolicy: maxMergeAtOnce=30, maxMergeAtOnceExplicit=34, maxMergedSegmentMB=75.927734375, floorSegmentMB=0.8544921875, forceMergeDeletesPctAllowed=7.33507383579018, segmentsPerTier=47.0, maxCFSSegmentSizeMB=8.796093022207999E12, noCFSRatio=0.0
   [junit4]   2> 957183 INFO  (coreLoadExecutor-3491-thread-1-processing-n:127.0.0.1:34028_) [n:127.0.0.1:34028_ c:control_collection s:shard1 r:core_node1 x:collection1] o.a.s.c.SolrDeletionPolicy SolrDeletionPolicy.onCommit: commits: num=1
   [junit4]   2> 	commit{dir=MockDirectoryWrapper(RAMDirectory@5615ffe1 lockFactory=org.apache.lucene.store.SingleInstanceLockFactory@4ce68b5c),segFN=segments_1,generation=1}
   [junit4]   2> 957183 INFO  (coreLoadExecutor-3491-thread-1-processing-n:127.0.0.1:34028_) [n:127.0.0.1:34028_ c:control_collection s:shard1 r:core_node1 x:collection1] o.a.s.c.SolrDeletionPolicy newest commit generation = 1
   [junit4]   2> 957183 INFO  (OldIndexDirectoryCleanupThreadForCore-collection1) [n:127.0.0.1:34028_ c:control_collection s:shard1 r:core_node1 x:collection1] o.a.s.c.SolrCore Looking for old index directories to cleanup for core collection1 in /export/home/jenkins/workspace/Lucene-Solr-trunk-Solaris/solr/build/solr-core/test/J0/temp/solr.cloud.AsyncMigrateRouteKeyTest_2A1A548F279236AB-001/control-001/cores/collection1/data/
   [junit4]   2> 957183 WARN  (OldIndexDirectoryCleanupThreadForCore-collection1) [n:127.0.0.1:34028_ c:control_collection s:shard1 r:core_node1 x:collection1] o.a.s.c.DirectoryFactory /export/home/jenkins/workspace/Lucene-Solr-trunk-Solaris/solr/build/solr-core/test/J0/temp/solr.cloud.AsyncMigrateRouteKeyTest_2A1A548F279236AB-001/control-001/cores/collection1/data/ does not point to a valid data directory; skipping clean-up of old index directories.
   [junit4]   2> 957186 INFO  (coreLoadExecutor-3491-thread-1-processing-n:127.0.0.1:34028_) [n:127.0.0.1:34028_ c:control_collection s:shard1 r:core_node1 x:collection1] o.a.s.u.p.UpdateRequestProcessorChain creating updateRequestProcessorChain "nodistrib"
   [junit4]   2> 957186 INFO  (coreLoadExecutor-3491-thread-1-processing-n:127.0.0.1:34028_) [n:127.0.0.1:34028_ c:control_collection s:shard1 r:core_node1 x:collection1] o.a.s.u.p.UpdateRequestProcessorChain creating updateRequestProcessorChain "dedupe"
   [junit4]   2> 957186 INFO  (coreLoadExecutor-3491-thread-1-processing-n:127.0.0.1:34028_) [n:127.0.0.1:34028_ c:control_collection s:shard1 r:core_node1 x:collection1] o.a.s.u.p.UpdateRequestProcessorChain inserting DistributedUpdateProcessorFactory into updateRequestProcessorChain "dedupe"
   [junit4]   2> 957186 INFO  (coreLoadExecutor-3491-thread-1-processing-n:127.0.0.1:34028_) [n:127.0.0.1:34028_ c:control_collection s:shard1 r:core_node1 x:collection1] o.a.s.u.p.UpdateRequestProcessorChain creating updateRequestProcessorChain "stored_sig"
   [junit4]   2> 957186 INFO  (coreLoadExecutor-3491-thread-1-processing-n:127.0.0.1:34028_) [n:127.0.0.1:34028_ c:control_collection s:shard1 r:core_node1 x:collection1] o.a.s.u.p.UpdateRequestProcessorChain inserting DistributedUpdateProcessorFactory into updateRequestProcessorChain "stored_sig"
   [junit4]   2> 957186 INFO  (coreLoadExecutor-3491-thread-1-processing-n:127.0.0.1:34028_) [n:127.0.0.1:34028_ c:control_collection s:shard1 r:core_node1 x:collection1] o.a.s.u.p.UpdateRequestProcessorChain creating updateRequestProcessorChain "distrib-dup-test-chain-explicit"
   [junit4]   2> 957187 INFO  (coreLoadExecutor-3491-thread-1-processing-n:127.0.0.1:34028_) [n:127.0.0.1:34028_ c:control_collection s:shard1 r:core_node1 x:collection1] o.a.s.u.p.UpdateRequestProcessorChain creating updateRequestProcessorChain "distrib-dup-test-chain-implicit"
   [junit4]   2> 957187 INFO  (coreLoadExecutor-3491-thread-1-processing-n:127.0.0.1:34028_) [n:127.0.0.1:34028_ c:control_collection s:shard1 r:core_node1 x:collection1] o.a.s.u.p.UpdateRequestProcessorChain inserting DistributedUpdateProcessorFactory into updateRequestProcessorChain "distrib-dup-test-chain-implicit"
   [junit4]   2> 957187 INFO  (coreLoadExecutor-3491-thread-1-processing-n:127.0.0.1:34028_) [n:127.0.0.1:34028_ c:control_collection s:shard1 r:core_node1 x:collection1] o.a.s.c.SolrCore no updateRequestProcessorChain defined as default, creating implicit default
   [junit4]   2> 957187 WARN  (coreLoadExecutor-3491-thread-1-processing-n:127.0.0.1:34028_) [n:127.0.0.1:34028_ c:control_collection s:shard1 r:core_node1 x:collection1] o.a.s.c.RequestHandlers INVALID paramSet a in requestHandler {type = requestHandler,name = /dump,class = DumpRequestHandler,args = {defaults={a=A,b=B}}}
   [junit4]   2> 957188 INFO  (coreLoadExecutor-3491-thread-1-processing-n:127.0.0.1:34028_) [n:127.0.0.1:34028_ c:control_collection s:shard1 r:core_node1 x:collection1] o.a.s.h.l.XMLLoader xsltCacheLifetimeSeconds=60
   [junit4]   2> 957189 INFO  (coreLoadExecutor-3491-thread-1-processing-n:127.0.0.1:34028_) [n:127.0.0.1:34028_ c:control_collection s:shard1 r:core_node1 x:collection1] o.a.s.h.l.XMLLoader xsltCacheLifetimeSeconds=60
   [junit4]   2> 957190 INFO  (coreLoadExecutor-3491-thread-1-processing-n:127.0.0.1:34028_) [n:127.0.0.1:34028_ c:control_collection s:shard1 r:core_node1 x:collection1] o.a.s.h.l.XMLLoader xsltCacheLifetimeSeconds=60
   [junit4]   2> 957191 INFO  (coreLoadExecutor-3491-thread-1-processing-n:127.0.0.1:34028_) [n:127.0.0.1:34028_ c:control_collection s:shard1 r:core_node1 x:collection1] o.a.s.h.l.XMLLoader xsltCacheLifetimeSeconds=60
   [junit4]   2> 957208 INFO  (coreLoadExecutor-3491-thread-1-processing-n:127.0.0.1:34028_) [n:127.0.0.1:34028_ c:control_collection s:shard1 r:core_node1 x:collection1] o.a.s.c.RequestHandlers Registered paths: /admin/mbeans,standard,/dump,/update/csv,/sql,/update/json/docs,/admin/luke,/export,/admin/segments,/get,/admin/system,/replication,/admin/properties,/config,/stream,/schema,/admin/plugins,/admin/logging,/update/json,/admin/threads,/admin/ping,/update,/admin/file
   [junit4]   2> 957208 INFO  (coreLoadExecutor-3491-thread-1-processing-n:127.0.0.1:34028_) [n:127.0.0.1:34028_ c:control_collection s:shard1 r:core_node1 x:collection1] o.a.s.c.SolrCore Using default statsCache cache: org.apache.solr.search.stats.LocalStatsCache
   [junit4]   2> 957209 INFO  (coreLoadExecutor-3491-thread-1-processing-n:127.0.0.1:34028_) [n:127.0.0.1:34028_ c:control_collection s:shard1 r:core_node1 x:collection1] o.a.s.u.UpdateHandler Using UpdateLog implementation: org.apache.solr.update.UpdateLog
   [junit4]   2> 957209 INFO  (coreLoadExecutor-3491-thread-1-processing-n:127.0.0.1:34028_) [n:127.0.0.1:34028_ c:control_collection s:shard1 r:core_node1 x:collection1] o.a.s.u.UpdateLog Initializing UpdateLog: dataDir= defaultSyncLevel=FLUSH numRecordsToKeep=100 maxNumLogsToKeep=10 numVersionBuckets=65536
   [junit4]   2> 957210 INFO  (coreLoadExecutor-3491-thread-1-processing-n:127.0.0.1:34028_) [n:127.0.0.1:34028_ c:control_collection s:shard1 r:core_node1 x:collection1] o.a.s.u.CommitTracker Hard AutoCommit: disabled
   [junit4]   2> 957210 INFO  (coreLoadExecutor-3491-thread-1-processing-n:127.0.0.1:34028_) [n:127.0.0.1:34028_ c:control_collection s:shard1 r:core_node1 x:collection1] o.a.s.u.CommitTracker Soft AutoCommit: disabled
   [junit4]   2> 957210 INFO  (coreLoadExecutor-3491-thread-1-processing-n:127.0.0.1:34028_) [n:127.0.0.1:34028_ c:control_collection s:shard1 r:core_node1 x:collection1] o.a.s.u.RandomMergePolicy RandomMergePolicy wrapping class org.apache.lucene.index.TieredMergePolicy: [TieredMergePolicy: maxMergeAtOnce=15, maxMergeAtOnceExplicit=20, maxMergedSegmentMB=11.6181640625, floorSegmentMB=1.9541015625, forceMergeDeletesPctAllowed=28.387641771843057, segmentsPerTier=44.0, maxCFSSegmentSizeMB=8.796093022207999E12, noCFSRatio=1.0
   [junit4]   2> 957210 INFO  (coreLoadExecutor-3491-thread-1-processing-n:127.0.0.1:34028_) [n:127.0.0.1:34028_ c:control_collection s:shard1 r:core_node1 x:collection1] o.a.s.c.SolrDeletionPolicy SolrDeletionPolicy.onInit: commits: num=1
   [junit4]   2> 	commit{dir=MockDirectoryWrapper(RAMDirectory@5615ffe1 lockFactory=org.apache.lucene.store.SingleInstanceLockFactory@4ce68b5c),segFN=segments_1,generation=1}
   [junit4]   2> 957210 INFO  (coreLoadExecutor-3491-thread-1-processing-n:127.0.0.1:34028_) [n:127.0.0.1:34028_ c:control_collection s:shard1 r:core_node1 x:collection1] o.a.s.c.SolrDeletionPolicy newest commit generation = 1
   [junit4]   2> 957210 INFO  (coreLoadExecutor-3491-thread-1-processing-n:127.0.0.1:34028_) [n:127.0.0.1:34028_ c:control_collection s:shard1 r:core_node1 x:collection1] o.a.s.s.SolrIndexSearcher Opening [Searcher@6092cda5[collection1] main]
   [junit4]   2> 957211 INFO  (coreLoadExecutor-3491-thread-1-processing-n:127.0.0.1:34028_) [n:127.0.0.1:34028_ c:control_collection s:shard1 r:core_node1 x:collection1] o.a.s.c.c.ZkStateReader Load collection config from: [/collections/control_collection]
   [junit4]   2> 957212 INFO  (coreLoadExecutor-3491-thread-1-processing-n:127.0.0.1:34028_) [n:127.0.0.1:34028_ c:control_collection s:shard1 r:core_node1 x:collection1] o.a.s.c.c.ZkStateReader path=[/collections/control_collection] [configName]=[conf1] specified config exists in ZooKeeper
   [junit4]   2> 957212 INFO  (coreLoadExecutor-3491-thread-1-processing-n:127.0.0.1:34028_) [n:127.0.0.1:34028_ c:control_collection s:shard1 r:core_node1 x:collection1] o.a.s.r.ManagedResourceStorage Setting up ZooKeeper-based storage for the RestManager with znodeBase: /configs/conf1
   [junit4]   2> 957213 INFO  (coreLoadExecutor-3491-thread-1-processing-n:127.0.0.1:34028_) [n:127.0.0.1:34028_ c:control_collection s:shard1 r:core_node1 x:collection1] o.a.s.r.ManagedResourceStorage Configured ZooKeeperStorageIO with znodeBase: /configs/conf1
   [junit4]   2> 957213 INFO  (coreLoadExecutor-3491-thread-1-processing-n:127.0.0.1:34028_) [n:127.0.0.1:34028_ c:control_collection s:shard1 r:core_node1 x:collection1] o.a.s.r.RestManager Initializing RestManager with initArgs: {}
   [junit4]   2> 957213 INFO  (coreLoadExecutor-3491-thread-1-processing-n:127.0.0.1:34028_) [n:127.0.0.1:34028_ c:control_collection s:shard1 r:core_node1 x:collection1] o.a.s.r.ManagedResourceStorage Reading _rest_managed.json using ZooKeeperStorageIO:path=/configs/conf1
   [junit4]   2> 957214 INFO  (coreLoadExecutor-3491-thread-1-processing-n:127.0.0.1:34028_) [n:127.0.0.1:34028_ c:control_collection s:shard1 r:core_node1 x:collection1] o.a.s.r.ManagedResourceStorage No data found for znode /configs/conf1/_rest_managed.json
   [junit4]   2> 957214 INFO  (coreLoadExecutor-3491-thread-1-processing-n:127.0.0.1:34028_) [n:127.0.0.1:34028_ c:control_collection s:shard1 r:core_node1 x:collection1] o.a.s.r.ManagedResourceStorage Loaded null at path _rest_managed.json using ZooKeeperStorageIO:path=/configs/conf1
   [junit4]   2> 957214 INFO  (coreLoadExecutor-3491-thread-1-processing-n:127.0.0.1:34028_) [n:127.0.0.1:34028_ c:control_collection s:shard1 r:core_node1 x:collection1] o.a.s.r.RestManager Initializing 0 registered ManagedResources
   [junit4]   2> 957214 INFO  (coreLoadExecutor-3491-thread-1-processing-n:127.0.0.1:34028_) [n:127.0.0.1:34028_ c:control_collection s:shard1 r:core_node1 x:collection1] o.a.s.h.ReplicationHandler Commits will be reserved for  10000
   [junit4]   2> 957214 INFO  (searcherExecutor-3492-thread-1-processing-n:127.0.0.1:34028_ x:collection1 s:shard1 c:control_collection r:core_node1) [n:127.0.0.1:34028_ c:control_collection s:shard1 r:core_node1 x:collection1] o.a.s.c.SolrCore [collection1] Registered new searcher Searcher@6092cda5[collection1] main{ExitableDirectoryReader(UninvertingDirectoryReader())}
   [junit4]   2> 957214 INFO  (coreLoadExecutor-3491-thread-1-processing-n:127.0.0.1:34028_) [n:127.0.0.1:34028_ c:control_collection s:shard1 r:core_node1 x:collection1] o.a.s.u.UpdateLog Looking up max value of version field to seed version buckets
   [junit4]   2> 957214 INFO  (coreLoadExecutor-3491-thread-1-processing-n:127.0.0.1:34028_) [n:127.0.0.1:34028_ c:control_collection s:shard1 r:core_node1 x:collection1] o.a.s.u.VersionInfo Refreshing highest value of _version_ for 65536 version buckets from index
   [junit4]   2> 957215 INFO  (coreLoadExecutor-3491-thread-1-processing-n:127.0.0.1:34028_) [n:127.0.0.1:34028_ c:control_collection s:shard1 r:core_node1 x:collection1] o.a.s.u.VersionInfo No terms found for _version_, cannot seed version bucket highest value from index
   [junit4]   2> 957215 INFO  (coreLoadExecutor-3491-thread-1-processing-n:127.0.0.1:34028_) [n:127.0.0.1:34028_ c:control_collection s:shard1 r:core_node1 x:collection1] o.a.s.u.UpdateLog Could not find max version in index or recent updates, using new clock 1523120245323071488
   [junit4]   2> 957216 INFO  (coreLoadExecutor-3491-thread-1-processing-n:127.0.0.1:34028_) [n:127.0.0.1:34028_ c:control_collection s:shard1 r:core_node1 x:collection1] o.a.s.u.UpdateLog Took 1.0ms to seed version buckets with highest version 1523120245323071488
   [junit4]   2> 957216 INFO  (coreLoadExecutor-3491-thread-1-processing-n:127.0.0.1:34028_) [n:127.0.0.1:34028_ c:control_collection s:shard1 r:core_node1 x:collection1] o.a.s.c.ZkController watch zkdir /configs/conf1
   [junit4]   2> 957217 INFO  (coreLoadExecutor-3491-thread-1-processing-n:127.0.0.1:34028_) [n:127.0.0.1:34028_ c:control_collection s:shard1 r:core_node1 x:collection1] o.a.s.c.CoreContainer registering core: collection1
   [junit4]   2> 957218 INFO  (coreZkRegister-3485-thread-1-processing-n:127.0.0.1:34028_ x:collection1 s:shard1 c:control_collection r:core_node1) [n:127.0.0.1:34028_ c:control_collection s:shard1 r:core_node1 x:collection1] o.a.s.c.ZkController Register replica - core:collection1 address:http://127.0.0.1:34028 collection:control_collection shard:shard1
   [junit4]   2> 957219 INFO  (coreZkRegister-3485-thread-1-processing-n:127.0.0.1:34028_ x:collection1 s:shard1 c:control_collection r:core_node1) [n:127.0.0.1:34028_ c:control_collection s:shard1 r:core_node1 x:collection1] o.a.s.c.c.SolrZkClient makePath: /collections/control_collection/leader_elect/shard1/election
   [junit4]   2> 957226 INFO  (coreZkRegister-3485-thread-1-processing-n:127.0.0.1:34028_ x:collection1 s:shard1 c:control_collection r:core_node1) [n:127.0.0.1:34028_ c:control_collection s:shard1 r:core_node1 x:collection1] o.a.s.c.LeaderElector Joined leadership election with path: /collections/control_collection/leader_elect/shard1/election/95195015224229892-core_node1-n_0000000000
   [junit4]   2> 957227 INFO  (coreZkRegister-3485-thread-1-processing-n:127.0.0.1:34028_ x:collection1 s:shard1 c:control_collection r:core_node1) [n:127.0.0.1:34028_ c:control_collection s:shard1 r:core_node1 x:collection1] o.a.s.c.ShardLeaderElectionContext Running the leader process for shard=shard1 and weAreReplacement=false and leaderVoteWait=10000
   [junit4]   2> 957229 INFO  (coreZkRegister-3485-thread-1-processing-n:127.0.0.1:34028_ x:collection1 s:shard1 c:control_collection r:core_node1) [n:127.0.0.1:34028_ c:control_collection s:shard1 r:core_node1 x:collection1] o.a.s.c.ShardLeaderElectionContext Enough replicas found to continue.
   [junit4]   2> 957229 INFO  (coreZkRegister-3485-thread-1-processing-n:127.0.0.1:34028_ x:collection1 s:shard1 c:control_collection r:core_node1) [n:127.0.0.1:34028_ c:control_collection s:shard1 r:core_node1 x:collection1] o.a.s.c.ShardLeaderElectionContext I may be the new leader - try and sync
   [junit4]   2> 957229 INFO  (coreZkRegister-3485-thread-1-processing-n:127.0.0.1:34028_ x:collection1 s:shard1 c:control_collection r:core_node1) [n:127.0.0.1:34028_ c:control_collection s:shard1 r:core_node1 x:collection1] o.a.s.c.SyncStrategy Sync replicas to http://127.0.0.1:34028/collection1/
   [junit4]   2> 957229 INFO  (coreZkRegister-3485-thread-1-processing-n:127.0.0.1:34028_ x:collection1 s:shard1 c:control_collection r:core_node1) [n:127.0.0.1:34028_ c:control_collection s:shard1 r:core_node1 x:collection1] o.a.s.c.SyncStrategy Sync Success - now sync replicas to me
   [junit4]   2> 957229 INFO  (coreZkRegister-3485-thread-1-processing-n:127.0.0.1:34028_ x:collection1 s:shard1 c:control_collection r:core_node1) [n:127.0.0.1:34028_ c:control_collection s:shard1 r:core_node1 x:collection1] o.a.s.c.SyncStrategy http://127.0.0.1:34028/collection1/ has no replicas
   [junit4]   2> 957230 INFO  (OverseerStateUpdate-95195015224229892-127.0.0.1:34028_-n_0000000000) [n:127.0.0.1:34028_    ] o.a.s.c.Overseer processMessage: queueSize: 1, message = {
   [junit4]   2>   "operation":"leader",
   [junit4]   2>   "shard":"shard1",
   [junit4]   2>   "collection":"control_collection"} current state version: 1
   [junit4]   2> 957230 INFO  (coreZkRegister-3485-thread-1-processing-n:127.0.0.1:34028_ x:collection1 s:shard1 c:control_collection r:core_node1) [n:127.0.0.1:34028_ c:control_collection s:shard1 r:core_node1 x:collection1] o.a.s.c.c.SolrZkClient makePath: /collections/control_collection/leaders/shard1
   [junit4]   2> 957237 INFO  (coreZkRegister-3485-thread-1-processing-n:127.0.0.1:34028_ x:collection1 s:shard1 c:control_collection r:core_node1) [n:127.0.0.1:34028_ c:control_collection s:shard1 r:core_node1 x:collection1] o.a.s.c.ShardLeaderElectionContextBase Creating leader registration node
   [junit4]   2> 957239 INFO  (coreZkRegister-3485-thread-1-processing-n:127.0.0.1:34028_ x:collection1 s:shard1 c:control_collection r:core_node1) [n:127.0.0.1:34028_ c:control_collection s:shard1 r:core_node1 x:collection1] o.a.s.c.ShardLeaderElectionContext I am the new leader: http://127.0.0.1:34028/collection1/ shard1
   [junit4]   2> 957241 INFO  (OverseerStateUpdate-95195015224229892-127.0.0.1:34028_-n_0000000000) [n:127.0.0.1:34028_    ] o.a.s.c.Overseer processMessage: queueSize: 1, message = {
   [junit4]   2>   "operation":"leader",
   [junit4]   2>   "shard":"shard1",
   [junit4]   2>   "collection":"control_collection",
   [junit4]   2>   "base_url":"http://127.0.0.1:34028",
   [junit4]   2>   "core":"collection1",
   [junit4]   2>   "state":"active"} current state version: 1
   [junit4]   2> 957346 INFO  (zkCallback-1344-thread-1-processing-n:127.0.0.1:34028_) [n:127.0.0.1:34028_    ] o.a.s.c.c.ZkStateReader A cluster state change: [WatchedEvent state:SyncConnected type:NodeDataChanged path:/clusterstate.json], has occurred - updating... (live nodes size: [1])
   [junit4]   2> 957392 INFO  (coreZkRegister-3485-thread-1-processing-n:127.0.0.1:34028_ x:collection1 s:shard1 c:control_collection r:core_node1) [n:127.0.0.1:34028_ c:control_collection s:shard1 r:core_node1 x:collection1] o.a.s.c.ZkController We are http://127.0.0.1:34028/collection1/ and leader is http://127.0.0.1:34028/collection1/
   [junit4]   2> 957392 INFO  (coreZkRegister-3485-thread-1-processing-n:127.0.0.1:34028_ x:collection1 s:shard1 c:control_collection r:core_node1) [n:127.0.0.1:34028_ c:control_collection s:shard1 r:core_node1 x:collection1] o.a.s.c.ZkController No LogReplay needed for core=collection1 baseURL=http://127.0.0.1:34028
   [junit4]   2> 957392 INFO  (coreZkRegister-3485-thread-1-processing-n:127.0.0.1:34028_ x:collection1 s:shard1 c:control_collection r:core_node1) [n:127.0.0.1:34028_ c:control_collection s:shard1 r:core_node1 x:collection1] o.a.s.c.ZkController I am the leader, no recovery necessary
   [junit4]   2> 957393 INFO  (coreZkRegister-3485-thread-1-processing-n:127.0.0.1:34028_ x:collection1 s:shard1 c:control_collection r:core_node1) [n:127.0.0.1:34028_ c:control_collection s:shard1 r:core_node1 x:collection1] o.a.s.c.ZkController publishing state=active
   [junit4]   2> 957393 INFO  (coreZkRegister-3485-thread-1-processing-n:127.0.0.1:34028_ x:collection1 s:shard1 c:control_collection r:core_node1) [n:127.0.0.1:34028_ c:control_collection s:shard1 r:core_node1 x:collection1] o.a.s.c.ZkController numShards not found on descriptor - reading it from system property
   [junit4]   2> 957396 INFO  (OverseerStateUpdate-95195015224229892-127.0.0.1:34028_-n_0000000000) [n:127.0.0.1:34028_    ] o.a.s.c.Overseer processMessage: queueSize: 1, message = {
   [junit4]   2>   "core":"collection1",
   [junit4]   2>   "core_node_name":"core_node1",
   [junit4]   2>   "roles":null,
   [junit4]   2>   "base_url":"http://127.0.0.1:34028",
   [junit4]   2>   "node_name":"127.0.0.1:34028_",
   [junit4]   2>   "numShards":"1",
   [junit4]   2>   "state":"active",
   [junit4]   2>   "shard":"shard1",
   [junit4]   2>   "collection":"control_collection",
   [junit4]   2>   "operation":"state"} current state version: 2
   [junit4]   2> 957397 INFO  (OverseerStateUpdate-95195015224229892-127.0.0.1:34028_-n_0000000000) [n:127.0.0.1:34028_    ] o.a.s.c.o.ReplicaMutator Update state numShards=1 message={
   [junit4]   2>   "core":"collection1",
   [junit4]   2>   "core_node_name":"core_node1",
   [junit4]   2>   "roles":null,
   [junit4]   2>   "base_url":"http://127.0.0.1:34028",
   [junit4]   2>   "node_name":"127.0.0.1:34028_",
   [junit4]   2>   "numShards":"1",
   [junit4]   2>   "state":"active",
   [junit4]   2>   "shard":"shard1",
   [junit4]   2>   "collection":"control_collection",
   [junit4]   2>   "operation":"state"}
   [junit4]   2> 957500 INFO  (zkCallback-1344-thread-1-processing-n:127.0.0.1:34028_) [n:127.0.0.1:34028_    ] o.a.s.c.c.ZkStateReader A cluster state change: [WatchedEvent state:SyncConnected type:NodeDataChanged path:/clusterstate.json], has occurred - updating... (live nodes size: [1])
   [junit4]   2> 957549 INFO  (TEST-AsyncMigrateRouteKeyTest.test-seed#[2A1A548F279236AB]) [    ] o.a.s.c.c.SolrZkClient Using default ZkCredentialsProvider
   [junit4]   2> 957549 INFO  (TEST-AsyncMigrateRouteKeyTest.test-seed#[2A1A548F279236AB]) [    ] o.a.s.c.c.ConnectionManager Waiting for client to connect to ZooKeeper
   [junit4]   2> 957551 INFO  (zkCallback-1346-thread-1) [    ] o.a.s.c.c.ConnectionManager Watcher org.apache.solr.common.cloud.ConnectionManager@29ab6ad8 name:ZooKeeperConnection Watcher:127.0.0.1:48021/solr got event WatchedEvent state:SyncConnected type:None path:null path:null type:None
   [junit4]   2> 957551 INFO  (TEST-AsyncMigrateRouteKeyTest.test-seed#[2A1A548F279236AB]) [    ] o.a.s.c.c.ConnectionManager Client is connected to ZooKeeper
   [junit4]   2> 957551 INFO  (TEST-AsyncMigrateRouteKeyTest.test-seed#[2A1A548F279236AB]) [    ] o.a.s.c.c.SolrZkClient Using default ZkACLProvider
   [junit4]   2> 957551 INFO  (TEST-AsyncMigrateRouteKeyTest.test-seed#[2A1A548F279236AB]) [    ] o.a.s.c.c.ZkStateReader Updating cluster state from ZooKeeper... 
   [junit4]   2> 957555 INFO  (TEST-AsyncMigrateRouteKeyTest.test-seed#[2A1A548F279236AB]) [    ] o.a.s.c.ChaosMonkey monkey: init - expire sessions:false cause connection loss:false
   [junit4]   2> 957555 INFO  (TEST-AsyncMigrateRouteKeyTest.test-seed#[2A1A548F279236AB]) [    ] o.a.s.c.AbstractFullDistribZkTestBase Creating collection1 with stateFormat=2
   [junit4]   2> 957555 INFO  (TEST-AsyncMigrateRouteKeyTest.test-seed#[2A1A548F279236AB]) [    ] o.a.s.c.c.SolrZkClient Using default ZkCredentialsProvider
   [junit4]   2> 957555 INFO  (TEST-AsyncMigrateRouteKeyTest.test-seed#[2A1A548F279236AB]) [    ] o.a.s.c.c.ConnectionManager Waiting for client to connect to ZooKeeper
   [junit4]   2> 957557 INFO  (zkCallback-1347-thread-1) [    ] o.a.s.c.c.ConnectionManager Watcher org.apache.solr.common.cloud.ConnectionManager@7436148e name:ZooKeeperConnection Watcher:127.0.0.1:48021/solr got event WatchedEvent state:SyncConnected type:None path:null path:null type:None
   [junit4]   2> 957558 INFO  (TEST-AsyncMigrateRouteKeyTest.test-seed#[2A1A548F279236AB]) [    ] o.a.s.c.c.ConnectionManager Client is connected to ZooKeeper
   [junit4]   2> 957558 INFO  (TEST-AsyncMigrateRouteKeyTest.test-seed#[2A1A548F279236AB]) [    ] o.a.s.c.c.SolrZkClient Using default ZkACLProvider
   [junit4]   2> 957561 INFO  (OverseerStateUpdate-95195015224229892-127.0.0.1:34028_-n_0000000000) [n:127.0.0.1:34028_    ] o.a.s.c.Overseer processMessage: queueSize: 1, message = {
   [junit4]   2>   "operation":"create",
   [junit4]   2>   "name":"collection1",
   [junit4]   2>   "numShards":"2",
   [junit4]   2>   "stateFormat":"2"} current state version: 3
   [junit4]   2> 957561 INFO  (OverseerStateUpdate-95195015224229892-127.0.0.1:34028_-n_0000000000) [n:127.0.0.1:34028_    ] o.a.s.c.o.ClusterStateMutator building a new cName: collection1
   [junit4]   2> 957665 INFO  (OverseerStateUpdate-95195015224229892-127.0.0.1:34028_-n_0000000000) [n:127.0.0.1:34028_    ] o.a.s.c.o.ZkStateWriter going to create_collection /collections/collection1/state.json
   [junit4]   2> 957701 INFO  (TEST-AsyncMigrateRouteKeyTest.test-seed#[2A1A548F279236AB]) [    ] o.a.s.SolrTestCaseJ4 Writing core.properties file to /export/home/jenkins/workspace/Lucene-Solr-trunk-Solaris/solr/build/solr-core/test/J0/temp/solr.cloud.AsyncMigrateRouteKeyTest_2A1A548F279236AB-001/shard-1-001/cores/collection1
   [junit4]   2> 957702 INFO  (TEST-AsyncMigrateRouteKeyTest.test-seed#[2A1A548F279236AB]) [    ] o.a.s.c.AbstractFullDistribZkTestBase create jetty 1 in directory /export/home/jenkins/workspace/Lucene-Solr-trunk-Solaris/solr/build/solr-core/test/J0/temp/solr.cloud.AsyncMigrateRouteKeyTest_2A1A548F279236AB-001/shard-1-001
   [junit4]   2> 957702 INFO  (TEST-AsyncMigrateRouteKeyTest.test-seed#[2A1A548F279236AB]) [    ] o.e.j.s.Server jetty-9.2.13.v20150730
   [junit4]   2> 957704 INFO  (TEST-AsyncMigrateRouteKeyTest.test-seed#[2A1A548F279236AB]) [    ] o.e.j.s.h.ContextHandler Started o.e.j.s.ServletContextHandler@e597f78{/,null,AVAILABLE}
   [junit4]   2> 957705 INFO  (TEST-AsyncMigrateRouteKeyTest.test-seed#[2A1A548F279236AB]) [    ] o.e.j.s.ServerConnector Started ServerConnector@1a261826{HTTP/1.1}{127.0.0.1:46921}
   [junit4]   2> 957705 INFO  (TEST-AsyncMigrateRouteKeyTest.test-seed#[2A1A548F279236AB]) [    ] o.e.j.s.Server Started @960569ms
   [junit4]   2> 957705 INFO  (TEST-AsyncMigrateRouteKeyTest.test-seed#[2A1A548F279236AB]) [    ] o.a.s.c.s.e.JettySolrRunner Jetty properties: {solr.data.dir=/export/home/jenkins/workspace/Lucene-Solr-trunk-Solaris/solr/build/solr-core/test/J0/temp/solr.cloud.AsyncMigrateRouteKeyTest_2A1A548F279236AB-001/tempDir-001/jetty1, solrconfig=solrconfig.xml, hostContext=/, hostPort=46921, coreRootDirectory=/export/home/jenkins/workspace/Lucene-Solr-trunk-Solaris/solr/build/solr-core/test/J0/../../../../../../../../../../export/home/jenkins/workspace/Lucene-Solr-trunk-Solaris/solr/build/solr-core/test/J0/temp/solr.cloud.AsyncMigrateRouteKeyTest_2A1A548F279236AB-001/shard-1-001/cores}
   [junit4]   2> 957706 INFO  (TEST-AsyncMigrateRouteKeyTest.test-seed#[2A1A548F279236AB]) [    ] o.a.s.s.SolrDispatchFilter SolrDispatchFilter.init(): sun.misc.Launcher$AppClassLoader@659e0bfd
   [junit4]   2> 957706 INFO  (TEST-AsyncMigrateRouteKeyTest.test-seed#[2A1A548F279236AB]) [    ] o.a.s.c.SolrResourceLoader new SolrResourceLoader for directory: '/export/home/jenkins/workspace/Lucene-Solr-trunk-Solaris/solr/build/solr-core/test/J0/temp/solr.cloud.AsyncMigrateRouteKeyTest_2A1A548F279236AB-001/shard-1-001'
   [junit4]   2> 957706 INFO  (TEST-AsyncMigrateRouteKeyTest.test-seed#[2A1A548F279236AB]) [    ] o.a.s.c.SolrResourceLoader JNDI not configured for solr (NoInitialContextEx)
   [junit4]   2> 957706 INFO  (TEST-AsyncMigrateRouteKeyTest.test-seed#[2A1A548F279236AB]) [    ] o.a.s.c.SolrResourceLoader solr home defaulted to 'solr/' (could not find system property or JNDI)
   [junit4]   2> 957706 INFO  (TEST-AsyncMigrateRouteKeyTest.test-seed#[2A1A548F279236AB]) [    ] o.a.s.c.c.SolrZkClient Using default ZkCredentialsProvider
   [junit4]   2> 957706 INFO  (TEST-AsyncMigrateRouteKeyTest.test-seed#[2A1A548F279236AB]) [    ] o.a.s.c.c.ConnectionManager Waiting for client to connect to ZooKeeper
   [junit4]   2> 957708 INFO  (zkCallback-1348-thread-1) [    ] o.a.s.c.c.ConnectionManager Watcher org.apache.solr.common.cloud.ConnectionManager@2227a757 name:ZooKeeperConnection Watcher:127.0.0.1:48021/solr got event WatchedEvent state:SyncConnected type:None path:null path:null type:None
   [junit4]   2> 957708 INFO  (TEST-AsyncMigrateRouteKeyTest.test-seed#[2A1A548F279236AB]) [    ] o.a.s.c.c.ConnectionManager Client is connected to ZooKeeper
   [junit4]   2> 957708 INFO  (TEST-AsyncMigrateRouteKeyTest.test-seed#[2A1A548F279236AB]) [    ] o.a.s.c.c.SolrZkClient Using default ZkACLProvider
   [junit4]   2> 957710 INFO  (TEST-AsyncMigrateRouteKeyTest.test-seed#[2A1A548F279236AB]) [    ] o.a.s.s.SolrDispatchFilter Loading solr.xml from SolrHome (not found in ZooKeeper)
   [junit4]   2> 957710 INFO  (TEST-AsyncMigrateRouteKeyTest.test-seed#[2A1A548F279236AB]) [    ] o.a.s.c.SolrXmlConfig Loading container configuration from /export/home/jenkins/workspace/Lucene-Solr-trunk-Solaris/solr/build/solr-core/test/J0/temp/solr.cloud.AsyncMigrateRouteKeyTest_2A1A548F279236AB-001/shard-1-001/solr.xml
   [junit4]   2> 957714 INFO  (TEST-AsyncMigrateRouteKeyTest.test-seed#[2A1A548F279236AB]) [    ] o.a.s.c.CorePropertiesLocator Config-defined core root directory: /export/home/jenkins/workspace/Lucene-Solr-trunk-Solaris/solr/build/solr-core/test/J0/../../../../../../../../../../export/home/jenkins/workspace/Lucene-Solr-trunk-Solaris/solr/build/solr-core/test/J0/temp/solr.cloud.AsyncMigrateRouteKeyTest_2A1A548F279236AB-001/shard-1-001/cores
   [junit4]   2> 957714 INFO  (TEST-AsyncMigrateRouteKeyTest.test-seed#[2A1A548F279236AB]) [    ] o.a.s.c.CoreContainer New CoreContainer 415920624
   [junit4]   2> 957714 INFO  (TEST-AsyncMigrateRouteKeyTest.test-seed#[2A1A548F279236AB]) [    ] o.a.s.c.CoreContainer Loading cores into CoreContainer [instanceDir=/export/home/jenkins/workspace/Lucene-Solr-trunk-Solaris/solr/build/solr-core/test/J0/temp/solr.cloud.AsyncMigrateRouteKeyTest_2A1A548F279236AB-001/shard-1-001]
   [junit4]   2> 957714 WARN  (TEST-AsyncMigrateRouteKeyTest.test-seed#[2A1A548F279236AB]) [    ] o.a.s.c.CoreContainer Couldn't add files from /export/home/jenkins/workspace/Lucene-Solr-trunk-Solaris/solr/build/solr-core/test/J0/temp/solr.cloud.AsyncMigrateRouteKeyTest_2A1A548F279236AB-001/shard-1-001/lib to classpath: /export/home/jenkins/workspace/Lucene-Solr-trunk-Solaris/solr/build/solr-core/test/J0/temp/solr.cloud.AsyncMigrateRouteKeyTest_2A1A548F279236AB-001/shard-1-001/lib
   [junit4]   2> 957715 INFO  (TEST-AsyncMigrateRouteKeyTest.test-seed#[2A1A548F279236AB]) [    ] o.a.s.h.c.HttpShardHandlerFactory created with socketTimeout : 90000,urlScheme : ,connTimeout : 15000,maxConnectionsPerHost : 20,maxConnections : 10000,corePoolSize : 0,maximumPoolSize : 2147483647,maxThreadIdleTime : 5,sizeOfQueue : -1,fairnessPolicy : false,useRetries : false,
   [junit4]   2> 957716 INFO  (TEST-AsyncMigrateRouteKeyTest.test-seed#[2A1A548F279236AB]) [    ] o.a.s.u.UpdateShardHandler Creating UpdateShardHandler HTTP client with params: socketTimeout=340000&connTimeout=45000&retry=true
   [junit4]   2> 957716 INFO  (TEST-AsyncMigrateRouteKeyTest.test-seed#[2A1A548F279236AB]) [    ] o.a.s.l.LogWatcher SLF4J impl is org.slf4j.impl.Log4jLoggerFactory
   [junit4]   2> 957716 INFO  (TEST-AsyncMigrateRouteKeyTest.test-seed#[2A1A548F279236AB]) [    ] o.a.s.l.LogWatcher Registering Log Listener [Log4j (org.slf4j.impl.Log4jLoggerFactory)]
   [junit4]   2> 957716 INFO  (TEST-AsyncMigrateRouteKeyTest.test-seed#[2A1A548F279236AB]) [    ] o.a.s.c.ZkContainer Zookeeper client=127.0.0.1:48021/solr
   [junit4]   2> 957716 INFO  (TEST-AsyncMigrateRouteKeyTest.test-seed#[2A1A548F279236AB]) [    ] o.a.s.c.ZkController zkHost includes chroot
   [junit4]   2> 957716 INFO  (TEST-AsyncMigrateRouteKeyTest.test-seed#[2A1A548F279236AB]) [    ] o.a.s.c.c.SolrZkClient Using default ZkCredentialsProvider
   [junit4]   2> 957717 INFO  (TEST-AsyncMigrateRouteKeyTest.test-seed#[2A1A548F279236AB]) [    ] o.a.s.c.c.ConnectionManager Waiting for client to connect to ZooKeeper
   [junit4]   2> 957718 INFO  (zkCallback-1351-thread-1) [    ] o.a.s.c.c.ConnectionManager Watcher org.apache.solr.common.cloud.ConnectionManager@51548e15 name:ZooKeeperConnection Watcher:127.0.0.1:48021 got event WatchedEvent state:SyncConnected type:None path:null path:null type:None
   [junit4]   2> 957719 INFO  (TEST-AsyncMigrateRouteKeyTest.test-seed#[2A1A548F279236AB]) [    ] o.a.s.c.c.ConnectionManager Client is connected to ZooKeeper
   [junit4]   2> 957719 INFO  (TEST-AsyncMigrateRouteKeyTest.test-seed#[2A1A548F279236AB]) [    ] o.a.s.c.c.SolrZkClient Using default ZkACLProvider
   [junit4]   2> 957720 INFO  (TEST-AsyncMigrateRouteKeyTest.test-seed#[2A1A548F279236AB]) [n:127.0.0.1:46921_    ] o.a.s.c.c.ConnectionManager Waiting for client to connect to ZooKeeper
   [junit4]   2> 957722 INFO  (zkCallback-1352-thread-1-processing-n:127.0.0.1:46921_) [n:127.0.0.1:46921_    ] o.a.s.c.c.ConnectionManager Watcher org.apache.solr.common.cloud.ConnectionManager@59e03237 name:ZooKeeperConnection Watcher:127.0.0.1:48021/solr got event WatchedEvent state:SyncConnected type:None path:null path:null type:None
   [junit4]   2> 957722 INFO  (TEST-AsyncMigrateRouteKeyTest.test-seed#[2A1A548F279236AB]) [n:127.0.0.1:46921_    ] o.a.s.c.c.ConnectionManager Client is connected to ZooKeeper
   [junit4]   2> 957730 INFO  (TEST-AsyncMigrateRouteKeyTest.test-seed#[2A1A548F279236AB]) [n:127.0.0.1:46921_    ] o.a.s.c.c.ZkStateReader Updating cluster state from ZooKeeper... 
   [junit4]   2> 958741 INFO  (TEST-AsyncMigrateRouteKeyTest.test-seed#[2A1A548F279236AB]) [n:127.0.0.1:46921_    ] o.a.s.c.ZkController Register node as live in ZooKeeper:/live_nodes/127.0.0.1:46921_
   [junit4]   2> 958742 INFO  (TEST-AsyncMigrateRouteKeyTest.test-seed#[2A1A548F279236AB]) [n:127.0.0.1:46921_    ] o.a.s.c.c.SolrZkClient makePath: /live_nodes/127.0.0.1:46921_
   [junit4]   2> 958743 INFO  (zkCallback-1344-thread-1-processing-n:127.0.0.1:34028_) [n:127.0.0.1:34028_    ] o.a.s.c.c.ZkStateReader A live node change: [WatchedEvent state:SyncConnected type:NodeChildrenChanged path:/live_nodes], has occurred - updating... (live nodes size: [1])
   [junit4]   2> 958743 INFO  (zkCallback-1346-thread-1) [    ] o.a.s.c.c.ZkStateReader A live node change: [WatchedEvent state:SyncConnected type:NodeChildrenChanged path:/live_nodes], has occurred - updating... (live nodes size: [1])
   [junit4]   2> 958743 INFO  (zkCallback-1352-thread-1-processing-n:127.0.0.1:46921_) [n:127.0.0.1:46921_    ] o.a.s.c.c.ZkStateReader A live node change: [WatchedEvent state:SyncConnected type:NodeChildrenChanged path:/live_nodes], has occurred - updating... (live nodes size: [1])
   [junit4]   2> 958745 INFO  (TEST-AsyncMigrateRouteKeyTest.test-seed#[2A1A548F279236AB]) [n:127.0.0.1:46921_    ] o.a.s.c.Overseer Overseer (id=null) closing
   [junit4]   2> 958746 INFO  (TEST-AsyncMigrateRouteKeyTest.test-seed#[2A1A548F279236AB]) [n:127.0.0.1:46921_    ] o.a.s.c.LeaderElector Joined leadership election with path: /overseer_elect/election/95195015224229897-127.0.0.1:46921_-n_0000000001
   [junit4]   2> 958747 INFO  (TEST-AsyncMigrateRouteKeyTest.test-seed#[2A1A548F279236AB]) [n:127.0.0.1:46921_    ] o.a.s.c.LeaderElector Watching path /overseer_elect/election/95195015224229892-127.0.0.1:34028_-n_0000000000 to know if I could be the leader
   [junit4]   2> 958763 INFO  (TEST-AsyncMigrateRouteKeyTest.test-seed#[2A1A548F279236AB]) [n:127.0.0.1:46921_    ] o.a.s.c.CoreContainer Security conf doesn't exist. Skipping setup for authorization module.
   [junit4]   2> 958763 INFO  (TEST-AsyncMigrateRouteKeyTest.test-seed#[2A1A548F279236AB]) [n:127.0.0.1:46921_    ] o.a.s.c.CoreContainer No authentication plugin used.
   [junit4]   2> 958764 INFO  (TEST-AsyncMigrateRouteKeyTest.test-seed#[2A1A548F279236AB]) [n:127.0.0.1:46921_    ] o.a.s.c.CorePropertiesLocator Looking for core definitions underneath /export/home/jenkins/workspace/Lucene-Solr-trunk-Solaris/solr/build/solr-core/test/J0/../../../../../../../../../../export/home/jenkins/workspace/Lucene-Solr-trunk-Solaris/solr/build/solr-core/test/J0/temp/solr.cloud.AsyncMigrateRouteKeyTest_2A1A548F279236AB-001/shard-1-001/cores
   [junit4]   2> 958765 INFO  (TEST-AsyncMigrateRouteKeyTest.test-seed#[2A1A548F279236AB]) [n:127.0.0.1:46921_    ] o.a.s.c.CoreDescriptor Created CoreDescriptor: {name=collection1, config=solrconfig.xml, transient=false, schema=schema.xml, loadOnStartup=true, configSetProperties=configsetprops.json, collection=collection1, coreNodeName=, dataDir=data/, shard=}
   [junit4]   2> 958765 INFO  (TEST-AsyncMigrateRouteKeyTest.test-seed#[2A1A548F279236AB]) [n:127.0.0.1:46921_    ] o.a.s.c.CorePropertiesLocator Found core collection1 in /export/home/jenkins/workspace/Lucene-Solr-trunk-Solaris/solr/build/solr-core/test/J0/../../../../../../../../../../export/home/jenkins/workspace/Lucene-Solr-trunk-Solaris/solr/build/solr-core/test/J0/temp/solr.cloud.AsyncMigrateRouteKeyTest_2A1A548F279236AB-001/shard-1-001/cores/collection1
   [junit4]   2> 958765 INFO  (TEST-AsyncMigrateRouteKeyTest.test-seed#[2A1A548F279236AB]) [n:127.0.0.1:46921_    ] o.a.s.c.CorePropertiesLocator Found 1 core definitions
   [junit4]   2> 958767 INFO  (TEST-AsyncMigrateRouteKeyTest.test-seed#[2A1A548F279236AB]) [n:127.0.0.1:46921_    ] o.a.s.s.SolrDispatchFilter user.dir=/export/home/jenkins/workspace/Lucene-Solr-trunk-Solaris/solr/build/solr-core/test/J0
   [junit4]   2> 958767 INFO  (TEST-AsyncMigrateRouteKeyTest.test-seed#[2A1A548F279236AB]) [n:127.0.0.1:46921_    ] o.a.s.s.SolrDispatchFilter SolrDispatchFilter.init() done
   [junit4]   2> 958767 INFO  (coreLoadExecutor-3502-thread-1-processing-n:127.0.0.1:46921_) [n:127.0.0.1:46921_ c:collection1   x:collection1] o.a.s.c.ZkController publishing state=down
   [junit4]   2> 958767 INFO  (coreLoadExecutor-3502-thread-1-processing-n:127.0.0.1:46921_) [n:127.0.0.1:46921_ c:collection1   x:collection1] o.a.s.c.ZkController numShards not found on descriptor - reading it from system property
   [junit4]   2> 958770 INFO  (coreLoadExecutor-3502-thread-1-processing-n:127.0.0.1:46921_) [n:127.0.0.1:46921_ c:collection1   x:collection1] o.a.s.c.ZkController Registering watch for collection collection1
   [junit4]   2> 958770 INFO  (coreLoadExecutor-3502-thread-1-processing-n:127.0.0.1:46921_) [n:127.0.0.1:46921_ c:collection1   x:collection1] o.a.s.c.c.ZkStateReader addZkWatch [collection1]
   [junit4]   2> 958770 INFO  (coreLoadExecutor-3502-thread-1-processing-n:127.0.0.1:46921_) [n:127.0.0.1:46921_ c:collection1   x:collection1] o.a.s.c.c.ZkStateReader Add data for [collection1] ver [0]
   [junit4]   2> 958770 INFO  (coreLoadExecutor-3502-thread-1-processing-n:127.0.0.1:46921_) [n:127.0.0.1:46921_ c:collection1   x:collection1] o.a.s.c.ZkController look for our core node name
   [junit4]   2> 958770 INFO  (OverseerStateUpdate-95195015224229892-127.0.0.1:34028_-n_0000000000) [n:127.0.0.1:34028_    ] o.a.s.c.Overseer processMessage: queueSize: 1, message = {
   [junit4]   2>   "core":"collection1",
   [junit4]   2>   "roles":null,
   [junit4]   2>   "base_url":"http://127.0.0.1:46921",
   [junit4]   2>   "node_name":"127.0.0.1:46921_",
   [junit4]   2>   "numShards":"2",
   [junit4]   2>   "state":"down",
   [junit4]   2>   "shard":null,
   [junit4]   2>   "collection":"collection1",
   [junit4]   2>   "operation":"state"} current state version: 3
   [junit4]   2> 958771 INFO  (OverseerStateUpdate-95195015224229892-127.0.0.1:34028_-n_0000000000) [n:127.0.0.1:34028_    ] o.a.s.c.o.ReplicaMutator Update state numShards=2 message={
   [junit4]   2>   "core":"collection1",
   [junit4]   2>   "roles":null,
   [junit4]   2>   "base_url":"http://127.0.0.1:46921",
   [junit4]   2>   "node_name":"127.0.0.1:46921_",
   [junit4]   2>   "numShards":"2",
   [junit4]   2>   "state":"down",
   [junit4]   2>   "shard":null,
   [junit4]   2>   "collection":"collection1",
   [junit4]   2>   "operation":"state"}
   [junit4]   2> 958771 INFO  (OverseerStateUpdate-95195015224229892-127.0.0.1:34028_-n_0000000000) [n:127.0.0.1:34028_    ] o.a.s.c.o.ReplicaMutator Collection already exists with numShards=2
   [junit4]   2> 958771 INFO  (OverseerStateUpdate-95195015224229892-127.0.0.1:34028_-n_0000000000) [n:127.0.0.1:34028_    ] o.a.s.c.o.ReplicaMutator Assigning new node to shard shard=shard2
   [junit4]   2> 958874 INFO  (OverseerStateUpdate-95195015224229892-127.0.0.1:34028_-n_0000000000) [n:127.0.0.1:34028_    ] o.a.s.c.o.ZkStateWriter going to update_collection /collections/collection1/state.json version: 0
   [junit4]   2> 958875 INFO  (zkCallback-1352-thread-1-processing-n:127.0.0.1:46921_) [n:127.0.0.1:46921_    ] o.a.s.c.c.ZkStateReader A cluster state change: [WatchedEvent state:SyncConnected type:NodeDataChanged path:/collections/collection1/state.json] for collection [collection1] has occurred - updating... (live nodes size: [2])
   [junit4]   2> 958876 INFO  (zkCallback-1352-thread-1-processing-n:127.0.0.1:46921_) [n:127.0.0.1:46921_    ] o.a.s.c.c.ZkStateReader Updating data for [collection1] from [0] to [1]
   [junit4]   2> 959772 INFO  (coreLoadExecutor-3502-thread-1-processing-n:127.0.0.1:46921_) [n:127.0.0.1:46921_ c:collection1   x:collection1] o.a.s.c.ZkController waiting to find shard id in clusterstate for collection1
   [junit4]   2> 959772 INFO  (coreLoadExecutor-3502-thread-1-processing-n:127.0.0.1:46921_) [n:127.0.0.1:46921_ c:collection1   x:collection1] o.a.s.c.ZkController Check for collection zkNode:collection1
   [junit4]   2> 959772 INFO  (coreLoadExecutor-3502-thread-1-processing-n:127.0.0.1:46921_) [n:127.0.0.1:46921_ c:collection1   x:collection1] o.a.s.c.ZkController Collection zkNode exists
   [junit4]   2> 959772 INFO  (coreLoadExecutor-3502-thread-1-processing-n:127.0.0.1:46921_) [n:127.0.0.1:46921_ c:collection1   x:collection1] o.a.s.c.c.ZkStateReader Load collection config from: [/collections/collection1]
   [junit4]   2> 959774 INFO  (coreLoadExecutor-3502-thread-1-processing-n:127.0.0.1:46921_) [n:127.0.0.1:46921_ c:collection1   x:collection1] o.a.s.c.c.ZkStateReader path=[/collections/collection1] [configName]=[conf1] specified config exists in ZooKeeper
   [junit4]   2> 959774 INFO  (coreLoadExecutor-3502-thread-1-processing-n:127.0.0.1:46921_) [n:127.0.0.1:46921_ c:collection1   x:collection1] o.a.s.c.SolrResourceLoader new SolrResourceLoader for directory: '/export/home/jenkins/workspace/Lucene-Solr-trunk-Solaris/solr/build/solr-core/test/J0/temp/solr.cloud.AsyncMigrateRouteKeyTest_2A1A548F279236AB-001/shard-1-001/cores/collection1'
   [junit4]   2> 959774 INFO  (coreLoadExecutor-3502-thread-1-processing-n:127.0.0.1:46921_) [n:127.0.0.1:46921_ c:collection1   x:collection1] o.a.s.c.SolrResourceLoader JNDI not configured for solr (NoInitialContextEx)
   [junit4]   2> 959774 INFO  (coreLoadExecutor-3502-thread-1-processing-n:127.0.0.1:46921_) [n:127.0.0.1:46921_ c:collection1   x:collection1] o.a.s.c.SolrResourceLoader solr home defaulted to 'solr/' (could not find system property or JNDI)
   [junit4]   2> 959776 INFO  (coreLoadExecutor-3502-thread-1-processing-n:127.0.0.1:46921_) [n:127.0.0.1:46921_ c:collection1   x:collection1] o.a.s.c.Config loaded config solrconfig.xml with version 0 
   [junit4]   2> 959781 INFO  (coreLoadExecutor-3502-thread-1-processing-n:127.0.0.1:46921_) [n:127.0.0.1:46921_ c:collection1   x:collection1] o.a.s.c.SolrConfig current version of requestparams : -1
   [junit4]   2> 959783 INFO  (coreLoadExecutor-3502-thread-1-processing-n:127.0.0.1:46921_) [n:127.0.0.1:46921_ c:collection1   x:collection1] o.a.s.c.SolrConfig Using Lucene MatchVersion: 6.0.0
   [junit4]   2> 959790 INFO  (coreLoadExecutor-3502-thread-1-processing-n:127.0.0.1:46921_) [n:127.0.0.1:46921_ c:collection1   x:collection1] o.a.s.c.SolrConfig Loaded SolrConfig: solrconfig.xml
   [junit4]   2> 959795 INFO  (coreLoadExecutor-3502-thread-1-processing-n:127.0.0.1:46921_) [n:127.0.0.1:46921_ c:collection1   x:collection1] o.a.s.s.IndexSchema [collection1] Schema name=test
   [junit4]   2> 959896 INFO  (coreLoadExecutor-3502-thread-1-processing-n:127.0.0.1:46921_) [n:127.0.0.1:46921_ c:collection1   x:collection1] o.a.s.s.IndexSchema default search field in schema is text
   [junit4]   2> 959897 INFO  (coreLoadExecutor-3502-thread-1-processing-n:127.0.0.1:46921_) [n:127.0.0.1:46921_ c:collection1   x:collection1] o.a.s.s.IndexSchema unique key field: id
   [junit4]   2> 959898 INFO  (coreLoadExecutor-3502-thread-1-processing-n:127.0.0.1:46921_) [n:127.0.0.1:46921_ c:collection1   x:collection1] o.a.s.s.FileExchangeRateProvider Reloading exchange rates from file currency.xml
   [junit4]   2> 959900 INFO  (coreLoadExecutor-3502-thread-1-processing-n:127.0.0.1:46921_) [n:127.0.0.1:46921_ c:collection1   x:collection1] o.a.s.s.FileExchangeRateProvider Reloading exchange rates from file currency.xml
   [junit4]   2> 959926 INFO  (coreLoadExecutor-3502-thread-1-processing-n:127.0.0.1:46921_) [n:127.0.0.1:46921_ c:collection1   x:collection1] o.a.s.c.ConfigSetProperties Did not find ConfigSet properties, assuming default properties: Can't find resource 'configsetprops.json' in classpath or '/configs/conf1', cwd=/export/home/jenkins/workspace/Lucene-Solr-trunk-Solaris/solr/build/solr-core/test/J0
   [junit4]   2> 959926 INFO  (coreLoadExecutor-3502-thread-1-processing-n:127.0.0.1:46921_) [n:127.0.0.1:46921_ c:collection1   x:collection1] o.a.s.c.CoreContainer Creating SolrCore 'collection1' using configuration from collection collection1
   [junit4]   2> 959926 INFO  (coreLoadExecutor-3502-thread-1-processing-n:127.0.0.1:46921_) [n:127.0.0.1:46921_ c:collection1 s:shard2 r:core_node1 x:collection1] o.a.s.c.SolrCore org.apache.solr.core.MockDirectoryFactory
   [junit4]   2> 959926 INFO  (coreLoadExecutor-3502-thread-1-processing-n:127.0.0.1:46921_) [n:127.0.0.1:46921_ c:collection1 s:shard2 r:core_node1 x:collection1] o.a.s.c.SolrCore [[collection1] ] Opening new SolrCore at [/export/home/jenkins/workspace/Lucene-Solr-trunk-Solaris/solr/build/solr-core/test/J0/temp/solr.cloud.AsyncMigrateRouteKeyTest_2A1A548F279236AB-001/shard-1-001/cores/collection1], dataDir=[/export/home/jenkins/workspace/Lucene-Solr-trunk-Solaris/solr/build/solr-core/test/J0/../../../../../../../../../../export/home/jenkins/workspace/Lucene-Solr-trunk-Solaris/solr/build/solr-core/test/J0/temp/solr.cloud.AsyncMigrateRouteKeyTest_2A1A548F279236AB-001/shard-1-001/cores/collection1/data/]
   [junit4]   2> 959927 INFO  (coreLoadExecutor-3502-thread-1-processing-n:127.0.0.1:46921_) [n:127.0.0.1:46921_ c:collection1 s:shard2 r:core_node1 x:collection1] o.a.s.c.JmxMonitoredMap JMX monitoring is enabled. Adding Solr mbeans to JMX Server: com.sun.jmx.mbeanserver.JmxMBeanServer@5e1bd012
   [junit4]   2> 959927 INFO  (coreLoadExecutor-3502-thread-1-processing-n:127.0.0.1:46921_) [n:127.0.0.1:46921_ c:collection1 s:shard2 r:core_node1 x:collection1] o.a.s.c.CachingDirectoryFactory return new directory for /export/home/jenkins/workspace/Lucene-Solr-trunk-Solaris/solr/build/solr-core/test/J0/../../../../../../../../../../export/home/jenkins/workspace/Lucene-Solr-trunk-Solaris/solr/build/solr-core/test/J0/temp/solr.cloud.AsyncMigrateRouteKeyTest_2A1A548F279236AB-001/shard-1-001/cores/collection1/data
   [junit4]   2> 959927 INFO  (coreLoadExecutor-3502-thread-1-processing-n:127.0.0.1:46921_) [n:127.0.0.1:46921_ c:collection1 s:shard2 r:core_node1 x:collection1] o.a.s.c.SolrCore New index directory detected: old=null new=/export/home/jenkins/workspace/Lucene-Solr-trunk-Solaris/solr/build/solr-core/test/J0/../../../../../../../../../../export/home/jenkins/workspace/Lucene-Solr-trunk-Solaris/solr/build/solr-core/test/J0/temp/solr.cloud.AsyncMigrateRouteKeyTest_2A1A548F279236AB-001/shard-1-001/cores/collection1/data/index/
   [junit4]   2> 959927 WARN  (coreLoadExecutor-3502-thread-1-processing-n:127.0.0.1:46921_) [n:127.0.0.1:46921_ c:collection1 s:shard2 r:core_node1 x:collection1] o.a.s.c.SolrCore [collection1] Solr index directory '/export/home/jenkins/workspace/Lucene-Solr-trunk-Solaris/solr/build/solr-core/test/J0/../../../../../../../../../../export/home/jenkins/workspace/Lucene-Solr-trunk-Solaris/solr/build/solr-core/test/J0/temp/solr.cloud.AsyncMigrateRouteKeyTest_2A1A548F279236AB-001/shard-1-001/cores/collection1/data/index' doesn't exist. Creating new index...
   [junit4]   2> 959927 INFO  (coreLoadExecutor-3502-thread-1-processing-n:127.0.0.1:46921_) [n:127.0.0.1:46921_ c:collection1 s:shard2 r:core_node1 x:collection1] o.a.s.c.CachingDirectoryFactory return new directory for /export/home/jenkins/workspace/Lucene-Solr-trunk-Solaris/solr/build/solr-core/test/J0/../../../../../../../../../../export/home/jenkins/workspace/Lucene-Solr-trunk-Solaris/solr/build/solr-core/test/J0/temp/solr.cloud.AsyncMigrateRouteKeyTest_2A1A548F279236AB-001/shard-1-001/cores/collection1/data/index
   [junit4]   2> 959927 INFO  (coreLoadExecutor-3502-thread-1-processing-n:127.0.0.1:46921_) [n:127.0.0.1:46921_ c:collection1 s:shard2 r:core_node1 x:collection1] o.a.s.u.RandomMergePolicy RandomMergePolicy wrapping class org.apache.lucene.index.TieredMergePolicy: [TieredMergePolicy: maxMergeAtOnce=30, maxMergeAtOnceExplicit=34, maxMergedSegmentMB=75.927734375, floorSegmentMB=0.8544921875, forceMergeDeletesPctAllowed=7.33507383579018, segmentsPerTier=47.0, maxCFSSegmentSizeMB=8.796093022207999E12, noCFSRatio=0.0
   [junit4]   2> 959928 INFO  (coreLoadExecutor-3502-thread-1-processing-n:127.0.0.1:46921_) [n:127.0.0.1:46921_ c:collection1 s:shard2 r:core_node1 x:collection1] o.a.s.c.SolrDeletionPolicy SolrDeletionPolicy.onCommit: commits: num=1
   [junit4]   2> 	commit{dir=MockDirectoryWrapper(RAMDirectory@ca3a24e lockFactory=org.apache.lucene.store.SingleInstanceLockFactory@65c04932),segFN=segments_1,generation=1}
   [junit4]   2> 959928 INFO  (coreLoadExecutor-3502-thread-1-processing-n:127.0.0.1:46921_) [n:127.0.0.1:46921_ c:collection1 s:shard2 r:core_node1 x:collection1] o.a.s.c.SolrDeletionPolicy newest commit generation = 1
   [junit4]   2> 959928 INFO  (OldIndexDirectoryCleanupThreadForCore-collection1) [n:127.0.0.1:46921_ c:collection1 s:shard2 r:core_node1 x:collection1] o.a.s.c.SolrCore Looking for old index directories to cleanup for core collection1 in /export/home/jenkins/workspace/Lucene-Solr-trunk-Solaris/solr/build/solr-core/test/J0/../../../../../../../../../../export/home/jenkins/workspace/Lucene-Solr-trunk-Solaris/solr/build/solr-core/test/J0/temp/solr.cloud.AsyncMigrateRouteKeyTest_2A1A548F279236AB-001/shard-1-001/cores/collection1/data/
   [junit4]   2> 959929 WARN  (OldIndexDirectoryCleanupThreadForCore-collection1) [n:127.0.0.1:46921_ c:collection1 s:shard2 r:core_node1 x:collection1] o.a.s.c.DirectoryFactory /export/home/jenkins/workspace/Lucene-Solr-trunk-Solaris/solr/build/solr-core/test/J0/../../../../../../../../../../export/home/jenkins/workspace/Lucene-Solr-trunk-Solaris/solr/build/solr-core/test/J0/temp/solr.cloud.AsyncMigrateRouteKeyTest_2A1A548F279236AB-001/shard-1-001/cores/collection1/data/ does not point to a valid data directory; skipping clean-up of old index directories.
   [junit4]   2> 959931 INFO  (coreLoadExecutor-3502-thread-1-processing-n:127.0.0.1:46921_) [n:127.0.0.1:46921_ c:collection1 s:shard2 r:core_node1 x:collection1] o.a.s.u.p.UpdateRequestProcessorChain creating updateRequestProcessorChain "nodistrib"
   [junit4]   2> 959931 INFO  (coreLoadExecutor-3502-thread-1-processing-n:127.0.0.1:46921_) [n:127.0.0.1:46921_ c:collection1 s:shard2 r:core_node1 x:collection1] o.a.s.u.p.UpdateRequestProcessorChain creating updateRequestProcessorChain "dedupe"
   [junit4]   2> 959931 INFO  (coreLoadExecutor-3502-thread-1-processing-n:127.0.0.1:46921_) [n:127.0.0.1:46921_ c:collection1 s:shard2 r:core_node1 x:collection1] o.a.s.u.p.UpdateRequestProcessorChain inserting DistributedUpdateProcessorFactory into updateRequestProcessorChain "dedupe"
   [junit4]   2> 959931 INFO  (coreLoadExecutor-3502-thread-1-processing-n:127.0.0.

[...truncated too long message...]

t=0;path=/export/home/jenkins/workspace/Lucene-Solr-trunk-Solaris/solr/build/solr-core/test/J0/temp/solr.cloud.AsyncMigrateRouteKeyTest_2A1A548F279236AB-001/shard-4-001/cores/collection1/data;done=false>>]
   [junit4]   2> 994306 INFO  (zkCallback-1368-thread-1-processing-n:127.0.0.1:59748_) [n:127.0.0.1:59748_ c:collection1 s:shard1 r:core_node4 x:collection1] o.a.s.c.CachingDirectoryFactory Closing directory: /export/home/jenkins/workspace/Lucene-Solr-trunk-Solaris/solr/build/solr-core/test/J0/temp/solr.cloud.AsyncMigrateRouteKeyTest_2A1A548F279236AB-001/shard-4-001/cores/collection1/data
   [junit4]   2> 994306 INFO  (zkCallback-1368-thread-1-processing-n:127.0.0.1:59748_) [n:127.0.0.1:59748_ c:collection1 s:shard1 r:core_node4 x:collection1] o.a.s.c.ShardLeaderElectionContextBase No version found for ephemeral leader parent node, won't remove previous leader registration.
   [junit4]   2> 994306 INFO  (zkCallback-1368-thread-1-processing-n:127.0.0.1:59748_) [n:127.0.0.1:59748_ c:collection1 s:shard1 r:core_node4 x:collection1] o.a.s.c.ElectionContext Canceling election /collections/collection1/leader_elect/shard1/election/95195015224229906-core_node4-n_0000000001
   [junit4]   2> 994306 WARN  (zkCallback-1368-thread-1-processing-n:127.0.0.1:59748_) [n:127.0.0.1:59748_ c:collection1 s:shard1 r:core_node4 x:collection1] o.a.s.c.LeaderElector 
   [junit4]   2> org.apache.zookeeper.KeeperException$SessionExpiredException: KeeperErrorCode = Session expired for /collections/collection1/leader_elect/shard1/election/95195015224229906-core_node4-n_0000000001
   [junit4]   2> 	at org.apache.zookeeper.KeeperException.create(KeeperException.java:127)
   [junit4]   2> 	at org.apache.zookeeper.KeeperException.create(KeeperException.java:51)
   [junit4]   2> 	at org.apache.zookeeper.ZooKeeper.delete(ZooKeeper.java:873)
   [junit4]   2> 	at org.apache.solr.common.cloud.SolrZkClient$2.execute(SolrZkClient.java:244)
   [junit4]   2> 	at org.apache.solr.common.cloud.SolrZkClient$2.execute(SolrZkClient.java:241)
   [junit4]   2> 	at org.apache.solr.common.cloud.ZkCmdExecutor.retryOperation(ZkCmdExecutor.java:61)
   [junit4]   2> 	at org.apache.solr.common.cloud.SolrZkClient.delete(SolrZkClient.java:241)
   [junit4]   2> 	at org.apache.solr.cloud.ElectionContext.cancelElection(ElectionContext.java:87)
   [junit4]   2> 	at org.apache.solr.cloud.ShardLeaderElectionContextBase.cancelElection(ElectionContext.java:167)
   [junit4]   2> 	at org.apache.solr.cloud.ShardLeaderElectionContext.cancelElection(ElectionContext.java:268)
   [junit4]   2> 	at org.apache.solr.cloud.ShardLeaderElectionContext.runLeaderProcess(ElectionContext.java:444)
   [junit4]   2> 	at org.apache.solr.cloud.LeaderElector.runIamLeaderProcess(LeaderElector.java:198)
   [junit4]   2> 	at org.apache.solr.cloud.LeaderElector.checkIfIamLeader(LeaderElector.java:158)
   [junit4]   2> 	at org.apache.solr.cloud.LeaderElector.access$200(LeaderElector.java:59)
   [junit4]   2> 	at org.apache.solr.cloud.LeaderElector$ElectionWatcher.process(LeaderElector.java:389)
   [junit4]   2> 	at org.apache.solr.common.cloud.SolrZkClient$3$1.run(SolrZkClient.java:269)
   [junit4]   2> 	at java.util.concurrent.Executors$RunnableAdapter.call(Executors.java:511)
   [junit4]   2> 	at java.util.concurrent.FutureTask.run(FutureTask.java:266)
   [junit4]   2> 	at org.apache.solr.common.util.ExecutorUtil$MDCAwareThreadPoolExecutor$1.run(ExecutorUtil.java:232)
   [junit4]   2> 	at java.util.concurrent.ThreadPoolExecutor.runWorker(ThreadPoolExecutor.java:1142)
   [junit4]   2> 	at java.util.concurrent.ThreadPoolExecutor$Worker.run(ThreadPoolExecutor.java:617)
   [junit4]   2> 	at java.lang.Thread.run(Thread.java:745)
   [junit4]   2> 994308 INFO  (TEST-AsyncMigrateRouteKeyTest.test-seed#[2A1A548F279236AB]) [    ] o.e.j.s.ServerConnector Stopped ServerConnector@4b8071e9{HTTP/1.1}{127.0.0.1:0}
   [junit4]   2> 994308 INFO  (TEST-AsyncMigrateRouteKeyTest.test-seed#[2A1A548F279236AB]) [    ] o.e.j.s.h.ContextHandler Stopped o.e.j.s.ServletContextHandler@52f6b736{/,null,UNAVAILABLE}
   [junit4]   2> 994310 INFO  (TEST-AsyncMigrateRouteKeyTest.test-seed#[2A1A548F279236AB]) [n:127.0.0.1:59748_ c:collection1 s:shard1 r:core_node4 x:collection1] o.a.s.c.ZkTestServer connecting to 127.0.0.1:48021 48021
   [junit4]   2> 995578 INFO  (Thread-3497) [    ] o.a.s.c.ZkTestServer connecting to 127.0.0.1:48021 48021
   [junit4]   2> 995580 WARN  (Thread-3497) [    ] o.a.s.c.ZkTestServer Watch limit violations: 
   [junit4]   2> Maximum concurrent create/delete watches above limit:
   [junit4]   2> 
   [junit4]   2> 	6	/solr/aliases.json
   [junit4]   2> 	5	/solr/security.json
   [junit4]   2> 	5	/solr/configs/conf1
   [junit4]   2> 
   [junit4]   2> Maximum concurrent data watches above limit:
   [junit4]   2> 
   [junit4]   2> 	6	/solr/clusterstate.json
   [junit4]   2> 	4	/solr/collections/collection1/state.json
   [junit4]   2> 
   [junit4]   2> Maximum concurrent children watches above limit:
   [junit4]   2> 
   [junit4]   2> 	6	/solr/live_nodes
   [junit4]   2> 	6	/solr/collections
   [junit4]   2> 	3	/solr/overseer/queue
   [junit4]   2> 	3	/solr/overseer/collection-queue-work
   [junit4]   2> 
   [junit4]   2> NOTE: reproduce with: ant test  -Dtestcase=AsyncMigrateRouteKeyTest -Dtests.method=test -Dtests.seed=2A1A548F279236AB -Dtests.slow=true -Dtests.locale=ar_IQ -Dtests.timezone=Europe/Monaco -Dtests.asserts=true -Dtests.file.encoding=UTF-8
   [junit4] FAILURE 40.1s J0 | AsyncMigrateRouteKeyTest.test <<<
   [junit4]    > Throwable #1: java.lang.AssertionError: There are still nodes recoverying - waited for 15 seconds
   [junit4]    > 	at __randomizedtesting.SeedInfo.seed([2A1A548F279236AB:A24E6B55896E5B53]:0)
   [junit4]    > 	at org.apache.solr.cloud.AbstractDistribZkTestBase.waitForRecoveriesToFinish(AbstractDistribZkTestBase.java:175)
   [junit4]    > 	at org.apache.solr.cloud.AbstractFullDistribZkTestBase.waitForRecoveriesToFinish(AbstractFullDistribZkTestBase.java:857)
   [junit4]    > 	at org.apache.solr.cloud.AbstractFullDistribZkTestBase.waitForThingsToLevelOut(AbstractFullDistribZkTestBase.java:1413)
   [junit4]    > 	at org.apache.solr.cloud.AsyncMigrateRouteKeyTest.test(AsyncMigrateRouteKeyTest.java:42)
   [junit4]    > 	at org.apache.solr.BaseDistributedSearchTestCase$ShardsRepeatRule$ShardsFixedStatement.callStatement(BaseDistributedSearchTestCase.java:965)
   [junit4]    > 	at org.apache.solr.BaseDistributedSearchTestCase$ShardsRepeatRule$ShardsStatement.evaluate(BaseDistributedSearchTestCase.java:940)
   [junit4]    > 	at java.lang.Thread.run(Thread.java:745)
   [junit4]   2> 995608 INFO  (SUITE-AsyncMigrateRouteKeyTest-seed#[2A1A548F279236AB]-worker) [n:127.0.0.1:59748_ c:collection1 s:shard1 r:core_node4 x:collection1] o.a.s.SolrTestCaseJ4 ###deleteCore
   [junit4]   2> NOTE: leaving temporary files on disk at: /export/home/jenkins/workspace/Lucene-Solr-trunk-Solaris/solr/build/solr-core/test/J0/temp/solr.cloud.AsyncMigrateRouteKeyTest_2A1A548F279236AB-001
   [junit4]   2> NOTE: test params are: codec=Asserting(Lucene60): {}, docValues:{}, sim=ClassicSimilarity, locale=ar_IQ, timezone=Europe/Monaco
   [junit4]   2> NOTE: SunOS 5.11 amd64/Oracle Corporation 1.8.0_66 (64-bit)/cpus=3,threads=1,free=170535256,total=518979584
   [junit4]   2> NOTE: All tests run in this JVM: [TestManagedSchema, TestMiniSolrCloudClusterBase, TestFileDictionaryLookup, StandardRequestHandlerTest, TestArbitraryIndexDir, TestStressReorder, SolrCloudExampleTest, HLLUtilTest, BigEndianAscendingWordDeserializerTest, ZkCLITest, TestCloudSchemaless, TestAnalyzeInfixSuggestions, SolrRequestParserTest, HighlighterMaxOffsetTest, DirectoryFactoryTest, OverseerTest, ZkStateWriterTest, TestAuthorizationFramework, TestReRankQParserPlugin, AnalyticsMergeStrategyTest, SchemaVersionSpecificBehaviorTest, DocumentAnalysisRequestHandlerTest, CloudExitableDirectoryReaderTest, SpatialHeatmapFacetsTest, BitVectorTest, DeleteShardTest, TestSolrConfigHandlerConcurrent, TestRuleBasedAuthorizationPlugin, RequestLoggingTest, TestReplicationHandler, IndexBasedSpellCheckerTest, TestAuthenticationFramework, TestConfigReload, BlockJoinFacetRandomTest, TestCoreContainer, RulesTest, TestShardHandlerFactory, TestLFUCache, CustomCollectionTest, LeaderInitiatedRecoveryOnShardRestartTest, MoreLikeThisHandlerTest, TestInitQParser, SuggesterFSTTest, OverseerRolesTest, TestInfoStreamLogging, GraphQueryTest, TestManagedSchemaFieldResource, TestTrackingShardHandlerFactory, UUIDUpdateProcessorFallbackTest, SyncSliceTest, SystemInfoHandlerTest, AsyncMigrateRouteKeyTest]
   [junit4] Completed [110/575 (1!)] on J0 in 40.07s, 1 test, 1 failure <<< FAILURES!

[...truncated 1498 lines...]
BUILD FAILED
/export/home/jenkins/workspace/Lucene-Solr-trunk-Solaris/build.xml:784: The following error occurred while executing this line:
/export/home/jenkins/workspace/Lucene-Solr-trunk-Solaris/build.xml:728: The following error occurred while executing this line:
/export/home/jenkins/workspace/Lucene-Solr-trunk-Solaris/build.xml:59: The following error occurred while executing this line:
/export/home/jenkins/workspace/Lucene-Solr-trunk-Solaris/solr/build.xml:233: The following error occurred while executing this line:
/export/home/jenkins/workspace/Lucene-Solr-trunk-Solaris/solr/common-build.xml:516: The following error occurred while executing this line:
/export/home/jenkins/workspace/Lucene-Solr-trunk-Solaris/lucene/common-build.xml:1424: The following error occurred while executing this line:
/export/home/jenkins/workspace/Lucene-Solr-trunk-Solaris/lucene/common-build.xml:981: There were test failures: 575 suites (8 ignored), 2291 tests, 1 failure, 85 ignored (70 assumptions) [seed: 2A1A548F279236AB]

Total time: 68 minutes 36 seconds
Build step 'Invoke Ant' marked build as failure
Archiving artifacts
[WARNINGS] Skipping publisher since build result is FAILURE
Recording test results
Email was triggered for: Failure - Any
Sending email for trigger: Failure - Any



Mime
View raw message