lucene-dev mailing list archives

Site index · List index
Message view « Date » · « Thread »
Top « Date » · « Thread »
From Policeman Jenkins Server <jenk...@thetaphi.de>
Subject [JENKINS-EA] Lucene-Solr-trunk-Linux (32bit/jdk-9-ea+95) - Build # 15491 - Failure!
Date Sat, 09 Jan 2016 07:40:52 GMT
Build: http://jenkins.thetaphi.de/job/Lucene-Solr-trunk-Linux/15491/
Java: 32bit/jdk-9-ea+95 -server -XX:+UseG1GC -XX:-CompactStrings

1 tests failed.
FAILED:  org.apache.solr.cloud.HttpPartitionTest.test

Error Message:
Didn't see all replicas for shard shard1 in c8n_1x2 come up within 30000 ms! ClusterState: {   "collection1":{     "replicationFactor":"1",     "shards":{       "shard1":{         "range":"80000000-ffffffff",         "state":"active",         "replicas":{"core_node2":{             "core":"collection1",             "base_url":"http://127.0.0.1:44615",             "node_name":"127.0.0.1:44615_",             "state":"active",             "leader":"true"}}},       "shard2":{         "range":"0-7fffffff",         "state":"active",         "replicas":{           "core_node1":{             "core":"collection1",             "base_url":"http://127.0.0.1:57383",             "node_name":"127.0.0.1:57383_",             "state":"active",             "leader":"true"},           "core_node3":{             "core":"collection1",             "base_url":"http://127.0.0.1:54432",             "node_name":"127.0.0.1:54432_",             "state":"active"}}}},     "router":{"name":"compositeId"},     "maxShardsPerNode":"1",     "autoAddReplicas":"false",     "autoCreated":"true"},   "control_collection":{     "replicationFactor":"1",     "shards":{"shard1":{         "range":"80000000-7fffffff",         "state":"active",         "replicas":{"core_node1":{             "core":"collection1",             "base_url":"http://127.0.0.1:37655",             "node_name":"127.0.0.1:37655_",             "state":"active",             "leader":"true"}}}},     "router":{"name":"compositeId"},     "maxShardsPerNode":"1",     "autoAddReplicas":"false",     "autoCreated":"true"},   "c8n_1x2":{     "replicationFactor":"2",     "shards":{"shard1":{         "range":"80000000-7fffffff",         "state":"active",         "replicas":{           "core_node1":{             "core":"c8n_1x2_shard1_replica1",             "base_url":"http://127.0.0.1:57383",             "node_name":"127.0.0.1:57383_",             "state":"active",             "leader":"true"},           "core_node2":{             "core":"c8n_1x2_shard1_replica2",             "base_url":"http://127.0.0.1:37655",             "node_name":"127.0.0.1:37655_",             "state":"recovering"}}}},     "router":{"name":"compositeId"},     "maxShardsPerNode":"1",     "autoAddReplicas":"false"},   "collMinRf_1x3":{     "replicationFactor":"3",     "shards":{"shard1":{         "range":"80000000-7fffffff",         "state":"active",         "replicas":{           "core_node1":{             "core":"collMinRf_1x3_shard1_replica1",             "base_url":"http://127.0.0.1:44615",             "node_name":"127.0.0.1:44615_",             "state":"active"},           "core_node2":{             "core":"collMinRf_1x3_shard1_replica2",             "base_url":"http://127.0.0.1:37655",             "node_name":"127.0.0.1:37655_",             "state":"active"},           "core_node3":{             "core":"collMinRf_1x3_shard1_replica3",             "base_url":"http://127.0.0.1:57383",             "node_name":"127.0.0.1:57383_",             "state":"active",             "leader":"true"}}}},     "router":{"name":"compositeId"},     "maxShardsPerNode":"1",     "autoAddReplicas":"false"}}

Stack Trace:
java.lang.AssertionError: Didn't see all replicas for shard shard1 in c8n_1x2 come up within 30000 ms! ClusterState: {
  "collection1":{
    "replicationFactor":"1",
    "shards":{
      "shard1":{
        "range":"80000000-ffffffff",
        "state":"active",
        "replicas":{"core_node2":{
            "core":"collection1",
            "base_url":"http://127.0.0.1:44615",
            "node_name":"127.0.0.1:44615_",
            "state":"active",
            "leader":"true"}}},
      "shard2":{
        "range":"0-7fffffff",
        "state":"active",
        "replicas":{
          "core_node1":{
            "core":"collection1",
            "base_url":"http://127.0.0.1:57383",
            "node_name":"127.0.0.1:57383_",
            "state":"active",
            "leader":"true"},
          "core_node3":{
            "core":"collection1",
            "base_url":"http://127.0.0.1:54432",
            "node_name":"127.0.0.1:54432_",
            "state":"active"}}}},
    "router":{"name":"compositeId"},
    "maxShardsPerNode":"1",
    "autoAddReplicas":"false",
    "autoCreated":"true"},
  "control_collection":{
    "replicationFactor":"1",
    "shards":{"shard1":{
        "range":"80000000-7fffffff",
        "state":"active",
        "replicas":{"core_node1":{
            "core":"collection1",
            "base_url":"http://127.0.0.1:37655",
            "node_name":"127.0.0.1:37655_",
            "state":"active",
            "leader":"true"}}}},
    "router":{"name":"compositeId"},
    "maxShardsPerNode":"1",
    "autoAddReplicas":"false",
    "autoCreated":"true"},
  "c8n_1x2":{
    "replicationFactor":"2",
    "shards":{"shard1":{
        "range":"80000000-7fffffff",
        "state":"active",
        "replicas":{
          "core_node1":{
            "core":"c8n_1x2_shard1_replica1",
            "base_url":"http://127.0.0.1:57383",
            "node_name":"127.0.0.1:57383_",
            "state":"active",
            "leader":"true"},
          "core_node2":{
            "core":"c8n_1x2_shard1_replica2",
            "base_url":"http://127.0.0.1:37655",
            "node_name":"127.0.0.1:37655_",
            "state":"recovering"}}}},
    "router":{"name":"compositeId"},
    "maxShardsPerNode":"1",
    "autoAddReplicas":"false"},
  "collMinRf_1x3":{
    "replicationFactor":"3",
    "shards":{"shard1":{
        "range":"80000000-7fffffff",
        "state":"active",
        "replicas":{
          "core_node1":{
            "core":"collMinRf_1x3_shard1_replica1",
            "base_url":"http://127.0.0.1:44615",
            "node_name":"127.0.0.1:44615_",
            "state":"active"},
          "core_node2":{
            "core":"collMinRf_1x3_shard1_replica2",
            "base_url":"http://127.0.0.1:37655",
            "node_name":"127.0.0.1:37655_",
            "state":"active"},
          "core_node3":{
            "core":"collMinRf_1x3_shard1_replica3",
            "base_url":"http://127.0.0.1:57383",
            "node_name":"127.0.0.1:57383_",
            "state":"active",
            "leader":"true"}}}},
    "router":{"name":"compositeId"},
    "maxShardsPerNode":"1",
    "autoAddReplicas":"false"}}
	at __randomizedtesting.SeedInfo.seed([6FA626F4C96F9A0:8EAE5DB5E26A9458]:0)
	at org.junit.Assert.fail(Assert.java:93)
	at org.apache.solr.cloud.AbstractFullDistribZkTestBase.ensureAllReplicasAreActive(AbstractFullDistribZkTestBase.java:1844)
	at org.apache.solr.cloud.HttpPartitionTest.testRf2(HttpPartitionTest.java:349)
	at org.apache.solr.cloud.HttpPartitionTest.test(HttpPartitionTest.java:109)
	at sun.reflect.NativeMethodAccessorImpl.invoke0(Native Method)
	at sun.reflect.NativeMethodAccessorImpl.invoke(NativeMethodAccessorImpl.java:62)
	at sun.reflect.DelegatingMethodAccessorImpl.invoke(DelegatingMethodAccessorImpl.java:43)
	at java.lang.reflect.Method.invoke(Method.java:520)
	at com.carrotsearch.randomizedtesting.RandomizedRunner.invoke(RandomizedRunner.java:1764)
	at com.carrotsearch.randomizedtesting.RandomizedRunner$8.evaluate(RandomizedRunner.java:871)
	at com.carrotsearch.randomizedtesting.RandomizedRunner$9.evaluate(RandomizedRunner.java:907)
	at com.carrotsearch.randomizedtesting.RandomizedRunner$10.evaluate(RandomizedRunner.java:921)
	at org.apache.solr.BaseDistributedSearchTestCase$ShardsRepeatRule$ShardsFixedStatement.callStatement(BaseDistributedSearchTestCase.java:965)
	at org.apache.solr.BaseDistributedSearchTestCase$ShardsRepeatRule$ShardsStatement.evaluate(BaseDistributedSearchTestCase.java:940)
	at com.carrotsearch.randomizedtesting.rules.SystemPropertiesRestoreRule$1.evaluate(SystemPropertiesRestoreRule.java:57)
	at org.apache.lucene.util.TestRuleSetupTeardownChained$1.evaluate(TestRuleSetupTeardownChained.java:50)
	at org.apache.lucene.util.AbstractBeforeAfterRule$1.evaluate(AbstractBeforeAfterRule.java:46)
	at org.apache.lucene.util.TestRuleThreadAndTestName$1.evaluate(TestRuleThreadAndTestName.java:49)
	at org.apache.lucene.util.TestRuleIgnoreAfterMaxFailures$1.evaluate(TestRuleIgnoreAfterMaxFailures.java:65)
	at org.apache.lucene.util.TestRuleMarkFailure$1.evaluate(TestRuleMarkFailure.java:48)
	at com.carrotsearch.randomizedtesting.rules.StatementAdapter.evaluate(StatementAdapter.java:36)
	at com.carrotsearch.randomizedtesting.ThreadLeakControl$StatementRunner.run(ThreadLeakControl.java:367)
	at com.carrotsearch.randomizedtesting.ThreadLeakControl.forkTimeoutingTask(ThreadLeakControl.java:809)
	at com.carrotsearch.randomizedtesting.ThreadLeakControl$3.evaluate(ThreadLeakControl.java:460)
	at com.carrotsearch.randomizedtesting.RandomizedRunner.runSingleTest(RandomizedRunner.java:880)
	at com.carrotsearch.randomizedtesting.RandomizedRunner$5.evaluate(RandomizedRunner.java:781)
	at com.carrotsearch.randomizedtesting.RandomizedRunner$6.evaluate(RandomizedRunner.java:816)
	at com.carrotsearch.randomizedtesting.RandomizedRunner$7.evaluate(RandomizedRunner.java:827)
	at com.carrotsearch.randomizedtesting.rules.StatementAdapter.evaluate(StatementAdapter.java:36)
	at com.carrotsearch.randomizedtesting.rules.SystemPropertiesRestoreRule$1.evaluate(SystemPropertiesRestoreRule.java:57)
	at org.apache.lucene.util.AbstractBeforeAfterRule$1.evaluate(AbstractBeforeAfterRule.java:46)
	at com.carrotsearch.randomizedtesting.rules.StatementAdapter.evaluate(StatementAdapter.java:36)
	at org.apache.lucene.util.TestRuleStoreClassName$1.evaluate(TestRuleStoreClassName.java:42)
	at com.carrotsearch.randomizedtesting.rules.NoShadowingOrOverridesOnMethodsRule$1.evaluate(NoShadowingOrOverridesOnMethodsRule.java:40)
	at com.carrotsearch.randomizedtesting.rules.NoShadowingOrOverridesOnMethodsRule$1.evaluate(NoShadowingOrOverridesOnMethodsRule.java:40)
	at com.carrotsearch.randomizedtesting.rules.StatementAdapter.evaluate(StatementAdapter.java:36)
	at com.carrotsearch.randomizedtesting.rules.StatementAdapter.evaluate(StatementAdapter.java:36)
	at com.carrotsearch.randomizedtesting.rules.StatementAdapter.evaluate(StatementAdapter.java:36)
	at org.apache.lucene.util.TestRuleAssertionsRequired$1.evaluate(TestRuleAssertionsRequired.java:54)
	at org.apache.lucene.util.TestRuleMarkFailure$1.evaluate(TestRuleMarkFailure.java:48)
	at org.apache.lucene.util.TestRuleIgnoreAfterMaxFailures$1.evaluate(TestRuleIgnoreAfterMaxFailures.java:65)
	at org.apache.lucene.util.TestRuleIgnoreTestSuites$1.evaluate(TestRuleIgnoreTestSuites.java:55)
	at com.carrotsearch.randomizedtesting.rules.StatementAdapter.evaluate(StatementAdapter.java:36)
	at com.carrotsearch.randomizedtesting.ThreadLeakControl$StatementRunner.run(ThreadLeakControl.java:367)
	at java.lang.Thread.run(Thread.java:747)




Build Log:
[...truncated 10014 lines...]
   [junit4] Suite: org.apache.solr.cloud.HttpPartitionTest
   [junit4]   2> Creating dataDir: /home/jenkins/workspace/Lucene-Solr-trunk-Linux/solr/build/solr-core/test/J1/temp/solr.cloud.HttpPartitionTest_6FA626F4C96F9A0-001/init-core-data-001
   [junit4]   2> 436213 INFO  (SUITE-HttpPartitionTest-seed#[6FA626F4C96F9A0]-worker) [    ] o.a.s.BaseDistributedSearchTestCase Setting hostContext system property: /
   [junit4]   2> 436214 INFO  (TEST-HttpPartitionTest.test-seed#[6FA626F4C96F9A0]) [    ] o.a.s.c.ZkTestServer STARTING ZK TEST SERVER
   [junit4]   2> 436214 INFO  (Thread-1405) [    ] o.a.s.c.ZkTestServer client port:0.0.0.0/0.0.0.0:0
   [junit4]   2> 436214 INFO  (Thread-1405) [    ] o.a.s.c.ZkTestServer Starting server
   [junit4]   2> 436314 INFO  (TEST-HttpPartitionTest.test-seed#[6FA626F4C96F9A0]) [    ] o.a.s.c.ZkTestServer start zk server on port:45936
   [junit4]   2> 436314 INFO  (TEST-HttpPartitionTest.test-seed#[6FA626F4C96F9A0]) [    ] o.a.s.c.c.SolrZkClient Using default ZkCredentialsProvider
   [junit4]   2> 436315 INFO  (TEST-HttpPartitionTest.test-seed#[6FA626F4C96F9A0]) [    ] o.a.s.c.c.ConnectionManager Waiting for client to connect to ZooKeeper
   [junit4]   2> 436316 INFO  (zkCallback-517-thread-1) [    ] o.a.s.c.c.ConnectionManager Watcher org.apache.solr.common.cloud.ConnectionManager@efec36 name:ZooKeeperConnection Watcher:127.0.0.1:45936 got event WatchedEvent state:SyncConnected type:None path:null path:null type:None
   [junit4]   2> 436316 INFO  (TEST-HttpPartitionTest.test-seed#[6FA626F4C96F9A0]) [    ] o.a.s.c.c.ConnectionManager Client is connected to ZooKeeper
   [junit4]   2> 436317 INFO  (TEST-HttpPartitionTest.test-seed#[6FA626F4C96F9A0]) [    ] o.a.s.c.c.SolrZkClient Using default ZkACLProvider
   [junit4]   2> 436317 INFO  (TEST-HttpPartitionTest.test-seed#[6FA626F4C96F9A0]) [    ] o.a.s.c.c.SolrZkClient makePath: /solr
   [junit4]   2> 436318 INFO  (TEST-HttpPartitionTest.test-seed#[6FA626F4C96F9A0]) [    ] o.a.s.c.c.SolrZkClient Using default ZkCredentialsProvider
   [junit4]   2> 436318 INFO  (TEST-HttpPartitionTest.test-seed#[6FA626F4C96F9A0]) [    ] o.a.s.c.c.ConnectionManager Waiting for client to connect to ZooKeeper
   [junit4]   2> 436319 INFO  (zkCallback-518-thread-1) [    ] o.a.s.c.c.ConnectionManager Watcher org.apache.solr.common.cloud.ConnectionManager@1773465 name:ZooKeeperConnection Watcher:127.0.0.1:45936/solr got event WatchedEvent state:SyncConnected type:None path:null path:null type:None
   [junit4]   2> 436319 INFO  (TEST-HttpPartitionTest.test-seed#[6FA626F4C96F9A0]) [    ] o.a.s.c.c.ConnectionManager Client is connected to ZooKeeper
   [junit4]   2> 436319 INFO  (TEST-HttpPartitionTest.test-seed#[6FA626F4C96F9A0]) [    ] o.a.s.c.c.SolrZkClient Using default ZkACLProvider
   [junit4]   2> 436319 INFO  (TEST-HttpPartitionTest.test-seed#[6FA626F4C96F9A0]) [    ] o.a.s.c.c.SolrZkClient makePath: /collections/collection1
   [junit4]   2> 436319 INFO  (TEST-HttpPartitionTest.test-seed#[6FA626F4C96F9A0]) [    ] o.a.s.c.c.SolrZkClient makePath: /collections/collection1/shards
   [junit4]   2> 436320 INFO  (TEST-HttpPartitionTest.test-seed#[6FA626F4C96F9A0]) [    ] o.a.s.c.c.SolrZkClient makePath: /collections/control_collection
   [junit4]   2> 436320 INFO  (TEST-HttpPartitionTest.test-seed#[6FA626F4C96F9A0]) [    ] o.a.s.c.c.SolrZkClient makePath: /collections/control_collection/shards
   [junit4]   2> 436321 INFO  (TEST-HttpPartitionTest.test-seed#[6FA626F4C96F9A0]) [    ] o.a.s.c.AbstractZkTestCase put /home/jenkins/workspace/Lucene-Solr-trunk-Linux/solr/core/src/test-files/solr/collection1/conf/solrconfig-tlog.xml to /configs/conf1/solrconfig.xml
   [junit4]   2> 436321 INFO  (TEST-HttpPartitionTest.test-seed#[6FA626F4C96F9A0]) [    ] o.a.s.c.c.SolrZkClient makePath: /configs/conf1/solrconfig.xml
   [junit4]   2> 436321 INFO  (TEST-HttpPartitionTest.test-seed#[6FA626F4C96F9A0]) [    ] o.a.s.c.AbstractZkTestCase put /home/jenkins/workspace/Lucene-Solr-trunk-Linux/solr/core/src/test-files/solr/collection1/conf/schema.xml to /configs/conf1/schema.xml
   [junit4]   2> 436321 INFO  (TEST-HttpPartitionTest.test-seed#[6FA626F4C96F9A0]) [    ] o.a.s.c.c.SolrZkClient makePath: /configs/conf1/schema.xml
   [junit4]   2> 436322 INFO  (TEST-HttpPartitionTest.test-seed#[6FA626F4C96F9A0]) [    ] o.a.s.c.AbstractZkTestCase put /home/jenkins/workspace/Lucene-Solr-trunk-Linux/solr/core/src/test-files/solr/collection1/conf/solrconfig.snippet.randomindexconfig.xml to /configs/conf1/solrconfig.snippet.randomindexconfig.xml
   [junit4]   2> 436322 INFO  (TEST-HttpPartitionTest.test-seed#[6FA626F4C96F9A0]) [    ] o.a.s.c.c.SolrZkClient makePath: /configs/conf1/solrconfig.snippet.randomindexconfig.xml
   [junit4]   2> 436323 INFO  (TEST-HttpPartitionTest.test-seed#[6FA626F4C96F9A0]) [    ] o.a.s.c.AbstractZkTestCase put /home/jenkins/workspace/Lucene-Solr-trunk-Linux/solr/core/src/test-files/solr/collection1/conf/stopwords.txt to /configs/conf1/stopwords.txt
   [junit4]   2> 436323 INFO  (TEST-HttpPartitionTest.test-seed#[6FA626F4C96F9A0]) [    ] o.a.s.c.c.SolrZkClient makePath: /configs/conf1/stopwords.txt
   [junit4]   2> 436323 INFO  (TEST-HttpPartitionTest.test-seed#[6FA626F4C96F9A0]) [    ] o.a.s.c.AbstractZkTestCase put /home/jenkins/workspace/Lucene-Solr-trunk-Linux/solr/core/src/test-files/solr/collection1/conf/protwords.txt to /configs/conf1/protwords.txt
   [junit4]   2> 436323 INFO  (TEST-HttpPartitionTest.test-seed#[6FA626F4C96F9A0]) [    ] o.a.s.c.c.SolrZkClient makePath: /configs/conf1/protwords.txt
   [junit4]   2> 436324 INFO  (TEST-HttpPartitionTest.test-seed#[6FA626F4C96F9A0]) [    ] o.a.s.c.AbstractZkTestCase put /home/jenkins/workspace/Lucene-Solr-trunk-Linux/solr/core/src/test-files/solr/collection1/conf/currency.xml to /configs/conf1/currency.xml
   [junit4]   2> 436324 INFO  (TEST-HttpPartitionTest.test-seed#[6FA626F4C96F9A0]) [    ] o.a.s.c.c.SolrZkClient makePath: /configs/conf1/currency.xml
   [junit4]   2> 436325 INFO  (TEST-HttpPartitionTest.test-seed#[6FA626F4C96F9A0]) [    ] o.a.s.c.AbstractZkTestCase put /home/jenkins/workspace/Lucene-Solr-trunk-Linux/solr/core/src/test-files/solr/collection1/conf/enumsConfig.xml to /configs/conf1/enumsConfig.xml
   [junit4]   2> 436325 INFO  (TEST-HttpPartitionTest.test-seed#[6FA626F4C96F9A0]) [    ] o.a.s.c.c.SolrZkClient makePath: /configs/conf1/enumsConfig.xml
   [junit4]   2> 436325 INFO  (TEST-HttpPartitionTest.test-seed#[6FA626F4C96F9A0]) [    ] o.a.s.c.AbstractZkTestCase put /home/jenkins/workspace/Lucene-Solr-trunk-Linux/solr/core/src/test-files/solr/collection1/conf/open-exchange-rates.json to /configs/conf1/open-exchange-rates.json
   [junit4]   2> 436325 INFO  (TEST-HttpPartitionTest.test-seed#[6FA626F4C96F9A0]) [    ] o.a.s.c.c.SolrZkClient makePath: /configs/conf1/open-exchange-rates.json
   [junit4]   2> 436326 INFO  (TEST-HttpPartitionTest.test-seed#[6FA626F4C96F9A0]) [    ] o.a.s.c.AbstractZkTestCase put /home/jenkins/workspace/Lucene-Solr-trunk-Linux/solr/core/src/test-files/solr/collection1/conf/mapping-ISOLatin1Accent.txt to /configs/conf1/mapping-ISOLatin1Accent.txt
   [junit4]   2> 436326 INFO  (TEST-HttpPartitionTest.test-seed#[6FA626F4C96F9A0]) [    ] o.a.s.c.c.SolrZkClient makePath: /configs/conf1/mapping-ISOLatin1Accent.txt
   [junit4]   2> 436326 INFO  (TEST-HttpPartitionTest.test-seed#[6FA626F4C96F9A0]) [    ] o.a.s.c.AbstractZkTestCase put /home/jenkins/workspace/Lucene-Solr-trunk-Linux/solr/core/src/test-files/solr/collection1/conf/old_synonyms.txt to /configs/conf1/old_synonyms.txt
   [junit4]   2> 436326 INFO  (TEST-HttpPartitionTest.test-seed#[6FA626F4C96F9A0]) [    ] o.a.s.c.c.SolrZkClient makePath: /configs/conf1/old_synonyms.txt
   [junit4]   2> 436327 INFO  (TEST-HttpPartitionTest.test-seed#[6FA626F4C96F9A0]) [    ] o.a.s.c.AbstractZkTestCase put /home/jenkins/workspace/Lucene-Solr-trunk-Linux/solr/core/src/test-files/solr/collection1/conf/synonyms.txt to /configs/conf1/synonyms.txt
   [junit4]   2> 436327 INFO  (TEST-HttpPartitionTest.test-seed#[6FA626F4C96F9A0]) [    ] o.a.s.c.c.SolrZkClient makePath: /configs/conf1/synonyms.txt
   [junit4]   2> 436411 INFO  (TEST-HttpPartitionTest.test-seed#[6FA626F4C96F9A0]) [    ] o.a.s.SolrTestCaseJ4 Writing core.properties file to /home/jenkins/workspace/Lucene-Solr-trunk-Linux/solr/build/solr-core/test/J1/temp/solr.cloud.HttpPartitionTest_6FA626F4C96F9A0-001/control-001/cores/collection1
   [junit4]   2> 436413 INFO  (TEST-HttpPartitionTest.test-seed#[6FA626F4C96F9A0]) [    ] o.e.j.s.Server jetty-9.2.13.v20150730
   [junit4]   2> 436413 INFO  (TEST-HttpPartitionTest.test-seed#[6FA626F4C96F9A0]) [    ] o.e.j.s.h.ContextHandler Started o.e.j.s.ServletContextHandler@128875d{/,null,AVAILABLE}
   [junit4]   2> 436415 INFO  (TEST-HttpPartitionTest.test-seed#[6FA626F4C96F9A0]) [    ] o.e.j.s.ServerConnector Started ServerConnector@1b17801{HTTP/1.1}{127.0.0.1:55762}
   [junit4]   2> 436415 INFO  (TEST-HttpPartitionTest.test-seed#[6FA626F4C96F9A0]) [    ] o.e.j.s.Server Started @438229ms
   [junit4]   2> 436415 INFO  (TEST-HttpPartitionTest.test-seed#[6FA626F4C96F9A0]) [    ] o.a.s.c.s.e.JettySolrRunner Jetty properties: {solr.data.dir=/home/jenkins/workspace/Lucene-Solr-trunk-Linux/solr/build/solr-core/test/J1/temp/solr.cloud.HttpPartitionTest_6FA626F4C96F9A0-001/tempDir-001/control/data, hostContext=/, hostPort=37655, coreRootDirectory=/home/jenkins/workspace/Lucene-Solr-trunk-Linux/solr/build/solr-core/test/J1/temp/solr.cloud.HttpPartitionTest_6FA626F4C96F9A0-001/control-001/cores}
   [junit4]   2> 436416 INFO  (TEST-HttpPartitionTest.test-seed#[6FA626F4C96F9A0]) [    ] o.a.s.s.SolrDispatchFilter SolrDispatchFilter.init(): sun.misc.Launcher$AppClassLoader@1521cc1
   [junit4]   2> 436416 INFO  (TEST-HttpPartitionTest.test-seed#[6FA626F4C96F9A0]) [    ] o.a.s.c.SolrResourceLoader new SolrResourceLoader for directory: '/home/jenkins/workspace/Lucene-Solr-trunk-Linux/solr/build/solr-core/test/J1/temp/solr.cloud.HttpPartitionTest_6FA626F4C96F9A0-001/control-001'
   [junit4]   2> 436416 INFO  (TEST-HttpPartitionTest.test-seed#[6FA626F4C96F9A0]) [    ] o.a.s.c.SolrResourceLoader JNDI not configured for solr (NoInitialContextEx)
   [junit4]   2> 436416 INFO  (TEST-HttpPartitionTest.test-seed#[6FA626F4C96F9A0]) [    ] o.a.s.c.SolrResourceLoader solr home defaulted to 'solr/' (could not find system property or JNDI)
   [junit4]   2> 436416 INFO  (TEST-HttpPartitionTest.test-seed#[6FA626F4C96F9A0]) [    ] o.a.s.c.c.SolrZkClient Using default ZkCredentialsProvider
   [junit4]   2> 436417 INFO  (TEST-HttpPartitionTest.test-seed#[6FA626F4C96F9A0]) [    ] o.a.s.c.c.ConnectionManager Waiting for client to connect to ZooKeeper
   [junit4]   2> 436418 INFO  (zkCallback-519-thread-1) [    ] o.a.s.c.c.ConnectionManager Watcher org.apache.solr.common.cloud.ConnectionManager@dc5b96 name:ZooKeeperConnection Watcher:127.0.0.1:45936/solr got event WatchedEvent state:SyncConnected type:None path:null path:null type:None
   [junit4]   2> 436418 INFO  (TEST-HttpPartitionTest.test-seed#[6FA626F4C96F9A0]) [    ] o.a.s.c.c.ConnectionManager Client is connected to ZooKeeper
   [junit4]   2> 436418 INFO  (TEST-HttpPartitionTest.test-seed#[6FA626F4C96F9A0]) [    ] o.a.s.c.c.SolrZkClient Using default ZkACLProvider
   [junit4]   2> 436418 INFO  (TEST-HttpPartitionTest.test-seed#[6FA626F4C96F9A0]) [    ] o.a.s.s.SolrDispatchFilter Loading solr.xml from SolrHome (not found in ZooKeeper)
   [junit4]   2> 436418 INFO  (TEST-HttpPartitionTest.test-seed#[6FA626F4C96F9A0]) [    ] o.a.s.c.SolrXmlConfig Loading container configuration from /home/jenkins/workspace/Lucene-Solr-trunk-Linux/solr/build/solr-core/test/J1/temp/solr.cloud.HttpPartitionTest_6FA626F4C96F9A0-001/control-001/solr.xml
   [junit4]   2> 436422 INFO  (TEST-HttpPartitionTest.test-seed#[6FA626F4C96F9A0]) [    ] o.a.s.c.CorePropertiesLocator Config-defined core root directory: /home/jenkins/workspace/Lucene-Solr-trunk-Linux/solr/build/solr-core/test/J1/temp/solr.cloud.HttpPartitionTest_6FA626F4C96F9A0-001/control-001/cores
   [junit4]   2> 436422 INFO  (TEST-HttpPartitionTest.test-seed#[6FA626F4C96F9A0]) [    ] o.a.s.c.CoreContainer New CoreContainer 162918
   [junit4]   2> 436422 INFO  (TEST-HttpPartitionTest.test-seed#[6FA626F4C96F9A0]) [    ] o.a.s.c.CoreContainer Loading cores into CoreContainer [instanceDir=/home/jenkins/workspace/Lucene-Solr-trunk-Linux/solr/build/solr-core/test/J1/temp/solr.cloud.HttpPartitionTest_6FA626F4C96F9A0-001/control-001]
   [junit4]   2> 436422 WARN  (TEST-HttpPartitionTest.test-seed#[6FA626F4C96F9A0]) [    ] o.a.s.c.CoreContainer Couldn't add files from /home/jenkins/workspace/Lucene-Solr-trunk-Linux/solr/build/solr-core/test/J1/temp/solr.cloud.HttpPartitionTest_6FA626F4C96F9A0-001/control-001/lib to classpath: /home/jenkins/workspace/Lucene-Solr-trunk-Linux/solr/build/solr-core/test/J1/temp/solr.cloud.HttpPartitionTest_6FA626F4C96F9A0-001/control-001/lib
   [junit4]   2> 436422 INFO  (TEST-HttpPartitionTest.test-seed#[6FA626F4C96F9A0]) [    ] o.a.s.h.c.HttpShardHandlerFactory created with socketTimeout : 90000,urlScheme : ,connTimeout : 15000,maxConnectionsPerHost : 20,maxConnections : 10000,corePoolSize : 0,maximumPoolSize : 2147483647,maxThreadIdleTime : 5,sizeOfQueue : -1,fairnessPolicy : false,useRetries : false,
   [junit4]   2> 436423 INFO  (TEST-HttpPartitionTest.test-seed#[6FA626F4C96F9A0]) [    ] o.a.s.u.UpdateShardHandler Creating UpdateShardHandler HTTP client with params: socketTimeout=340000&connTimeout=45000&retry=true
   [junit4]   2> 436423 INFO  (TEST-HttpPartitionTest.test-seed#[6FA626F4C96F9A0]) [    ] o.a.s.l.LogWatcher SLF4J impl is org.slf4j.impl.Log4jLoggerFactory
   [junit4]   2> 436423 INFO  (TEST-HttpPartitionTest.test-seed#[6FA626F4C96F9A0]) [    ] o.a.s.l.LogWatcher Registering Log Listener [Log4j (org.slf4j.impl.Log4jLoggerFactory)]
   [junit4]   2> 436423 INFO  (TEST-HttpPartitionTest.test-seed#[6FA626F4C96F9A0]) [    ] o.a.s.c.ZkContainer Zookeeper client=127.0.0.1:45936/solr
   [junit4]   2> 436423 INFO  (TEST-HttpPartitionTest.test-seed#[6FA626F4C96F9A0]) [    ] o.a.s.c.ZkController zkHost includes chroot
   [junit4]   2> 436423 INFO  (TEST-HttpPartitionTest.test-seed#[6FA626F4C96F9A0]) [    ] o.a.s.c.c.SolrZkClient Using default ZkCredentialsProvider
   [junit4]   2> 436424 INFO  (TEST-HttpPartitionTest.test-seed#[6FA626F4C96F9A0]) [    ] o.a.s.c.c.ConnectionManager Waiting for client to connect to ZooKeeper
   [junit4]   2> 436424 INFO  (zkCallback-522-thread-1) [    ] o.a.s.c.c.ConnectionManager Watcher org.apache.solr.common.cloud.ConnectionManager@a5dd44 name:ZooKeeperConnection Watcher:127.0.0.1:45936 got event WatchedEvent state:SyncConnected type:None path:null path:null type:None
   [junit4]   2> 436425 INFO  (TEST-HttpPartitionTest.test-seed#[6FA626F4C96F9A0]) [    ] o.a.s.c.c.ConnectionManager Client is connected to ZooKeeper
   [junit4]   2> 436425 INFO  (TEST-HttpPartitionTest.test-seed#[6FA626F4C96F9A0]) [    ] o.a.s.c.c.SolrZkClient Using default ZkACLProvider
   [junit4]   2> 436426 INFO  (TEST-HttpPartitionTest.test-seed#[6FA626F4C96F9A0]) [    ] o.a.s.c.c.ConnectionManager Waiting for client to connect to ZooKeeper
   [junit4]   2> 436426 INFO  (zkCallback-523-thread-1) [    ] o.a.s.c.c.ConnectionManager Watcher org.apache.solr.common.cloud.ConnectionManager@6ce087 name:ZooKeeperConnection Watcher:127.0.0.1:45936/solr got event WatchedEvent state:SyncConnected type:None path:null path:null type:None
   [junit4]   2> 436426 INFO  (TEST-HttpPartitionTest.test-seed#[6FA626F4C96F9A0]) [    ] o.a.s.c.c.ConnectionManager Client is connected to ZooKeeper
   [junit4]   2> 436427 INFO  (TEST-HttpPartitionTest.test-seed#[6FA626F4C96F9A0]) [    ] o.a.s.c.c.SolrZkClient makePath: /overseer/queue
   [junit4]   2> 436428 INFO  (TEST-HttpPartitionTest.test-seed#[6FA626F4C96F9A0]) [    ] o.a.s.c.c.SolrZkClient makePath: /overseer/collection-queue-work
   [junit4]   2> 436429 INFO  (TEST-HttpPartitionTest.test-seed#[6FA626F4C96F9A0]) [    ] o.a.s.c.c.SolrZkClient makePath: /overseer/collection-map-running
   [junit4]   2> 436429 INFO  (TEST-HttpPartitionTest.test-seed#[6FA626F4C96F9A0]) [    ] o.a.s.c.c.SolrZkClient makePath: /overseer/collection-map-completed
   [junit4]   2> 436430 INFO  (TEST-HttpPartitionTest.test-seed#[6FA626F4C96F9A0]) [    ] o.a.s.c.c.SolrZkClient makePath: /overseer/collection-map-failure
   [junit4]   2> 436430 INFO  (TEST-HttpPartitionTest.test-seed#[6FA626F4C96F9A0]) [    ] o.a.s.c.c.SolrZkClient makePath: /live_nodes
   [junit4]   2> 436431 INFO  (TEST-HttpPartitionTest.test-seed#[6FA626F4C96F9A0]) [    ] o.a.s.c.c.SolrZkClient makePath: /aliases.json
   [junit4]   2> 436431 INFO  (TEST-HttpPartitionTest.test-seed#[6FA626F4C96F9A0]) [    ] o.a.s.c.c.SolrZkClient makePath: /clusterstate.json
   [junit4]   2> 436431 INFO  (TEST-HttpPartitionTest.test-seed#[6FA626F4C96F9A0]) [    ] o.a.s.c.c.SolrZkClient makePath: /security.json
   [junit4]   2> 436432 INFO  (TEST-HttpPartitionTest.test-seed#[6FA626F4C96F9A0]) [    ] o.a.s.c.ZkController Register node as live in ZooKeeper:/live_nodes/127.0.0.1:37655_
   [junit4]   2> 436432 INFO  (TEST-HttpPartitionTest.test-seed#[6FA626F4C96F9A0]) [    ] o.a.s.c.c.SolrZkClient makePath: /live_nodes/127.0.0.1:37655_
   [junit4]   2> 436433 INFO  (TEST-HttpPartitionTest.test-seed#[6FA626F4C96F9A0]) [    ] o.a.s.c.c.SolrZkClient makePath: /overseer_elect
   [junit4]   2> 436433 INFO  (TEST-HttpPartitionTest.test-seed#[6FA626F4C96F9A0]) [    ] o.a.s.c.c.SolrZkClient makePath: /overseer_elect/election
   [junit4]   2> 436433 INFO  (TEST-HttpPartitionTest.test-seed#[6FA626F4C96F9A0]) [    ] o.a.s.c.Overseer Overseer (id=null) closing
   [junit4]   2> 436433 INFO  (TEST-HttpPartitionTest.test-seed#[6FA626F4C96F9A0]) [    ] o.a.s.c.LeaderElector Joined leadership election with path: /overseer_elect/election/95179504364683268-127.0.0.1:37655_-n_0000000000
   [junit4]   2> 436434 INFO  (TEST-HttpPartitionTest.test-seed#[6FA626F4C96F9A0]) [    ] o.a.s.c.OverseerElectionContext I am going to be the leader 127.0.0.1:37655_
   [junit4]   2> 436434 INFO  (TEST-HttpPartitionTest.test-seed#[6FA626F4C96F9A0]) [    ] o.a.s.c.c.SolrZkClient makePath: /overseer_elect/leader
   [junit4]   2> 436434 INFO  (TEST-HttpPartitionTest.test-seed#[6FA626F4C96F9A0]) [    ] o.a.s.c.Overseer Overseer (id=95179504364683268-127.0.0.1:37655_-n_0000000000) starting
   [junit4]   2> 436434 INFO  (TEST-HttpPartitionTest.test-seed#[6FA626F4C96F9A0]) [    ] o.a.s.c.c.SolrZkClient makePath: /overseer/queue-work
   [junit4]   2> 436436 INFO  (TEST-HttpPartitionTest.test-seed#[6FA626F4C96F9A0]) [    ] o.a.s.c.OverseerAutoReplicaFailoverThread Starting OverseerAutoReplicaFailoverThread autoReplicaFailoverWorkLoopDelay=10000 autoReplicaFailoverWaitAfterExpiration=30000 autoReplicaFailoverBadNodeExpiration=60000
   [junit4]   2> 436436 INFO  (OverseerCollectionConfigSetProcessor-95179504364683268-127.0.0.1:37655_-n_0000000000) [    ] o.a.s.c.OverseerTaskProcessor Process current queue of overseer operations
   [junit4]   2> 436436 INFO  (TEST-HttpPartitionTest.test-seed#[6FA626F4C96F9A0]) [    ] o.a.s.c.c.ZkStateReader Updating cluster state from ZooKeeper... 
   [junit4]   2> 436436 INFO  (OverseerStateUpdate-95179504364683268-127.0.0.1:37655_-n_0000000000) [    ] o.a.s.c.Overseer Starting to work on the main queue
   [junit4]   2> 436451 INFO  (TEST-HttpPartitionTest.test-seed#[6FA626F4C96F9A0]) [    ] o.a.s.c.CoreContainer Security conf doesn't exist. Skipping setup for authorization module.
   [junit4]   2> 436451 INFO  (TEST-HttpPartitionTest.test-seed#[6FA626F4C96F9A0]) [    ] o.a.s.c.CoreContainer No authentication plugin used.
   [junit4]   2> 436451 INFO  (TEST-HttpPartitionTest.test-seed#[6FA626F4C96F9A0]) [    ] o.a.s.c.CorePropertiesLocator Looking for core definitions underneath /home/jenkins/workspace/Lucene-Solr-trunk-Linux/solr/build/solr-core/test/J1/temp/solr.cloud.HttpPartitionTest_6FA626F4C96F9A0-001/control-001/cores
   [junit4]   2> 436452 INFO  (TEST-HttpPartitionTest.test-seed#[6FA626F4C96F9A0]) [    ] o.a.s.c.CoreDescriptor Created CoreDescriptor: {name=collection1, config=solrconfig.xml, transient=false, schema=schema.xml, loadOnStartup=true, configSetProperties=configsetprops.json, collection=control_collection, coreNodeName=, dataDir=data/, shard=}
   [junit4]   2> 436452 INFO  (TEST-HttpPartitionTest.test-seed#[6FA626F4C96F9A0]) [    ] o.a.s.c.CorePropertiesLocator Found core collection1 in /home/jenkins/workspace/Lucene-Solr-trunk-Linux/solr/build/solr-core/test/J1/temp/solr.cloud.HttpPartitionTest_6FA626F4C96F9A0-001/control-001/cores/collection1
   [junit4]   2> 436452 INFO  (TEST-HttpPartitionTest.test-seed#[6FA626F4C96F9A0]) [    ] o.a.s.c.CorePropertiesLocator Found 1 core definitions
   [junit4]   2> 436452 INFO  (TEST-HttpPartitionTest.test-seed#[6FA626F4C96F9A0]) [    ] o.a.s.s.SolrDispatchFilter user.dir=/home/jenkins/workspace/Lucene-Solr-trunk-Linux/solr/build/solr-core/test/J1
   [junit4]   2> 436452 INFO  (TEST-HttpPartitionTest.test-seed#[6FA626F4C96F9A0]) [    ] o.a.s.s.SolrDispatchFilter SolrDispatchFilter.init() done
   [junit4]   2> 436452 INFO  (coreLoadExecutor-1312-thread-1) [    ] o.a.s.c.ZkController publishing state=down
   [junit4]   2> 436452 INFO  (coreLoadExecutor-1312-thread-1) [    ] o.a.s.c.ZkController numShards not found on descriptor - reading it from system property
   [junit4]   2> 436453 INFO  (OverseerStateUpdate-95179504364683268-127.0.0.1:37655_-n_0000000000) [    ] o.a.s.c.Overseer processMessage: queueSize: 1, message = {
   [junit4]   2>   "core":"collection1",
   [junit4]   2>   "roles":null,
   [junit4]   2>   "base_url":"http://127.0.0.1:37655",
   [junit4]   2>   "node_name":"127.0.0.1:37655_",
   [junit4]   2>   "numShards":"1",
   [junit4]   2>   "state":"down",
   [junit4]   2>   "shard":null,
   [junit4]   2>   "collection":"control_collection",
   [junit4]   2>   "operation":"state"} current state version: 0
   [junit4]   2> 436453 INFO  (coreLoadExecutor-1312-thread-1) [    ] o.a.s.c.ZkController look for our core node name
   [junit4]   2> 436453 INFO  (OverseerStateUpdate-95179504364683268-127.0.0.1:37655_-n_0000000000) [    ] o.a.s.c.o.ReplicaMutator Update state numShards=1 message={
   [junit4]   2>   "core":"collection1",
   [junit4]   2>   "roles":null,
   [junit4]   2>   "base_url":"http://127.0.0.1:37655",
   [junit4]   2>   "node_name":"127.0.0.1:37655_",
   [junit4]   2>   "numShards":"1",
   [junit4]   2>   "state":"down",
   [junit4]   2>   "shard":null,
   [junit4]   2>   "collection":"control_collection",
   [junit4]   2>   "operation":"state"}
   [junit4]   2> 436453 INFO  (OverseerStateUpdate-95179504364683268-127.0.0.1:37655_-n_0000000000) [    ] o.a.s.c.o.ClusterStateMutator building a new cName: control_collection
   [junit4]   2> 436453 INFO  (OverseerStateUpdate-95179504364683268-127.0.0.1:37655_-n_0000000000) [    ] o.a.s.c.o.ReplicaMutator Assigning new node to shard shard=shard1
   [junit4]   2> 436454 INFO  (zkCallback-523-thread-1) [    ] o.a.s.c.c.ZkStateReader A cluster state change: [WatchedEvent state:SyncConnected type:NodeDataChanged path:/clusterstate.json], has occurred - updating... (live nodes size: [1])
   [junit4]   2> 437453 INFO  (coreLoadExecutor-1312-thread-1) [    ] o.a.s.c.ZkController waiting to find shard id in clusterstate for collection1
   [junit4]   2> 437453 INFO  (coreLoadExecutor-1312-thread-1) [    ] o.a.s.c.ZkController Check for collection zkNode:control_collection
   [junit4]   2> 437454 INFO  (coreLoadExecutor-1312-thread-1) [    ] o.a.s.c.ZkController Collection zkNode exists
   [junit4]   2> 437454 INFO  (coreLoadExecutor-1312-thread-1) [    ] o.a.s.c.c.ZkStateReader Load collection config from: [/collections/control_collection]
   [junit4]   2> 437454 INFO  (coreLoadExecutor-1312-thread-1) [    ] o.a.s.c.c.ZkStateReader path=[/collections/control_collection] [configName]=[conf1] specified config exists in ZooKeeper
   [junit4]   2> 437454 INFO  (coreLoadExecutor-1312-thread-1) [    ] o.a.s.c.SolrResourceLoader new SolrResourceLoader for directory: '/home/jenkins/workspace/Lucene-Solr-trunk-Linux/solr/build/solr-core/test/J1/temp/solr.cloud.HttpPartitionTest_6FA626F4C96F9A0-001/control-001/cores/collection1'
   [junit4]   2> 437454 INFO  (coreLoadExecutor-1312-thread-1) [    ] o.a.s.c.SolrResourceLoader JNDI not configured for solr (NoInitialContextEx)
   [junit4]   2> 437454 INFO  (coreLoadExecutor-1312-thread-1) [    ] o.a.s.c.SolrResourceLoader solr home defaulted to 'solr/' (could not find system property or JNDI)
   [junit4]   2> 437455 INFO  (coreLoadExecutor-1312-thread-1) [    ] o.a.s.c.Config loaded config solrconfig.xml with version 0 
   [junit4]   2> 437459 INFO  (coreLoadExecutor-1312-thread-1) [    ] o.a.s.c.SolrConfig current version of requestparams : -1
   [junit4]   2> 437461 INFO  (coreLoadExecutor-1312-thread-1) [    ] o.a.s.c.SolrConfig Using Lucene MatchVersion: 6.0.0
   [junit4]   2> 437466 INFO  (coreLoadExecutor-1312-thread-1) [    ] o.a.s.c.SolrConfig Loaded SolrConfig: solrconfig.xml
   [junit4]   2> 437469 INFO  (coreLoadExecutor-1312-thread-1) [    ] o.a.s.s.IndexSchema [collection1] Schema name=test
   [junit4]   2> 437548 INFO  (coreLoadExecutor-1312-thread-1) [    ] o.a.s.s.OpenExchangeRatesOrgProvider Initialized with rates=open-exchange-rates.json, refreshInterval=1440.
   [junit4]   2> 437553 INFO  (coreLoadExecutor-1312-thread-1) [    ] o.a.s.s.IndexSchema default search field in schema is text
   [junit4]   2> 437553 INFO  (coreLoadExecutor-1312-thread-1) [    ] o.a.s.s.IndexSchema unique key field: id
   [junit4]   2> 437557 INFO  (coreLoadExecutor-1312-thread-1) [    ] o.a.s.s.FileExchangeRateProvider Reloading exchange rates from file currency.xml
   [junit4]   2> 437559 INFO  (coreLoadExecutor-1312-thread-1) [    ] o.a.s.s.FileExchangeRateProvider Reloading exchange rates from file currency.xml
   [junit4]   2> 437561 INFO  (coreLoadExecutor-1312-thread-1) [    ] o.a.s.s.OpenExchangeRatesOrgProvider Reloading exchange rates from open-exchange-rates.json
   [junit4]   2> 437561 INFO  (coreLoadExecutor-1312-thread-1) [    ] o.a.s.s.OpenExchangeRatesOrgProvider Reloading exchange rates from open-exchange-rates.json
   [junit4]   2> 437562 INFO  (coreLoadExecutor-1312-thread-1) [    ] o.a.s.c.ConfigSetProperties Did not find ConfigSet properties, assuming default properties: Can't find resource 'configsetprops.json' in classpath or '/configs/conf1', cwd=/home/jenkins/workspace/Lucene-Solr-trunk-Linux/solr/build/solr-core/test/J1
   [junit4]   2> 437562 INFO  (coreLoadExecutor-1312-thread-1) [    ] o.a.s.c.CoreContainer Creating SolrCore 'collection1' using configuration from collection control_collection
   [junit4]   2> 437562 INFO  (coreLoadExecutor-1312-thread-1) [    ] o.a.s.c.SolrCore org.apache.solr.core.MockDirectoryFactory
   [junit4]   2> 437563 INFO  (coreLoadExecutor-1312-thread-1) [    ] o.a.s.c.SolrCore [[collection1] ] Opening new SolrCore at [/home/jenkins/workspace/Lucene-Solr-trunk-Linux/solr/build/solr-core/test/J1/temp/solr.cloud.HttpPartitionTest_6FA626F4C96F9A0-001/control-001/cores/collection1], dataDir=[/home/jenkins/workspace/Lucene-Solr-trunk-Linux/solr/build/solr-core/test/J1/temp/solr.cloud.HttpPartitionTest_6FA626F4C96F9A0-001/control-001/cores/collection1/data/]
   [junit4]   2> 437563 INFO  (coreLoadExecutor-1312-thread-1) [    ] o.a.s.c.JmxMonitoredMap JMX monitoring is enabled. Adding Solr mbeans to JMX Server: com.sun.jmx.mbeanserver.JmxMBeanServer@ddc343
   [junit4]   2> 437563 INFO  (coreLoadExecutor-1312-thread-1) [    ] o.a.s.c.CachingDirectoryFactory return new directory for /home/jenkins/workspace/Lucene-Solr-trunk-Linux/solr/build/solr-core/test/J1/temp/solr.cloud.HttpPartitionTest_6FA626F4C96F9A0-001/control-001/cores/collection1/data
   [junit4]   2> 437563 INFO  (coreLoadExecutor-1312-thread-1) [    ] o.a.s.c.SolrCore New index directory detected: old=null new=/home/jenkins/workspace/Lucene-Solr-trunk-Linux/solr/build/solr-core/test/J1/temp/solr.cloud.HttpPartitionTest_6FA626F4C96F9A0-001/control-001/cores/collection1/data/index/
   [junit4]   2> 437563 WARN  (coreLoadExecutor-1312-thread-1) [    ] o.a.s.c.SolrCore [collection1] Solr index directory '/home/jenkins/workspace/Lucene-Solr-trunk-Linux/solr/build/solr-core/test/J1/temp/solr.cloud.HttpPartitionTest_6FA626F4C96F9A0-001/control-001/cores/collection1/data/index' doesn't exist. Creating new index...
   [junit4]   2> 437563 INFO  (coreLoadExecutor-1312-thread-1) [    ] o.a.s.c.CachingDirectoryFactory return new directory for /home/jenkins/workspace/Lucene-Solr-trunk-Linux/solr/build/solr-core/test/J1/temp/solr.cloud.HttpPartitionTest_6FA626F4C96F9A0-001/control-001/cores/collection1/data/index
   [junit4]   2> 437564 INFO  (coreLoadExecutor-1312-thread-1) [    ] o.a.s.u.RandomMergePolicy RandomMergePolicy wrapping class org.apache.lucene.index.TieredMergePolicy: [TieredMergePolicy: maxMergeAtOnce=46, maxMergeAtOnceExplicit=29, maxMergedSegmentMB=84.8759765625, floorSegmentMB=1.6162109375, forceMergeDeletesPctAllowed=23.93995171852376, segmentsPerTier=46.0, maxCFSSegmentSizeMB=8.796093022207999E12, noCFSRatio=0.0
   [junit4]   2> 437564 INFO  (coreLoadExecutor-1312-thread-1) [    ] o.a.s.c.SolrDeletionPolicy SolrDeletionPolicy.onCommit: commits: num=1
   [junit4]   2> 	commit{dir=MockDirectoryWrapper(RAMDirectory@1fb8301 lockFactory=org.apache.lucene.store.SingleInstanceLockFactory@4ecd3e),segFN=segments_1,generation=1}
   [junit4]   2> 437564 INFO  (coreLoadExecutor-1312-thread-1) [    ] o.a.s.c.SolrDeletionPolicy newest commit generation = 1
   [junit4]   2> 437564 INFO  (OldIndexDirectoryCleanupThreadForCore-collection1) [    ] o.a.s.c.SolrCore Looking for old index directories to cleanup for core collection1 in /home/jenkins/workspace/Lucene-Solr-trunk-Linux/solr/build/solr-core/test/J1/temp/solr.cloud.HttpPartitionTest_6FA626F4C96F9A0-001/control-001/cores/collection1/data/
   [junit4]   2> 437564 WARN  (OldIndexDirectoryCleanupThreadForCore-collection1) [    ] o.a.s.c.DirectoryFactory /home/jenkins/workspace/Lucene-Solr-trunk-Linux/solr/build/solr-core/test/J1/temp/solr.cloud.HttpPartitionTest_6FA626F4C96F9A0-001/control-001/cores/collection1/data/ does not point to a valid data directory; skipping clean-up of old index directories.
   [junit4]   2> 437566 INFO  (coreLoadExecutor-1312-thread-1) [    ] o.a.s.u.p.UpdateRequestProcessorChain creating updateRequestProcessorChain "nodistrib"
   [junit4]   2> 437566 INFO  (coreLoadExecutor-1312-thread-1) [    ] o.a.s.u.p.UpdateRequestProcessorChain creating updateRequestProcessorChain "dedupe"
   [junit4]   2> 437566 INFO  (coreLoadExecutor-1312-thread-1) [    ] o.a.s.u.p.UpdateRequestProcessorChain inserting DistributedUpdateProcessorFactory into updateRequestProcessorChain "dedupe"
   [junit4]   2> 437566 INFO  (coreLoadExecutor-1312-thread-1) [    ] o.a.s.u.p.UpdateRequestProcessorChain creating updateRequestProcessorChain "stored_sig"
   [junit4]   2> 437566 INFO  (coreLoadExecutor-1312-thread-1) [    ] o.a.s.u.p.UpdateRequestProcessorChain inserting DistributedUpdateProcessorFactory into updateRequestProcessorChain "stored_sig"
   [junit4]   2> 437566 INFO  (coreLoadExecutor-1312-thread-1) [    ] o.a.s.u.p.UpdateRequestProcessorChain creating updateRequestProcessorChain "distrib-dup-test-chain-explicit"
   [junit4]   2> 437567 INFO  (coreLoadExecutor-1312-thread-1) [    ] o.a.s.u.p.UpdateRequestProcessorChain creating updateRequestProcessorChain "distrib-dup-test-chain-implicit"
   [junit4]   2> 437567 INFO  (coreLoadExecutor-1312-thread-1) [    ] o.a.s.u.p.UpdateRequestProcessorChain inserting DistributedUpdateProcessorFactory into updateRequestProcessorChain "distrib-dup-test-chain-implicit"
   [junit4]   2> 437567 INFO  (coreLoadExecutor-1312-thread-1) [    ] o.a.s.c.SolrCore no updateRequestProcessorChain defined as default, creating implicit default
   [junit4]   2> 437567 WARN  (coreLoadExecutor-1312-thread-1) [    ] o.a.s.c.RequestHandlers INVALID paramSet a in requestHandler {type = requestHandler,name = /dump,class = DumpRequestHandler,args = {defaults={a=A,b=B}}}
   [junit4]   2> 437568 INFO  (coreLoadExecutor-1312-thread-1) [    ] o.a.s.h.l.XMLLoader xsltCacheLifetimeSeconds=60
   [junit4]   2> 437568 INFO  (coreLoadExecutor-1312-thread-1) [    ] o.a.s.h.l.XMLLoader xsltCacheLifetimeSeconds=60
   [junit4]   2> 437594 INFO  (coreLoadExecutor-1312-thread-1) [    ] o.a.s.h.l.XMLLoader xsltCacheLifetimeSeconds=60
   [junit4]   2> 437595 INFO  (coreLoadExecutor-1312-thread-1) [    ] o.a.s.h.l.XMLLoader xsltCacheLifetimeSeconds=60
   [junit4]   2> 437598 INFO  (coreLoadExecutor-1312-thread-1) [    ] o.a.s.c.RequestHandlers Registered paths: /admin/mbeans,standard,/dump,/update/csv,/sql,/update/json/docs,/admin/luke,/export,/admin/segments,/get,/admin/system,/replication,/admin/properties,/config,/stream,/schema,/admin/plugins,/admin/logging,/update/json,/admin/threads,/admin/ping,/update,/admin/file
   [junit4]   2> 437598 INFO  (coreLoadExecutor-1312-thread-1) [    ] o.a.s.c.SolrCore Using default statsCache cache: org.apache.solr.search.stats.LocalStatsCache
   [junit4]   2> 437599 INFO  (coreLoadExecutor-1312-thread-1) [    ] o.a.s.u.UpdateHandler Using UpdateLog implementation: org.apache.solr.update.UpdateLog
   [junit4]   2> 437599 INFO  (coreLoadExecutor-1312-thread-1) [    ] o.a.s.u.UpdateLog Initializing UpdateLog: dataDir= defaultSyncLevel=FLUSH numRecordsToKeep=100 maxNumLogsToKeep=10 numVersionBuckets=65536
   [junit4]   2> 437599 INFO  (coreLoadExecutor-1312-thread-1) [    ] o.a.s.u.CommitTracker Hard AutoCommit: disabled
   [junit4]   2> 437599 INFO  (coreLoadExecutor-1312-thread-1) [    ] o.a.s.u.CommitTracker Soft AutoCommit: disabled
   [junit4]   2> 437600 INFO  (coreLoadExecutor-1312-thread-1) [    ] o.a.s.u.RandomMergePolicy RandomMergePolicy wrapping class org.apache.lucene.index.AlcoholicMergePolicy: [AlcoholicMergePolicy: minMergeSize=0, mergeFactor=10, maxMergeSize=78817268, maxMergeSizeForForcedMerge=9223372036854775807, calibrateSizeByDeletes=true, maxMergeDocs=2147483647, maxCFSSegmentSizeMB=8.796093022207999E12, noCFSRatio=0.1]
   [junit4]   2> 437600 INFO  (coreLoadExecutor-1312-thread-1) [    ] o.a.s.c.SolrDeletionPolicy SolrDeletionPolicy.onInit: commits: num=1
   [junit4]   2> 	commit{dir=MockDirectoryWrapper(RAMDirectory@1fb8301 lockFactory=org.apache.lucene.store.SingleInstanceLockFactory@4ecd3e),segFN=segments_1,generation=1}
   [junit4]   2> 437600 INFO  (coreLoadExecutor-1312-thread-1) [    ] o.a.s.c.SolrDeletionPolicy newest commit generation = 1
   [junit4]   2> 437600 INFO  (coreLoadExecutor-1312-thread-1) [    ] o.a.s.s.SolrIndexSearcher Opening Searcher@6818dc[collection1] main
   [junit4]   2> 437601 INFO  (coreLoadExecutor-1312-thread-1) [    ] o.a.s.c.c.ZkStateReader Load collection config from: [/collections/control_collection]
   [junit4]   2> 437601 INFO  (coreLoadExecutor-1312-thread-1) [    ] o.a.s.c.c.ZkStateReader path=[/collections/control_collection] [configName]=[conf1] specified config exists in ZooKeeper
   [junit4]   2> 437601 INFO  (coreLoadExecutor-1312-thread-1) [    ] o.a.s.r.ManagedResourceStorage Setting up ZooKeeper-based storage for the RestManager with znodeBase: /configs/conf1
   [junit4]   2> 437601 INFO  (coreLoadExecutor-1312-thread-1) [    ] o.a.s.r.ManagedResourceStorage Configured ZooKeeperStorageIO with znodeBase: /configs/conf1
   [junit4]   2> 437601 INFO  (coreLoadExecutor-1312-thread-1) [    ] o.a.s.r.RestManager Initializing RestManager with initArgs: {}
   [junit4]   2> 437601 INFO  (coreLoadExecutor-1312-thread-1) [    ] o.a.s.r.ManagedResourceStorage Reading _rest_managed.json using ZooKeeperStorageIO:path=/configs/conf1
   [junit4]   2> 437601 INFO  (coreLoadExecutor-1312-thread-1) [    ] o.a.s.r.ManagedResourceStorage No data found for znode /configs/conf1/_rest_managed.json
   [junit4]   2> 437601 INFO  (coreLoadExecutor-1312-thread-1) [    ] o.a.s.r.ManagedResourceStorage Loaded null at path _rest_managed.json using ZooKeeperStorageIO:path=/configs/conf1
   [junit4]   2> 437601 INFO  (coreLoadExecutor-1312-thread-1) [    ] o.a.s.r.RestManager Initializing 0 registered ManagedResources
   [junit4]   2> 437601 INFO  (coreLoadExecutor-1312-thread-1) [    ] o.a.s.h.ReplicationHandler Commits will be reserved for  10000
   [junit4]   2> 437602 INFO  (searcherExecutor-1313-thread-1) [    ] o.a.s.c.SolrCore [collection1] Registered new searcher Searcher@6818dc[collection1] main{ExitableDirectoryReader(UninvertingDirectoryReader())}
   [junit4]   2> 437602 INFO  (coreLoadExecutor-1312-thread-1) [    ] o.a.s.u.UpdateLog Looking up max value of version field to seed version buckets
   [junit4]   2> 437602 INFO  (coreLoadExecutor-1312-thread-1) [    ] o.a.s.u.VersionInfo Refreshing highest value of _version_ for 65536 version buckets from index
   [junit4]   2> 437602 INFO  (coreLoadExecutor-1312-thread-1) [    ] o.a.s.u.VersionInfo No terms found for _version_, cannot seed version bucket highest value from index
   [junit4]   2> 437602 INFO  (coreLoadExecutor-1312-thread-1) [    ] o.a.s.u.UpdateLog Could not find max version in index or recent updates, using new clock 1522872071289307136
   [junit4]   2> 437604 INFO  (coreLoadExecutor-1312-thread-1) [    ] o.a.s.u.UpdateLog Took 1.0ms to seed version buckets with highest version 1522872071289307136
   [junit4]   2> 437604 INFO  (coreLoadExecutor-1312-thread-1) [    ] o.a.s.c.ZkController watch zkdir /configs/conf1
   [junit4]   2> 437604 INFO  (coreLoadExecutor-1312-thread-1) [    ] o.a.s.c.CoreContainer registering core: collection1
   [junit4]   2> 437604 INFO  (coreZkRegister-1306-thread-1) [    ] o.a.s.c.ZkController Register replica - core:collection1 address:http://127.0.0.1:37655 collection:control_collection shard:shard1
   [junit4]   2> 437605 INFO  (coreZkRegister-1306-thread-1) [    ] o.a.s.c.c.SolrZkClient makePath: /collections/control_collection/leader_elect/shard1/election
   [junit4]   2> 437606 INFO  (coreZkRegister-1306-thread-1) [    ] o.a.s.c.LeaderElector Joined leadership election with path: /collections/control_collection/leader_elect/shard1/election/95179504364683268-core_node1-n_0000000000
   [junit4]   2> 437606 INFO  (coreZkRegister-1306-thread-1) [    ] o.a.s.c.ShardLeaderElectionContext Running the leader process for shard=shard1 and weAreReplacement=false and leaderVoteWait=10000
   [junit4]   2> 437606 INFO  (coreZkRegister-1306-thread-1) [    ] o.a.s.c.ShardLeaderElectionContext Enough replicas found to continue.
   [junit4]   2> 437606 INFO  (coreZkRegister-1306-thread-1) [    ] o.a.s.c.ShardLeaderElectionContext I may be the new leader - try and sync
   [junit4]   2> 437606 INFO  (coreZkRegister-1306-thread-1) [    ] o.a.s.c.SyncStrategy Sync replicas to http://127.0.0.1:37655/collection1/
   [junit4]   2> 437606 INFO  (coreZkRegister-1306-thread-1) [    ] o.a.s.c.SyncStrategy Sync Success - now sync replicas to me
   [junit4]   2> 437606 INFO  (coreZkRegister-1306-thread-1) [    ] o.a.s.c.SyncStrategy http://127.0.0.1:37655/collection1/ has no replicas
   [junit4]   2> 437607 INFO  (OverseerStateUpdate-95179504364683268-127.0.0.1:37655_-n_0000000000) [    ] o.a.s.c.Overseer processMessage: queueSize: 1, message = {
   [junit4]   2>   "operation":"leader",
   [junit4]   2>   "shard":"shard1",
   [junit4]   2>   "collection":"control_collection"} current state version: 1
   [junit4]   2> 437607 INFO  (coreZkRegister-1306-thread-1) [    ] o.a.s.c.c.SolrZkClient makePath: /collections/control_collection/leaders/shard1
   [junit4]   2> 437608 INFO  (coreZkRegister-1306-thread-1) [    ] o.a.s.c.ShardLeaderElectionContextBase Creating leader registration node
   [junit4]   2> 437609 INFO  (coreZkRegister-1306-thread-1) [    ] o.a.s.c.ShardLeaderElectionContext I am the new leader: http://127.0.0.1:37655/collection1/ shard1
   [junit4]   2> 437609 INFO  (OverseerStateUpdate-95179504364683268-127.0.0.1:37655_-n_0000000000) [    ] o.a.s.c.Overseer processMessage: queueSize: 1, message = {
   [junit4]   2>   "operation":"leader",
   [junit4]   2>   "shard":"shard1",
   [junit4]   2>   "collection":"control_collection",
   [junit4]   2>   "base_url":"http://127.0.0.1:37655",
   [junit4]   2>   "core":"collection1",
   [junit4]   2>   "state":"active"} current state version: 1
   [junit4]   2> 437710 INFO  (zkCallback-523-thread-1) [    ] o.a.s.c.c.ZkStateReader A cluster state change: [WatchedEvent state:SyncConnected type:NodeDataChanged path:/clusterstate.json], has occurred - updating... (live nodes size: [1])
   [junit4]   2> 437759 INFO  (coreZkRegister-1306-thread-1) [    ] o.a.s.c.ZkController We are http://127.0.0.1:37655/collection1/ and leader is http://127.0.0.1:37655/collection1/
   [junit4]   2> 437760 INFO  (coreZkRegister-1306-thread-1) [    ] o.a.s.c.ZkController No LogReplay needed for core=collection1 baseURL=http://127.0.0.1:37655
   [junit4]   2> 437760 INFO  (coreZkRegister-1306-thread-1) [    ] o.a.s.c.ZkController I am the leader, no recovery necessary
   [junit4]   2> 437760 INFO  (coreZkRegister-1306-thread-1) [    ] o.a.s.c.ZkController publishing state=active
   [junit4]   2> 437760 INFO  (coreZkRegister-1306-thread-1) [    ] o.a.s.c.ZkController numShards not found on descriptor - reading it from system property
   [junit4]   2> 437761 INFO  (OverseerStateUpdate-95179504364683268-127.0.0.1:37655_-n_0000000000) [    ] o.a.s.c.Overseer processMessage: queueSize: 1, message = {
   [junit4]   2>   "core":"collection1",
   [junit4]   2>   "core_node_name":"core_node1",
   [junit4]   2>   "roles":null,
   [junit4]   2>   "base_url":"http://127.0.0.1:37655",
   [junit4]   2>   "node_name":"127.0.0.1:37655_",
   [junit4]   2>   "numShards":"1",
   [junit4]   2>   "state":"active",
   [junit4]   2>   "shard":"shard1",
   [junit4]   2>   "collection":"control_collection",
   [junit4]   2>   "operation":"state"} current state version: 2
   [junit4]   2> 437761 INFO  (OverseerStateUpdate-95179504364683268-127.0.0.1:37655_-n_0000000000) [    ] o.a.s.c.o.ReplicaMutator Update state numShards=1 message={
   [junit4]   2>   "core":"collection1",
   [junit4]   2>   "core_node_name":"core_node1",
   [junit4]   2>   "roles":null,
   [junit4]   2>   "base_url":"http://127.0.0.1:37655",
   [junit4]   2>   "node_name":"127.0.0.1:37655_",
   [junit4]   2>   "numShards":"1",
   [junit4]   2>   "state":"active",
   [junit4]   2>   "shard":"shard1",
   [junit4]   2>   "collection":"control_collection",
   [junit4]   2>   "operation":"state"}
   [junit4]   2> 437862 INFO  (zkCallback-523-thread-2) [    ] o.a.s.c.c.ZkStateReader A cluster state change: [WatchedEvent state:SyncConnected type:NodeDataChanged path:/clusterstate.json], has occurred - updating... (live nodes size: [1])
   [junit4]   2> 437954 INFO  (TEST-HttpPartitionTest.test-seed#[6FA626F4C96F9A0]) [    ] o.a.s.c.c.SolrZkClient Using default ZkCredentialsProvider
   [junit4]   2> 437954 INFO  (TEST-HttpPartitionTest.test-seed#[6FA626F4C96F9A0]) [    ] o.a.s.c.c.ConnectionManager Waiting for client to connect to ZooKeeper
   [junit4]   2> 437955 INFO  (zkCallback-525-thread-1) [    ] o.a.s.c.c.ConnectionManager Watcher org.apache.solr.common.cloud.ConnectionManager@2051ea name:ZooKeeperConnection Watcher:127.0.0.1:45936/solr got event WatchedEvent state:SyncConnected type:None path:null path:null type:None
   [junit4]   2> 437955 INFO  (TEST-HttpPartitionTest.test-seed#[6FA626F4C96F9A0]) [    ] o.a.s.c.c.ConnectionManager Client is connected to ZooKeeper
   [junit4]   2> 437955 INFO  (TEST-HttpPartitionTest.test-seed#[6FA626F4C96F9A0]) [    ] o.a.s.c.c.SolrZkClient Using default ZkACLProvider
   [junit4]   2> 437955 INFO  (TEST-HttpPartitionTest.test-seed#[6FA626F4C96F9A0]) [    ] o.a.s.c.c.ZkStateReader Updating cluster state from ZooKeeper... 
   [junit4]   2> 437956 INFO  (TEST-HttpPartitionTest.test-seed#[6FA626F4C96F9A0]) [    ] o.a.s.c.ChaosMonkey monkey: init - expire sessions:false cause connection loss:false
   [junit4]   2> 437956 INFO  (TEST-HttpPartitionTest.test-seed#[6FA626F4C96F9A0]) [    ] o.a.s.c.AbstractFullDistribZkTestBase Creating collection1 with stateFormat=2
   [junit4]   2> 437956 INFO  (TEST-HttpPartitionTest.test-seed#[6FA626F4C96F9A0]) [    ] o.a.s.c.c.SolrZkClient Using default ZkCredentialsProvider
   [junit4]   2> 437956 INFO  (TEST-HttpPartitionTest.test-seed#[6FA626F4C96F9A0]) [    ] o.a.s.c.c.ConnectionManager Waiting for client to connect to ZooKeeper
   [junit4]   2> 437957 INFO  (zkCallback-526-thread-1) [    ] o.a.s.c.c.ConnectionManager Watcher org.apache.solr.common.cloud.ConnectionManager@10f506 name:ZooKeeperConnection Watcher:127.0.0.1:45936/solr got event WatchedEvent state:SyncConnected type:None path:null path:null type:None
   [junit4]   2> 437957 INFO  (TEST-HttpPartitionTest.test-seed#[6FA626F4C96F9A0]) [    ] o.a.s.c.c.ConnectionManager Client is connected to ZooKeeper
   [junit4]   2> 437957 INFO  (TEST-HttpPartitionTest.test-seed#[6FA626F4C96F9A0]) [    ] o.a.s.c.c.SolrZkClient Using default ZkACLProvider
   [junit4]   2> 437958 INFO  (OverseerStateUpdate-95179504364683268-127.0.0.1:37655_-n_0000000000) [    ] o.a.s.c.Overseer processMessage: queueSize: 1, message = {
   [junit4]   2>   "operation":"create",
   [junit4]   2>   "name":"collection1",
   [junit4]   2>   "numShards":"2",
   [junit4]   2>   "stateFormat":"2"} current state version: 3
   [junit4]   2> 437958 INFO  (OverseerStateUpdate-95179504364683268-127.0.0.1:37655_-n_0000000000) [    ] o.a.s.c.o.ClusterStateMutator building a new cName: collection1
   [junit4]   2> 438019 INFO  (TEST-HttpPartitionTest.test-seed#[6FA626F4C96F9A0]) [    ] o.a.s.SolrTestCaseJ4 Writing core.properties file to /home/jenkins/workspace/Lucene-Solr-trunk-Linux/solr/build/solr-core/test/J1/temp/solr.cloud.HttpPartitionTest_6FA626F4C96F9A0-001/shard-1-001/cores/collection1
   [junit4]   2> 438020 INFO  (TEST-HttpPartitionTest.test-seed#[6FA626F4C96F9A0]) [    ] o.a.s.c.AbstractFullDistribZkTestBase create jetty 1 in directory /home/jenkins/workspace/Lucene-Solr-trunk-Linux/solr/build/solr-core/test/J1/temp/solr.cloud.HttpPartitionTest_6FA626F4C96F9A0-001/shard-1-001
   [junit4]   2> 438021 INFO  (TEST-HttpPartitionTest.test-seed#[6FA626F4C96F9A0]) [    ] o.e.j.s.Server jetty-9.2.13.v20150730
   [junit4]   2> 438022 INFO  (TEST-HttpPartitionTest.test-seed#[6FA626F4C96F9A0]) [    ] o.e.j.s.h.ContextHandler Started o.e.j.s.ServletContextHandler@336770{/,null,AVAILABLE}
   [junit4]   2> 438022 INFO  (TEST-HttpPartitionTest.test-seed#[6FA626F4C96F9A0]) [    ] o.e.j.s.ServerConnector Started ServerConnector@ce4c19{HTTP/1.1}{127.0.0.1:47228}
   [junit4]   2> 438022 INFO  (TEST-HttpPartitionTest.test-seed#[6FA626F4C96F9A0]) [    ] o.e.j.s.Server Started @439836ms
   [junit4]   2> 438022 INFO  (TEST-HttpPartitionTest.test-seed#[6FA626F4C96F9A0]) [    ] o.a.s.c.s.e.JettySolrRunner Jetty properties: {solr.data.dir=/home/jenkins/workspace/Lucene-Solr-trunk-Linux/solr/build/solr-core/test/J1/temp/solr.cloud.HttpPartitionTest_6FA626F4C96F9A0-001/tempDir-001/jetty1, solrconfig=solrconfig.xml, hostContext=/, hostPort=57383, coreRootDirectory=/home/jenkins/workspace/Lucene-Solr-trunk-Linux/solr/build/solr-core/test/J1/temp/solr.cloud.HttpPartitionTest_6FA626F4C96F9A0-001/shard-1-001/cores}
   [junit4]   2> 438023 INFO  (TEST-HttpPartitionTest.test-seed#[6FA626F4C96F9A0]) [    ] o.a.s.s.SolrDispatchFilter SolrDispatchFilter.init(): sun.misc.Launcher$AppClassLoader@1521cc1
   [junit4]   2> 438023 INFO  (TEST-HttpPartitionTest.test-seed#[6FA626F4C96F9A0]) [    ] o.a.s.c.SolrResourceLoader new SolrResourceLoader for directory: '/home/jenkins/workspace/Lucene-Solr-trunk-Linux/solr/build/solr-core/test/J1/temp/solr.cloud.HttpPartitionTest_6FA626F4C96F9A0-001/shard-1-001'
   [junit4]   2> 438023 INFO  (TEST-HttpPartitionTest.test-seed#[6FA626F4C96F9A0]) [    ] o.a.s.c.SolrResourceLoader JNDI not configured for solr (NoInitialContextEx)
   [junit4]   2> 438023 INFO  (TEST-HttpPartitionTest.test-seed#[6FA626F4C96F9A0]) [    ] o.a.s.c.SolrResourceLoader solr home defaulted to 'solr/' (could not find system property or JNDI)
   [junit4]   2> 438023 INFO  (TEST-HttpPartitionTest.test-seed#[6FA626F4C96F9A0]) [    ] o.a.s.c.c.SolrZkClient Using default ZkCredentialsProvider
   [junit4]   2> 438023 INFO  (TEST-HttpPartitionTest.test-seed#[6FA626F4C96F9A0]) [    ] o.a.s.c.c.ConnectionManager Waiting for client to connect to ZooKeeper
   [junit4]   2> 438024 INFO  (zkCallback-527-thread-1) [    ] o.a.s.c.c.ConnectionManager Watcher org.apache.solr.common.cloud.ConnectionManager@bceed9 name:ZooKeeperConnection Watcher:127.0.0.1:45936/solr got event WatchedEvent state:SyncConnected type:None path:null path:null type:None
   [junit4]   2> 438025 INFO  (TEST-HttpPartitionTest.test-seed#[6FA626F4C96F9A0]) [    ] o.a.s.c.c.ConnectionManager Client is connected to ZooKeeper
   [junit4]   2> 438025 INFO  (TEST-HttpPartitionTest.test-seed#[6FA626F4C96F9A0]) [    ] o.a.s.c.c.SolrZkClient Using default ZkACLProvider
   [junit4]   2> 438026 INFO  (TEST-HttpPartitionTest.test-seed#[6FA626F4C96F9A0]) [    ] o.a.s.s.SolrDispatchFilter Loading solr.xml from SolrHome (not found in ZooKeeper)
   [junit4]   2> 438026 INFO  (TEST-HttpPartitionTest.test-seed#[6FA626F4C96F9A0]) [    ] o.a.s.c.SolrXmlConfig Loading container configuration from /home/jenkins/workspace/Lucene-Solr-trunk-Linux/solr/build/solr-core/test/J1/temp/solr.cloud.HttpPartitionTest_6FA626F4C96F9A0-001/shard-1-001/solr.xml
   [junit4]   2> 438030 INFO  (TEST-HttpPartitionTest.test-seed#[6FA626F4C96F9A0]) [    ] o.a.s.c.CorePropertiesLocator Config-defined core root directory: /home/jenkins/workspace/Lucene-Solr-trunk-Linux/solr/build/solr-core/test/J1/temp/solr.cloud.HttpPartitionTest_6FA626F4C96F9A0-001/shard-1-001/cores
   [junit4]   2> 438030 INFO  (TEST-HttpPartitionTest.test-seed#[6FA626F4C96F9A0]) [    ] o.a.s.c.CoreContainer New CoreContainer 21266726
   [junit4]   2> 438030 INFO  (TEST-HttpPartitionTest.test-seed#[6FA626F4C96F9A0]) [    ] o.a.s.c.CoreContainer Loading cores into CoreContainer [instanceDir=/home/jenkins/workspace/Lucene-Solr-trunk-Linux/solr/build/solr-core/test/J1/temp/solr.cloud.HttpPartitionTest_6FA626F4C96F9A0-001/shard-1-001]
   [junit4]   2> 438030 WARN  (TEST-HttpPartitionTest.test-seed#[6FA626F4C96F9A0]) [    ] o.a.s.c.CoreContainer Couldn't add files from /home/jenkins/workspace/Lucene-Solr-trunk-Linux/solr/build/solr-core/test/J1/temp/solr.cloud.HttpPartitionTest_6FA626F4C96F9A0-001/shard-1-001/lib to classpath: /home/jenkins/workspace/Lucene-Solr-trunk-Linux/solr/build/solr-core/test/J1/temp/solr.cloud.HttpPartitionTest_6FA626F4C96F9A0-001/shard-1-001/lib
   [junit4]   2> 438030 INFO  (TEST-HttpPartitionTest.test-seed#[6FA626F4C96F9A0]) [    ] o.a.s.h.c.HttpShardHandlerFactory created with socketTimeout : 90000,urlScheme : ,connTimeout : 15000,maxConnectionsPerHost : 20,maxConnections : 10000,corePoolSize : 0,maximumPoolSize : 2147483647,maxThreadIdleTime : 5,sizeOfQueue : -1,fairnessPolicy : false,useRetries : false,
   [junit4]   2> 438031 INFO  (TEST-HttpPartitionTest.test-seed#[6FA626F4C96F9A0]) [    ] o.a.s.u.UpdateShardHandler Creating UpdateShardHandler HTTP client with params: socketTimeout=340000&connTimeout=45000&retry=true
   [junit4]   2> 438032 INFO  (TEST-HttpPartitionTest.test-seed#[6FA626F4C96F9A0]) [    ] o.a.s.l.LogWatcher SLF4J impl is org.slf4j.impl.Log4jLoggerFactory
   [junit4]   2> 438032 INFO  (TEST-HttpPartitionTest.test-seed#[6FA626F4C96F9A0]) [    ] o.a.s.l.LogWatcher Registering Log Listener [Log4j (org.slf4j.impl.Log4jLoggerFactory)]
   [junit4]   2> 438032 INFO  (TEST-HttpPartitionTest.test-seed#[6FA626F4C96F9A0]) [    ] o.a.s.c.ZkContainer Zookeeper client=127.0.0.1:45936/solr
   [junit4]   2> 438032 INFO  (TEST-HttpPartitionTest.test-seed#[6FA626F4C96F9A0]) [    ] o.a.s.c.ZkController zkHost includes chroot
   [junit4]   2> 438032 INFO  (TEST-HttpPartitionTest.test-seed#[6FA626F4C96F9A0]) [    ] o.a.s.c.c.SolrZkClient Using default ZkCredentialsProvider
   [junit4]   2> 438033 INFO  (TEST-HttpPartitionTest.test-seed#[6FA626F4C96F9A0]) [    ] o.a.s.c.c.ConnectionManager Waiting for client to connect to ZooKeeper
   [junit4]   2> 438036 INFO  (zkCallback-530-thread-1) [    ] o.a.s.c.c.ConnectionManager Watcher org.apache.solr.common.cloud.ConnectionManager@dfdc31 name:ZooKeeperConnection Watcher:127.0.0.1:45936 got event WatchedEvent state:SyncConnected type:None path:null path:null type:None
   [junit4]   2> 438036 INFO  (TEST-HttpPartitionTest.test-seed#[6FA626F4C96F9A0]) [    ] o.a.s.c.c.ConnectionManager Client is connected to ZooKeeper
   [junit4]   2> 438037 INFO  (TEST-HttpPartitionTest.test-seed#[6FA626F4C96F9A0]) [    ] o.a.s.c.c.SolrZkClient Using default ZkACLProvider
   [junit4]   2> 438038 INFO  (TEST-HttpPartitionTest.test-seed#[6FA626F4C96F9A0]) [    ] o.a.s.c.c.ConnectionManager Waiting for client to connect to ZooKeeper
   [junit4]   2> 438039 INFO  (zkCallback-531-thread-1) [    ] o.a.s.c.c.ConnectionManager Watcher org.apache.solr.common.cloud.ConnectionManager@6f3708 name:ZooKeeperConnection Watcher:127.0.0.1:45936/solr got event WatchedEvent state:SyncConnected type:None path:null path:null type:None
   [junit4]   2> 438039 INFO  (TEST-HttpPartitionTest.test-seed#[6FA626F4C96F9A0]) [    ] o.a.s.c.c.ConnectionManager Client is connected to ZooKeeper
   [junit4]   2> 438042 INFO  (TEST-HttpPartitionTest.test-seed#[6FA626F4C96F9A0]) [    ] o.a.s.c.c.ZkStateReader Updating cluster state from ZooKeeper... 
   [junit4]   2> 438059 INFO  (OverseerStateUpdate-95179504364683268-127.0.0.1:37655_-n_0000000000) [    ] o.a.s.c.o.ZkStateWriter going to create_collection /collections/collection1/state.json
   [junit4]   2> 439044 INFO  (TEST-HttpPartitionTest.test-seed#[6FA626F4C96F9A0]) [    ] o.a.s.c.ZkController Register node as live in ZooKeeper:/live_nodes/127.0.0.1:57383_
   [junit4]   2> 439044 INFO  (TEST-HttpPartitionTest.test-seed#[6FA626F4C96F9A0]) [    ] o.a.s.c.c.SolrZkClient makePath: /live_nodes/127.0.0.1:57383_
   [junit4]   2> 439045 INFO  (zkCallback-523-thread-2) [    ] o.a.s.c.c.ZkStateReader A live node change: [WatchedEvent state:SyncConnected type:NodeChildrenChanged path:/live_nodes], has occurred - updating... (live nodes size: [1])
   [junit4]   2> 439045 INFO  (zkCallback-525-thread-1) [    ] o.a.s.c.c.ZkStateReader A live node change: [WatchedEvent state:SyncConnected type:NodeChildrenChanged path:/live_nodes], has occurred - updating... (live nodes size: [1])
   [junit4]   2> 439045 INFO  (zkCallback-531-thread-1) [    ] o.a.s.c.c.ZkStateReader A live node change: [WatchedEvent state:SyncConnected type:NodeChildrenChanged path:/live_nodes], has occurred - updating... (live nodes size: [1])
   [junit4]   2> 439046 INFO  (TEST-HttpPartitionTest.test-seed#[6FA626F4C96F9A0]) [    ] o.a.s.c.Overseer Overseer (id=null) closing
   [junit4]   2> 439046 INFO  (TEST-HttpPartitionTest.test-seed#[6FA626F4C96F9A0]) [    ] o.a.s.c.LeaderElector Joined leadership election with path: /overseer_elect/election/95179504364683273-127.0.0.1:57383_-n_0000000001
   [junit4]   2> 439046 INFO  (TEST-HttpPartitionTest.test-seed#[6FA626F4C96F9A0]) [    ] o.a.s.c.LeaderElector Watching path /overseer_elect/election/95179504364683268-127.0.0.1:37655_-n_0000000000 to know if I could be the leader
   [junit4]   2> 439057 INFO  (TEST-HttpPartitionTest.test-seed#[6FA626F4C96F9A0]) [    ] o.a.s.c.CoreContainer Security conf doesn't exist. Skipping setup for authorization module.
   [junit4]   2> 439057 INFO  (TEST-HttpPartitionTest.test-seed#[6FA626F4C96F9A0]) [    ] o.a.s.c.CoreContainer No authentication plugin used.
   [junit4]   2> 439058 INFO  (TEST-HttpPartitionTest.test-seed#[6FA626F4C96F9A0]) [    ] o.a.s.c.CorePropertiesLocator Looking for core definitions underneath /home/jenkins/workspace/Lucene-Solr-trunk-Linux/solr/build/solr-core/test/J1/temp/solr.cloud.HttpPartitionTest_6FA626F4C96F9A0-001/shard-1-001/cores
   [junit4]   2> 439058 INFO  (TEST-HttpPartitionTest.test-seed#[6FA626F4C96F9A0]) [    ] o.a.s.c.CoreDescriptor Created CoreDescriptor: {name=collection1, config=solrconfig.xml, transient=false, schema=schema.xml, loadOnStartup=true, configSetProperties=configsetprops.json, collection=collection1, coreNodeName=, dataDir=data/, shard=}
   [junit4]   2> 439058 INFO  (TEST-HttpPartitionTest.test-seed#[6FA626F4C96F9A0]) [    ] o.a.s.c.CorePropertiesLocator Found core collection1 in /home/jenkins/workspace/Lucene-Solr-trunk-Linux/solr/build/solr-core/test/J1/temp/solr.cloud.HttpPartitionTest_6FA626F4C96F9A0-001/shard-1-001/cores/collection1
   [junit4]   2> 439058 INFO  (TEST-HttpPartitionTest.test-seed#[6FA626F4C96F9A0]) [    ] o.a.s.c.CorePropertiesLocator Found 1 core definitions
   [junit4]   2> 439059 INFO  (coreLoadExecutor-1323-thread-1) [    ] o.a.s.c.ZkController publishing state=down
   [junit4]   2> 439059 INFO  (coreLoadExecutor-1323-thread-1) [    ] o.a.s.c.ZkController numShards not found on descriptor - reading it from system property
   [junit4]   2> 439059 INFO  (TEST-HttpPartitionTest.test-seed#[6FA626F4C96F9A0]) [    ] o.a.s.s.SolrDispatchFilter user.dir=/home/jenkins/workspace/Lucene-Solr-trunk-Linux/solr/build/solr-core/test/J1
   [junit4]   2> 439059 INFO  (TEST-HttpPartitionTest.test-seed#[6FA626F4C96F9A0]) [    ] o.a.s.s.SolrDispatchFilter SolrDispatchFilter.init() done
   [junit4]   2> 439060 INFO  (coreLoadExecutor-1323-thread-1) [    ] o.a.s.c.ZkController Registering watch for collection collection1
   [junit4]   2> 439060 INFO  (coreLoadExecutor-1323-thread-1) [    ] o.a.s.c.c.ZkStateReader addZkWatch [collection1]
   [junit4]   2> 439060 INFO  (coreLoadExecutor-1323-thread-1) [    ] o.a.s.c.c.ZkStateReader Add data for [collection1] ver [0]
   [junit4]   2> 439060 INFO  (OverseerStateUpdate-95179504364683268-127.0.0.1:37655_-n_0000000000) [    ] o.a.s.c.Overseer processMessage: queueSize: 1, message = {
   [junit4]   2>   "core":"collection1",
   [junit4]   2>   "roles":null,
   [junit4]   2>   "base_url":"http://127.0.0.1:57383",
   [junit4]   2>   "node_name":"127.0.0.1:57383_",
   [junit4]   2>   "numShards":"2",
   [junit4]   2>   "state":"down",
   [junit4]   2>   "shard":null,
   [junit4]   2>   "collection":"collection1",
   [junit4]   2>   "operation":"state"} current state version: 3
   [junit4]   2> 439060 INFO  (coreLoadExecutor-1323-thread-1) [    ] o.a.s.c.ZkController look for our core node name
   [junit4]   2> 439061 INFO  (OverseerStateUpdate-95179504364683268-127.0.0.1:37655_-n_0000000000) [    ] o.a.s.c.o.ReplicaMutator Update state numShards=2 message={
   [junit4]   2>   "core":"collection1",
   [junit4]   2>   "roles":null,
   [junit4]   2>   "base_url":"http://127.0.0.1:57383",
   [junit4]   2>   "node_name":"127.0.0.1:57383_",
   [junit4]   2>   "numShards":"2",
   [junit4]   2>   "state":"down",
   [junit4]   2>   "shard":null,
   [junit4]   2>   "collection":"collection1",
   [junit4]   2>   "operation":"state"}
   [junit4]   2> 439061 INFO  (OverseerStateUpdate-95179504364683268-127.0.0.1:37655_-n_0000000000) [    ] o.a.s.c.o.ReplicaMutator Collection already exists with numShards=2
   [junit4]   2> 439061 INFO  (OverseerStateUpdate-95179504364683268-127.0.0.1:37655_-n_0000000000) [    ] o.a.s.c.o.ReplicaMutator Assigning new node to shard shard=shard2
   [junit4]   2> 439162 INFO  (OverseerStateUpdate-95179504364683268-127.0.0.1:37655_-n_0000000000) [    ] o.a.s.c.o.ZkStateWriter going to update_collection /collections/collection1/state.json version: 0
   [junit4]   2> 439162 INFO  (zkCallback-531-thread-1) [    ] o.a.s.c.c.ZkStateReader A cluster state change: [WatchedEvent state:SyncConnected type:NodeDataChanged path:/collections/collection1/state.json] for collection [collection1] has occurred - updating... (live nodes size: [2])
   [junit4]   2> 439162 INFO  (zkCallback-531-thread-1) [    ] o.a.s.c.c.ZkStateReader Updating data for [collection1] from [0] to [1]
   [junit4]   2> 440060 INFO  (coreLoadExecutor-1323-thread-1) [    ] o.a.s.c.ZkController waiting to find shard id in clusterstate for collection1
   [junit4]   2> 440061 INFO  (coreLoadExecutor-1323-thread-1) [    ] o.a.s.c.ZkController Check for collection zkNode:collection1
   [junit4]   2> 440061 INFO  (coreLoadExecutor-1323-thread-1) [    ] o.a.s.c.ZkController Collection zkNode exists
   [junit4]   2> 440061 INFO  (coreLoadExecutor-1323-thread-1) [    ] o.a.s.c.c.ZkStateReader Load collection config from: [/collections/collection1]
   [junit4]   2> 440061 INFO  (coreLoadExecutor-1323-thread-1) [    ] o.a.s.c.c.ZkStateReader path=[/collections/collection1] [configName]=[conf1] specified config exists in ZooKeeper
   [junit4]   2> 440061 INFO  (coreLoadExecutor-1323-thread-1) [    ] o.a.s.c.SolrResourceLoader new SolrResourceLoader for directory: '/home/jenkins/workspace/Lucene-Solr-trunk-Linux/solr/build/solr-core/test/J1/temp/solr.cloud.HttpPartitionTest_6FA626F4C96F9A0-001/shard-1-001/cores/collection1'
   [junit4]   2> 440061 INFO  (coreLoadExecutor-1323-thread-1) [    ] o.a.s.c.SolrResourceLoader JNDI not configured for solr (NoInitialContextEx)
   [junit4]   2> 440061 INFO  (coreLoadExecutor-1323-thread-1) [    ] o.a.s.c.SolrResourceLoader solr home defaulted to 'solr/' (could not find system property or JNDI)
   [junit4]   2> 440062 INFO  (coreLoadExecutor-1323-thread-1) [    ] o.a.s.c.Config loaded config solrconfig.xml with version 0 
   [junit4]   2> 440065 INFO  (coreLoadExecutor-1323-thread-1) [    ] o.a.s.c.SolrConfig current version of requestparams : -1
   [junit4]   2> 440068 INFO  (coreLoadExecutor-1323-thread-1) [    ] o.a.s.c.SolrConfig Using Lucene MatchVersion: 6.0.0
   [junit4]   2> 440072 INFO  (coreLoadExecutor-1323-thread-1) [    ] o.a.s.c.SolrConfig Loaded SolrConfig: solrconfig.xml
   [junit4]   2> 440076 INFO  (coreLoadExecutor-1323-thread-1) [    ] o.a.s.s.IndexSchema [collection1] Schema name=test
   [junit4]   2> 440133 INFO  (coreLoadExecutor-1323-thread-1) [    ] o.a.s.s.OpenExchangeRatesOrgProvider Initialized with rates=open-exchange-rates.json, refreshInterval=1440.
   [junit4]   2> 440138 INFO  (coreLoadExecutor-1323-thread-1) [    ] o.a.s.s.IndexSchema default search field in schema is text
   [junit4]   2> 440139 INFO  (coreLoadExecutor-1323-thread-1) [    ] o.a.s.s.IndexSchema unique key field: id
   [junit4]   2> 440144 INFO  (coreLoadExecutor-1323-thread-1) [    ] o.a.s.s.FileExchangeRateProvider Reloading exchange rates from file currency.xml
   [junit4]   2> 440145 INFO  (coreLoadExecutor-1323-thread-1) [    ] o.a.s.s.FileExchangeRateProvider Reloading exchange rates from file currency.xml
   [junit4]   2> 440146 INFO  (coreLoadExecutor-1323-thread-1) [    ] o.a.s.s.OpenExchangeRatesOrgProvider Reloading exchange rates from open-exchange-rates.json
   [junit4]   2> 440147 INFO  (coreLoadExecutor-1323-thread-1) [    ] o.a.s.s.OpenExchangeRatesOrgProvider Reloading exchange rates from open-exchange-rates.json
   [junit4]   2> 440148 INFO  (coreLoadExecutor-1323-thread-1) [    ] o.a.s.c.ConfigSetProperties Did not find ConfigSet properties, assuming default properties: Can't find resource 'configsetprops.json' in classpath or '/configs/conf1', cwd=/home/jenkins/workspace/Lucene-Solr-trunk-Linux/solr/build/solr-core/test/J1
   [junit4]   2> 440148 INFO  (coreLoadExecutor-1323-thread-1) [    ] o.a.s.c.CoreContainer Creating SolrCore 'collection1' using configuration from collection collection1
   [junit4]   2> 440148 INFO  (coreLoadExecutor-1323-thread-1) [    ] o.a.s.c.SolrCore org.apache.solr.core.MockDirectoryFactory
   [junit4]   2> 440148 INFO  (coreLoadExecutor-1323-thread-1) [    ] o.a.s.c.SolrCore [[collection1] ] Opening new SolrCore at [/home/jenkins/workspace/Lucene-Solr-trunk-Linux/solr/build/solr-core/test/J1/temp/solr.cloud.HttpPartitionTest_6FA626F4C96F9A0-001/shard-1-001/cores/collection1], dataDir=[/home/jenkins/workspace/Lucene-Solr-trunk-Linux/solr/build/solr-core/test/J1/temp/solr.cloud.HttpPartitionTest_6FA626F4C96F9A0-001/shard-1-001/cores/collection1/data/]
   [junit4]   2> 440148 INFO  (coreLoadExecutor-1323-thread-1) [    ] o.a.s.c.JmxMonitoredMap JMX monitoring is enabled. Adding Solr mbeans to JMX Server: com.sun.jmx.mbeanserver.JmxMBeanServer@ddc343
   [junit4]   2> 440149 INFO  (coreLoadExecutor-1323-thread-1) [    ] o.a.s.c.CachingDirectoryFactory return new directory for /home/jenkins/workspace/Lucene-Solr-trunk-Linux/solr/build/solr-core/test/J1/temp/solr.cloud.HttpPartitionTest_6FA626F4C96F9A0-001/shard-1-001/cores/collection1/data
   [junit4]   2> 440149 INFO  (coreLoadExecutor-1323-thread-1) [    ] o.a.s.c.SolrCore New index directory detected: old=null new=/home/jenkins/workspace/Lucene-Solr-trunk-Linux/solr/build/solr-core/test/J1/temp/solr.cloud.HttpPartitionTest_6FA626F4C96F9A0-001/shard-1-001/cores/collection1/data/index/
   [junit4]   2> 440149 WARN  (coreLoadExecutor-1323-thread-1) [    ] o.a.s.c.SolrCore [collection1] Solr index directory '/home/jenkins/workspace/Lucene-Solr-trunk-Linux/solr/build/solr-core/test/J1/temp/solr.cloud.HttpPartitionTest_6FA626F4C96F9A0-001/shard-1-001/cores/collection1/data/index' doesn't exist. Creating new index...
   [junit4]   2> 440149 INFO  (coreLoadExecutor-1323-thread-1) [    ] o.a.s.c.CachingDirectoryFactory return new directory for /home/jenkins/workspace/Lucene-Solr-trunk-Linux/solr/build/solr-core/test/J1/temp/solr.cloud.HttpPartitionTest_6FA626F4C96F9A0-001/shard-1-001/cores/collection1/data/index
   [junit4]   2> 440149 INFO  (coreLoadExecutor-1323-thread-1) [    ] o.a.s.u.RandomMergePolicy RandomMergePolicy wrapping class org.apache.lucene.index.TieredMergePolicy: [TieredMergePolicy: maxMergeAtOnce=46, maxMergeAtOnceExplicit=29, maxMergedSegmentMB=84.8759765625, floorSegmentMB=1.6162109375, forceMergeDeletesPctAllowed=23.93995171852376, segmentsPerTier=46.0, maxCFSSegmentSizeMB=8.796093022207999E12, noCFSRatio=0.0
   [junit4]   2> 440150 INFO  (coreLoadExecutor-1323-thread-1) [    ] o.a.s.c.SolrDeletionPolicy SolrDeletionPolicy.onCommit: commits: num=1
   [junit4]   2> 	commit{dir=MockDirectoryWrapper(RAMDirectory@410f0f lockFactory=org.apache.lucene.store.SingleInstanceLockFactory@19631a1),segFN=segments_1,generation=1}
   [junit4]   2> 440150 INFO  (coreLoadExecutor-1323-thread-1) [    ] o.a.s.c.SolrDeletionPolicy newest commit generation = 1
   [junit4]   2> 440150 INFO  (OldIndexDirectoryCleanupThreadForCore-collection1) [    ] o.a.s.c.SolrCore Looking for old index directories to cleanup for core collection1 in /home/jenkins/workspace/Lucene-Solr-trunk-Linux/solr/build/solr-core/test/J1/temp/solr.cloud.HttpPartitionTest_6FA626F4C96F9A0-001/shard-1-001/cores/collection1/data/
   [junit4]   2> 440150 WARN  (OldIndexDirectoryCleanupThreadForCore-collection1) [    ] o.a.s.c.DirectoryFactory /home/jenkins/workspace/Lucene-Solr-trunk-Linux/solr/build/solr-core/test/J1/temp/solr.cloud.HttpPartitionTest_6FA626F4C96F9A0-001/shard-1-001/cores/collection1/data/ does not point to a valid data directory; skipping clean-up of old index directories.
   [junit4]   2> 440153 INFO  (coreLoadExecutor-1323-thread-1) [    ] o.a.s.u.p.UpdateRequestProcessorChain creating updateRequestProcessorChain "nodistrib"
   [junit4]   2> 440153 INFO  (coreLoadExecutor-1323-thread-1) [    ] o.a.s.u.p.UpdateRequestProcessorChain creating updateRequestProcessorChain "dedupe"
   [junit4]   2> 440153 INFO  (coreLoadExecutor-1323-thread-1) [    ] o.a.s.u.p.UpdateRequestProcessorChain inserting DistributedUpdateProcessorFactory into updateRequestProcessorChain "dedupe"
   [junit4]   2> 440153 INFO  (coreLoadExecutor-1323-thread-1) [    ] o.a.s.u.p.UpdateRequestProcessorChain creating updateRequestProcessorChain "stored_sig"
   [junit4]   2> 440153 INFO  (coreLoadExecutor-1323-thread-1) [    ] o.a.s.u.p.UpdateRequestProcessorChain inserting DistributedUpdateProcessorFactory into updateRequestProcessorChain "stored_sig"
   [junit4]   2> 440153 INFO  (coreLoadExecutor-1323-thread-1) [    ] o.a.s.u.p.UpdateRequestProcessorChain creating updateRequestProcessorChain "distrib-dup-test-chain-explicit"
   [junit4]   2> 440153 INFO  (coreLoadExecutor-1323-thread-1) [    ] o.a.s.u.p.UpdateRequestProcessorChain creating updateRequestProcessorChain "distrib-dup-test-chain-implicit"
   [junit4]   2> 440153 INFO  (coreLoadExecutor-1323-thread-1) [    ] o.a.s.u.p.UpdateRequestProcessorChain inserting DistributedUpdateProcessorFactory into updateRequestProcessorChain "distrib-dup-test-chain-implicit"
   [junit4]   2> 440153 INFO  (coreLoadExecutor-1323-thread-1) [    ] o.a.s.c.SolrCore no updateRequestProcessorChain defined as default, creating implicit default
   [junit4]   2> 440153 WARN  (coreLoadExecutor-1323-thread-1) [    ] o.a.s.c.RequestHandlers INVALID paramSet a in requestHandler {type = requestHandler,name = /dump,class = DumpRequestHandler,args = {defaults={a=A,b=B}}}
   [junit4]   2> 440154 INFO  (coreLoadExecutor-1323-thread-1) [    ] o.a.s.h.l.XMLLoader xsltCacheLifetimeSeconds=60
   [junit4]   2> 440155 INFO  (coreLoadExecutor-1323-thread-1) [    ] o.a.s.h.l.XMLLoader xsltCacheLifetimeSeconds=60
   [junit4]   2> 440155 INFO  (coreLoadExecutor-1323-thread-1) [    ] o.a.s.h.l.XMLLoader xsltCacheLifetimeSeconds=60
   [junit4]   2> 440156 INFO  (coreLoadExecutor-1323-thread-1) [    ] o.a.s.h.l.XMLLoader xsltCacheLifetimeSeconds=60
   [junit4]   2> 440159 INFO  (coreLoadExecutor-1323-thread-1) [    ] o.a.s.c.RequestHandlers Registered paths: /admin/mbeans,standard,/dump,/update/csv,/sql,/update/json/docs,/admin/luke,/export,/admin/segments,/get,/admin/system,/replication,/admin/properties,/config,/stream,/schema,/admin/plugins,/admin/logging,/update/json,/admin/threads,/admin/ping,/update,/admin/file
   [junit4]   2> 440159 INFO  (coreLoadExecutor-1323-thread-1) [    ] o.a.s.c.SolrCore Using default statsCache cache: org.apache.solr.search.stats.LocalStatsCache
   [junit4]   2> 440160 INFO  (coreLoadExecutor-1323-thread-1) [    ] o.a.s.u.UpdateHandler Using UpdateLog implementation: org.apache.solr.update.UpdateLog
   [junit4]   2> 440160 INFO  (coreLoadExecutor-1323-thread-1) [    ] o.a.s.u.UpdateLog Initializing UpdateLog: dataDir= defaultSyncLevel=FLUSH numRecordsToKeep=100 maxNumLogsToKeep=10 numVersionBuckets=65536
   [junit4]   2> 440160 INFO  (coreLoadExecutor-1323-thread-1) [    ] o.a.s.u.CommitTracker Hard AutoCommit: disabled
   [junit4]   2> 440160 INFO  (coreLoadExecutor-1323-thread-1) [    ] o.a.s.u.CommitTracker Soft AutoCommit: disabled
   [junit4]   2> 440161 INFO  (coreLoadExecutor-1323-thread-1) [    ] o.a.s.u.RandomMergePolicy RandomMergePolicy wrapping class org.apache.lucene.index.AlcoholicMergePolicy: [AlcoholicMergePolicy: minMergeSize=0, mergeFactor=10, maxMergeSize=78817268, maxMergeSizeForForcedMerge=9223372036854775807, calibrateSizeByDeletes=true, maxMergeDocs=2147483647, maxCFSSegmentSizeMB=8.796093022207999E12, noCFSRatio=0.1]
   [junit4]   2> 440161 INFO  (coreLoadExecutor-1323-thread-1) [    ] o.a.s.c.SolrDeletionPolicy SolrDeletionPolicy.onInit: commits: num=1
   [junit4]   2> 	commit{dir=MockDirectoryWrapper(RAMDirectory@410f0f lockFactory=org.apache.lucene.store.SingleInstanceLockFactory@19631a1),segFN=segments_1,generation=1}
   [junit4]   2> 440161 INFO  (coreLoadExecutor-1323-thread-1) [    ] o.a.s.c.SolrDeletionPolicy newest commit generation = 1
   [junit4]   2> 440162 INFO  (coreLoadExecutor-1323-thread-1) [    ] o.a.s.s.SolrIndexSearcher Opening Searcher@12747e8[collection1] main
   [junit4]   2> 440162 INFO  (coreLoadExecutor-1323-thread-1) [    ] o.a.s.c.c.ZkStateReader Load collection config from: [/collections/collection1]
   [junit4]   2> 440162 INFO  (coreLoadExecutor-1323-thread-1) [    ] o.a.s.c.c.ZkStateReader path=[/collections/collection1] [configName]=[conf1] specified config exists in ZooKeeper
   [junit4]   2> 440162 INFO  (coreLoadExecutor-1323-thread-1) [    ] o.a.s.r.ManagedResourceStorage Setting up ZooKeeper-based storage for the RestManager with znodeBase: /configs/conf1
   [junit4]   2> 440162 INFO  (coreLoadExecutor-1323-thread-1) [    ] o.a.s.r.ManagedResourceStorage Configured ZooKeeperStorageIO with znodeBase: /configs/conf1
   [junit4]   2> 440162 INFO  (coreLoadExecutor-1323-thread-1) [    ] o.a.s.r.RestManager Initializing RestManager with initArgs: {}
   [junit4]   2> 440162 INFO  (coreLoadExecutor-1323-thread-1) [    ] o.a.s.r.ManagedResourceStorage Reading _rest_managed.json using ZooKeeperStorageIO:path=/configs/conf1
   [junit4]   2> 440162 INFO  (coreLoadExecutor-1323-thread-1) [    ] o.a.s.r.ManagedResourceStorage No data found for znode /configs/conf1/_rest_managed.json
   [junit4]   2> 440162 INFO  (coreLoadExecutor-1323-thread-1) [    ] o.a.s.r.ManagedResourceStorage Loaded null at path _rest_managed.json using ZooKeeperStorageIO:path=/configs/conf1
   [junit4]   2> 440162 INFO  (coreLoadExecutor-1323-thread-1) [    ] o.a.s.r.RestManager Initializing 0 registered ManagedResources
   [junit4]   2> 440163 INFO  (coreLoadExecutor-1323-thread-1) [    ] o.a.s.h.ReplicationHandler Commits will be reserved for  10000
   [junit4]   2> 440163 INFO  (searcherExecutor-1324-thread-1) [    ] o.a.s.c.SolrCore [collection1] Registered new searcher Searcher@12747e8[collection1] main{ExitableDirectoryReader(UninvertingDirectoryReader())}
   [junit4]   2> 440163 INFO  (coreLoadExecutor-1323-thread-1) [    ] o.a.s.u.UpdateLog Looking up max value of version field to seed version buckets
   [junit4]   2> 440163 INFO  (coreLoadExecutor-1323-thread-1) [    ] o.a.s.u.VersionInfo Refreshing highest value of _version_ for 65536 version buckets from index
   [junit4]   2> 440163 INFO  (coreLoadExecutor-1323-thread-1) [    ] o.a.s.u.VersionInfo No terms found for _version_, cannot seed version bucket highest value from index
   [junit4]   2> 440163 INFO  (coreLoadExecutor-1323-thread-1) [    ] o.a.s.u.UpdateLog Could not find max version in index or recent updates, using new clock 1522872073974710272
   [junit4]   2> 440165 INFO  (coreLoadExecutor-1323-thread-1) [    ] o.a.s.u.UpdateLog Took 1.0ms to seed version buckets with highest version 1522872073974710272
   [junit4]   2> 440165 INFO  (coreLoadExecutor-1323-thread-1) [    ] o.a.s.c.ZkController watch zkdir /configs/conf1
   [junit4]   2> 440166 INFO  (coreLoadExecutor-1323-thread-1) [    ] o.a.s.c.CoreContainer registering core: collection1
   [junit4]   2> 440166 INFO  (coreZkRegister-1318-thread-1) [    ] o.a.s.c.ZkController Register replica - core:collection1 address:http://127.0.0.1:57383 collection:collection1 shard:shard2
   [junit4]   2> 440166 INFO  (coreZkRegister-1318-thread-1) [    ] o.a.s.c.c.SolrZkClient makePath: /collections/collection1/leader_elect/shard2/election
   [junit4]   2> 440168 INFO  (coreZkRegister-1318-thread-1) [    ] o.a.s.c.LeaderElector Joined leadership election with path: /collections/collection1/leader_elect/shard2/election/95179504364683273-core_node1-n_0000000000
   [junit4]   2> 440168 INFO  (coreZkRegister-1318-thread-1) [    ] o.a.s.c.ShardLeaderElectionContext Running the leader process for shard=shard2 and weAreReplacement=false and leaderVoteWait=10000
   [junit4]   2> 440169 INFO  (coreZkRegister-1318-thread-1) [    ] o.a.s.c.ShardLeaderElectionContext Enough replicas found to continue.
   [junit4]   2> 440169 INFO  (coreZkRegister-1318-thread-1) [    ] o.a.s.c.ShardLeaderElectionContext I may be the new leader - try and sync
   [junit4]   2> 440169 INFO  (coreZkRegister-1318-thread-1) [    ] o.a.s.c.SyncStrategy Sync replicas to http://127.0.0.1:57383/collection1/
   [junit4]   2> 440169 INFO  (coreZkRegister-1318-thread-1) [    ] o.a.s.c.SyncStrategy Sync Success - now sync replicas to me
   [junit4]   2> 440169 INFO  (coreZkRegister-1318-thread-1) [    ] o.a.s.c.SyncStrategy http://127.0.0.1:57383/collection1/ has no replicas
   [junit4]   2> 440169 INFO  (OverseerStateUpdate-95179504364683268-127.0.0.1:37655_-n_0000000000) [    ] o.a.s.c.Overseer processMessage: queueSize: 1, message = {
   [junit4]   2>   "operation":"leader",
   [junit4]   2>   "shard":"shard2",
   [junit4]   2>   "collection":"collection1"} current state version: 3
   [junit4]   2> 440170 INFO  (coreZkRegister-1318-thread-1) [    ] o.a.s.c.c.SolrZkClient makePath: /collections/collection1/leaders/shard2
   [junit4]   2> 440171 INFO  (coreZkRegister-1318-thread-1) [    ] o.a.s.c.ShardLeaderElectionContextBase Creating leader registration node
   [junit4]   2> 440172 INFO  (coreZkRegister-1318-thread-1) [    ] o.a.s.c.ShardLeaderElectionContext I am the new leader: http://127.0.0.1:57383/collection1/ shard2
   [junit4]   2> 440172 INFO  (OverseerStateUpdate-95179504364683268-127.0.0.1:37655_-n_0000000000) [    ] o.a.s.c.Overseer processMessage: queueSize: 1, message = {
   [junit4]   2>   "operation":"leader",
   [junit4]   2>   "shard":"shard2",
   [junit4]   2>   "collection":"collection1",
   [junit4]   2>   "base_url":"http://127.0.0.1:57383",
   [junit4]   2>   "core":"collection1",
   [junit4]   2>   "state":"active"} current state version: 3
   [junit4]   2> 440273 INFO  (OverseerStateUpdate-95179504364683268-127.0.0.1:37655_-n_0000000000) [    ] o.a.s.c.o.ZkStateWriter going to update_collection /collections/collection1/state.json version: 1
   [junit4]   2> 440274 INFO  (zkCallback-531-thread-1) [    ] o.a.s.c.c.ZkStateReader A cluster state change: [WatchedEvent state:SyncConnected type:NodeDataChanged path:/collections/collection1/state.json] for collection [collection1] has occurred - updating... (live nodes size: [2])
   [junit4]   2> 440274 INFO  (zkCallback-531-thread-1) [    ] o.a.s.c.c.ZkStateReader Updating data for [collection1] from [1] to [2]
   [junit4]   2> 440323 INFO  (coreZkRegister-1318-thread-1) [    ] o.a.s.c.ZkController We are http://127.0.0.1:57383/collection1/ and leader is http://127.0.0.1:57383/collection1/
   [junit4]   2> 440323 INFO  (coreZkRegister-1318-thread-1) [    ] o.a.s.c.ZkController No LogReplay needed for core=collection1 baseURL=http://127.0.0.1:57383
   [junit4]   2> 440323 INFO  (coreZkRegister-1318-thread-1) [    ] o.a.s.c.ZkController I am the leader, no recovery necessary
   [junit4]   2> 440323 INFO  (coreZkRegister-1318-thread-1) [    ] o.a.s.c.ZkController publishing state=active
   [junit4]   2> 440323 INFO  (coreZkRegister-1318-thread-1) [    ] o.a.s.c.ZkController numShards not found on descriptor - reading it from system property
   [junit4]   2> 440324 INFO  (OverseerStateUpdate-95179504364683268-127.0.0.1:37655_-n_0000000000) [    ] o.a.s.c.Overseer processMessage: queueSize: 1, message = {
   [junit4]   2>   "core":"collection1",
   [junit4]   2>   "core_node_name":"core_node1",
   [junit4]   2>   "roles":null,
   [junit4]   2>   "base_url":"http://127.0.0.1:57383",
   [junit4]   2>   "node_name":"127.0.0.1:57383_",
   [junit4]   2>   "numShards":"2",

[...truncated too long message...]

HttpPartitionTest.test-seed#[6FA626F4C96F9A0]) [    ] o.a.s.c.SocketProxy Closing 4 connections to: http://127.0.0.1:54432/, target: http://127.0.0.1:33008/
   [junit4]   2> 570498 WARN  (TEST-HttpPartitionTest.test-seed#[6FA626F4C96F9A0]) [    ] o.a.s.c.SocketProxy Closing 1 connections to: http://127.0.0.1:37655/, target: http://127.0.0.1:55762/
   [junit4]   2> 570498 WARN  (TEST-HttpPartitionTest.test-seed#[6FA626F4C96F9A0]) [    ] o.a.s.c.SocketProxy Closing 5 connections to: http://127.0.0.1:44615/, target: http://127.0.0.1:53959/
   [junit4]   2> NOTE: reproduce with: ant test  -Dtestcase=HttpPartitionTest -Dtests.method=test -Dtests.seed=6FA626F4C96F9A0 -Dtests.multiplier=3 -Dtests.slow=true -Dtests.locale=in -Dtests.timezone=Greenwich -Dtests.asserts=true -Dtests.file.encoding=UTF-8
   [junit4] FAILURE  134s J1 | HttpPartitionTest.test <<<
   [junit4]    > Throwable #1: java.lang.AssertionError: Didn't see all replicas for shard shard1 in c8n_1x2 come up within 30000 ms! ClusterState: {
   [junit4]    >   "collection1":{
   [junit4]    >     "replicationFactor":"1",
   [junit4]    >     "shards":{
   [junit4]    >       "shard1":{
   [junit4]    >         "range":"80000000-ffffffff",
   [junit4]    >         "state":"active",
   [junit4]    >         "replicas":{"core_node2":{
   [junit4]    >             "core":"collection1",
   [junit4]    >             "base_url":"http://127.0.0.1:44615",
   [junit4]    >             "node_name":"127.0.0.1:44615_",
   [junit4]    >             "state":"active",
   [junit4]    >             "leader":"true"}}},
   [junit4]    >       "shard2":{
   [junit4]    >         "range":"0-7fffffff",
   [junit4]    >         "state":"active",
   [junit4]    >         "replicas":{
   [junit4]    >           "core_node1":{
   [junit4]    >             "core":"collection1",
   [junit4]    >             "base_url":"http://127.0.0.1:57383",
   [junit4]    >             "node_name":"127.0.0.1:57383_",
   [junit4]    >             "state":"active",
   [junit4]    >             "leader":"true"},
   [junit4]    >           "core_node3":{
   [junit4]    >             "core":"collection1",
   [junit4]    >             "base_url":"http://127.0.0.1:54432",
   [junit4]    >             "node_name":"127.0.0.1:54432_",
   [junit4]    >             "state":"active"}}}},
   [junit4]    >     "router":{"name":"compositeId"},
   [junit4]    >     "maxShardsPerNode":"1",
   [junit4]    >     "autoAddReplicas":"false",
   [junit4]    >     "autoCreated":"true"},
   [junit4]    >   "control_collection":{
   [junit4]    >     "replicationFactor":"1",
   [junit4]    >     "shards":{"shard1":{
   [junit4]    >         "range":"80000000-7fffffff",
   [junit4]    >         "state":"active",
   [junit4]    >         "replicas":{"core_node1":{
   [junit4]    >             "core":"collection1",
   [junit4]    >             "base_url":"http://127.0.0.1:37655",
   [junit4]    >             "node_name":"127.0.0.1:37655_",
   [junit4]    >             "state":"active",
   [junit4]    >             "leader":"true"}}}},
   [junit4]    >     "router":{"name":"compositeId"},
   [junit4]    >     "maxShardsPerNode":"1",
   [junit4]    >     "autoAddReplicas":"false",
   [junit4]    >     "autoCreated":"true"},
   [junit4]    >   "c8n_1x2":{
   [junit4]    >     "replicationFactor":"2",
   [junit4]    >     "shards":{"shard1":{
   [junit4]    >         "range":"80000000-7fffffff",
   [junit4]    >         "state":"active",
   [junit4]    >         "replicas":{
   [junit4]    >           "core_node1":{
   [junit4]    >             "core":"c8n_1x2_shard1_replica1",
   [junit4]    >             "base_url":"http://127.0.0.1:57383",
   [junit4]    >             "node_name":"127.0.0.1:57383_",
   [junit4]    >             "state":"active",
   [junit4]    >             "leader":"true"},
   [junit4]    >           "core_node2":{
   [junit4]    >             "core":"c8n_1x2_shard1_replica2",
   [junit4]    >             "base_url":"http://127.0.0.1:37655",
   [junit4]    >             "node_name":"127.0.0.1:37655_",
   [junit4]    >             "state":"recovering"}}}},
   [junit4]    >     "router":{"name":"compositeId"},
   [junit4]    >     "maxShardsPerNode":"1",
   [junit4]    >     "autoAddReplicas":"false"},
   [junit4]    >   "collMinRf_1x3":{
   [junit4]    >     "replicationFactor":"3",
   [junit4]    >     "shards":{"shard1":{
   [junit4]    >         "range":"80000000-7fffffff",
   [junit4]    >         "state":"active",
   [junit4]    >         "replicas":{
   [junit4]    >           "core_node1":{
   [junit4]    >             "core":"collMinRf_1x3_shard1_replica1",
   [junit4]    >             "base_url":"http://127.0.0.1:44615",
   [junit4]    >             "node_name":"127.0.0.1:44615_",
   [junit4]    >             "state":"active"},
   [junit4]    >           "core_node2":{
   [junit4]    >             "core":"collMinRf_1x3_shard1_replica2",
   [junit4]    >             "base_url":"http://127.0.0.1:37655",
   [junit4]    >             "node_name":"127.0.0.1:37655_",
   [junit4]    >             "state":"active"},
   [junit4]    >           "core_node3":{
   [junit4]    >             "core":"collMinRf_1x3_shard1_replica3",
   [junit4]    >             "base_url":"http://127.0.0.1:57383",
   [junit4]    >             "node_name":"127.0.0.1:57383_",
   [junit4]    >             "state":"active",
   [junit4]    >             "leader":"true"}}}},
   [junit4]    >     "router":{"name":"compositeId"},
   [junit4]    >     "maxShardsPerNode":"1",
   [junit4]    >     "autoAddReplicas":"false"}}
   [junit4]    > 	at __randomizedtesting.SeedInfo.seed([6FA626F4C96F9A0:8EAE5DB5E26A9458]:0)
   [junit4]    > 	at org.apache.solr.cloud.AbstractFullDistribZkTestBase.ensureAllReplicasAreActive(AbstractFullDistribZkTestBase.java:1844)
   [junit4]    > 	at org.apache.solr.cloud.HttpPartitionTest.testRf2(HttpPartitionTest.java:349)
   [junit4]    > 	at org.apache.solr.cloud.HttpPartitionTest.test(HttpPartitionTest.java:109)
   [junit4]    > 	at org.apache.solr.BaseDistributedSearchTestCase$ShardsRepeatRule$ShardsFixedStatement.callStatement(BaseDistributedSearchTestCase.java:965)
   [junit4]    > 	at org.apache.solr.BaseDistributedSearchTestCase$ShardsRepeatRule$ShardsStatement.evaluate(BaseDistributedSearchTestCase.java:940)
   [junit4]    > 	at java.lang.Thread.run(Thread.java:747)
   [junit4]   2> 570501 INFO  (SUITE-HttpPartitionTest-seed#[6FA626F4C96F9A0]-worker) [    ] o.a.s.SolrTestCaseJ4 ###deleteCore
   [junit4]   2> NOTE: leaving temporary files on disk at: /home/jenkins/workspace/Lucene-Solr-trunk-Linux/solr/build/solr-core/test/J1/temp/solr.cloud.HttpPartitionTest_6FA626F4C96F9A0-001
   [junit4]   2> Jan 09, 2016 7:21:54 AM com.carrotsearch.randomizedtesting.ThreadLeakControl checkThreadLeaks
   [junit4]   2> WARNING: Will linger awaiting termination of 2 leaked thread(s).
   [junit4]   2> NOTE: test params are: codec=CheapBastard, sim=RandomSimilarityProvider(queryNorm=false,coord=no): {}, locale=in, timezone=Greenwich
   [junit4]   2> NOTE: Linux 3.19.0-42-generic i386/Oracle Corporation 9-ea (32-bit)/cpus=12,threads=1,free=434657128,total=536870912
   [junit4]   2> NOTE: All tests run in this JVM: [TestSchemaManager, OutOfBoxZkACLAndCredentialsProvidersTest, UUIDUpdateProcessorFallbackTest, TestDocBasedVersionConstraints, OpenExchangeRatesOrgProviderTest, DistributedTermsComponentTest, TestSolrDeletionPolicy2, DocumentBuilderTest, TestFileDictionaryLookup, HighlighterTest, TestDocumentBuilder, CollectionsAPIAsyncDistributedZkTest, BlockJoinFacetSimpleTest, TestSchemaResource, SolrIndexSplitterTest, DistribCursorPagingTest, CollectionReloadTest, TimeZoneUtilsTest, TestRequestForwarding, TestManagedResource, TestSerializedLuceneMatchVersion, TestOverriddenPrefixQueryForCustomFieldType, TermsComponentTest, TestSolrDynamicMBean, SecurityConfHandlerTest, TestCloudSchemaless, ZkSolrClientTest, SpellingQueryConverterTest, BasicFunctionalityTest, VersionInfoTest, TestBlobHandler, DistributedIntervalFacetingTest, TestConfigSets, HdfsDirectoryTest, AnalyticsMergeStrategyTest, ZkCLITest, BadCopyFieldTest, ShardRoutingCustomTest, TestAddFieldRealTimeGet, TestDefaultSearchFieldResource, SpellPossibilityIteratorTest, UpdateRequestProcessorFactoryTest, TestMiniSolrCloudClusterBase, OpenCloseCoreStressTest, TestInfoStreamLogging, BJQParserTest, TestBulkSchemaConcurrent, TestDefaultStatsCache, ConnectionManagerTest, FileUtilsTest, TestHashPartitioner, TestQuerySenderListener, HdfsRecoverLeaseTest, NotRequiredUniqueKeyTest, RecoveryAfterSoftCommitTest, TestPivotHelperCode, TestReloadDeadlock, HttpPartitionTest]
   [junit4] Completed [161/575 (1!)] on J1 in 135.06s, 1 test, 1 failure <<< FAILURES!

[...truncated 1353 lines...]
BUILD FAILED
/home/jenkins/workspace/Lucene-Solr-trunk-Linux/build.xml:784: The following error occurred while executing this line:
/home/jenkins/workspace/Lucene-Solr-trunk-Linux/build.xml:728: The following error occurred while executing this line:
/home/jenkins/workspace/Lucene-Solr-trunk-Linux/build.xml:59: The following error occurred while executing this line:
/home/jenkins/workspace/Lucene-Solr-trunk-Linux/solr/build.xml:233: The following error occurred while executing this line:
/home/jenkins/workspace/Lucene-Solr-trunk-Linux/solr/common-build.xml:516: The following error occurred while executing this line:
/home/jenkins/workspace/Lucene-Solr-trunk-Linux/lucene/common-build.xml:1424: The following error occurred while executing this line:
/home/jenkins/workspace/Lucene-Solr-trunk-Linux/lucene/common-build.xml:981: There were test failures: 575 suites (8 ignored), 2290 tests, 1 failure, 115 ignored (70 assumptions) [seed: 6FA626F4C96F9A0]

Total time: 50 minutes 54 seconds
Build step 'Invoke Ant' marked build as failure
Archiving artifacts
[WARNINGS] Skipping publisher since build result is FAILURE
Recording test results
Email was triggered for: Failure - Any
Sending email for trigger: Failure - Any



Mime
View raw message