lucene-dev mailing list archives

Site index · List index
Message view « Date » · « Thread »
Top « Date » · « Thread »
From Policeman Jenkins Server <jenk...@thetaphi.de>
Subject [JENKINS-EA] Lucene-Solr-trunk-Linux (32bit/jdk-9-ea+95) - Build # 15536 - Failure!
Date Wed, 13 Jan 2016 03:23:23 GMT
Build: http://jenkins.thetaphi.de/job/Lucene-Solr-trunk-Linux/15536/
Java: 32bit/jdk-9-ea+95 -client -XX:+UseConcMarkSweepGC -XX:-CompactStrings

3 tests failed.
FAILED:  junit.framework.TestSuite.org.apache.solr.cloud.CollectionsAPIDistributedZkTest

Error Message:
5 threads leaked from SUITE scope at org.apache.solr.cloud.CollectionsAPIDistributedZkTest:     1) Thread[id=6434, name=TEST-CollectionsAPIDistributedZkTest.test-seed#[6EB190BC378DF78D]-EventThread, state=WAITING, group=TGRP-CollectionsAPIDistributedZkTest]         at jdk.internal.misc.Unsafe.park(Native Method)         at java.util.concurrent.locks.LockSupport.park(LockSupport.java:178)         at java.util.concurrent.locks.AbstractQueuedSynchronizer$ConditionObject.await(AbstractQueuedSynchronizer.java:2061)         at java.util.concurrent.LinkedBlockingQueue.take(LinkedBlockingQueue.java:442)         at org.apache.zookeeper.ClientCnxn$EventThread.run(ClientCnxn.java:494)    2) Thread[id=6654, name=zkCallback-986-thread-2, state=TIMED_WAITING, group=TGRP-CollectionsAPIDistributedZkTest]         at jdk.internal.misc.Unsafe.park(Native Method)         at java.util.concurrent.locks.LockSupport.parkNanos(LockSupport.java:218)         at java.util.concurrent.SynchronousQueue$TransferStack.awaitFulfill(SynchronousQueue.java:461)         at java.util.concurrent.SynchronousQueue$TransferStack.transfer(SynchronousQueue.java:362)         at java.util.concurrent.SynchronousQueue.poll(SynchronousQueue.java:937)         at java.util.concurrent.ThreadPoolExecutor.getTask(ThreadPoolExecutor.java:1082)         at java.util.concurrent.ThreadPoolExecutor.runWorker(ThreadPoolExecutor.java:1143)         at java.util.concurrent.ThreadPoolExecutor$Worker.run(ThreadPoolExecutor.java:632)         at java.lang.Thread.run(Thread.java:747)    3) Thread[id=6435, name=zkCallback-986-thread-1, state=TIMED_WAITING, group=TGRP-CollectionsAPIDistributedZkTest]         at jdk.internal.misc.Unsafe.park(Native Method)         at java.util.concurrent.locks.LockSupport.parkNanos(LockSupport.java:218)         at java.util.concurrent.SynchronousQueue$TransferStack.awaitFulfill(SynchronousQueue.java:461)         at java.util.concurrent.SynchronousQueue$TransferStack.transfer(SynchronousQueue.java:362)         at java.util.concurrent.SynchronousQueue.poll(SynchronousQueue.java:937)         at java.util.concurrent.ThreadPoolExecutor.getTask(ThreadPoolExecutor.java:1082)         at java.util.concurrent.ThreadPoolExecutor.runWorker(ThreadPoolExecutor.java:1143)         at java.util.concurrent.ThreadPoolExecutor$Worker.run(ThreadPoolExecutor.java:632)         at java.lang.Thread.run(Thread.java:747)    4) Thread[id=6433, name=TEST-CollectionsAPIDistributedZkTest.test-seed#[6EB190BC378DF78D]-SendThread(127.0.0.1:49237), state=TIMED_WAITING, group=TGRP-CollectionsAPIDistributedZkTest]         at java.lang.Thread.sleep(Native Method)         at org.apache.zookeeper.ClientCnxn$SendThread.run(ClientCnxn.java:994)    5) Thread[id=6655, name=zkCallback-986-thread-3, state=TIMED_WAITING, group=TGRP-CollectionsAPIDistributedZkTest]         at jdk.internal.misc.Unsafe.park(Native Method)         at java.util.concurrent.locks.LockSupport.parkNanos(LockSupport.java:218)         at java.util.concurrent.SynchronousQueue$TransferStack.awaitFulfill(SynchronousQueue.java:461)         at java.util.concurrent.SynchronousQueue$TransferStack.transfer(SynchronousQueue.java:362)         at java.util.concurrent.SynchronousQueue.poll(SynchronousQueue.java:937)         at java.util.concurrent.ThreadPoolExecutor.getTask(ThreadPoolExecutor.java:1082)         at java.util.concurrent.ThreadPoolExecutor.runWorker(ThreadPoolExecutor.java:1143)         at java.util.concurrent.ThreadPoolExecutor$Worker.run(ThreadPoolExecutor.java:632)         at java.lang.Thread.run(Thread.java:747)

Stack Trace:
com.carrotsearch.randomizedtesting.ThreadLeakError: 5 threads leaked from SUITE scope at org.apache.solr.cloud.CollectionsAPIDistributedZkTest: 
   1) Thread[id=6434, name=TEST-CollectionsAPIDistributedZkTest.test-seed#[6EB190BC378DF78D]-EventThread, state=WAITING, group=TGRP-CollectionsAPIDistributedZkTest]
        at jdk.internal.misc.Unsafe.park(Native Method)
        at java.util.concurrent.locks.LockSupport.park(LockSupport.java:178)
        at java.util.concurrent.locks.AbstractQueuedSynchronizer$ConditionObject.await(AbstractQueuedSynchronizer.java:2061)
        at java.util.concurrent.LinkedBlockingQueue.take(LinkedBlockingQueue.java:442)
        at org.apache.zookeeper.ClientCnxn$EventThread.run(ClientCnxn.java:494)
   2) Thread[id=6654, name=zkCallback-986-thread-2, state=TIMED_WAITING, group=TGRP-CollectionsAPIDistributedZkTest]
        at jdk.internal.misc.Unsafe.park(Native Method)
        at java.util.concurrent.locks.LockSupport.parkNanos(LockSupport.java:218)
        at java.util.concurrent.SynchronousQueue$TransferStack.awaitFulfill(SynchronousQueue.java:461)
        at java.util.concurrent.SynchronousQueue$TransferStack.transfer(SynchronousQueue.java:362)
        at java.util.concurrent.SynchronousQueue.poll(SynchronousQueue.java:937)
        at java.util.concurrent.ThreadPoolExecutor.getTask(ThreadPoolExecutor.java:1082)
        at java.util.concurrent.ThreadPoolExecutor.runWorker(ThreadPoolExecutor.java:1143)
        at java.util.concurrent.ThreadPoolExecutor$Worker.run(ThreadPoolExecutor.java:632)
        at java.lang.Thread.run(Thread.java:747)
   3) Thread[id=6435, name=zkCallback-986-thread-1, state=TIMED_WAITING, group=TGRP-CollectionsAPIDistributedZkTest]
        at jdk.internal.misc.Unsafe.park(Native Method)
        at java.util.concurrent.locks.LockSupport.parkNanos(LockSupport.java:218)
        at java.util.concurrent.SynchronousQueue$TransferStack.awaitFulfill(SynchronousQueue.java:461)
        at java.util.concurrent.SynchronousQueue$TransferStack.transfer(SynchronousQueue.java:362)
        at java.util.concurrent.SynchronousQueue.poll(SynchronousQueue.java:937)
        at java.util.concurrent.ThreadPoolExecutor.getTask(ThreadPoolExecutor.java:1082)
        at java.util.concurrent.ThreadPoolExecutor.runWorker(ThreadPoolExecutor.java:1143)
        at java.util.concurrent.ThreadPoolExecutor$Worker.run(ThreadPoolExecutor.java:632)
        at java.lang.Thread.run(Thread.java:747)
   4) Thread[id=6433, name=TEST-CollectionsAPIDistributedZkTest.test-seed#[6EB190BC378DF78D]-SendThread(127.0.0.1:49237), state=TIMED_WAITING, group=TGRP-CollectionsAPIDistributedZkTest]
        at java.lang.Thread.sleep(Native Method)
        at org.apache.zookeeper.ClientCnxn$SendThread.run(ClientCnxn.java:994)
   5) Thread[id=6655, name=zkCallback-986-thread-3, state=TIMED_WAITING, group=TGRP-CollectionsAPIDistributedZkTest]
        at jdk.internal.misc.Unsafe.park(Native Method)
        at java.util.concurrent.locks.LockSupport.parkNanos(LockSupport.java:218)
        at java.util.concurrent.SynchronousQueue$TransferStack.awaitFulfill(SynchronousQueue.java:461)
        at java.util.concurrent.SynchronousQueue$TransferStack.transfer(SynchronousQueue.java:362)
        at java.util.concurrent.SynchronousQueue.poll(SynchronousQueue.java:937)
        at java.util.concurrent.ThreadPoolExecutor.getTask(ThreadPoolExecutor.java:1082)
        at java.util.concurrent.ThreadPoolExecutor.runWorker(ThreadPoolExecutor.java:1143)
        at java.util.concurrent.ThreadPoolExecutor$Worker.run(ThreadPoolExecutor.java:632)
        at java.lang.Thread.run(Thread.java:747)
	at __randomizedtesting.SeedInfo.seed([6EB190BC378DF78D]:0)


FAILED:  junit.framework.TestSuite.org.apache.solr.cloud.CollectionsAPIDistributedZkTest

Error Message:
There are still zombie threads that couldn't be terminated:    1) Thread[id=6654, name=zkCallback-986-thread-2, state=TIMED_WAITING, group=TGRP-CollectionsAPIDistributedZkTest]         at jdk.internal.misc.Unsafe.park(Native Method)         at java.util.concurrent.locks.LockSupport.parkNanos(LockSupport.java:218)         at java.util.concurrent.SynchronousQueue$TransferStack.awaitFulfill(SynchronousQueue.java:461)         at java.util.concurrent.SynchronousQueue$TransferStack.transfer(SynchronousQueue.java:362)         at java.util.concurrent.SynchronousQueue.poll(SynchronousQueue.java:937)         at java.util.concurrent.ThreadPoolExecutor.getTask(ThreadPoolExecutor.java:1082)         at java.util.concurrent.ThreadPoolExecutor.runWorker(ThreadPoolExecutor.java:1143)         at java.util.concurrent.ThreadPoolExecutor$Worker.run(ThreadPoolExecutor.java:632)         at java.lang.Thread.run(Thread.java:747)    2) Thread[id=6435, name=zkCallback-986-thread-1, state=TIMED_WAITING, group=TGRP-CollectionsAPIDistributedZkTest]         at jdk.internal.misc.Unsafe.park(Native Method)         at java.util.concurrent.locks.LockSupport.parkNanos(LockSupport.java:218)         at java.util.concurrent.SynchronousQueue$TransferStack.awaitFulfill(SynchronousQueue.java:461)         at java.util.concurrent.SynchronousQueue$TransferStack.transfer(SynchronousQueue.java:362)         at java.util.concurrent.SynchronousQueue.poll(SynchronousQueue.java:937)         at java.util.concurrent.ThreadPoolExecutor.getTask(ThreadPoolExecutor.java:1082)         at java.util.concurrent.ThreadPoolExecutor.runWorker(ThreadPoolExecutor.java:1143)         at java.util.concurrent.ThreadPoolExecutor$Worker.run(ThreadPoolExecutor.java:632)         at java.lang.Thread.run(Thread.java:747)    3) Thread[id=6433, name=TEST-CollectionsAPIDistributedZkTest.test-seed#[6EB190BC378DF78D]-SendThread(127.0.0.1:49237), state=TIMED_WAITING, group=TGRP-CollectionsAPIDistributedZkTest]         at java.lang.Thread.sleep(Native Method)         at org.apache.zookeeper.client.StaticHostProvider.next(StaticHostProvider.java:101)         at org.apache.zookeeper.ClientCnxn$SendThread.startConnect(ClientCnxn.java:940)         at org.apache.zookeeper.ClientCnxn$SendThread.run(ClientCnxn.java:1003)    4) Thread[id=6655, name=zkCallback-986-thread-3, state=TIMED_WAITING, group=TGRP-CollectionsAPIDistributedZkTest]         at jdk.internal.misc.Unsafe.park(Native Method)         at java.util.concurrent.locks.LockSupport.parkNanos(LockSupport.java:218)         at java.util.concurrent.SynchronousQueue$TransferStack.awaitFulfill(SynchronousQueue.java:461)         at java.util.concurrent.SynchronousQueue$TransferStack.transfer(SynchronousQueue.java:362)         at java.util.concurrent.SynchronousQueue.poll(SynchronousQueue.java:937)         at java.util.concurrent.ThreadPoolExecutor.getTask(ThreadPoolExecutor.java:1082)         at java.util.concurrent.ThreadPoolExecutor.runWorker(ThreadPoolExecutor.java:1143)         at java.util.concurrent.ThreadPoolExecutor$Worker.run(ThreadPoolExecutor.java:632)         at java.lang.Thread.run(Thread.java:747)

Stack Trace:
com.carrotsearch.randomizedtesting.ThreadLeakError: There are still zombie threads that couldn't be terminated:
   1) Thread[id=6654, name=zkCallback-986-thread-2, state=TIMED_WAITING, group=TGRP-CollectionsAPIDistributedZkTest]
        at jdk.internal.misc.Unsafe.park(Native Method)
        at java.util.concurrent.locks.LockSupport.parkNanos(LockSupport.java:218)
        at java.util.concurrent.SynchronousQueue$TransferStack.awaitFulfill(SynchronousQueue.java:461)
        at java.util.concurrent.SynchronousQueue$TransferStack.transfer(SynchronousQueue.java:362)
        at java.util.concurrent.SynchronousQueue.poll(SynchronousQueue.java:937)
        at java.util.concurrent.ThreadPoolExecutor.getTask(ThreadPoolExecutor.java:1082)
        at java.util.concurrent.ThreadPoolExecutor.runWorker(ThreadPoolExecutor.java:1143)
        at java.util.concurrent.ThreadPoolExecutor$Worker.run(ThreadPoolExecutor.java:632)
        at java.lang.Thread.run(Thread.java:747)
   2) Thread[id=6435, name=zkCallback-986-thread-1, state=TIMED_WAITING, group=TGRP-CollectionsAPIDistributedZkTest]
        at jdk.internal.misc.Unsafe.park(Native Method)
        at java.util.concurrent.locks.LockSupport.parkNanos(LockSupport.java:218)
        at java.util.concurrent.SynchronousQueue$TransferStack.awaitFulfill(SynchronousQueue.java:461)
        at java.util.concurrent.SynchronousQueue$TransferStack.transfer(SynchronousQueue.java:362)
        at java.util.concurrent.SynchronousQueue.poll(SynchronousQueue.java:937)
        at java.util.concurrent.ThreadPoolExecutor.getTask(ThreadPoolExecutor.java:1082)
        at java.util.concurrent.ThreadPoolExecutor.runWorker(ThreadPoolExecutor.java:1143)
        at java.util.concurrent.ThreadPoolExecutor$Worker.run(ThreadPoolExecutor.java:632)
        at java.lang.Thread.run(Thread.java:747)
   3) Thread[id=6433, name=TEST-CollectionsAPIDistributedZkTest.test-seed#[6EB190BC378DF78D]-SendThread(127.0.0.1:49237), state=TIMED_WAITING, group=TGRP-CollectionsAPIDistributedZkTest]
        at java.lang.Thread.sleep(Native Method)
        at org.apache.zookeeper.client.StaticHostProvider.next(StaticHostProvider.java:101)
        at org.apache.zookeeper.ClientCnxn$SendThread.startConnect(ClientCnxn.java:940)
        at org.apache.zookeeper.ClientCnxn$SendThread.run(ClientCnxn.java:1003)
   4) Thread[id=6655, name=zkCallback-986-thread-3, state=TIMED_WAITING, group=TGRP-CollectionsAPIDistributedZkTest]
        at jdk.internal.misc.Unsafe.park(Native Method)
        at java.util.concurrent.locks.LockSupport.parkNanos(LockSupport.java:218)
        at java.util.concurrent.SynchronousQueue$TransferStack.awaitFulfill(SynchronousQueue.java:461)
        at java.util.concurrent.SynchronousQueue$TransferStack.transfer(SynchronousQueue.java:362)
        at java.util.concurrent.SynchronousQueue.poll(SynchronousQueue.java:937)
        at java.util.concurrent.ThreadPoolExecutor.getTask(ThreadPoolExecutor.java:1082)
        at java.util.concurrent.ThreadPoolExecutor.runWorker(ThreadPoolExecutor.java:1143)
        at java.util.concurrent.ThreadPoolExecutor$Worker.run(ThreadPoolExecutor.java:632)
        at java.lang.Thread.run(Thread.java:747)
	at __randomizedtesting.SeedInfo.seed([6EB190BC378DF78D]:0)


FAILED:  org.apache.solr.cloud.CollectionsAPIDistributedZkTest.test

Error Message:
some core start times did not change on reload

Stack Trace:
java.lang.AssertionError: some core start times did not change on reload
	at __randomizedtesting.SeedInfo.seed([6EB190BC378DF78D:E6E5AF6699719A75]:0)
	at org.junit.Assert.fail(Assert.java:93)
	at org.junit.Assert.assertTrue(Assert.java:43)
	at org.apache.solr.cloud.CollectionsAPIDistributedZkTest.testCollectionsAPI(CollectionsAPIDistributedZkTest.java:749)
	at org.apache.solr.cloud.CollectionsAPIDistributedZkTest.test(CollectionsAPIDistributedZkTest.java:160)
	at sun.reflect.NativeMethodAccessorImpl.invoke0(Native Method)
	at sun.reflect.NativeMethodAccessorImpl.invoke(NativeMethodAccessorImpl.java:62)
	at sun.reflect.DelegatingMethodAccessorImpl.invoke(DelegatingMethodAccessorImpl.java:43)
	at java.lang.reflect.Method.invoke(Method.java:520)
	at com.carrotsearch.randomizedtesting.RandomizedRunner.invoke(RandomizedRunner.java:1764)
	at com.carrotsearch.randomizedtesting.RandomizedRunner$8.evaluate(RandomizedRunner.java:871)
	at com.carrotsearch.randomizedtesting.RandomizedRunner$9.evaluate(RandomizedRunner.java:907)
	at com.carrotsearch.randomizedtesting.RandomizedRunner$10.evaluate(RandomizedRunner.java:921)
	at org.apache.solr.BaseDistributedSearchTestCase$ShardsRepeatRule$ShardsFixedStatement.callStatement(BaseDistributedSearchTestCase.java:965)
	at org.apache.solr.BaseDistributedSearchTestCase$ShardsRepeatRule$ShardsStatement.evaluate(BaseDistributedSearchTestCase.java:940)
	at com.carrotsearch.randomizedtesting.rules.SystemPropertiesRestoreRule$1.evaluate(SystemPropertiesRestoreRule.java:57)
	at org.apache.lucene.util.TestRuleSetupTeardownChained$1.evaluate(TestRuleSetupTeardownChained.java:50)
	at org.apache.lucene.util.AbstractBeforeAfterRule$1.evaluate(AbstractBeforeAfterRule.java:46)
	at org.apache.lucene.util.TestRuleThreadAndTestName$1.evaluate(TestRuleThreadAndTestName.java:49)
	at org.apache.lucene.util.TestRuleIgnoreAfterMaxFailures$1.evaluate(TestRuleIgnoreAfterMaxFailures.java:65)
	at org.apache.lucene.util.TestRuleMarkFailure$1.evaluate(TestRuleMarkFailure.java:48)
	at com.carrotsearch.randomizedtesting.rules.StatementAdapter.evaluate(StatementAdapter.java:36)
	at com.carrotsearch.randomizedtesting.ThreadLeakControl$StatementRunner.run(ThreadLeakControl.java:367)
	at com.carrotsearch.randomizedtesting.ThreadLeakControl.forkTimeoutingTask(ThreadLeakControl.java:809)
	at com.carrotsearch.randomizedtesting.ThreadLeakControl$3.evaluate(ThreadLeakControl.java:460)
	at com.carrotsearch.randomizedtesting.RandomizedRunner.runSingleTest(RandomizedRunner.java:880)
	at com.carrotsearch.randomizedtesting.RandomizedRunner$5.evaluate(RandomizedRunner.java:781)
	at com.carrotsearch.randomizedtesting.RandomizedRunner$6.evaluate(RandomizedRunner.java:816)
	at com.carrotsearch.randomizedtesting.RandomizedRunner$7.evaluate(RandomizedRunner.java:827)
	at com.carrotsearch.randomizedtesting.rules.StatementAdapter.evaluate(StatementAdapter.java:36)
	at com.carrotsearch.randomizedtesting.rules.SystemPropertiesRestoreRule$1.evaluate(SystemPropertiesRestoreRule.java:57)
	at org.apache.lucene.util.AbstractBeforeAfterRule$1.evaluate(AbstractBeforeAfterRule.java:46)
	at com.carrotsearch.randomizedtesting.rules.StatementAdapter.evaluate(StatementAdapter.java:36)
	at org.apache.lucene.util.TestRuleStoreClassName$1.evaluate(TestRuleStoreClassName.java:42)
	at com.carrotsearch.randomizedtesting.rules.NoShadowingOrOverridesOnMethodsRule$1.evaluate(NoShadowingOrOverridesOnMethodsRule.java:40)
	at com.carrotsearch.randomizedtesting.rules.NoShadowingOrOverridesOnMethodsRule$1.evaluate(NoShadowingOrOverridesOnMethodsRule.java:40)
	at com.carrotsearch.randomizedtesting.rules.StatementAdapter.evaluate(StatementAdapter.java:36)
	at com.carrotsearch.randomizedtesting.rules.StatementAdapter.evaluate(StatementAdapter.java:36)
	at com.carrotsearch.randomizedtesting.rules.StatementAdapter.evaluate(StatementAdapter.java:36)
	at org.apache.lucene.util.TestRuleAssertionsRequired$1.evaluate(TestRuleAssertionsRequired.java:54)
	at org.apache.lucene.util.TestRuleMarkFailure$1.evaluate(TestRuleMarkFailure.java:48)
	at org.apache.lucene.util.TestRuleIgnoreAfterMaxFailures$1.evaluate(TestRuleIgnoreAfterMaxFailures.java:65)
	at org.apache.lucene.util.TestRuleIgnoreTestSuites$1.evaluate(TestRuleIgnoreTestSuites.java:55)
	at com.carrotsearch.randomizedtesting.rules.StatementAdapter.evaluate(StatementAdapter.java:36)
	at com.carrotsearch.randomizedtesting.ThreadLeakControl$StatementRunner.run(ThreadLeakControl.java:367)
	at java.lang.Thread.run(Thread.java:747)




Build Log:
[...truncated 10479 lines...]
   [junit4] Suite: org.apache.solr.cloud.CollectionsAPIDistributedZkTest
   [junit4]   2> Creating dataDir: /home/jenkins/workspace/Lucene-Solr-trunk-Linux/solr/build/solr-core/test/J1/temp/solr.cloud.CollectionsAPIDistributedZkTest_6EB190BC378DF78D-001/init-core-data-001
   [junit4]   2> 871176 INFO  (SUITE-CollectionsAPIDistributedZkTest-seed#[6EB190BC378DF78D]-worker) [    ] o.a.s.SolrTestCaseJ4 Randomized ssl (true) and clientAuth (false)
   [junit4]   2> 871177 INFO  (SUITE-CollectionsAPIDistributedZkTest-seed#[6EB190BC378DF78D]-worker) [    ] o.a.s.BaseDistributedSearchTestCase Setting hostContext system property: /_/oo
   [junit4]   2> 871178 INFO  (TEST-CollectionsAPIDistributedZkTest.test-seed#[6EB190BC378DF78D]) [    ] o.a.s.c.ZkTestServer STARTING ZK TEST SERVER
   [junit4]   2> 871179 INFO  (Thread-2400) [    ] o.a.s.c.ZkTestServer client port:0.0.0.0/0.0.0.0:0
   [junit4]   2> 871179 INFO  (Thread-2400) [    ] o.a.s.c.ZkTestServer Starting server
   [junit4]   2> 871278 INFO  (TEST-CollectionsAPIDistributedZkTest.test-seed#[6EB190BC378DF78D]) [    ] o.a.s.c.ZkTestServer start zk server on port:49237
   [junit4]   2> 871278 INFO  (TEST-CollectionsAPIDistributedZkTest.test-seed#[6EB190BC378DF78D]) [    ] o.a.s.c.c.SolrZkClient Using default ZkCredentialsProvider
   [junit4]   2> 871279 INFO  (TEST-CollectionsAPIDistributedZkTest.test-seed#[6EB190BC378DF78D]) [    ] o.a.s.c.c.ConnectionManager Waiting for client to connect to ZooKeeper
   [junit4]   2> 871281 INFO  (zkCallback-946-thread-1) [    ] o.a.s.c.c.ConnectionManager Watcher org.apache.solr.common.cloud.ConnectionManager@1ef5f1f name:ZooKeeperConnection Watcher:127.0.0.1:49237 got event WatchedEvent state:SyncConnected type:None path:null path:null type:None
   [junit4]   2> 871281 INFO  (TEST-CollectionsAPIDistributedZkTest.test-seed#[6EB190BC378DF78D]) [    ] o.a.s.c.c.ConnectionManager Client is connected to ZooKeeper
   [junit4]   2> 871281 INFO  (TEST-CollectionsAPIDistributedZkTest.test-seed#[6EB190BC378DF78D]) [    ] o.a.s.c.c.SolrZkClient Using default ZkACLProvider
   [junit4]   2> 871281 INFO  (TEST-CollectionsAPIDistributedZkTest.test-seed#[6EB190BC378DF78D]) [    ] o.a.s.c.c.SolrZkClient makePath: /solr
   [junit4]   2> 871282 INFO  (TEST-CollectionsAPIDistributedZkTest.test-seed#[6EB190BC378DF78D]) [    ] o.a.s.c.c.SolrZkClient Using default ZkCredentialsProvider
   [junit4]   2> 871282 INFO  (TEST-CollectionsAPIDistributedZkTest.test-seed#[6EB190BC378DF78D]) [    ] o.a.s.c.c.ConnectionManager Waiting for client to connect to ZooKeeper
   [junit4]   2> 871283 INFO  (zkCallback-947-thread-1) [    ] o.a.s.c.c.ConnectionManager Watcher org.apache.solr.common.cloud.ConnectionManager@1228e6b name:ZooKeeperConnection Watcher:127.0.0.1:49237/solr got event WatchedEvent state:SyncConnected type:None path:null path:null type:None
   [junit4]   2> 871283 INFO  (TEST-CollectionsAPIDistributedZkTest.test-seed#[6EB190BC378DF78D]) [    ] o.a.s.c.c.ConnectionManager Client is connected to ZooKeeper
   [junit4]   2> 871284 INFO  (TEST-CollectionsAPIDistributedZkTest.test-seed#[6EB190BC378DF78D]) [    ] o.a.s.c.c.SolrZkClient Using default ZkACLProvider
   [junit4]   2> 871284 INFO  (TEST-CollectionsAPIDistributedZkTest.test-seed#[6EB190BC378DF78D]) [    ] o.a.s.c.c.SolrZkClient makePath: /collections/collection1
   [junit4]   2> 871286 INFO  (TEST-CollectionsAPIDistributedZkTest.test-seed#[6EB190BC378DF78D]) [    ] o.a.s.c.c.SolrZkClient makePath: /collections/collection1/shards
   [junit4]   2> 871287 INFO  (TEST-CollectionsAPIDistributedZkTest.test-seed#[6EB190BC378DF78D]) [    ] o.a.s.c.c.SolrZkClient makePath: /collections/control_collection
   [junit4]   2> 871287 INFO  (TEST-CollectionsAPIDistributedZkTest.test-seed#[6EB190BC378DF78D]) [    ] o.a.s.c.c.SolrZkClient makePath: /collections/control_collection/shards
   [junit4]   2> 871289 INFO  (TEST-CollectionsAPIDistributedZkTest.test-seed#[6EB190BC378DF78D]) [    ] o.a.s.c.AbstractZkTestCase put /home/jenkins/workspace/Lucene-Solr-trunk-Linux/solr/core/src/test-files/solr/collection1/conf/solrconfig-tlog.xml to /configs/conf1/solrconfig.xml
   [junit4]   2> 871289 INFO  (TEST-CollectionsAPIDistributedZkTest.test-seed#[6EB190BC378DF78D]) [    ] o.a.s.c.c.SolrZkClient makePath: /configs/conf1/solrconfig.xml
   [junit4]   2> 871290 INFO  (TEST-CollectionsAPIDistributedZkTest.test-seed#[6EB190BC378DF78D]) [    ] o.a.s.c.AbstractZkTestCase put /home/jenkins/workspace/Lucene-Solr-trunk-Linux/solr/core/src/test-files/solr/collection1/conf/schema.xml to /configs/conf1/schema.xml
   [junit4]   2> 871291 INFO  (TEST-CollectionsAPIDistributedZkTest.test-seed#[6EB190BC378DF78D]) [    ] o.a.s.c.c.SolrZkClient makePath: /configs/conf1/schema.xml
   [junit4]   2> 871292 INFO  (TEST-CollectionsAPIDistributedZkTest.test-seed#[6EB190BC378DF78D]) [    ] o.a.s.c.AbstractZkTestCase put /home/jenkins/workspace/Lucene-Solr-trunk-Linux/solr/core/src/test-files/solr/collection1/conf/solrconfig.snippet.randomindexconfig.xml to /configs/conf1/solrconfig.snippet.randomindexconfig.xml
   [junit4]   2> 871292 INFO  (TEST-CollectionsAPIDistributedZkTest.test-seed#[6EB190BC378DF78D]) [    ] o.a.s.c.c.SolrZkClient makePath: /configs/conf1/solrconfig.snippet.randomindexconfig.xml
   [junit4]   2> 871293 INFO  (TEST-CollectionsAPIDistributedZkTest.test-seed#[6EB190BC378DF78D]) [    ] o.a.s.c.AbstractZkTestCase put /home/jenkins/workspace/Lucene-Solr-trunk-Linux/solr/core/src/test-files/solr/collection1/conf/stopwords.txt to /configs/conf1/stopwords.txt
   [junit4]   2> 871293 INFO  (TEST-CollectionsAPIDistributedZkTest.test-seed#[6EB190BC378DF78D]) [    ] o.a.s.c.c.SolrZkClient makePath: /configs/conf1/stopwords.txt
   [junit4]   2> 871294 INFO  (TEST-CollectionsAPIDistributedZkTest.test-seed#[6EB190BC378DF78D]) [    ] o.a.s.c.AbstractZkTestCase put /home/jenkins/workspace/Lucene-Solr-trunk-Linux/solr/core/src/test-files/solr/collection1/conf/protwords.txt to /configs/conf1/protwords.txt
   [junit4]   2> 871294 INFO  (TEST-CollectionsAPIDistributedZkTest.test-seed#[6EB190BC378DF78D]) [    ] o.a.s.c.c.SolrZkClient makePath: /configs/conf1/protwords.txt
   [junit4]   2> 871295 INFO  (TEST-CollectionsAPIDistributedZkTest.test-seed#[6EB190BC378DF78D]) [    ] o.a.s.c.AbstractZkTestCase put /home/jenkins/workspace/Lucene-Solr-trunk-Linux/solr/core/src/test-files/solr/collection1/conf/currency.xml to /configs/conf1/currency.xml
   [junit4]   2> 871295 INFO  (TEST-CollectionsAPIDistributedZkTest.test-seed#[6EB190BC378DF78D]) [    ] o.a.s.c.c.SolrZkClient makePath: /configs/conf1/currency.xml
   [junit4]   2> 871296 INFO  (TEST-CollectionsAPIDistributedZkTest.test-seed#[6EB190BC378DF78D]) [    ] o.a.s.c.AbstractZkTestCase put /home/jenkins/workspace/Lucene-Solr-trunk-Linux/solr/core/src/test-files/solr/collection1/conf/enumsConfig.xml to /configs/conf1/enumsConfig.xml
   [junit4]   2> 871297 INFO  (TEST-CollectionsAPIDistributedZkTest.test-seed#[6EB190BC378DF78D]) [    ] o.a.s.c.c.SolrZkClient makePath: /configs/conf1/enumsConfig.xml
   [junit4]   2> 871297 INFO  (TEST-CollectionsAPIDistributedZkTest.test-seed#[6EB190BC378DF78D]) [    ] o.a.s.c.AbstractZkTestCase put /home/jenkins/workspace/Lucene-Solr-trunk-Linux/solr/core/src/test-files/solr/collection1/conf/open-exchange-rates.json to /configs/conf1/open-exchange-rates.json
   [junit4]   2> 871298 INFO  (TEST-CollectionsAPIDistributedZkTest.test-seed#[6EB190BC378DF78D]) [    ] o.a.s.c.c.SolrZkClient makePath: /configs/conf1/open-exchange-rates.json
   [junit4]   2> 871298 INFO  (TEST-CollectionsAPIDistributedZkTest.test-seed#[6EB190BC378DF78D]) [    ] o.a.s.c.AbstractZkTestCase put /home/jenkins/workspace/Lucene-Solr-trunk-Linux/solr/core/src/test-files/solr/collection1/conf/mapping-ISOLatin1Accent.txt to /configs/conf1/mapping-ISOLatin1Accent.txt
   [junit4]   2> 871298 INFO  (TEST-CollectionsAPIDistributedZkTest.test-seed#[6EB190BC378DF78D]) [    ] o.a.s.c.c.SolrZkClient makePath: /configs/conf1/mapping-ISOLatin1Accent.txt
   [junit4]   2> 871299 INFO  (TEST-CollectionsAPIDistributedZkTest.test-seed#[6EB190BC378DF78D]) [    ] o.a.s.c.AbstractZkTestCase put /home/jenkins/workspace/Lucene-Solr-trunk-Linux/solr/core/src/test-files/solr/collection1/conf/old_synonyms.txt to /configs/conf1/old_synonyms.txt
   [junit4]   2> 871299 INFO  (TEST-CollectionsAPIDistributedZkTest.test-seed#[6EB190BC378DF78D]) [    ] o.a.s.c.c.SolrZkClient makePath: /configs/conf1/old_synonyms.txt
   [junit4]   2> 871300 INFO  (TEST-CollectionsAPIDistributedZkTest.test-seed#[6EB190BC378DF78D]) [    ] o.a.s.c.AbstractZkTestCase put /home/jenkins/workspace/Lucene-Solr-trunk-Linux/solr/core/src/test-files/solr/collection1/conf/synonyms.txt to /configs/conf1/synonyms.txt
   [junit4]   2> 871301 INFO  (TEST-CollectionsAPIDistributedZkTest.test-seed#[6EB190BC378DF78D]) [    ] o.a.s.c.c.SolrZkClient makePath: /configs/conf1/synonyms.txt
   [junit4]   2> 871302 INFO  (TEST-CollectionsAPIDistributedZkTest.test-seed#[6EB190BC378DF78D]) [    ] o.a.s.c.c.SolrZkClient Using default ZkCredentialsProvider
   [junit4]   2> 871302 INFO  (TEST-CollectionsAPIDistributedZkTest.test-seed#[6EB190BC378DF78D]) [    ] o.a.s.c.c.ConnectionManager Waiting for client to connect to ZooKeeper
   [junit4]   2> 871303 INFO  (zkCallback-948-thread-1) [    ] o.a.s.c.c.ConnectionManager Watcher org.apache.solr.common.cloud.ConnectionManager@ae4594 name:ZooKeeperConnection Watcher:127.0.0.1:49237/solr got event WatchedEvent state:SyncConnected type:None path:null path:null type:None
   [junit4]   2> 871303 INFO  (TEST-CollectionsAPIDistributedZkTest.test-seed#[6EB190BC378DF78D]) [    ] o.a.s.c.c.ConnectionManager Client is connected to ZooKeeper
   [junit4]   2> 871304 INFO  (TEST-CollectionsAPIDistributedZkTest.test-seed#[6EB190BC378DF78D]) [    ] o.a.s.c.c.SolrZkClient Using default ZkACLProvider
   [junit4]   2> 871304 INFO  (TEST-CollectionsAPIDistributedZkTest.test-seed#[6EB190BC378DF78D]) [    ] o.a.s.c.c.SolrZkClient Using default ZkCredentialsProvider
   [junit4]   2> 871305 INFO  (TEST-CollectionsAPIDistributedZkTest.test-seed#[6EB190BC378DF78D]) [    ] o.a.s.c.c.ConnectionManager Waiting for client to connect to ZooKeeper
   [junit4]   2> 871305 INFO  (zkCallback-949-thread-1) [    ] o.a.s.c.c.ConnectionManager Watcher org.apache.solr.common.cloud.ConnectionManager@1fefc2c name:ZooKeeperConnection Watcher:127.0.0.1:49237 got event WatchedEvent state:SyncConnected type:None path:null path:null type:None
   [junit4]   2> 871305 INFO  (TEST-CollectionsAPIDistributedZkTest.test-seed#[6EB190BC378DF78D]) [    ] o.a.s.c.c.ConnectionManager Client is connected to ZooKeeper
   [junit4]   2> 871306 INFO  (TEST-CollectionsAPIDistributedZkTest.test-seed#[6EB190BC378DF78D]) [    ] o.a.s.c.c.SolrZkClient Using default ZkACLProvider
   [junit4]   2> 871306 INFO  (TEST-CollectionsAPIDistributedZkTest.test-seed#[6EB190BC378DF78D]) [    ] o.a.s.c.c.SolrZkClient makePath: /solr
   [junit4]   2> 871306 INFO  (TEST-CollectionsAPIDistributedZkTest.test-seed#[6EB190BC378DF78D]) [    ] o.a.s.c.c.SolrZkClient Using default ZkCredentialsProvider
   [junit4]   2> 871307 INFO  (TEST-CollectionsAPIDistributedZkTest.test-seed#[6EB190BC378DF78D]) [    ] o.a.s.c.c.ConnectionManager Waiting for client to connect to ZooKeeper
   [junit4]   2> 871307 INFO  (zkCallback-950-thread-1) [    ] o.a.s.c.c.ConnectionManager Watcher org.apache.solr.common.cloud.ConnectionManager@a8cec1 name:ZooKeeperConnection Watcher:127.0.0.1:49237/solr got event WatchedEvent state:SyncConnected type:None path:null path:null type:None
   [junit4]   2> 871307 INFO  (TEST-CollectionsAPIDistributedZkTest.test-seed#[6EB190BC378DF78D]) [    ] o.a.s.c.c.ConnectionManager Client is connected to ZooKeeper
   [junit4]   2> 871308 INFO  (TEST-CollectionsAPIDistributedZkTest.test-seed#[6EB190BC378DF78D]) [    ] o.a.s.c.c.SolrZkClient Using default ZkACLProvider
   [junit4]   2> 871309 INFO  (TEST-CollectionsAPIDistributedZkTest.test-seed#[6EB190BC378DF78D]) [    ] o.a.s.c.AbstractZkTestCase put /home/jenkins/workspace/Lucene-Solr-trunk-Linux/solr/core/src/test-files/solr/collection1/conf/solrconfig-tlog.xml to /configs/conf2/solrconfig.xml
   [junit4]   2> 871309 INFO  (TEST-CollectionsAPIDistributedZkTest.test-seed#[6EB190BC378DF78D]) [    ] o.a.s.c.c.SolrZkClient makePath: /configs/conf2/solrconfig.xml
   [junit4]   2> 871310 INFO  (TEST-CollectionsAPIDistributedZkTest.test-seed#[6EB190BC378DF78D]) [    ] o.a.s.c.AbstractZkTestCase put /home/jenkins/workspace/Lucene-Solr-trunk-Linux/solr/core/src/test-files/solr/collection1/conf/schema.xml to /configs/conf2/schema.xml
   [junit4]   2> 871310 INFO  (TEST-CollectionsAPIDistributedZkTest.test-seed#[6EB190BC378DF78D]) [    ] o.a.s.c.c.SolrZkClient makePath: /configs/conf2/schema.xml
   [junit4]   2> 871314 INFO  (TEST-CollectionsAPIDistributedZkTest.test-seed#[6EB190BC378DF78D]) [    ] o.a.s.c.AbstractZkTestCase put /home/jenkins/workspace/Lucene-Solr-trunk-Linux/solr/core/src/test-files/solr/collection1/conf/enumsConfig.xml to /configs/conf2/enumsConfig.xml
   [junit4]   2> 871314 INFO  (TEST-CollectionsAPIDistributedZkTest.test-seed#[6EB190BC378DF78D]) [    ] o.a.s.c.c.SolrZkClient makePath: /configs/conf2/enumsConfig.xml
   [junit4]   2> 871315 INFO  (TEST-CollectionsAPIDistributedZkTest.test-seed#[6EB190BC378DF78D]) [    ] o.a.s.c.AbstractZkTestCase put /home/jenkins/workspace/Lucene-Solr-trunk-Linux/solr/core/src/test-files/solr/collection1/conf/solrconfig.snippet.randomindexconfig.xml to /configs/conf2/solrconfig.snippet.randomindexconfig.xml
   [junit4]   2> 871315 INFO  (TEST-CollectionsAPIDistributedZkTest.test-seed#[6EB190BC378DF78D]) [    ] o.a.s.c.c.SolrZkClient makePath: /configs/conf2/solrconfig.snippet.randomindexconfig.xml
   [junit4]   2> 871316 INFO  (TEST-CollectionsAPIDistributedZkTest.test-seed#[6EB190BC378DF78D]) [    ] o.a.s.c.AbstractZkTestCase put /home/jenkins/workspace/Lucene-Solr-trunk-Linux/solr/core/src/test-files/solr/collection1/conf/stopwords.txt to /configs/conf2/stopwords.txt
   [junit4]   2> 871316 INFO  (TEST-CollectionsAPIDistributedZkTest.test-seed#[6EB190BC378DF78D]) [    ] o.a.s.c.c.SolrZkClient makePath: /configs/conf2/stopwords.txt
   [junit4]   2> 871317 INFO  (TEST-CollectionsAPIDistributedZkTest.test-seed#[6EB190BC378DF78D]) [    ] o.a.s.c.AbstractZkTestCase put /home/jenkins/workspace/Lucene-Solr-trunk-Linux/solr/core/src/test-files/solr/collection1/conf/protwords.txt to /configs/conf2/protwords.txt
   [junit4]   2> 871317 INFO  (TEST-CollectionsAPIDistributedZkTest.test-seed#[6EB190BC378DF78D]) [    ] o.a.s.c.c.SolrZkClient makePath: /configs/conf2/protwords.txt
   [junit4]   2> 871318 INFO  (TEST-CollectionsAPIDistributedZkTest.test-seed#[6EB190BC378DF78D]) [    ] o.a.s.c.AbstractZkTestCase put /home/jenkins/workspace/Lucene-Solr-trunk-Linux/solr/core/src/test-files/solr/collection1/conf/currency.xml to /configs/conf2/currency.xml
   [junit4]   2> 871318 INFO  (TEST-CollectionsAPIDistributedZkTest.test-seed#[6EB190BC378DF78D]) [    ] o.a.s.c.c.SolrZkClient makePath: /configs/conf2/currency.xml
   [junit4]   2> 871318 INFO  (TEST-CollectionsAPIDistributedZkTest.test-seed#[6EB190BC378DF78D]) [    ] o.a.s.c.AbstractZkTestCase put /home/jenkins/workspace/Lucene-Solr-trunk-Linux/solr/core/src/test-files/solr/collection1/conf/open-exchange-rates.json to /configs/conf2/open-exchange-rates.json
   [junit4]   2> 871319 INFO  (TEST-CollectionsAPIDistributedZkTest.test-seed#[6EB190BC378DF78D]) [    ] o.a.s.c.c.SolrZkClient makePath: /configs/conf2/open-exchange-rates.json
   [junit4]   2> 871319 INFO  (TEST-CollectionsAPIDistributedZkTest.test-seed#[6EB190BC378DF78D]) [    ] o.a.s.c.AbstractZkTestCase put /home/jenkins/workspace/Lucene-Solr-trunk-Linux/solr/core/src/test-files/solr/collection1/conf/mapping-ISOLatin1Accent.txt to /configs/conf2/mapping-ISOLatin1Accent.txt
   [junit4]   2> 871320 INFO  (TEST-CollectionsAPIDistributedZkTest.test-seed#[6EB190BC378DF78D]) [    ] o.a.s.c.c.SolrZkClient makePath: /configs/conf2/mapping-ISOLatin1Accent.txt
   [junit4]   2> 871321 INFO  (TEST-CollectionsAPIDistributedZkTest.test-seed#[6EB190BC378DF78D]) [    ] o.a.s.c.AbstractZkTestCase put /home/jenkins/workspace/Lucene-Solr-trunk-Linux/solr/core/src/test-files/solr/collection1/conf/old_synonyms.txt to /configs/conf2/old_synonyms.txt
   [junit4]   2> 871321 INFO  (TEST-CollectionsAPIDistributedZkTest.test-seed#[6EB190BC378DF78D]) [    ] o.a.s.c.c.SolrZkClient makePath: /configs/conf2/old_synonyms.txt
   [junit4]   2> 871322 INFO  (TEST-CollectionsAPIDistributedZkTest.test-seed#[6EB190BC378DF78D]) [    ] o.a.s.c.AbstractZkTestCase put /home/jenkins/workspace/Lucene-Solr-trunk-Linux/solr/core/src/test-files/solr/collection1/conf/synonyms.txt to /configs/conf2/synonyms.txt
   [junit4]   2> 871322 INFO  (TEST-CollectionsAPIDistributedZkTest.test-seed#[6EB190BC378DF78D]) [    ] o.a.s.c.c.SolrZkClient makePath: /configs/conf2/synonyms.txt
   [junit4]   2> 871323 INFO  (TEST-CollectionsAPIDistributedZkTest.test-seed#[6EB190BC378DF78D]) [    ] o.a.s.c.AbstractZkTestCase put /home/jenkins/workspace/Lucene-Solr-trunk-Linux/solr/core/src/test-files/solr/collection1/conf/elevate.xml to /configs/conf2/elevate.xml
   [junit4]   2> 871323 INFO  (TEST-CollectionsAPIDistributedZkTest.test-seed#[6EB190BC378DF78D]) [    ] o.a.s.c.c.SolrZkClient makePath: /configs/conf2/elevate.xml
   [junit4]   2> 871398 INFO  (TEST-CollectionsAPIDistributedZkTest.test-seed#[6EB190BC378DF78D]) [    ] o.a.s.SolrTestCaseJ4 Writing core.properties file to /home/jenkins/workspace/Lucene-Solr-trunk-Linux/solr/build/solr-core/test/J1/temp/solr.cloud.CollectionsAPIDistributedZkTest_6EB190BC378DF78D-001/control-001/cores/collection1
   [junit4]   2> 871399 INFO  (TEST-CollectionsAPIDistributedZkTest.test-seed#[6EB190BC378DF78D]) [    ] o.e.j.s.Server jetty-9.2.13.v20150730
   [junit4]   2> 871401 INFO  (TEST-CollectionsAPIDistributedZkTest.test-seed#[6EB190BC378DF78D]) [    ] o.e.j.s.h.ContextHandler Started o.e.j.s.ServletContextHandler@318dc1{/_/oo,null,AVAILABLE}
   [junit4]   2> 871413 INFO  (TEST-CollectionsAPIDistributedZkTest.test-seed#[6EB190BC378DF78D]) [    ] o.e.j.s.ServerConnector Started ServerConnector@f124f8{SSL-http/1.1}{127.0.0.1:49745}
   [junit4]   2> 871414 INFO  (TEST-CollectionsAPIDistributedZkTest.test-seed#[6EB190BC378DF78D]) [    ] o.e.j.s.Server Started @872844ms
   [junit4]   2> 871414 INFO  (TEST-CollectionsAPIDistributedZkTest.test-seed#[6EB190BC378DF78D]) [    ] o.a.s.c.s.e.JettySolrRunner Jetty properties: {solr.data.dir=/home/jenkins/workspace/Lucene-Solr-trunk-Linux/solr/build/solr-core/test/J1/temp/solr.cloud.CollectionsAPIDistributedZkTest_6EB190BC378DF78D-001/tempDir-001/control/data, hostContext=/_/oo, hostPort=49745, coreRootDirectory=/home/jenkins/workspace/Lucene-Solr-trunk-Linux/solr/build/solr-core/test/J1/../../../../../../../../../home/jenkins/workspace/Lucene-Solr-trunk-Linux/solr/build/solr-core/test/J1/temp/solr.cloud.CollectionsAPIDistributedZkTest_6EB190BC378DF78D-001/control-001/cores}
   [junit4]   2> 871414 INFO  (TEST-CollectionsAPIDistributedZkTest.test-seed#[6EB190BC378DF78D]) [    ] o.a.s.s.SolrDispatchFilter SolrDispatchFilter.init(): sun.misc.Launcher$AppClassLoader@1eb6432
   [junit4]   2> 871414 INFO  (TEST-CollectionsAPIDistributedZkTest.test-seed#[6EB190BC378DF78D]) [    ] o.a.s.c.SolrResourceLoader new SolrResourceLoader for directory: '/home/jenkins/workspace/Lucene-Solr-trunk-Linux/solr/build/solr-core/test/J1/temp/solr.cloud.CollectionsAPIDistributedZkTest_6EB190BC378DF78D-001/control-001'
   [junit4]   2> 871414 INFO  (TEST-CollectionsAPIDistributedZkTest.test-seed#[6EB190BC378DF78D]) [    ] o.a.s.c.SolrResourceLoader JNDI not configured for solr (NoInitialContextEx)
   [junit4]   2> 871414 INFO  (TEST-CollectionsAPIDistributedZkTest.test-seed#[6EB190BC378DF78D]) [    ] o.a.s.c.SolrResourceLoader solr home defaulted to 'solr/' (could not find system property or JNDI)
   [junit4]   2> 871415 INFO  (TEST-CollectionsAPIDistributedZkTest.test-seed#[6EB190BC378DF78D]) [    ] o.a.s.c.c.SolrZkClient Using default ZkCredentialsProvider
   [junit4]   2> 871415 INFO  (TEST-CollectionsAPIDistributedZkTest.test-seed#[6EB190BC378DF78D]) [    ] o.a.s.c.c.ConnectionManager Waiting for client to connect to ZooKeeper
   [junit4]   2> 871416 INFO  (zkCallback-951-thread-1) [    ] o.a.s.c.c.ConnectionManager Watcher org.apache.solr.common.cloud.ConnectionManager@1b5aeba name:ZooKeeperConnection Watcher:127.0.0.1:49237/solr got event WatchedEvent state:SyncConnected type:None path:null path:null type:None
   [junit4]   2> 871416 INFO  (TEST-CollectionsAPIDistributedZkTest.test-seed#[6EB190BC378DF78D]) [    ] o.a.s.c.c.ConnectionManager Client is connected to ZooKeeper
   [junit4]   2> 871417 INFO  (TEST-CollectionsAPIDistributedZkTest.test-seed#[6EB190BC378DF78D]) [    ] o.a.s.c.c.SolrZkClient Using default ZkACLProvider
   [junit4]   2> 871417 INFO  (TEST-CollectionsAPIDistributedZkTest.test-seed#[6EB190BC378DF78D]) [    ] o.a.s.s.SolrDispatchFilter Loading solr.xml from SolrHome (not found in ZooKeeper)
   [junit4]   2> 871417 INFO  (TEST-CollectionsAPIDistributedZkTest.test-seed#[6EB190BC378DF78D]) [    ] o.a.s.c.SolrXmlConfig Loading container configuration from /home/jenkins/workspace/Lucene-Solr-trunk-Linux/solr/build/solr-core/test/J1/temp/solr.cloud.CollectionsAPIDistributedZkTest_6EB190BC378DF78D-001/control-001/solr.xml
   [junit4]   2> 871425 INFO  (TEST-CollectionsAPIDistributedZkTest.test-seed#[6EB190BC378DF78D]) [    ] o.a.s.c.CorePropertiesLocator Config-defined core root directory: /home/jenkins/workspace/Lucene-Solr-trunk-Linux/solr/build/solr-core/test/J1/../../../../../../../../../home/jenkins/workspace/Lucene-Solr-trunk-Linux/solr/build/solr-core/test/J1/temp/solr.cloud.CollectionsAPIDistributedZkTest_6EB190BC378DF78D-001/control-001/cores
   [junit4]   2> 871425 INFO  (TEST-CollectionsAPIDistributedZkTest.test-seed#[6EB190BC378DF78D]) [    ] o.a.s.c.CoreContainer New CoreContainer 27077371
   [junit4]   2> 871425 INFO  (TEST-CollectionsAPIDistributedZkTest.test-seed#[6EB190BC378DF78D]) [    ] o.a.s.c.CoreContainer Loading cores into CoreContainer [instanceDir=/home/jenkins/workspace/Lucene-Solr-trunk-Linux/solr/build/solr-core/test/J1/temp/solr.cloud.CollectionsAPIDistributedZkTest_6EB190BC378DF78D-001/control-001]
   [junit4]   2> 871426 WARN  (TEST-CollectionsAPIDistributedZkTest.test-seed#[6EB190BC378DF78D]) [    ] o.a.s.c.CoreContainer Couldn't add files from /home/jenkins/workspace/Lucene-Solr-trunk-Linux/solr/build/solr-core/test/J1/temp/solr.cloud.CollectionsAPIDistributedZkTest_6EB190BC378DF78D-001/control-001/lib to classpath: /home/jenkins/workspace/Lucene-Solr-trunk-Linux/solr/build/solr-core/test/J1/temp/solr.cloud.CollectionsAPIDistributedZkTest_6EB190BC378DF78D-001/control-001/lib
   [junit4]   2> 871426 INFO  (TEST-CollectionsAPIDistributedZkTest.test-seed#[6EB190BC378DF78D]) [    ] o.a.s.h.c.HttpShardHandlerFactory created with socketTimeout : 90000,urlScheme : ,connTimeout : 15000,maxConnectionsPerHost : 20,maxConnections : 10000,corePoolSize : 0,maximumPoolSize : 2147483647,maxThreadIdleTime : 5,sizeOfQueue : -1,fairnessPolicy : false,useRetries : false,
   [junit4]   2> 871428 INFO  (TEST-CollectionsAPIDistributedZkTest.test-seed#[6EB190BC378DF78D]) [    ] o.a.s.u.UpdateShardHandler Creating UpdateShardHandler HTTP client with params: socketTimeout=340000&connTimeout=45000&retry=true
   [junit4]   2> 871430 INFO  (TEST-CollectionsAPIDistributedZkTest.test-seed#[6EB190BC378DF78D]) [    ] o.a.s.l.LogWatcher SLF4J impl is org.slf4j.impl.Log4jLoggerFactory
   [junit4]   2> 871430 INFO  (TEST-CollectionsAPIDistributedZkTest.test-seed#[6EB190BC378DF78D]) [    ] o.a.s.l.LogWatcher Registering Log Listener [Log4j (org.slf4j.impl.Log4jLoggerFactory)]
   [junit4]   2> 871430 INFO  (TEST-CollectionsAPIDistributedZkTest.test-seed#[6EB190BC378DF78D]) [    ] o.a.s.c.ZkContainer Zookeeper client=127.0.0.1:49237/solr
   [junit4]   2> 871430 INFO  (TEST-CollectionsAPIDistributedZkTest.test-seed#[6EB190BC378DF78D]) [    ] o.a.s.c.ZkController zkHost includes chroot
   [junit4]   2> 871430 INFO  (TEST-CollectionsAPIDistributedZkTest.test-seed#[6EB190BC378DF78D]) [    ] o.a.s.c.c.SolrZkClient Using default ZkCredentialsProvider
   [junit4]   2> 871430 INFO  (TEST-CollectionsAPIDistributedZkTest.test-seed#[6EB190BC378DF78D]) [    ] o.a.s.c.c.ConnectionManager Waiting for client to connect to ZooKeeper
   [junit4]   2> 871431 INFO  (zkCallback-954-thread-1) [    ] o.a.s.c.c.ConnectionManager Watcher org.apache.solr.common.cloud.ConnectionManager@170410e name:ZooKeeperConnection Watcher:127.0.0.1:49237 got event WatchedEvent state:SyncConnected type:None path:null path:null type:None
   [junit4]   2> 871432 INFO  (TEST-CollectionsAPIDistributedZkTest.test-seed#[6EB190BC378DF78D]) [    ] o.a.s.c.c.ConnectionManager Client is connected to ZooKeeper
   [junit4]   2> 871432 INFO  (TEST-CollectionsAPIDistributedZkTest.test-seed#[6EB190BC378DF78D]) [    ] o.a.s.c.c.SolrZkClient Using default ZkACLProvider
   [junit4]   2> 871433 INFO  (TEST-CollectionsAPIDistributedZkTest.test-seed#[6EB190BC378DF78D]) [    ] o.a.s.c.c.ConnectionManager Waiting for client to connect to ZooKeeper
   [junit4]   2> 871434 INFO  (zkCallback-955-thread-1) [    ] o.a.s.c.c.ConnectionManager Watcher org.apache.solr.common.cloud.ConnectionManager@288d01 name:ZooKeeperConnection Watcher:127.0.0.1:49237/solr got event WatchedEvent state:SyncConnected type:None path:null path:null type:None
   [junit4]   2> 871434 INFO  (TEST-CollectionsAPIDistributedZkTest.test-seed#[6EB190BC378DF78D]) [    ] o.a.s.c.c.ConnectionManager Client is connected to ZooKeeper
   [junit4]   2> 871435 INFO  (TEST-CollectionsAPIDistributedZkTest.test-seed#[6EB190BC378DF78D]) [    ] o.a.s.c.c.SolrZkClient makePath: /overseer/queue
   [junit4]   2> 871436 INFO  (TEST-CollectionsAPIDistributedZkTest.test-seed#[6EB190BC378DF78D]) [    ] o.a.s.c.c.SolrZkClient makePath: /overseer/collection-queue-work
   [junit4]   2> 871437 INFO  (TEST-CollectionsAPIDistributedZkTest.test-seed#[6EB190BC378DF78D]) [    ] o.a.s.c.c.SolrZkClient makePath: /overseer/collection-map-running
   [junit4]   2> 871438 INFO  (TEST-CollectionsAPIDistributedZkTest.test-seed#[6EB190BC378DF78D]) [    ] o.a.s.c.c.SolrZkClient makePath: /overseer/collection-map-completed
   [junit4]   2> 871439 INFO  (TEST-CollectionsAPIDistributedZkTest.test-seed#[6EB190BC378DF78D]) [    ] o.a.s.c.c.SolrZkClient makePath: /overseer/collection-map-failure
   [junit4]   2> 871441 INFO  (TEST-CollectionsAPIDistributedZkTest.test-seed#[6EB190BC378DF78D]) [    ] o.a.s.c.c.SolrZkClient makePath: /live_nodes
   [junit4]   2> 871441 INFO  (TEST-CollectionsAPIDistributedZkTest.test-seed#[6EB190BC378DF78D]) [    ] o.a.s.c.c.SolrZkClient makePath: /aliases.json
   [junit4]   2> 871442 INFO  (TEST-CollectionsAPIDistributedZkTest.test-seed#[6EB190BC378DF78D]) [    ] o.a.s.c.c.SolrZkClient makePath: /clusterstate.json
   [junit4]   2> 871442 INFO  (TEST-CollectionsAPIDistributedZkTest.test-seed#[6EB190BC378DF78D]) [    ] o.a.s.c.c.SolrZkClient makePath: /security.json
   [junit4]   2> 871443 INFO  (TEST-CollectionsAPIDistributedZkTest.test-seed#[6EB190BC378DF78D]) [    ] o.a.s.c.ZkController Register node as live in ZooKeeper:/live_nodes/127.0.0.1:49745__%2Foo
   [junit4]   2> 871443 INFO  (TEST-CollectionsAPIDistributedZkTest.test-seed#[6EB190BC378DF78D]) [    ] o.a.s.c.c.SolrZkClient makePath: /live_nodes/127.0.0.1:49745__%2Foo
   [junit4]   2> 871444 INFO  (TEST-CollectionsAPIDistributedZkTest.test-seed#[6EB190BC378DF78D]) [    ] o.a.s.c.c.SolrZkClient makePath: /overseer_elect
   [junit4]   2> 871445 INFO  (TEST-CollectionsAPIDistributedZkTest.test-seed#[6EB190BC378DF78D]) [    ] o.a.s.c.c.SolrZkClient makePath: /overseer_elect/election
   [junit4]   2> 871445 INFO  (TEST-CollectionsAPIDistributedZkTest.test-seed#[6EB190BC378DF78D]) [    ] o.a.s.c.Overseer Overseer (id=null) closing
   [junit4]   2> 871446 INFO  (TEST-CollectionsAPIDistributedZkTest.test-seed#[6EB190BC378DF78D]) [    ] o.a.s.c.LeaderElector Joined leadership election with path: /overseer_elect/election/95201212062760967-127.0.0.1:49745__%2Foo-n_0000000000
   [junit4]   2> 871447 INFO  (TEST-CollectionsAPIDistributedZkTest.test-seed#[6EB190BC378DF78D]) [    ] o.a.s.c.OverseerElectionContext I am going to be the leader 127.0.0.1:49745__%2Foo
   [junit4]   2> 871448 INFO  (TEST-CollectionsAPIDistributedZkTest.test-seed#[6EB190BC378DF78D]) [    ] o.a.s.c.c.SolrZkClient makePath: /overseer_elect/leader
   [junit4]   2> 871448 INFO  (TEST-CollectionsAPIDistributedZkTest.test-seed#[6EB190BC378DF78D]) [    ] o.a.s.c.Overseer Overseer (id=95201212062760967-127.0.0.1:49745__%2Foo-n_0000000000) starting
   [junit4]   2> 871449 INFO  (TEST-CollectionsAPIDistributedZkTest.test-seed#[6EB190BC378DF78D]) [    ] o.a.s.c.c.SolrZkClient makePath: /overseer/queue-work
   [junit4]   2> 871453 INFO  (TEST-CollectionsAPIDistributedZkTest.test-seed#[6EB190BC378DF78D]) [    ] o.a.s.c.OverseerAutoReplicaFailoverThread Starting OverseerAutoReplicaFailoverThread autoReplicaFailoverWorkLoopDelay=10000 autoReplicaFailoverWaitAfterExpiration=10000 autoReplicaFailoverBadNodeExpiration=60000
   [junit4]   2> 871453 INFO  (OverseerCollectionConfigSetProcessor-95201212062760967-127.0.0.1:49745__%2Foo-n_0000000000) [    ] o.a.s.c.OverseerTaskProcessor Process current queue of overseer operations
   [junit4]   2> 871453 INFO  (TEST-CollectionsAPIDistributedZkTest.test-seed#[6EB190BC378DF78D]) [    ] o.a.s.c.c.ZkStateReader Updating cluster state from ZooKeeper... 
   [junit4]   2> 871453 INFO  (OverseerStateUpdate-95201212062760967-127.0.0.1:49745__%2Foo-n_0000000000) [    ] o.a.s.c.Overseer Starting to work on the main queue
   [junit4]   2> 871478 INFO  (TEST-CollectionsAPIDistributedZkTest.test-seed#[6EB190BC378DF78D]) [    ] o.a.s.c.CoreContainer Security conf doesn't exist. Skipping setup for authorization module.
   [junit4]   2> 871478 INFO  (TEST-CollectionsAPIDistributedZkTest.test-seed#[6EB190BC378DF78D]) [    ] o.a.s.c.CoreContainer No authentication plugin used.
   [junit4]   2> 871479 INFO  (TEST-CollectionsAPIDistributedZkTest.test-seed#[6EB190BC378DF78D]) [    ] o.a.s.c.CorePropertiesLocator Looking for core definitions underneath /home/jenkins/workspace/Lucene-Solr-trunk-Linux/solr/build/solr-core/test/J1/../../../../../../../../../home/jenkins/workspace/Lucene-Solr-trunk-Linux/solr/build/solr-core/test/J1/temp/solr.cloud.CollectionsAPIDistributedZkTest_6EB190BC378DF78D-001/control-001/cores
   [junit4]   2> 871480 INFO  (TEST-CollectionsAPIDistributedZkTest.test-seed#[6EB190BC378DF78D]) [    ] o.a.s.c.CoreDescriptor Created CoreDescriptor: {name=collection1, config=solrconfig.xml, transient=false, schema=schema.xml, loadOnStartup=true, configSetProperties=configsetprops.json, collection=control_collection, coreNodeName=, dataDir=data/, shard=}
   [junit4]   2> 871480 INFO  (TEST-CollectionsAPIDistributedZkTest.test-seed#[6EB190BC378DF78D]) [    ] o.a.s.c.CorePropertiesLocator Found core collection1 in /home/jenkins/workspace/Lucene-Solr-trunk-Linux/solr/build/solr-core/test/J1/../../../../../../../../../home/jenkins/workspace/Lucene-Solr-trunk-Linux/solr/build/solr-core/test/J1/temp/solr.cloud.CollectionsAPIDistributedZkTest_6EB190BC378DF78D-001/control-001/cores/collection1
   [junit4]   2> 871480 INFO  (TEST-CollectionsAPIDistributedZkTest.test-seed#[6EB190BC378DF78D]) [    ] o.a.s.c.CorePropertiesLocator Found 1 core definitions
   [junit4]   2> 871481 INFO  (TEST-CollectionsAPIDistributedZkTest.test-seed#[6EB190BC378DF78D]) [    ] o.a.s.s.SolrDispatchFilter user.dir=/home/jenkins/workspace/Lucene-Solr-trunk-Linux/solr/build/solr-core/test/J1
   [junit4]   2> 871481 INFO  (TEST-CollectionsAPIDistributedZkTest.test-seed#[6EB190BC378DF78D]) [    ] o.a.s.s.SolrDispatchFilter SolrDispatchFilter.init() done
   [junit4]   2> 871481 INFO  (coreLoadExecutor-2343-thread-1) [    ] o.a.s.c.ZkController publishing state=down
   [junit4]   2> 871481 INFO  (coreLoadExecutor-2343-thread-1) [    ] o.a.s.c.ZkController numShards not found on descriptor - reading it from system property
   [junit4]   2> 871482 INFO  (OverseerStateUpdate-95201212062760967-127.0.0.1:49745__%2Foo-n_0000000000) [    ] o.a.s.c.Overseer processMessage: queueSize: 1, message = {
   [junit4]   2>   "core":"collection1",
   [junit4]   2>   "roles":null,
   [junit4]   2>   "base_url":"https://127.0.0.1:49745/_/oo",
   [junit4]   2>   "node_name":"127.0.0.1:49745__%2Foo",
   [junit4]   2>   "numShards":"1",
   [junit4]   2>   "state":"down",
   [junit4]   2>   "shard":null,
   [junit4]   2>   "collection":"control_collection",
   [junit4]   2>   "operation":"state"} current state version: 0
   [junit4]   2> 871482 INFO  (coreLoadExecutor-2343-thread-1) [    ] o.a.s.c.ZkController look for our core node name
   [junit4]   2> 871483 INFO  (OverseerStateUpdate-95201212062760967-127.0.0.1:49745__%2Foo-n_0000000000) [    ] o.a.s.c.o.ReplicaMutator Update state numShards=1 message={
   [junit4]   2>   "core":"collection1",
   [junit4]   2>   "roles":null,
   [junit4]   2>   "base_url":"https://127.0.0.1:49745/_/oo",
   [junit4]   2>   "node_name":"127.0.0.1:49745__%2Foo",
   [junit4]   2>   "numShards":"1",
   [junit4]   2>   "state":"down",
   [junit4]   2>   "shard":null,
   [junit4]   2>   "collection":"control_collection",
   [junit4]   2>   "operation":"state"}
   [junit4]   2> 871483 INFO  (OverseerStateUpdate-95201212062760967-127.0.0.1:49745__%2Foo-n_0000000000) [    ] o.a.s.c.o.ClusterStateMutator building a new cName: control_collection
   [junit4]   2> 871483 INFO  (OverseerStateUpdate-95201212062760967-127.0.0.1:49745__%2Foo-n_0000000000) [    ] o.a.s.c.o.ReplicaMutator Assigning new node to shard shard=shard1
   [junit4]   2> 871484 INFO  (zkCallback-955-thread-1) [    ] o.a.s.c.c.ZkStateReader A cluster state change: [WatchedEvent state:SyncConnected type:NodeDataChanged path:/clusterstate.json], has occurred - updating... (live nodes size: [1])
   [junit4]   2> 872483 INFO  (coreLoadExecutor-2343-thread-1) [    ] o.a.s.c.ZkController waiting to find shard id in clusterstate for collection1
   [junit4]   2> 872483 INFO  (coreLoadExecutor-2343-thread-1) [    ] o.a.s.c.ZkController Check for collection zkNode:control_collection
   [junit4]   2> 872483 INFO  (coreLoadExecutor-2343-thread-1) [    ] o.a.s.c.ZkController Collection zkNode exists
   [junit4]   2> 872483 INFO  (coreLoadExecutor-2343-thread-1) [    ] o.a.s.c.c.ZkStateReader Load collection config from: [/collections/control_collection]
   [junit4]   2> 872483 INFO  (coreLoadExecutor-2343-thread-1) [    ] o.a.s.c.c.ZkStateReader path=[/collections/control_collection] [configName]=[conf1] specified config exists in ZooKeeper
   [junit4]   2> 872484 INFO  (coreLoadExecutor-2343-thread-1) [    ] o.a.s.c.SolrResourceLoader new SolrResourceLoader for directory: '/home/jenkins/workspace/Lucene-Solr-trunk-Linux/solr/build/solr-core/test/J1/temp/solr.cloud.CollectionsAPIDistributedZkTest_6EB190BC378DF78D-001/control-001/cores/collection1'
   [junit4]   2> 872484 INFO  (coreLoadExecutor-2343-thread-1) [    ] o.a.s.c.SolrResourceLoader JNDI not configured for solr (NoInitialContextEx)
   [junit4]   2> 872484 INFO  (coreLoadExecutor-2343-thread-1) [    ] o.a.s.c.SolrResourceLoader solr home defaulted to 'solr/' (could not find system property or JNDI)
   [junit4]   2> 872485 INFO  (coreLoadExecutor-2343-thread-1) [    ] o.a.s.c.Config loaded config solrconfig.xml with version 0 
   [junit4]   2> 872490 INFO  (coreLoadExecutor-2343-thread-1) [    ] o.a.s.c.SolrConfig current version of requestparams : -1
   [junit4]   2> 872497 INFO  (coreLoadExecutor-2343-thread-1) [    ] o.a.s.c.SolrConfig Using Lucene MatchVersion: 6.0.0
   [junit4]   2> 872511 INFO  (coreLoadExecutor-2343-thread-1) [    ] o.a.s.c.SolrConfig Loaded SolrConfig: solrconfig.xml
   [junit4]   2> 872518 INFO  (coreLoadExecutor-2343-thread-1) [    ] o.a.s.s.IndexSchema [collection1] Schema name=test
   [junit4]   2> 872674 INFO  (coreLoadExecutor-2343-thread-1) [    ] o.a.s.s.OpenExchangeRatesOrgProvider Initialized with rates=open-exchange-rates.json, refreshInterval=1440.
   [junit4]   2> 872684 INFO  (coreLoadExecutor-2343-thread-1) [    ] o.a.s.s.IndexSchema default search field in schema is text
   [junit4]   2> 872686 INFO  (coreLoadExecutor-2343-thread-1) [    ] o.a.s.s.IndexSchema unique key field: id
   [junit4]   2> 872694 INFO  (coreLoadExecutor-2343-thread-1) [    ] o.a.s.s.FileExchangeRateProvider Reloading exchange rates from file currency.xml
   [junit4]   2> 872696 INFO  (coreLoadExecutor-2343-thread-1) [    ] o.a.s.s.FileExchangeRateProvider Reloading exchange rates from file currency.xml
   [junit4]   2> 872698 INFO  (coreLoadExecutor-2343-thread-1) [    ] o.a.s.s.OpenExchangeRatesOrgProvider Reloading exchange rates from open-exchange-rates.json
   [junit4]   2> 872698 INFO  (coreLoadExecutor-2343-thread-1) [    ] o.a.s.s.OpenExchangeRatesOrgProvider Reloading exchange rates from open-exchange-rates.json
   [junit4]   2> 872700 INFO  (coreLoadExecutor-2343-thread-1) [    ] o.a.s.c.ConfigSetProperties Did not find ConfigSet properties, assuming default properties: Can't find resource 'configsetprops.json' in classpath or '/configs/conf1', cwd=/home/jenkins/workspace/Lucene-Solr-trunk-Linux/solr/build/solr-core/test/J1
   [junit4]   2> 872700 INFO  (coreLoadExecutor-2343-thread-1) [    ] o.a.s.c.CoreContainer Creating SolrCore 'collection1' using configuration from collection control_collection
   [junit4]   2> 872700 INFO  (coreLoadExecutor-2343-thread-1) [    ] o.a.s.c.SolrCore org.apache.solr.core.MockDirectoryFactory
   [junit4]   2> 872700 INFO  (coreLoadExecutor-2343-thread-1) [    ] o.a.s.c.SolrCore [[collection1] ] Opening new SolrCore at [/home/jenkins/workspace/Lucene-Solr-trunk-Linux/solr/build/solr-core/test/J1/temp/solr.cloud.CollectionsAPIDistributedZkTest_6EB190BC378DF78D-001/control-001/cores/collection1], dataDir=[/home/jenkins/workspace/Lucene-Solr-trunk-Linux/solr/build/solr-core/test/J1/../../../../../../../../../home/jenkins/workspace/Lucene-Solr-trunk-Linux/solr/build/solr-core/test/J1/temp/solr.cloud.CollectionsAPIDistributedZkTest_6EB190BC378DF78D-001/control-001/cores/collection1/data/]
   [junit4]   2> 872700 INFO  (coreLoadExecutor-2343-thread-1) [    ] o.a.s.c.JmxMonitoredMap JMX monitoring is enabled. Adding Solr mbeans to JMX Server: com.sun.jmx.mbeanserver.JmxMBeanServer@f35dd6
   [junit4]   2> 872701 INFO  (coreLoadExecutor-2343-thread-1) [    ] o.a.s.c.CachingDirectoryFactory return new directory for /home/jenkins/workspace/Lucene-Solr-trunk-Linux/solr/build/solr-core/test/J1/../../../../../../../../../home/jenkins/workspace/Lucene-Solr-trunk-Linux/solr/build/solr-core/test/J1/temp/solr.cloud.CollectionsAPIDistributedZkTest_6EB190BC378DF78D-001/control-001/cores/collection1/data
   [junit4]   2> 872701 INFO  (coreLoadExecutor-2343-thread-1) [    ] o.a.s.c.SolrCore New index directory detected: old=null new=/home/jenkins/workspace/Lucene-Solr-trunk-Linux/solr/build/solr-core/test/J1/../../../../../../../../../home/jenkins/workspace/Lucene-Solr-trunk-Linux/solr/build/solr-core/test/J1/temp/solr.cloud.CollectionsAPIDistributedZkTest_6EB190BC378DF78D-001/control-001/cores/collection1/data/index/
   [junit4]   2> 872701 WARN  (coreLoadExecutor-2343-thread-1) [    ] o.a.s.c.SolrCore [collection1] Solr index directory '/home/jenkins/workspace/Lucene-Solr-trunk-Linux/solr/build/solr-core/test/J1/../../../../../../../../../home/jenkins/workspace/Lucene-Solr-trunk-Linux/solr/build/solr-core/test/J1/temp/solr.cloud.CollectionsAPIDistributedZkTest_6EB190BC378DF78D-001/control-001/cores/collection1/data/index' doesn't exist. Creating new index...
   [junit4]   2> 872702 INFO  (coreLoadExecutor-2343-thread-1) [    ] o.a.s.c.CachingDirectoryFactory return new directory for /home/jenkins/workspace/Lucene-Solr-trunk-Linux/solr/build/solr-core/test/J1/../../../../../../../../../home/jenkins/workspace/Lucene-Solr-trunk-Linux/solr/build/solr-core/test/J1/temp/solr.cloud.CollectionsAPIDistributedZkTest_6EB190BC378DF78D-001/control-001/cores/collection1/data/index
   [junit4]   2> 872702 INFO  (coreLoadExecutor-2343-thread-1) [    ] o.a.s.u.RandomMergePolicy RandomMergePolicy wrapping class org.apache.lucene.index.TieredMergePolicy: [TieredMergePolicy: maxMergeAtOnce=40, maxMergeAtOnceExplicit=14, maxMergedSegmentMB=90.6240234375, floorSegmentMB=1.291015625, forceMergeDeletesPctAllowed=26.292788119256674, segmentsPerTier=26.0, maxCFSSegmentSizeMB=8.796093022207999E12, noCFSRatio=1.0
   [junit4]   2> 872703 INFO  (coreLoadExecutor-2343-thread-1) [    ] o.a.s.c.SolrDeletionPolicy SolrDeletionPolicy.onCommit: commits: num=1
   [junit4]   2> 	commit{dir=MockDirectoryWrapper(NIOFSDirectory@/home/jenkins/workspace/Lucene-Solr-trunk-Linux/solr/build/solr-core/test/J1/temp/solr.cloud.CollectionsAPIDistributedZkTest_6EB190BC378DF78D-001/index-NIOFSDirectory-001 lockFactory=org.apache.lucene.store.NativeFSLockFactory@1a17e4e),segFN=segments_1,generation=1}
   [junit4]   2> 872704 INFO  (coreLoadExecutor-2343-thread-1) [    ] o.a.s.c.SolrDeletionPolicy newest commit generation = 1
   [junit4]   2> 872704 INFO  (OldIndexDirectoryCleanupThreadForCore-collection1) [    ] o.a.s.c.SolrCore Looking for old index directories to cleanup for core collection1 in /home/jenkins/workspace/Lucene-Solr-trunk-Linux/solr/build/solr-core/test/J1/../../../../../../../../../home/jenkins/workspace/Lucene-Solr-trunk-Linux/solr/build/solr-core/test/J1/temp/solr.cloud.CollectionsAPIDistributedZkTest_6EB190BC378DF78D-001/control-001/cores/collection1/data/
   [junit4]   2> 872705 WARN  (OldIndexDirectoryCleanupThreadForCore-collection1) [    ] o.a.s.c.DirectoryFactory /home/jenkins/workspace/Lucene-Solr-trunk-Linux/solr/build/solr-core/test/J1/../../../../../../../../../home/jenkins/workspace/Lucene-Solr-trunk-Linux/solr/build/solr-core/test/J1/temp/solr.cloud.CollectionsAPIDistributedZkTest_6EB190BC378DF78D-001/control-001/cores/collection1/data/ does not point to a valid data directory; skipping clean-up of old index directories.
   [junit4]   2> 872708 INFO  (coreLoadExecutor-2343-thread-1) [    ] o.a.s.u.p.UpdateRequestProcessorChain creating updateRequestProcessorChain "nodistrib"
   [junit4]   2> 872708 INFO  (coreLoadExecutor-2343-thread-1) [    ] o.a.s.u.p.UpdateRequestProcessorChain creating updateRequestProcessorChain "dedupe"
   [junit4]   2> 872708 INFO  (coreLoadExecutor-2343-thread-1) [    ] o.a.s.u.p.UpdateRequestProcessorChain inserting DistributedUpdateProcessorFactory into updateRequestProcessorChain "dedupe"
   [junit4]   2> 872709 INFO  (coreLoadExecutor-2343-thread-1) [    ] o.a.s.u.p.UpdateRequestProcessorChain creating updateRequestProcessorChain "stored_sig"
   [junit4]   2> 872709 INFO  (coreLoadExecutor-2343-thread-1) [    ] o.a.s.u.p.UpdateRequestProcessorChain inserting DistributedUpdateProcessorFactory into updateRequestProcessorChain "stored_sig"
   [junit4]   2> 872709 INFO  (coreLoadExecutor-2343-thread-1) [    ] o.a.s.u.p.UpdateRequestProcessorChain creating updateRequestProcessorChain "distrib-dup-test-chain-explicit"
   [junit4]   2> 872709 INFO  (coreLoadExecutor-2343-thread-1) [    ] o.a.s.u.p.UpdateRequestProcessorChain creating updateRequestProcessorChain "distrib-dup-test-chain-implicit"
   [junit4]   2> 872709 INFO  (coreLoadExecutor-2343-thread-1) [    ] o.a.s.u.p.UpdateRequestProcessorChain inserting DistributedUpdateProcessorFactory into updateRequestProcessorChain "distrib-dup-test-chain-implicit"
   [junit4]   2> 872709 INFO  (coreLoadExecutor-2343-thread-1) [    ] o.a.s.c.SolrCore no updateRequestProcessorChain defined as default, creating implicit default
   [junit4]   2> 872710 WARN  (coreLoadExecutor-2343-thread-1) [    ] o.a.s.c.RequestHandlers INVALID paramSet a in requestHandler {type = requestHandler,name = /dump,class = DumpRequestHandler,args = {defaults={a=A,b=B}}}
   [junit4]   2> 872711 INFO  (coreLoadExecutor-2343-thread-1) [    ] o.a.s.h.l.XMLLoader xsltCacheLifetimeSeconds=60
   [junit4]   2> 872713 INFO  (coreLoadExecutor-2343-thread-1) [    ] o.a.s.h.l.XMLLoader xsltCacheLifetimeSeconds=60
   [junit4]   2> 872713 INFO  (coreLoadExecutor-2343-thread-1) [    ] o.a.s.h.l.XMLLoader xsltCacheLifetimeSeconds=60
   [junit4]   2> 872714 INFO  (coreLoadExecutor-2343-thread-1) [    ] o.a.s.h.l.XMLLoader xsltCacheLifetimeSeconds=60
   [junit4]   2> 872721 INFO  (coreLoadExecutor-2343-thread-1) [    ] o.a.s.c.RequestHandlers Registered paths: /admin/mbeans,standard,/dump,/update/csv,/sql,/update/json/docs,/admin/luke,/export,/admin/segments,/get,/admin/system,/replication,/admin/properties,/config,/stream,/schema,/admin/plugins,/admin/logging,/update/json,/admin/threads,/admin/ping,/update,/admin/file
   [junit4]   2> 872722 INFO  (coreLoadExecutor-2343-thread-1) [    ] o.a.s.c.SolrCore Using default statsCache cache: org.apache.solr.search.stats.LocalStatsCache
   [junit4]   2> 872723 INFO  (coreLoadExecutor-2343-thread-1) [    ] o.a.s.u.UpdateHandler Using UpdateLog implementation: org.apache.solr.update.UpdateLog
   [junit4]   2> 872723 INFO  (coreLoadExecutor-2343-thread-1) [    ] o.a.s.u.UpdateLog Initializing UpdateLog: dataDir= defaultSyncLevel=FLUSH numRecordsToKeep=100 maxNumLogsToKeep=10 numVersionBuckets=65536
   [junit4]   2> 872724 INFO  (coreLoadExecutor-2343-thread-1) [    ] o.a.s.u.CommitTracker Hard AutoCommit: disabled
   [junit4]   2> 872724 INFO  (coreLoadExecutor-2343-thread-1) [    ] o.a.s.u.CommitTracker Soft AutoCommit: disabled
   [junit4]   2> 872724 INFO  (coreLoadExecutor-2343-thread-1) [    ] o.a.s.u.RandomMergePolicy RandomMergePolicy wrapping class org.apache.lucene.index.TieredMergePolicy: [TieredMergePolicy: maxMergeAtOnce=33, maxMergeAtOnceExplicit=13, maxMergedSegmentMB=6.369140625, floorSegmentMB=1.759765625, forceMergeDeletesPctAllowed=24.637230425006635, segmentsPerTier=35.0, maxCFSSegmentSizeMB=8.796093022207999E12, noCFSRatio=0.7209423935136263
   [junit4]   2> 872725 INFO  (coreLoadExecutor-2343-thread-1) [    ] o.a.s.c.SolrDeletionPolicy SolrDeletionPolicy.onInit: commits: num=1
   [junit4]   2> 	commit{dir=MockDirectoryWrapper(NIOFSDirectory@/home/jenkins/workspace/Lucene-Solr-trunk-Linux/solr/build/solr-core/test/J1/temp/solr.cloud.CollectionsAPIDistributedZkTest_6EB190BC378DF78D-001/index-NIOFSDirectory-001 lockFactory=org.apache.lucene.store.NativeFSLockFactory@1a17e4e),segFN=segments_1,generation=1}
   [junit4]   2> 872726 INFO  (coreLoadExecutor-2343-thread-1) [    ] o.a.s.c.SolrDeletionPolicy newest commit generation = 1
   [junit4]   2> 872726 INFO  (coreLoadExecutor-2343-thread-1) [    ] o.a.s.s.SolrIndexSearcher Opening [Searcher@1cb15db[collection1] main]
   [junit4]   2> 872726 INFO  (coreLoadExecutor-2343-thread-1) [    ] o.a.s.c.c.ZkStateReader Load collection config from: [/collections/control_collection]
   [junit4]   2> 872726 INFO  (coreLoadExecutor-2343-thread-1) [    ] o.a.s.c.c.ZkStateReader path=[/collections/control_collection] [configName]=[conf1] specified config exists in ZooKeeper
   [junit4]   2> 872726 INFO  (coreLoadExecutor-2343-thread-1) [    ] o.a.s.r.ManagedResourceStorage Setting up ZooKeeper-based storage for the RestManager with znodeBase: /configs/conf1
   [junit4]   2> 872726 INFO  (coreLoadExecutor-2343-thread-1) [    ] o.a.s.r.ManagedResourceStorage Configured ZooKeeperStorageIO with znodeBase: /configs/conf1
   [junit4]   2> 872726 INFO  (coreLoadExecutor-2343-thread-1) [    ] o.a.s.r.RestManager Initializing RestManager with initArgs: {}
   [junit4]   2> 872727 INFO  (coreLoadExecutor-2343-thread-1) [    ] o.a.s.r.ManagedResourceStorage Reading _rest_managed.json using ZooKeeperStorageIO:path=/configs/conf1
   [junit4]   2> 872727 INFO  (coreLoadExecutor-2343-thread-1) [    ] o.a.s.r.ManagedResourceStorage No data found for znode /configs/conf1/_rest_managed.json
   [junit4]   2> 872727 INFO  (coreLoadExecutor-2343-thread-1) [    ] o.a.s.r.ManagedResourceStorage Loaded null at path _rest_managed.json using ZooKeeperStorageIO:path=/configs/conf1
   [junit4]   2> 872727 INFO  (coreLoadExecutor-2343-thread-1) [    ] o.a.s.r.RestManager Initializing 0 registered ManagedResources
   [junit4]   2> 872727 INFO  (coreLoadExecutor-2343-thread-1) [    ] o.a.s.h.ReplicationHandler Commits will be reserved for  10000
   [junit4]   2> 872727 INFO  (searcherExecutor-2344-thread-1) [    ] o.a.s.c.SolrCore [collection1] Registered new searcher Searcher@1cb15db[collection1] main{ExitableDirectoryReader(UninvertingDirectoryReader())}
   [junit4]   2> 872727 INFO  (coreLoadExecutor-2343-thread-1) [    ] o.a.s.u.UpdateLog Looking up max value of version field to seed version buckets
   [junit4]   2> 872728 INFO  (coreLoadExecutor-2343-thread-1) [    ] o.a.s.u.VersionInfo Refreshing highest value of _version_ for 65536 version buckets from index
   [junit4]   2> 872728 INFO  (coreLoadExecutor-2343-thread-1) [    ] o.a.s.u.VersionInfo No terms found for _version_, cannot seed version bucket highest value from index
   [junit4]   2> 872728 INFO  (coreLoadExecutor-2343-thread-1) [    ] o.a.s.u.UpdateLog Could not find max version in index or recent updates, using new clock 1523219394626322432
   [junit4]   2> 872730 INFO  (coreLoadExecutor-2343-thread-1) [    ] o.a.s.u.UpdateLog Took 1.0ms to seed version buckets with highest version 1523219394626322432
   [junit4]   2> 872730 INFO  (coreLoadExecutor-2343-thread-1) [    ] o.a.s.c.ZkController watch zkdir /configs/conf1
   [junit4]   2> 872730 INFO  (coreLoadExecutor-2343-thread-1) [    ] o.a.s.c.CoreContainer registering core: collection1
   [junit4]   2> 872730 INFO  (coreZkRegister-2337-thread-1) [    ] o.a.s.c.ZkController Register replica - core:collection1 address:https://127.0.0.1:49745/_/oo collection:control_collection shard:shard1
   [junit4]   2> 872731 INFO  (coreZkRegister-2337-thread-1) [    ] o.a.s.c.c.SolrZkClient makePath: /collections/control_collection/leader_elect/shard1/election
   [junit4]   2> 872733 INFO  (coreZkRegister-2337-thread-1) [    ] o.a.s.c.LeaderElector Joined leadership election with path: /collections/control_collection/leader_elect/shard1/election/95201212062760967-core_node1-n_0000000000
   [junit4]   2> 872733 INFO  (coreZkRegister-2337-thread-1) [    ] o.a.s.c.ShardLeaderElectionContext Running the leader process for shard=shard1 and weAreReplacement=false and leaderVoteWait=180000
   [junit4]   2> 872734 INFO  (coreZkRegister-2337-thread-1) [    ] o.a.s.c.ShardLeaderElectionContext Enough replicas found to continue.
   [junit4]   2> 872734 INFO  (coreZkRegister-2337-thread-1) [    ] o.a.s.c.ShardLeaderElectionContext I may be the new leader - try and sync
   [junit4]   2> 872734 INFO  (coreZkRegister-2337-thread-1) [    ] o.a.s.c.SyncStrategy Sync replicas to https://127.0.0.1:49745/_/oo/collection1/
   [junit4]   2> 872734 INFO  (coreZkRegister-2337-thread-1) [    ] o.a.s.c.SyncStrategy Sync Success - now sync replicas to me
   [junit4]   2> 872734 INFO  (coreZkRegister-2337-thread-1) [    ] o.a.s.c.SyncStrategy https://127.0.0.1:49745/_/oo/collection1/ has no replicas
   [junit4]   2> 872734 INFO  (OverseerStateUpdate-95201212062760967-127.0.0.1:49745__%2Foo-n_0000000000) [    ] o.a.s.c.Overseer processMessage: queueSize: 1, message = {
   [junit4]   2>   "operation":"leader",
   [junit4]   2>   "shard":"shard1",
   [junit4]   2>   "collection":"control_collection"} current state version: 1
   [junit4]   2> 872734 INFO  (coreZkRegister-2337-thread-1) [    ] o.a.s.c.c.SolrZkClient makePath: /collections/control_collection/leaders/shard1
   [junit4]   2> 872735 INFO  (coreZkRegister-2337-thread-1) [    ] o.a.s.c.ShardLeaderElectionContextBase Creating leader registration node
   [junit4]   2> 872737 INFO  (coreZkRegister-2337-thread-1) [    ] o.a.s.c.ShardLeaderElectionContext I am the new leader: https://127.0.0.1:49745/_/oo/collection1/ shard1
   [junit4]   2> 872737 INFO  (OverseerStateUpdate-95201212062760967-127.0.0.1:49745__%2Foo-n_0000000000) [    ] o.a.s.c.Overseer processMessage: queueSize: 1, message = {
   [junit4]   2>   "operation":"leader",
   [junit4]   2>   "shard":"shard1",
   [junit4]   2>   "collection":"control_collection",
   [junit4]   2>   "base_url":"https://127.0.0.1:49745/_/oo",
   [junit4]   2>   "core":"collection1",
   [junit4]   2>   "state":"active"} current state version: 1
   [junit4]   2> 872839 INFO  (zkCallback-955-thread-1) [    ] o.a.s.c.c.ZkStateReader A cluster state change: [WatchedEvent state:SyncConnected type:NodeDataChanged path:/clusterstate.json], has occurred - updating... (live nodes size: [1])
   [junit4]   2> 872888 INFO  (coreZkRegister-2337-thread-1) [    ] o.a.s.c.ZkController We are https://127.0.0.1:49745/_/oo/collection1/ and leader is https://127.0.0.1:49745/_/oo/collection1/
   [junit4]   2> 872888 INFO  (coreZkRegister-2337-thread-1) [    ] o.a.s.c.ZkController No LogReplay needed for core=collection1 baseURL=https://127.0.0.1:49745/_/oo
   [junit4]   2> 872888 INFO  (coreZkRegister-2337-thread-1) [    ] o.a.s.c.ZkController I am the leader, no recovery necessary
   [junit4]   2> 872888 INFO  (coreZkRegister-2337-thread-1) [    ] o.a.s.c.ZkController publishing state=active
   [junit4]   2> 872888 INFO  (coreZkRegister-2337-thread-1) [    ] o.a.s.c.ZkController numShards not found on descriptor - reading it from system property
   [junit4]   2> 872889 INFO  (OverseerStateUpdate-95201212062760967-127.0.0.1:49745__%2Foo-n_0000000000) [    ] o.a.s.c.Overseer processMessage: queueSize: 1, message = {
   [junit4]   2>   "core":"collection1",
   [junit4]   2>   "core_node_name":"core_node1",
   [junit4]   2>   "roles":null,
   [junit4]   2>   "base_url":"https://127.0.0.1:49745/_/oo",
   [junit4]   2>   "node_name":"127.0.0.1:49745__%2Foo",
   [junit4]   2>   "numShards":"1",
   [junit4]   2>   "state":"active",
   [junit4]   2>   "shard":"shard1",
   [junit4]   2>   "collection":"control_collection",
   [junit4]   2>   "operation":"state"} current state version: 2
   [junit4]   2> 872889 INFO  (OverseerStateUpdate-95201212062760967-127.0.0.1:49745__%2Foo-n_0000000000) [    ] o.a.s.c.o.ReplicaMutator Update state numShards=1 message={
   [junit4]   2>   "core":"collection1",
   [junit4]   2>   "core_node_name":"core_node1",
   [junit4]   2>   "roles":null,
   [junit4]   2>   "base_url":"https://127.0.0.1:49745/_/oo",
   [junit4]   2>   "node_name":"127.0.0.1:49745__%2Foo",
   [junit4]   2>   "numShards":"1",
   [junit4]   2>   "state":"active",
   [junit4]   2>   "shard":"shard1",
   [junit4]   2>   "collection":"control_collection",
   [junit4]   2>   "operation":"state"}
   [junit4]   2> 872985 INFO  (TEST-CollectionsAPIDistributedZkTest.test-seed#[6EB190BC378DF78D]) [    ] o.a.s.c.c.SolrZkClient Using default ZkCredentialsProvider
   [junit4]   2> 872985 INFO  (TEST-CollectionsAPIDistributedZkTest.test-seed#[6EB190BC378DF78D]) [    ] o.a.s.c.c.ConnectionManager Waiting for client to connect to ZooKeeper
   [junit4]   2> 872986 INFO  (zkCallback-957-thread-1) [    ] o.a.s.c.c.ConnectionManager Watcher org.apache.solr.common.cloud.ConnectionManager@5f827b name:ZooKeeperConnection Watcher:127.0.0.1:49237/solr got event WatchedEvent state:SyncConnected type:None path:null path:null type:None
   [junit4]   2> 872986 INFO  (TEST-CollectionsAPIDistributedZkTest.test-seed#[6EB190BC378DF78D]) [    ] o.a.s.c.c.ConnectionManager Client is connected to ZooKeeper
   [junit4]   2> 872986 INFO  (TEST-CollectionsAPIDistributedZkTest.test-seed#[6EB190BC378DF78D]) [    ] o.a.s.c.c.SolrZkClient Using default ZkACLProvider
   [junit4]   2> 872986 INFO  (TEST-CollectionsAPIDistributedZkTest.test-seed#[6EB190BC378DF78D]) [    ] o.a.s.c.c.ZkStateReader Updating cluster state from ZooKeeper... 
   [junit4]   2> 872988 INFO  (TEST-CollectionsAPIDistributedZkTest.test-seed#[6EB190BC378DF78D]) [    ] o.a.s.c.ChaosMonkey monkey: init - expire sessions:false cause connection loss:false
   [junit4]   2> 872988 INFO  (TEST-CollectionsAPIDistributedZkTest.test-seed#[6EB190BC378DF78D]) [    ] o.a.s.c.AbstractFullDistribZkTestBase Creating collection1 with stateFormat=2
   [junit4]   2> 872988 INFO  (TEST-CollectionsAPIDistributedZkTest.test-seed#[6EB190BC378DF78D]) [    ] o.a.s.c.c.SolrZkClient Using default ZkCredentialsProvider
   [junit4]   2> 872988 INFO  (TEST-CollectionsAPIDistributedZkTest.test-seed#[6EB190BC378DF78D]) [    ] o.a.s.c.c.ConnectionManager Waiting for client to connect to ZooKeeper
   [junit4]   2> 872989 INFO  (zkCallback-958-thread-1) [    ] o.a.s.c.c.ConnectionManager Watcher org.apache.solr.common.cloud.ConnectionManager@2e9ce1 name:ZooKeeperConnection Watcher:127.0.0.1:49237/solr got event WatchedEvent state:SyncConnected type:None path:null path:null type:None
   [junit4]   2> 872989 INFO  (TEST-CollectionsAPIDistributedZkTest.test-seed#[6EB190BC378DF78D]) [    ] o.a.s.c.c.ConnectionManager Client is connected to ZooKeeper
   [junit4]   2> 872990 INFO  (TEST-CollectionsAPIDistributedZkTest.test-seed#[6EB190BC378DF78D]) [    ] o.a.s.c.c.SolrZkClient Using default ZkACLProvider
   [junit4]   2> 872991 INFO  (OverseerStateUpdate-95201212062760967-127.0.0.1:49745__%2Foo-n_0000000000) [    ] o.a.s.c.Overseer processMessage: queueSize: 1, message = {
   [junit4]   2>   "operation":"create",
   [junit4]   2>   "name":"collection1",
   [junit4]   2>   "numShards":"2",
   [junit4]   2>   "stateFormat":"2"} current state version: 2
   [junit4]   2> 872991 INFO  (OverseerStateUpdate-95201212062760967-127.0.0.1:49745__%2Foo-n_0000000000) [    ] o.a.s.c.o.ClusterStateMutator building a new cName: collection1
   [junit4]   2> 872992 INFO  (zkCallback-955-thread-1) [    ] o.a.s.c.c.ZkStateReader A cluster state change: [WatchedEvent state:SyncConnected type:NodeDataChanged path:/clusterstate.json], has occurred - updating... (live nodes size: [1])
   [junit4]   2> 872992 INFO  (zkCallback-957-thread-1) [    ] o.a.s.c.c.ZkStateReader A cluster state change: [WatchedEvent state:SyncConnected type:NodeDataChanged path:/clusterstate.json], has occurred - updating... (live nodes size: [1])
   [junit4]   2> 873065 INFO  (TEST-CollectionsAPIDistributedZkTest.test-seed#[6EB190BC378DF78D]) [    ] o.a.s.SolrTestCaseJ4 Writing core.properties file to /home/jenkins/workspace/Lucene-Solr-trunk-Linux/solr/build/solr-core/test/J1/temp/solr.cloud.CollectionsAPIDistributedZkTest_6EB190BC378DF78D-001/shard-1-001/cores/collection1
   [junit4]   2> 873066 INFO  (TEST-CollectionsAPIDistributedZkTest.test-seed#[6EB190BC378DF78D]) [    ] o.a.s.c.AbstractFullDistribZkTestBase create jetty 1 in directory /home/jenkins/workspace/Lucene-Solr-trunk-Linux/solr/build/solr-core/test/J1/temp/solr.cloud.CollectionsAPIDistributedZkTest_6EB190BC378DF78D-001/shard-1-001
   [junit4]   2> 873066 INFO  (TEST-CollectionsAPIDistributedZkTest.test-seed#[6EB190BC378DF78D]) [    ] o.e.j.s.Server jetty-9.2.13.v20150730
   [junit4]   2> 873067 INFO  (TEST-CollectionsAPIDistributedZkTest.test-seed#[6EB190BC378DF78D]) [    ] o.e.j.s.h.ContextHandler Started o.e.j.s.ServletContextHandler@1e31e40{/_/oo,null,AVAILABLE}
   [junit4]   2> 873073 INFO  (TEST-CollectionsAPIDistributedZkTest.test-seed#[6EB190BC378DF78D]) [    ] o.e.j.s.ServerConnector Started ServerConnector@61d14f{SSL-http/1.1}{127.0.0.1:39706}
   [junit4]   2> 873073 INFO  (TEST-CollectionsAPIDistributedZkTest.test-seed#[6EB190BC378DF78D]) [    ] o.e.j.s.Server Started @874503ms
   [junit4]   2> 873073 INFO  (TEST-CollectionsAPIDistributedZkTest.test-seed#[6EB190BC378DF78D]) [    ] o.a.s.c.s.e.JettySolrRunner Jetty properties: {solr.data.dir=/home/jenkins/workspace/Lucene-Solr-trunk-Linux/solr/build/solr-core/test/J1/temp/solr.cloud.CollectionsAPIDistributedZkTest_6EB190BC378DF78D-001/tempDir-001/jetty1, solrconfig=solrconfig.xml, hostContext=/_/oo, hostPort=39706, coreRootDirectory=/home/jenkins/workspace/Lucene-Solr-trunk-Linux/solr/build/solr-core/test/J1/../../../../../../../../../home/jenkins/workspace/Lucene-Solr-trunk-Linux/solr/build/solr-core/test/J1/temp/solr.cloud.CollectionsAPIDistributedZkTest_6EB190BC378DF78D-001/shard-1-001/cores}
   [junit4]   2> 873073 INFO  (TEST-CollectionsAPIDistributedZkTest.test-seed#[6EB190BC378DF78D]) [    ] o.a.s.s.SolrDispatchFilter SolrDispatchFilter.init(): sun.misc.Launcher$AppClassLoader@1eb6432
   [junit4]   2> 873073 INFO  (TEST-CollectionsAPIDistributedZkTest.test-seed#[6EB190BC378DF78D]) [    ] o.a.s.c.SolrResourceLoader new SolrResourceLoader for directory: '/home/jenkins/workspace/Lucene-Solr-trunk-Linux/solr/build/solr-core/test/J1/temp/solr.cloud.CollectionsAPIDistributedZkTest_6EB190BC378DF78D-001/shard-1-001'
   [junit4]   2> 873074 INFO  (TEST-CollectionsAPIDistributedZkTest.test-seed#[6EB190BC378DF78D]) [    ] o.a.s.c.SolrResourceLoader JNDI not configured for solr (NoInitialContextEx)
   [junit4]   2> 873074 INFO  (TEST-CollectionsAPIDistributedZkTest.test-seed#[6EB190BC378DF78D]) [    ] o.a.s.c.SolrResourceLoader solr home defaulted to 'solr/' (could not find system property or JNDI)
   [junit4]   2> 873074 INFO  (TEST-CollectionsAPIDistributedZkTest.test-seed#[6EB190BC378DF78D]) [    ] o.a.s.c.c.SolrZkClient Using default ZkCredentialsProvider
   [junit4]   2> 873074 INFO  (TEST-CollectionsAPIDistributedZkTest.test-seed#[6EB190BC378DF78D]) [    ] o.a.s.c.c.ConnectionManager Waiting for client to connect to ZooKeeper
   [junit4]   2> 873075 INFO  (zkCallback-959-thread-1) [    ] o.a.s.c.c.ConnectionManager Watcher org.apache.solr.common.cloud.ConnectionManager@12614bb name:ZooKeeperConnection Watcher:127.0.0.1:49237/solr got event WatchedEvent state:SyncConnected type:None path:null path:null type:None
   [junit4]   2> 873075 INFO  (TEST-CollectionsAPIDistributedZkTest.test-seed#[6EB190BC378DF78D]) [    ] o.a.s.c.c.ConnectionManager Client is connected to ZooKeeper
   [junit4]   2> 873076 INFO  (TEST-CollectionsAPIDistributedZkTest.test-seed#[6EB190BC378DF78D]) [    ] o.a.s.c.c.SolrZkClient Using default ZkACLProvider
   [junit4]   2> 873077 INFO  (TEST-CollectionsAPIDistributedZkTest.test-seed#[6EB190BC378DF78D]) [    ] o.a.s.s.SolrDispatchFilter Loading solr.xml from SolrHome (not found in ZooKeeper)
   [junit4]   2> 873077 INFO  (TEST-CollectionsAPIDistributedZkTest.test-seed#[6EB190BC378DF78D]) [    ] o.a.s.c.SolrXmlConfig Loading container configuration from /home/jenkins/workspace/Lucene-Solr-trunk-Linux/solr/build/solr-core/test/J1/temp/solr.cloud.CollectionsAPIDistributedZkTest_6EB190BC378DF78D-001/shard-1-001/solr.xml
   [junit4]   2> 873088 INFO  (TEST-CollectionsAPIDistributedZkTest.test-seed#[6EB190BC378DF78D]) [    ] o.a.s.c.CorePropertiesLocator Config-defined core root directory: /home/jenkins/workspace/Lucene-Solr-trunk-Linux/solr/build/solr-core/test/J1/../../../../../../../../../home/jenkins/workspace/Lucene-Solr-trunk-Linux/solr/build/solr-core/test/J1/temp/solr.cloud.CollectionsAPIDistributedZkTest_6EB190BC378DF78D-001/shard-1-001/cores
   [junit4]   2> 873088 INFO  (TEST-CollectionsAPIDistributedZkTest.test-seed#[6EB190BC378DF78D]) [    ] o.a.s.c.CoreContainer New CoreContainer 2995049
   [junit4]   2> 873088 INFO  (TEST-CollectionsAPIDistributedZkTest.test-seed#[6EB190BC378DF78D]) [    ] o.a.s.c.CoreContainer Loading cores into CoreContainer [instanceDir=/home/jenkins/workspace/Lucene-Solr-trunk-Linux/solr/build/solr-core/test/J1/temp/solr.cloud.CollectionsAPIDistributedZkTest_6EB190BC378DF78D-001/shard-1-001]
   [junit4]   2> 873088 WARN  (TEST-CollectionsAPIDistributedZkTest.test-seed#[6EB190BC378DF78D]) [    ] o.a.s.c.CoreContainer Couldn't add files from /home/jenkins/workspace/Lucene-Solr-trunk-Linux/solr/build/solr-core/test/J1/temp/solr.cloud.CollectionsAPIDistributedZkTest_6EB190BC378DF78D-001/shard-1-001/lib to classpath: /home/jenkins/workspace/Lucene-Solr-trunk-Linux/solr/build/solr-core/test/J1/temp/solr.cloud.CollectionsAPIDistributedZkTest_6EB190BC378DF78D-001/shard-1-001/lib
   [junit4]   2> 873088 INFO  (TEST-CollectionsAPIDistributedZkTest.test-seed#[6EB190BC378DF78D]) [    ] o.a.s.h.c.HttpShardHandlerFactory created with socketTimeout : 90000,urlScheme : ,connTimeout : 15000,maxConnectionsPerHost : 20,maxConnections : 10000,corePoolSize : 0,maximumPoolSize : 2147483647,maxThreadIdleTime : 5,sizeOfQueue : -1,fairnessPolicy : false,useRetries : false,
   [junit4]   2> 873090 INFO  (TEST-CollectionsAPIDistributedZkTest.test-seed#[6EB190BC378DF78D]) [    ] o.a.s.u.UpdateShardHandler Creating UpdateShardHandler HTTP client with params: socketTimeout=340000&connTimeout=45000&retry=true
   [junit4]   2> 873091 INFO  (TEST-CollectionsAPIDistributedZkTest.test-seed#[6EB190BC378DF78D]) [    ] o.a.s.l.LogWatcher SLF4J impl is org.slf4j.impl.Log4jLoggerFactory
   [junit4]   2> 873091 INFO  (TEST-CollectionsAPIDistributedZkTest.test-seed#[6EB190BC378DF78D]) [    ] o.a.s.l.LogWatcher Registering Log Listener [Log4j (org.slf4j.impl.Log4jLoggerFactory)]
   [junit4]   2> 873091 INFO  (TEST-CollectionsAPIDistributedZkTest.test-seed#[6EB190BC378DF78D]) [    ] o.a.s.c.ZkContainer Zookeeper client=127.0.0.1:49237/solr
   [junit4]   2> 873091 INFO  (TEST-CollectionsAPIDistributedZkTest.test-seed#[6EB190BC378DF78D]) [    ] o.a.s.c.ZkController zkHost includes chroot
   [junit4]   2> 873091 INFO  (TEST-CollectionsAPIDistributedZkTest.test-seed#[6EB190BC378DF78D]) [    ] o.a.s.c.c.SolrZkClient Using default ZkCredentialsProvider
   [junit4]   2> 873092 INFO  (TEST-CollectionsAPIDistributedZkTest.test-seed#[6EB190BC378DF78D]) [    ] o.a.s.c.c.ConnectionManager Waiting for client to connect to ZooKeeper
   [junit4]   2> 873093 INFO  (zkCallback-962-thread-1) [    ] o.a.s.c.c.ConnectionManager Watcher org.apache.solr.common.cloud.ConnectionManager@19d84d1 name:ZooKeeperConnection Watcher:127.0.0.1:49237 got event WatchedEvent state:SyncConnected type:None path:null path:null type:None
   [junit4]   2> 873093 INFO  (TEST-CollectionsAPIDistributedZkTest.test-seed#[6EB190BC378DF78D]) [    ] o.a.s.c.c.ConnectionManager Client is connected to ZooKeeper
   [junit4]   2> 873093 INFO  (TEST-CollectionsAPIDistributedZkTest.test-seed#[6EB190BC378DF78D]) [    ] o.a.s.c.c.SolrZkClient Using default ZkACLProvider
   [junit4]   2> 873094 INFO  (TEST-CollectionsAPIDistributedZkTest.test-seed#[6EB190BC378DF78D]) [    ] o.a.s.c.c.ConnectionManager Waiting for client to connect to ZooKeeper
   [junit4]   2> 873095 INFO  (OverseerStateUpdate-95201212062760967-127.0.0.1:49745__%2Foo-n_0000000000) [    ] o.a.s.c.o.ZkStateWriter going to create_collection /collections/collection1/state.json
   [junit4]   2> 873095 INFO  (zkCallback-963-thread-1) [    ] o.a.s.c.c.ConnectionManager Watcher org.apache.solr.common.cloud.ConnectionManager@a2543c name:ZooKeeperConnection Watcher:127.0.0.1:49237/solr got event WatchedEvent state:SyncConnected type:None path:null path:null type:None
   [junit4]   2> 873095 INFO  (TEST-CollectionsAPIDistributedZkTest.test-seed#[6EB190BC378DF78D]) [    ] o.a.s.c.c.ConnectionManager Client is connected to ZooKeeper
   [junit4]   2> 873099 INFO  (TEST-CollectionsAPIDistributedZkTest.test-seed#[6EB190BC378DF78D]) [    ] o.a.s.c.c.ZkStateReader Updating cluster state from ZooKeeper... 
   [junit4]   2> 874102 INFO  (TEST-CollectionsAPIDistributedZkTest.test-seed#[6EB190BC378DF78D]) [    ] o.a.s.c.ZkController Register node as live in ZooKeeper:/live_nodes/127.0.0.1:39706__%2Foo
   [junit4]   2> 874102 INFO  (TEST-CollectionsAPIDistributedZkTest.test-seed#[6EB190BC378DF78D]) [    ] o.a.s.c.c.SolrZkClient makePath: /live_nodes/127.0.0.1:39706__%2Foo
   [junit4]   2> 874103 INFO  (zkCallback-963-thread-1) [    ] o.a.s.c.c.ZkStateReader A live node change: [WatchedEvent state:SyncConnected type:NodeChildrenChanged path:/live_nodes], has occurred - updating... (live nodes size: [1])
   [junit4]   2> 874103 INFO  (zkCallback-957-thread-1) [    ] o.a.s.c.c.ZkStateReader A live node change: [WatchedEvent state:SyncConnected type:NodeChildrenChanged path:/live_nodes], has occurred - updating... (live nodes size: [1])
   [junit4]   2> 874103 INFO  (zkCallback-955-thread-1) [    ] o.a.s.c.c.ZkStateReader A live node change: [WatchedEvent state:SyncConnected type:NodeChildrenChanged path:/live_nodes], has occurred - updating... (live nodes size: [1])
   [junit4]   2> 874104 INFO  (TEST-CollectionsAPIDistributedZkTest.test-seed#[6EB190BC378DF78D]) [    ] o.a.s.c.Overseer Overseer (id=null) closing
   [junit4]   2> 874104 INFO  (TEST-CollectionsAPIDistributedZkTest.test-seed#[6EB190BC378DF78D]) [    ] o.a.s.c.LeaderElector Joined leadership election with path: /overseer_elect/election/95201212062760972-127.0.0.1:39706__%2Foo-n_0000000001
   [junit4]   2> 874105 INFO  (TEST-CollectionsAPIDistributedZkTest.test-seed#[6EB190BC378DF78D]) [    ] o.a.s.c.LeaderElector Watching path /overseer_elect/election/95201212062760967-127.0.0.1:49745__%2Foo-n_0000000000 to know if I could be the leader
   [junit4]   2> 874134 INFO  (TEST-CollectionsAPIDistributedZkTest.test-seed#[6EB190BC378DF78D]) [    ] o.a.s.c.CoreContainer Security conf doesn't exist. Skipping setup for authorization module.
   [junit4]   2> 874134 INFO  (TEST-CollectionsAPIDistributedZkTest.test-seed#[6EB190BC378DF78D]) [    ] o.a.s.c.CoreContainer No authentication plugin used.
   [junit4]   2> 874135 INFO  (TEST-CollectionsAPIDistributedZkTest.test-seed#[6EB190BC378DF78D]) [    ] o.a.s.c.CorePropertiesLocator Looking for core definitions underneath /home/jenkins/workspace/Lucene-Solr-trunk-Linux/solr/build/solr-core/test/J1/../../../../../../../../../home/jenkins/workspace/Lucene-Solr-trunk-Linux/solr/build/solr-core/test/J1/temp/solr.cloud.CollectionsAPIDistributedZkTest_6EB190BC378DF78D-001/shard-1-001/cores
   [junit4]   2> 874136 INFO  (TEST-CollectionsAPIDistributedZkTest.test-seed#[6EB190BC378DF78D]) [    ] o.a.s.c.CoreDescriptor Created CoreDescriptor: {name=collection1, config=solrconfig.xml, transient=false, schema=schema.xml, loadOnStartup=true, configSetProperties=configsetprops.json, collection=collection1, coreNodeName=, dataDir=data/, shard=}
   [junit4]   2> 874136 INFO  (TEST-CollectionsAPIDistributedZkTest.test-seed#[6EB190BC378DF78D]) [    ] o.a.s.c.CorePropertiesLocator Found core collection1 in /home/jenkins/workspace/Lucene-Solr-trunk-Linux/solr/build/solr-core/test/J1/../../../../../../../../../home/jenkins/workspace/Lucene-Solr-trunk-Linux/solr/build/solr-core/test/J1/temp/solr.cloud.CollectionsAPIDistributedZkTest_6EB190BC378DF78D-001/shard-1-001/cores/collection1
   [junit4]   2> 874136 INFO  (TEST-CollectionsAPIDistributedZkTest.test-seed#[6EB190BC378DF78D]) [    ] o.a.s.c.CorePropertiesLocator Found 1 core definitions
   [junit4]   2> 874136 INFO  (TEST-CollectionsAPIDistributedZkTest.test-seed#[6EB190BC378DF78D]) [    ] o.a.s.s.SolrDispatchFilter user.dir=/home/jenkins/workspace/Lucene-Solr-trunk-Linux/solr/build/solr-core/test/J1
   [junit4]   2> 874136 INFO  (TEST-CollectionsAPIDistributedZkTest.test-seed#[6EB190BC378DF78D]) [    ] o.a.s.s.SolrDispatchFilter SolrDispatchFilter.init() done
   [junit4]   2> 874137 INFO  (coreLoadExecutor-2354-thread-1) [    ] o.a.s.c.ZkController publishin

[...truncated too long message...]

ributedZkTest]
   [junit4]   2> NOTE: reproduce with: ant test  -Dtestcase=CollectionsAPIDistributedZkTest -Dtests.seed=6EB190BC378DF78D -Dtests.multiplier=3 -Dtests.slow=true -Dtests.locale=guz_KE -Dtests.timezone=Europe/Helsinki -Dtests.asserts=true -Dtests.file.encoding=ISO-8859-1
   [junit4] ERROR   0.00s J1 | CollectionsAPIDistributedZkTest (suite) <<<
   [junit4]    > Throwable #1: com.carrotsearch.randomizedtesting.ThreadLeakError: 5 threads leaked from SUITE scope at org.apache.solr.cloud.CollectionsAPIDistributedZkTest: 
   [junit4]    >    1) Thread[id=6434, name=TEST-CollectionsAPIDistributedZkTest.test-seed#[6EB190BC378DF78D]-EventThread, state=WAITING, group=TGRP-CollectionsAPIDistributedZkTest]
   [junit4]    >         at jdk.internal.misc.Unsafe.park(Native Method)
   [junit4]    >         at java.util.concurrent.locks.LockSupport.park(LockSupport.java:178)
   [junit4]    >         at java.util.concurrent.locks.AbstractQueuedSynchronizer$ConditionObject.await(AbstractQueuedSynchronizer.java:2061)
   [junit4]    >         at java.util.concurrent.LinkedBlockingQueue.take(LinkedBlockingQueue.java:442)
   [junit4]    >         at org.apache.zookeeper.ClientCnxn$EventThread.run(ClientCnxn.java:494)
   [junit4]    >    2) Thread[id=6654, name=zkCallback-986-thread-2, state=TIMED_WAITING, group=TGRP-CollectionsAPIDistributedZkTest]
   [junit4]    >         at jdk.internal.misc.Unsafe.park(Native Method)
   [junit4]    >         at java.util.concurrent.locks.LockSupport.parkNanos(LockSupport.java:218)
   [junit4]    >         at java.util.concurrent.SynchronousQueue$TransferStack.awaitFulfill(SynchronousQueue.java:461)
   [junit4]    >         at java.util.concurrent.SynchronousQueue$TransferStack.transfer(SynchronousQueue.java:362)
   [junit4]    >         at java.util.concurrent.SynchronousQueue.poll(SynchronousQueue.java:937)
   [junit4]    >         at java.util.concurrent.ThreadPoolExecutor.getTask(ThreadPoolExecutor.java:1082)
   [junit4]    >         at java.util.concurrent.ThreadPoolExecutor.runWorker(ThreadPoolExecutor.java:1143)
   [junit4]    >         at java.util.concurrent.ThreadPoolExecutor$Worker.run(ThreadPoolExecutor.java:632)
   [junit4]    >         at java.lang.Thread.run(Thread.java:747)
   [junit4]    >    3) Thread[id=6435, name=zkCallback-986-thread-1, state=TIMED_WAITING, group=TGRP-CollectionsAPIDistributedZkTest]
   [junit4]    >         at jdk.internal.misc.Unsafe.park(Native Method)
   [junit4]    >         at java.util.concurrent.locks.LockSupport.parkNanos(LockSupport.java:218)
   [junit4]    >         at java.util.concurrent.SynchronousQueue$TransferStack.awaitFulfill(SynchronousQueue.java:461)
   [junit4]    >         at java.util.concurrent.SynchronousQueue$TransferStack.transfer(SynchronousQueue.java:362)
   [junit4]    >         at java.util.concurrent.SynchronousQueue.poll(SynchronousQueue.java:937)
   [junit4]    >         at java.util.concurrent.ThreadPoolExecutor.getTask(ThreadPoolExecutor.java:1082)
   [junit4]    >         at java.util.concurrent.ThreadPoolExecutor.runWorker(ThreadPoolExecutor.java:1143)
   [junit4]    >         at java.util.concurrent.ThreadPoolExecutor$Worker.run(ThreadPoolExecutor.java:632)
   [junit4]    >         at java.lang.Thread.run(Thread.java:747)
   [junit4]    >    4) Thread[id=6433, name=TEST-CollectionsAPIDistributedZkTest.test-seed#[6EB190BC378DF78D]-SendThread(127.0.0.1:49237), state=TIMED_WAITING, group=TGRP-CollectionsAPIDistributedZkTest]
   [junit4]    >         at java.lang.Thread.sleep(Native Method)
   [junit4]    >         at org.apache.zookeeper.ClientCnxn$SendThread.run(ClientCnxn.java:994)
   [junit4]    >    5) Thread[id=6655, name=zkCallback-986-thread-3, state=TIMED_WAITING, group=TGRP-CollectionsAPIDistributedZkTest]
   [junit4]    >         at jdk.internal.misc.Unsafe.park(Native Method)
   [junit4]    >         at java.util.concurrent.locks.LockSupport.parkNanos(LockSupport.java:218)
   [junit4]    >         at java.util.concurrent.SynchronousQueue$TransferStack.awaitFulfill(SynchronousQueue.java:461)
   [junit4]    >         at java.util.concurrent.SynchronousQueue$TransferStack.transfer(SynchronousQueue.java:362)
   [junit4]    >         at java.util.concurrent.SynchronousQueue.poll(SynchronousQueue.java:937)
   [junit4]    >         at java.util.concurrent.ThreadPoolExecutor.getTask(ThreadPoolExecutor.java:1082)
   [junit4]    >         at java.util.concurrent.ThreadPoolExecutor.runWorker(ThreadPoolExecutor.java:1143)
   [junit4]    >         at java.util.concurrent.ThreadPoolExecutor$Worker.run(ThreadPoolExecutor.java:632)
   [junit4]    >         at java.lang.Thread.run(Thread.java:747)
   [junit4]    > 	at __randomizedtesting.SeedInfo.seed([6EB190BC378DF78D]:0)Throwable #2: com.carrotsearch.randomizedtesting.ThreadLeakError: There are still zombie threads that couldn't be terminated:
   [junit4]    >    1) Thread[id=6654, name=zkCallback-986-thread-2, state=TIMED_WAITING, group=TGRP-CollectionsAPIDistributedZkTest]
   [junit4]    >         at jdk.internal.misc.Unsafe.park(Native Method)
   [junit4]    >         at java.util.concurrent.locks.LockSupport.parkNanos(LockSupport.java:218)
   [junit4]    >         at java.util.concurrent.SynchronousQueue$TransferStack.awaitFulfill(SynchronousQueue.java:461)
   [junit4]    >         at java.util.concurrent.SynchronousQueue$TransferStack.transfer(SynchronousQueue.java:362)
   [junit4]    >         at java.util.concurrent.SynchronousQueue.poll(SynchronousQueue.java:937)
   [junit4]    >         at java.util.concurrent.ThreadPoolExecutor.getTask(ThreadPoolExecutor.java:1082)
   [junit4]    >         at java.util.concurrent.ThreadPoolExecutor.runWorker(ThreadPoolExecutor.java:1143)
   [junit4]    >         at java.util.concurrent.ThreadPoolExecutor$Worker.run(ThreadPoolExecutor.java:632)
   [junit4]    >         at java.lang.Thread.run(Thread.java:747)
   [junit4]    >    2) Thread[id=6435, name=zkCallback-986-thread-1, state=TIMED_WAITING, group=TGRP-CollectionsAPIDistributedZkTest]
   [junit4]    >         at jdk.internal.misc.Unsafe.park(Native Method)
   [junit4]    >         at java.util.concurrent.locks.LockSupport.parkNanos(LockSupport.java:218)
   [junit4]    >         at java.util.concurrent.SynchronousQueue$TransferStack.awaitFulfill(SynchronousQueue.java:461)
   [junit4]    >         at java.util.concurrent.SynchronousQueue$TransferStack.transfer(SynchronousQueue.java:362)
   [junit4]    >         at java.util.concurrent.SynchronousQueue.poll(SynchronousQueue.java:937)
   [junit4]    >         at java.util.concurrent.ThreadPoolExecutor.getTask(ThreadPoolExecutor.java:1082)
   [junit4]    >         at java.util.concurrent.ThreadPoolExecutor.runWorker(ThreadPoolExecutor.java:1143)
   [junit4]    >         at java.util.concurrent.ThreadPoolExecutor$Worker.run(ThreadPoolExecutor.java:632)
   [junit4]    >         at java.lang.Thread.run(Thread.java:747)
   [junit4]    >    3) Thread[id=6433, name=TEST-CollectionsAPIDistributedZkTest.test-seed#[6EB190BC378DF78D]-SendThread(127.0.0.1:49237), state=TIMED_WAITING, group=TGRP-CollectionsAPIDistributedZkTest]
   [junit4]    >         at java.lang.Thread.sleep(Native Method)
   [junit4]    >         at org.apache.zookeeper.client.StaticHostProvider.next(StaticHostProvider.java:101)
   [junit4]    >         at org.apache.zookeeper.ClientCnxn$SendThread.startConnect(ClientCnxn.java:940)
   [junit4]    >         at org.apache.zookeeper.ClientCnxn$SendThread.run(ClientCnxn.java:1003)
   [junit4]    >    4) Thread[id=6655, name=zkCallback-986-thread-3, state=TIMED_WAITING, group=TGRP-CollectionsAPIDistributedZkTest]
   [junit4]    >         at jdk.internal.misc.Unsafe.park(Native Method)
   [junit4]    >         at java.util.concurrent.locks.LockSupport.parkNanos(LockSupport.java:218)
   [junit4]    >         at java.util.concurrent.SynchronousQueue$TransferStack.awaitFulfill(SynchronousQueue.java:461)
   [junit4]    >         at java.util.concurrent.SynchronousQueue$TransferStack.transfer(SynchronousQueue.java:362)
   [junit4]    >         at java.util.concurrent.SynchronousQueue.poll(SynchronousQueue.java:937)
   [junit4]    >         at java.util.concurrent.ThreadPoolExecutor.getTask(ThreadPoolExecutor.java:1082)
   [junit4]    >         at java.util.concurrent.ThreadPoolExecutor.runWorker(ThreadPoolExecutor.java:1143)
   [junit4]    >         at java.util.concurrent.ThreadPoolExecutor$Worker.run(ThreadPoolExecutor.java:632)
   [junit4]    >         at java.lang.Thread.run(Thread.java:747)
   [junit4]    > 	at __randomizedtesting.SeedInfo.seed([6EB190BC378DF78D]:0)
   [junit4] Completed [285/576 (1!)] on J1 in 112.28s, 1 test, 1 failure, 2 errors <<< FAILURES!

[...truncated 962 lines...]
BUILD FAILED
/home/jenkins/workspace/Lucene-Solr-trunk-Linux/build.xml:784: The following error occurred while executing this line:
/home/jenkins/workspace/Lucene-Solr-trunk-Linux/build.xml:728: The following error occurred while executing this line:
/home/jenkins/workspace/Lucene-Solr-trunk-Linux/build.xml:59: The following error occurred while executing this line:
/home/jenkins/workspace/Lucene-Solr-trunk-Linux/solr/build.xml:233: The following error occurred while executing this line:
/home/jenkins/workspace/Lucene-Solr-trunk-Linux/solr/common-build.xml:522: The following error occurred while executing this line:
/home/jenkins/workspace/Lucene-Solr-trunk-Linux/lucene/common-build.xml:1424: The following error occurred while executing this line:
/home/jenkins/workspace/Lucene-Solr-trunk-Linux/lucene/common-build.xml:981: There were test failures: 576 suites (8 ignored), 2305 tests, 2 suite-level errors, 1 failure, 1122 ignored (64 assumptions) [seed: 6EB190BC378DF78D]

Total time: 44 minutes 40 seconds
Build step 'Invoke Ant' marked build as failure
Archiving artifacts
[WARNINGS] Skipping publisher since build result is FAILURE
Recording test results
Email was triggered for: Failure - Any
Sending email for trigger: Failure - Any



Mime
View raw message