lucene-dev mailing list archives

Site index · List index
Message view « Date » · « Thread »
Top « Date » · « Thread »
From Apache Jenkins Server <jenk...@builds.apache.org>
Subject [JENKINS] Lucene-Solr-NightlyTests-trunk - Build # 916 - Still Failing
Date Fri, 22 Jan 2016 08:00:21 GMT
Build: https://builds.apache.org/job/Lucene-Solr-NightlyTests-trunk/916/

2 tests failed.
FAILED:  org.apache.lucene.search.TestGeoPointQuery.testRandomBig

Error Message:
CheckIndex failed

Stack Trace:
java.lang.RuntimeException: CheckIndex failed
	at __randomizedtesting.SeedInfo.seed([335C0EA08513A80:8462BD6599084600]:0)
	at org.apache.lucene.util.TestUtil.checkIndex(TestUtil.java:281)
	at org.apache.lucene.util.TestUtil.checkIndex(TestUtil.java:263)
	at org.apache.lucene.store.BaseDirectoryWrapper.close(BaseDirectoryWrapper.java:46)
	at org.apache.lucene.util.IOUtils.close(IOUtils.java:89)
	at org.apache.lucene.util.IOUtils.close(IOUtils.java:76)
	at org.apache.lucene.util.BaseGeoPointTestCase.verify(BaseGeoPointTestCase.java:769)
	at org.apache.lucene.util.BaseGeoPointTestCase.doTestRandom(BaseGeoPointTestCase.java:411)
	at org.apache.lucene.util.BaseGeoPointTestCase.testRandomBig(BaseGeoPointTestCase.java:340)
	at sun.reflect.NativeMethodAccessorImpl.invoke0(Native Method)
	at sun.reflect.NativeMethodAccessorImpl.invoke(NativeMethodAccessorImpl.java:62)
	at sun.reflect.DelegatingMethodAccessorImpl.invoke(DelegatingMethodAccessorImpl.java:43)
	at java.lang.reflect.Method.invoke(Method.java:497)
	at com.carrotsearch.randomizedtesting.RandomizedRunner.invoke(RandomizedRunner.java:1764)
	at com.carrotsearch.randomizedtesting.RandomizedRunner$8.evaluate(RandomizedRunner.java:871)
	at com.carrotsearch.randomizedtesting.RandomizedRunner$9.evaluate(RandomizedRunner.java:907)
	at com.carrotsearch.randomizedtesting.RandomizedRunner$10.evaluate(RandomizedRunner.java:921)
	at org.apache.lucene.util.TestRuleSetupTeardownChained$1.evaluate(TestRuleSetupTeardownChained.java:50)
	at org.apache.lucene.util.AbstractBeforeAfterRule$1.evaluate(AbstractBeforeAfterRule.java:46)
	at org.apache.lucene.util.TestRuleThreadAndTestName$1.evaluate(TestRuleThreadAndTestName.java:49)
	at org.apache.lucene.util.TestRuleIgnoreAfterMaxFailures$1.evaluate(TestRuleIgnoreAfterMaxFailures.java:65)
	at org.apache.lucene.util.TestRuleMarkFailure$1.evaluate(TestRuleMarkFailure.java:48)
	at com.carrotsearch.randomizedtesting.rules.StatementAdapter.evaluate(StatementAdapter.java:36)
	at com.carrotsearch.randomizedtesting.ThreadLeakControl$StatementRunner.run(ThreadLeakControl.java:367)
	at com.carrotsearch.randomizedtesting.ThreadLeakControl.forkTimeoutingTask(ThreadLeakControl.java:809)
	at com.carrotsearch.randomizedtesting.ThreadLeakControl$3.evaluate(ThreadLeakControl.java:460)
	at com.carrotsearch.randomizedtesting.RandomizedRunner.runSingleTest(RandomizedRunner.java:880)
	at com.carrotsearch.randomizedtesting.RandomizedRunner$5.evaluate(RandomizedRunner.java:781)
	at com.carrotsearch.randomizedtesting.RandomizedRunner$6.evaluate(RandomizedRunner.java:816)
	at com.carrotsearch.randomizedtesting.RandomizedRunner$7.evaluate(RandomizedRunner.java:827)
	at org.apache.lucene.util.AbstractBeforeAfterRule$1.evaluate(AbstractBeforeAfterRule.java:46)
	at com.carrotsearch.randomizedtesting.rules.StatementAdapter.evaluate(StatementAdapter.java:36)
	at org.apache.lucene.util.TestRuleStoreClassName$1.evaluate(TestRuleStoreClassName.java:42)
	at com.carrotsearch.randomizedtesting.rules.NoShadowingOrOverridesOnMethodsRule$1.evaluate(NoShadowingOrOverridesOnMethodsRule.java:40)
	at com.carrotsearch.randomizedtesting.rules.NoShadowingOrOverridesOnMethodsRule$1.evaluate(NoShadowingOrOverridesOnMethodsRule.java:40)
	at com.carrotsearch.randomizedtesting.rules.StatementAdapter.evaluate(StatementAdapter.java:36)
	at com.carrotsearch.randomizedtesting.rules.StatementAdapter.evaluate(StatementAdapter.java:36)
	at com.carrotsearch.randomizedtesting.rules.StatementAdapter.evaluate(StatementAdapter.java:36)
	at org.apache.lucene.util.TestRuleAssertionsRequired$1.evaluate(TestRuleAssertionsRequired.java:54)
	at org.apache.lucene.util.TestRuleMarkFailure$1.evaluate(TestRuleMarkFailure.java:48)
	at org.apache.lucene.util.TestRuleIgnoreAfterMaxFailures$1.evaluate(TestRuleIgnoreAfterMaxFailures.java:65)
	at org.apache.lucene.util.TestRuleIgnoreTestSuites$1.evaluate(TestRuleIgnoreTestSuites.java:55)
	at com.carrotsearch.randomizedtesting.rules.StatementAdapter.evaluate(StatementAdapter.java:36)
	at com.carrotsearch.randomizedtesting.ThreadLeakControl$StatementRunner.run(ThreadLeakControl.java:367)
	at java.lang.Thread.run(Thread.java:745)


FAILED:  org.apache.lucene.search.TestLatLonPointQueries.testRandomBig

Error Message:
Captured an uncaught exception in thread: Thread[id=1039, name=T1, state=RUNNABLE, group=TGRP-TestLatLonPointQueries]

Stack Trace:
com.carrotsearch.randomizedtesting.UncaughtExceptionError: Captured an uncaught exception
in thread: Thread[id=1039, name=T1, state=RUNNABLE, group=TGRP-TestLatLonPointQueries]
Caused by: java.lang.AssertionError: some hits were wrong
	at __randomizedtesting.SeedInfo.seed([335C0EA08513A80]:0)
	at org.junit.Assert.fail(Assert.java:93)
	at org.apache.lucene.util.BaseGeoPointTestCase$VerifyHits.test(BaseGeoPointTestCase.java:552)
	at org.apache.lucene.util.BaseGeoPointTestCase$2._run(BaseGeoPointTestCase.java:756)
	at org.apache.lucene.util.BaseGeoPointTestCase$2.run(BaseGeoPointTestCase.java:623)




Build Log:
[...truncated 8314 lines...]
   [junit4] Suite: org.apache.lucene.search.TestLatLonPointQueries
   [junit4]   1> T1: id=928666 should match but did not
   [junit4]   1>   small=true query=PointInRectQuery:field=point: Lower Left: [-108.58928647246785,41.448217512539905]
Upper Right: [-108.0651864368011,41.57342302901563] docID=928666
   [junit4]   1>   lat=41.496269830391974 lon=-108.0651864822488
   [junit4]   1>   deleted?=false
   [junit4]   2> ene 22, 2016 12:49:12 AM com.carrotsearch.randomizedtesting.RandomizedRunner$QueueUncaughtExceptionsHandler
uncaughtException
   [junit4]   2> WARNING: Uncaught exception in thread: Thread[T1,5,TGRP-TestLatLonPointQueries]
   [junit4]   2> java.lang.AssertionError: some hits were wrong
   [junit4]   2> 	at __randomizedtesting.SeedInfo.seed([335C0EA08513A80]:0)
   [junit4]   2> 	at org.junit.Assert.fail(Assert.java:93)
   [junit4]   2> 	at org.apache.lucene.util.BaseGeoPointTestCase$VerifyHits.test(BaseGeoPointTestCase.java:552)
   [junit4]   2> 	at org.apache.lucene.util.BaseGeoPointTestCase$2._run(BaseGeoPointTestCase.java:756)
   [junit4]   2> 	at org.apache.lucene.util.BaseGeoPointTestCase$2.run(BaseGeoPointTestCase.java:623)
   [junit4]   2> 
   [junit4]   2> NOTE: download the large Jenkins line-docs file by running 'ant get-jenkins-line-docs'
in the lucene directory.
   [junit4]   2> NOTE: reproduce with: ant test  -Dtestcase=TestLatLonPointQueries -Dtests.method=testRandomBig
-Dtests.seed=335C0EA08513A80 -Dtests.multiplier=2 -Dtests.nightly=true -Dtests.slow=true -Dtests.linedocsfile=/x1/jenkins/lucene-data/enwiki.random.lines.txt
-Dtests.locale=es-AR -Dtests.timezone=America/Cambridge_Bay -Dtests.asserts=true -Dtests.file.encoding=UTF-8
   [junit4] ERROR   26.5s J1 | TestLatLonPointQueries.testRandomBig <<<
   [junit4]    > Throwable #1: java.lang.AssertionError
   [junit4]    > 	at org.apache.lucene.util.BaseGeoPointTestCase.verify(BaseGeoPointTestCase.java:770)
   [junit4]    > 	at org.apache.lucene.util.BaseGeoPointTestCase.doTestRandom(BaseGeoPointTestCase.java:411)
   [junit4]    > 	at org.apache.lucene.util.BaseGeoPointTestCase.testRandomBig(BaseGeoPointTestCase.java:340)
   [junit4]    > 	at java.lang.Thread.run(Thread.java:745)Throwable #2: com.carrotsearch.randomizedtesting.UncaughtExceptionError:
Captured an uncaught exception in thread: Thread[id=1039, name=T1, state=RUNNABLE, group=TGRP-TestLatLonPointQueries]
   [junit4]    > Caused by: java.lang.AssertionError: some hits were wrong
   [junit4]    > 	at __randomizedtesting.SeedInfo.seed([335C0EA08513A80]:0)
   [junit4]    > 	at org.apache.lucene.util.BaseGeoPointTestCase$VerifyHits.test(BaseGeoPointTestCase.java:552)
   [junit4]    > 	at org.apache.lucene.util.BaseGeoPointTestCase$2._run(BaseGeoPointTestCase.java:756)
   [junit4]    > 	at org.apache.lucene.util.BaseGeoPointTestCase$2.run(BaseGeoPointTestCase.java:623)
   [junit4]   2> NOTE: leaving temporary files on disk at: /x1/jenkins/jenkins-slave/workspace/Lucene-Solr-NightlyTests-trunk/lucene/build/sandbox/test/J1/temp/lucene.search.TestLatLonPointQueries_335C0EA08513A80-001
   [junit4]   2> NOTE: test params are: codec=Asserting(Lucene60): {id=PostingsFormat(name=Memory
doPackFST= true)}, docValues:{id=DocValuesFormat(name=Direct)}, sim=RandomSimilarity(queryNorm=false,coord=no):
{}, locale=es-AR, timezone=America/Cambridge_Bay
   [junit4]   2> NOTE: Linux 3.13.0-52-generic amd64/Oracle Corporation 1.8.0_66 (64-bit)/cpus=4,threads=1,free=86838928,total=228589568
   [junit4]   2> NOTE: All tests run in this JVM: [TestSlowFuzzyQuery2, TestPayloadSpanUtil,
TestFieldCacheTermsFilter, TestDocValuesNumbersQuery, TestDocValuesRangeQuery, TestDocValuesTermsQuery,
TestLatLonPointQueries]
   [junit4] Completed [9/13 (1!)] on J1 in 104.77s, 8 tests, 1 error <<< FAILURES!

[...truncated 13 lines...]
   [junit4] Suite: org.apache.lucene.search.TestGeoPointQuery
   [junit4]   1> CheckIndex failed
   [junit4]   1> Segments file=segments_1 numSegments=8 version=6.0.0 id=etcgpxshkea2z7orwh2vgtbkl
format=
   [junit4]   1>   1 of 8: name=_b maxDoc=649861
   [junit4]   1>     version=6.0.0
   [junit4]   1>     id=etcgpxshkea2z7orwh2vgtbke
   [junit4]   1>     codec=Asserting(Lucene60)
   [junit4]   1>     compound=false
   [junit4]   1>     numFiles=13
   [junit4]   1>     size (MB)=35.048
   [junit4]   1>     diagnostics = {os=Linux, java.vendor=Oracle Corporation, java.version=1.8.0_66,
java.vm.version=25.66-b17, lucene.version=6.0.0, mergeMaxNumSegments=-1, os.arch=amd64, java.runtime.version=1.8.0_66-b17,
source=merge, mergeFactor=10, os.version=3.13.0-52-generic, timestamp=1453448940180}
   [junit4]   1>     has deletions [delGen=1]
   [junit4]   1>     test: open reader.........FAILED
   [junit4]   1>     WARNING: exorciseIndex() would remove reference to this segment; full
exception:
   [junit4]   1> java.lang.OutOfMemoryError: Java heap space
   [junit4]   1> 	at org.apache.lucene.util.ArrayUtil.grow(ArrayUtil.java:354)
   [junit4]   1> 	at org.apache.lucene.codecs.memory.DirectPostingsFormat$DirectField.<init>(DirectPostingsFormat.java:352)
   [junit4]   1> 	at org.apache.lucene.codecs.memory.DirectPostingsFormat$DirectFields.<init>(DirectPostingsFormat.java:130)
   [junit4]   1> 	at org.apache.lucene.codecs.memory.DirectPostingsFormat.fieldsProducer(DirectPostingsFormat.java:114)
   [junit4]   1> 	at org.apache.lucene.codecs.perfield.PerFieldPostingsFormat$FieldsReader.<init>(PerFieldPostingsFormat.java:261)
   [junit4]   1> 	at org.apache.lucene.codecs.perfield.PerFieldPostingsFormat.fieldsProducer(PerFieldPostingsFormat.java:341)
   [junit4]   1> 	at org.apache.lucene.index.SegmentCoreReaders.<init>(SegmentCoreReaders.java:106)
   [junit4]   1> 	at org.apache.lucene.index.SegmentReader.<init>(SegmentReader.java:66)
   [junit4]   1> 	at org.apache.lucene.index.CheckIndex.checkIndex(CheckIndex.java:668)
   [junit4]   1> 	at org.apache.lucene.util.TestUtil.checkIndex(TestUtil.java:276)
   [junit4]   1> 	at org.apache.lucene.util.TestUtil.checkIndex(TestUtil.java:263)
   [junit4]   1> 	at org.apache.lucene.store.BaseDirectoryWrapper.close(BaseDirectoryWrapper.java:46)
   [junit4]   1> 	at org.apache.lucene.util.IOUtils.close(IOUtils.java:89)
   [junit4]   1> 	at org.apache.lucene.util.IOUtils.close(IOUtils.java:76)
   [junit4]   1> 	at org.apache.lucene.util.BaseGeoPointTestCase.verify(BaseGeoPointTestCase.java:769)
   [junit4]   1> 	at org.apache.lucene.util.BaseGeoPointTestCase.doTestRandom(BaseGeoPointTestCase.java:411)
   [junit4]   1> 	at org.apache.lucene.util.BaseGeoPointTestCase.testRandomBig(BaseGeoPointTestCase.java:340)
   [junit4]   1> 	at sun.reflect.NativeMethodAccessorImpl.invoke0(Native Method)
   [junit4]   1> 	at sun.reflect.NativeMethodAccessorImpl.invoke(NativeMethodAccessorImpl.java:62)
   [junit4]   1> 	at sun.reflect.DelegatingMethodAccessorImpl.invoke(DelegatingMethodAccessorImpl.java:43)
   [junit4]   1> 	at java.lang.reflect.Method.invoke(Method.java:497)
   [junit4]   1> 	at com.carrotsearch.randomizedtesting.RandomizedRunner.invoke(RandomizedRunner.java:1764)
   [junit4]   1> 	at com.carrotsearch.randomizedtesting.RandomizedRunner$8.evaluate(RandomizedRunner.java:871)
   [junit4]   1> 	at com.carrotsearch.randomizedtesting.RandomizedRunner$9.evaluate(RandomizedRunner.java:907)
   [junit4]   1> 	at com.carrotsearch.randomizedtesting.RandomizedRunner$10.evaluate(RandomizedRunner.java:921)
   [junit4]   1> 	at org.apache.lucene.util.TestRuleSetupTeardownChained$1.evaluate(TestRuleSetupTeardownChained.java:50)
   [junit4]   1> 	at org.apache.lucene.util.AbstractBeforeAfterRule$1.evaluate(AbstractBeforeAfterRule.java:46)
   [junit4]   1> 	at org.apache.lucene.util.TestRuleThreadAndTestName$1.evaluate(TestRuleThreadAndTestName.java:49)
   [junit4]   1> 	at org.apache.lucene.util.TestRuleIgnoreAfterMaxFailures$1.evaluate(TestRuleIgnoreAfterMaxFailures.java:65)
   [junit4]   1> 	at org.apache.lucene.util.TestRuleMarkFailure$1.evaluate(TestRuleMarkFailure.java:48)
   [junit4]   1> 	at com.carrotsearch.randomizedtesting.rules.StatementAdapter.evaluate(StatementAdapter.java:36)
   [junit4]   1> 	at com.carrotsearch.randomizedtesting.ThreadLeakControl$StatementRunner.run(ThreadLeakControl.java:367)
   [junit4]   1> 
   [junit4]   1>   2 of 8: name=_a maxDoc=65536
   [junit4]   1>     version=6.0.0
   [junit4]   1>     id=etcgpxshkea2z7orwh2vgtbkd
   [junit4]   1>     codec=Asserting(Lucene60)
   [junit4]   1>     compound=true
   [junit4]   1>     numFiles=4
   [junit4]   1>     size (MB)=3.687
   [junit4]   1>     diagnostics = {java.runtime.version=1.8.0_66-b17, java.vendor=Oracle
Corporation, java.version=1.8.0_66, java.vm.version=25.66-b17, lucene.version=6.0.0, os=Linux,
os.arch=amd64, os.version=3.13.0-52-generic, source=flush, timestamp=1453448940516}
   [junit4]   1>     has deletions [delGen=2]
   [junit4]   1>     test: open reader.........OK [took 0.854 sec]
   [junit4]   1>     test: check integrity.....OK [took 0.001 sec]
   [junit4]   1>     test: check live docs.....OK [291 deleted docs] [took 0.005 sec]
   [junit4]   1>     test: field infos.........OK [2 fields] [took 0.000 sec]
   [junit4]   1>     test: field norms.........OK [0 fields] [took 0.000 sec]
   [junit4]   1>     test: terms, freq, prox...OK [317611 terms; 560189 terms/docs pairs;
0 tokens] [took 0.072 sec]
   [junit4]   1>     test: stored fields.......OK [0 total field count; avg 0.0 fields
per doc] [took 0.011 sec]
   [junit4]   1>     test: term vectors........OK [0 total term vector count; avg 0.0 term/freq
vector fields per doc] [took 0.000 sec]
   [junit4]   1>     test: docvalues...........OK [2 docvalues fields; 0 BINARY; 1 NUMERIC;
0 SORTED; 1 SORTED_NUMERIC; 0 SORTED_SET] [took 0.007 sec]
   [junit4]   1> 
   [junit4]   1>   3 of 8: name=_c maxDoc=65536
   [junit4]   1>     version=6.0.0
   [junit4]   1>     id=etcgpxshkea2z7orwh2vgtbkf
   [junit4]   1>     codec=Asserting(Lucene60)
   [junit4]   1>     compound=true
   [junit4]   1>     numFiles=4
   [junit4]   1>     size (MB)=3.691
   [junit4]   1>     diagnostics = {java.runtime.version=1.8.0_66-b17, java.vendor=Oracle
Corporation, java.version=1.8.0_66, java.vm.version=25.66-b17, lucene.version=6.0.0, os=Linux,
os.arch=amd64, os.version=3.13.0-52-generic, source=flush, timestamp=1453448942102}
   [junit4]   1>     has deletions [delGen=2]
   [junit4]   1>     test: open reader.........OK [took 0.890 sec]
   [junit4]   1>     test: check integrity.....OK [took 0.001 sec]
   [junit4]   1>     test: check live docs.....OK [254 deleted docs] [took 0.001 sec]
   [junit4]   1>     test: field infos.........OK [2 fields] [took 0.000 sec]
   [junit4]   1>     test: field norms.........OK [0 fields] [took 0.000 sec]
   [junit4]   1>     test: terms, freq, prox...OK [318161 terms; 561154 terms/docs pairs;
0 tokens] [took 0.076 sec]
   [junit4]   1>     test: stored fields.......OK [0 total field count; avg 0.0 fields
per doc] [took 0.010 sec]
   [junit4]   1>     test: term vectors........OK [0 total term vector count; avg 0.0 term/freq
vector fields per doc] [took 0.000 sec]
   [junit4]   1>     test: docvalues...........OK [2 docvalues fields; 0 BINARY; 1 NUMERIC;
0 SORTED; 1 SORTED_NUMERIC; 0 SORTED_SET] [took 0.005 sec]
   [junit4]   1> 
   [junit4]   1>   4 of 8: name=_d maxDoc=65536
   [junit4]   1>     version=6.0.0
   [junit4]   1>     id=etcgpxshkea2z7orwh2vgtbkg
   [junit4]   1>     codec=Asserting(Lucene60)
   [junit4]   1>     compound=true
   [junit4]   1>     numFiles=4
   [junit4]   1>     size (MB)=3.69
   [junit4]   1>     diagnostics = {java.runtime.version=1.8.0_66-b17, java.vendor=Oracle
Corporation, java.version=1.8.0_66, java.vm.version=25.66-b17, lucene.version=6.0.0, os=Linux,
os.arch=amd64, os.version=3.13.0-52-generic, source=flush, timestamp=1453448943309}
   [junit4]   1>     has deletions [delGen=2]
   [junit4]   1>     test: open reader.........OK [took 0.848 sec]
   [junit4]   1>     test: check integrity.....OK [took 0.001 sec]
   [junit4]   1>     test: check live docs.....OK [179 deleted docs] [took 0.001 sec]
   [junit4]   1>     test: field infos.........OK [2 fields] [took 0.000 sec]
   [junit4]   1>     test: field norms.........OK [0 fields] [took 0.000 sec]
   [junit4]   1>     test: terms, freq, prox...OK [318500 terms; 561485 terms/docs pairs;
0 tokens] [took 0.070 sec]
   [junit4]   1>     test: stored fields.......OK [0 total field count; avg 0.0 fields
per doc] [took 0.004 sec]
   [junit4]   1>     test: term vectors........OK [0 total term vector count; avg 0.0 term/freq
vector fields per doc] [took 0.000 sec]
   [junit4]   1>     test: docvalues...........OK [2 docvalues fields; 0 BINARY; 1 NUMERIC;
0 SORTED; 1 SORTED_NUMERIC; 0 SORTED_SET] [took 0.005 sec]
   [junit4]   1> 
   [junit4]   1>   5 of 8: name=_e maxDoc=65536
   [junit4]   1>     version=6.0.0
   [junit4]   1>     id=etcgpxshkea2z7orwh2vgtbkh
   [junit4]   1>     codec=Asserting(Lucene60)
   [junit4]   1>     compound=true
   [junit4]   1>     numFiles=4
   [junit4]   1>     size (MB)=3.693
   [junit4]   1>     diagnostics = {java.runtime.version=1.8.0_66-b17, java.vendor=Oracle
Corporation, java.version=1.8.0_66, java.vm.version=25.66-b17, lucene.version=6.0.0, os=Linux,
os.arch=amd64, os.version=3.13.0-52-generic, source=flush, timestamp=1453448944900}
   [junit4]   1>     has deletions [delGen=2]
   [junit4]   1>     test: open reader.........OK [took 0.866 sec]
   [junit4]   1>     test: check integrity.....OK [took 0.001 sec]
   [junit4]   1>     test: check live docs.....OK [128 deleted docs] [took 0.001 sec]
   [junit4]   1>     test: field infos.........OK [2 fields] [took 0.000 sec]
   [junit4]   1>     test: field norms.........OK [0 fields] [took 0.000 sec]
   [junit4]   1>     test: terms, freq, prox...OK [319079 terms; 562656 terms/docs pairs;
0 tokens] [took 0.078 sec]
   [junit4]   1>     test: stored fields.......OK [0 total field count; avg 0.0 fields
per doc] [took 0.006 sec]
   [junit4]   1>     test: term vectors........OK [0 total term vector count; avg 0.0 term/freq
vector fields per doc] [took 0.000 sec]
   [junit4]   1>     test: docvalues...........OK [2 docvalues fields; 0 BINARY; 1 NUMERIC;
0 SORTED; 1 SORTED_NUMERIC; 0 SORTED_SET] [took 0.006 sec]
   [junit4]   1> 
   [junit4]   1>   6 of 8: name=_f maxDoc=65536
   [junit4]   1>     version=6.0.0
   [junit4]   1>     id=etcgpxshkea2z7orwh2vgtbki
   [junit4]   1>     codec=Asserting(Lucene60)
   [junit4]   1>     compound=true
   [junit4]   1>     numFiles=4
   [junit4]   1>     size (MB)=3.692
   [junit4]   1>     diagnostics = {java.runtime.version=1.8.0_66-b17, java.vendor=Oracle
Corporation, java.version=1.8.0_66, java.vm.version=25.66-b17, lucene.version=6.0.0, os=Linux,
os.arch=amd64, os.version=3.13.0-52-generic, source=flush, timestamp=1453448946539}
   [junit4]   1>     has deletions [delGen=2]
   [junit4]   1>     test: open reader.........OK [took 0.791 sec]
   [junit4]   1>     test: check integrity.....OK [took 0.001 sec]
   [junit4]   1>     test: check live docs.....OK [68 deleted docs] [took 0.001 sec]
   [junit4]   1>     test: field infos.........OK [2 fields] [took 0.000 sec]
   [junit4]   1>     test: field norms.........OK [0 fields] [took 0.000 sec]
   [junit4]   1>     test: terms, freq, prox...OK [319223 terms; 562636 terms/docs pairs;
0 tokens] [took 0.070 sec]
   [junit4]   1>     test: stored fields.......OK [0 total field count; avg 0.0 fields
per doc] [took 0.003 sec]
   [junit4]   1>     test: term vectors........OK [0 total term vector count; avg 0.0 term/freq
vector fields per doc] [took 0.000 sec]
   [junit4]   1>     test: docvalues...........OK [2 docvalues fields; 0 BINARY; 1 NUMERIC;
0 SORTED; 1 SORTED_NUMERIC; 0 SORTED_SET] [took 0.005 sec]
   [junit4]   1> 
   [junit4]   1>   7 of 8: name=_g maxDoc=65536
   [junit4]   1>     version=6.0.0
   [junit4]   1>     id=etcgpxshkea2z7orwh2vgtbkj
   [junit4]   1>     codec=Asserting(Lucene60)
   [junit4]   1>     compound=true
   [junit4]   1>     numFiles=4
   [junit4]   1>     size (MB)=3.694
   [junit4]   1>     diagnostics = {java.runtime.version=1.8.0_66-b17, java.vendor=Oracle
Corporation, java.version=1.8.0_66, java.vm.version=25.66-b17, lucene.version=6.0.0, os=Linux,
os.arch=amd64, os.version=3.13.0-52-generic, source=flush, timestamp=1453448948108}
   [junit4]   1>     has deletions [delGen=2]
   [junit4]   1>     test: open reader.........OK [took 0.807 sec]
   [junit4]   1>     test: check integrity.....OK [took 0.001 sec]
   [junit4]   1>     test: check live docs.....OK [24 deleted docs] [took 0.000 sec]
   [junit4]   1>     test: field infos.........OK [2 fields] [took 0.000 sec]
   [junit4]   1>     test: field norms.........OK [0 fields] [took 0.000 sec]
   [junit4]   1>     test: terms, freq, prox...OK [319652 terms; 563512 terms/docs pairs;
0 tokens] [took 0.072 sec]
   [junit4]   1>     test: stored fields.......OK [0 total field count; avg 0.0 fields
per doc] [took 0.004 sec]
   [junit4]   1>     test: term vectors........OK [0 total term vector count; avg 0.0 term/freq
vector fields per doc] [took 0.000 sec]
   [junit4]   1>     test: docvalues...........OK [2 docvalues fields; 0 BINARY; 1 NUMERIC;
0 SORTED; 1 SORTED_NUMERIC; 0 SORTED_SET] [took 0.005 sec]
   [junit4]   1> 
   [junit4]   1>   8 of 8: name=_h maxDoc=27142
   [junit4]   1>     version=6.0.0
   [junit4]   1>     id=etcgpxshkea2z7orwh2vgtbkk
   [junit4]   1>     codec=Asserting(Lucene60)
   [junit4]   1>     compound=true
   [junit4]   1>     numFiles=4
   [junit4]   1>     size (MB)=1.515
   [junit4]   1>     diagnostics = {java.runtime.version=1.8.0_66-b17, java.vendor=Oracle
Corporation, java.version=1.8.0_66, java.vm.version=25.66-b17, lucene.version=6.0.0, os=Linux,
os.arch=amd64, os.version=3.13.0-52-generic, source=flush, timestamp=1453448948661}
   [junit4]   1>     has deletions [delGen=1]
   [junit4]   1>     test: open reader.........OK [took 0.763 sec]
   [junit4]   1>     test: check integrity.....OK [took 0.001 sec]
   [junit4]   1>     test: check live docs.....OK [1 deleted docs] [took 0.000 sec]
   [junit4]   1>     test: field infos.........OK [2 fields] [took 0.000 sec]
   [junit4]   1>     test: field norms.........OK [0 fields] [took 0.000 sec]
   [junit4]   1>     test: terms, freq, prox...OK [136320 terms; 233765 terms/docs pairs;
0 tokens] [took 0.033 sec]
   [junit4]   1>     test: stored fields.......OK [0 total field count; avg 0.0 fields
per doc] [took 0.011 sec]
   [junit4]   1>     test: term vectors........OK [0 total term vector count; avg 0.0 term/freq
vector fields per doc] [took 0.000 sec]
   [junit4]   1>     test: docvalues...........OK [2 docvalues fields; 0 BINARY; 1 NUMERIC;
0 SORTED; 1 SORTED_NUMERIC; 0 SORTED_SET] [took 0.002 sec]
   [junit4]   1> 
   [junit4]   1> WARNING: 1 broken segments (containing 649861 documents) detected
   [junit4]   1> Took 13.932 sec total.
   [junit4]   1> 
   [junit4]   2> NOTE: download the large Jenkins line-docs file by running 'ant get-jenkins-line-docs'
in the lucene directory.
   [junit4]   2> NOTE: reproduce with: ant test  -Dtestcase=TestGeoPointQuery -Dtests.method=testRandomBig
-Dtests.seed=335C0EA08513A80 -Dtests.multiplier=2 -Dtests.nightly=true -Dtests.slow=true -Dtests.linedocsfile=/x1/jenkins/lucene-data/enwiki.random.lines.txt
-Dtests.locale=ar-SY -Dtests.timezone=America/Guyana -Dtests.asserts=true -Dtests.file.encoding=UTF-8
   [junit4] ERROR    607s J2 | TestGeoPointQuery.testRandomBig <<<
   [junit4]    > Throwable #1: java.lang.RuntimeException: CheckIndex failed
   [junit4]    > 	at __randomizedtesting.SeedInfo.seed([335C0EA08513A80:8462BD6599084600]:0)
   [junit4]    > 	at org.apache.lucene.util.TestUtil.checkIndex(TestUtil.java:281)
   [junit4]    > 	at org.apache.lucene.util.TestUtil.checkIndex(TestUtil.java:263)
   [junit4]    > 	at org.apache.lucene.store.BaseDirectoryWrapper.close(BaseDirectoryWrapper.java:46)
   [junit4]    > 	at org.apache.lucene.util.IOUtils.close(IOUtils.java:89)
   [junit4]    > 	at org.apache.lucene.util.IOUtils.close(IOUtils.java:76)
   [junit4]    > 	at org.apache.lucene.util.BaseGeoPointTestCase.verify(BaseGeoPointTestCase.java:769)
   [junit4]    > 	at org.apache.lucene.util.BaseGeoPointTestCase.doTestRandom(BaseGeoPointTestCase.java:411)
   [junit4]    > 	at org.apache.lucene.util.BaseGeoPointTestCase.testRandomBig(BaseGeoPointTestCase.java:340)
   [junit4]    > 	at java.lang.Thread.run(Thread.java:745)
   [junit4]   2> NOTE: leaving temporary files on disk at: /x1/jenkins/jenkins-slave/workspace/Lucene-Solr-NightlyTests-trunk/lucene/build/sandbox/test/J2/temp/lucene.search.TestGeoPointQuery_335C0EA08513A80-001
   [junit4]   2> NOTE: test params are: codec=Asserting(Lucene60): {string=PostingsFormat(name=Memory
doPackFST= false), id=PostingsFormat(name=Memory doPackFST= false), point=PostingsFormat(name=Direct)},
docValues:{id=DocValuesFormat(name=Lucene54), point=DocValuesFormat(name=Memory)}, sim=RandomSimilarity(queryNorm=true,coord=no):
{}, locale=ar-SY, timezone=America/Guyana
   [junit4]   2> NOTE: Linux 3.13.0-52-generic amd64/Oracle Corporation 1.8.0_66 (64-bit)/cpus=4,threads=1,free=94344592,total=477626368
   [junit4]   2> NOTE: All tests run in this JVM: [TestGeoPointQuery]
   [junit4] Completed [11/13 (2!)] on J2 in 715.56s, 23 tests, 1 error <<< FAILURES!

[...truncated 7 lines...]
   [junit4] JVM J2: stdout was not empty, see: /x1/jenkins/jenkins-slave/workspace/Lucene-Solr-NightlyTests-trunk/lucene/build/sandbox/test/temp/junit4-J2-20160122_074649_374.sysout
   [junit4] >>> JVM J2 emitted unexpected output (verbatim) ----
   [junit4] java.lang.OutOfMemoryError: Java heap space
   [junit4] Dumping heap to /x1/jenkins/jenkins-slave/workspace/Lucene-Solr-NightlyTests-trunk/heapdumps/java_pid29783.hprof
...
   [junit4] Heap dump file created [545413465 bytes in 3.359 secs]
   [junit4] <<< JVM J2: EOF ----

[...truncated 11 lines...]
BUILD FAILED
/x1/jenkins/jenkins-slave/workspace/Lucene-Solr-NightlyTests-trunk/build.xml:791: The following
error occurred while executing this line:
/x1/jenkins/jenkins-slave/workspace/Lucene-Solr-NightlyTests-trunk/build.xml:728: The following
error occurred while executing this line:
/x1/jenkins/jenkins-slave/workspace/Lucene-Solr-NightlyTests-trunk/build.xml:59: The following
error occurred while executing this line:
/x1/jenkins/jenkins-slave/workspace/Lucene-Solr-NightlyTests-trunk/lucene/build.xml:472: The
following error occurred while executing this line:
/x1/jenkins/jenkins-slave/workspace/Lucene-Solr-NightlyTests-trunk/lucene/common-build.xml:2154:
The following error occurred while executing this line:
/x1/jenkins/jenkins-slave/workspace/Lucene-Solr-NightlyTests-trunk/lucene/module-build.xml:58:
The following error occurred while executing this line:
/x1/jenkins/jenkins-slave/workspace/Lucene-Solr-NightlyTests-trunk/lucene/common-build.xml:1424:
The following error occurred while executing this line:
/x1/jenkins/jenkins-slave/workspace/Lucene-Solr-NightlyTests-trunk/lucene/common-build.xml:981:
There were test failures: 13 suites, 97 tests, 2 errors [seed: 335C0EA08513A80]

Total time: 178 minutes 9 seconds
Build step 'Invoke Ant' marked build as failure
Archiving artifacts
No prior successful build to compare, so performing full copy of artifacts
Recording test results
Email was triggered for: Failure - Any
Sending email for trigger: Failure - Any



Mime
View raw message