lucene-dev mailing list archives

Site index · List index
Message view « Date » · « Thread »
Top « Date » · « Thread »
From Policeman Jenkins Server <jenk...@thetaphi.de>
Subject [JENKINS] Lucene-Solr-trunk-Solaris (64bit/jdk1.8.0) - Build # 332 - Still Failing!
Date Wed, 13 Jan 2016 16:01:50 GMT
Build: http://jenkins.thetaphi.de/job/Lucene-Solr-trunk-Solaris/332/
Java: 64bit/jdk1.8.0 -XX:-UseCompressedOops -XX:+UseParallelGC

3 tests failed.
FAILED:  org.apache.solr.cloud.CollectionsAPIDistributedZkTest.test

Error Message:
Error from server at http://127.0.0.1:64992/_/ii/awholynewcollection_0: non ok status: 500, message:Server Error

Stack Trace:
org.apache.solr.client.solrj.impl.HttpSolrClient$RemoteSolrException: Error from server at http://127.0.0.1:64992/_/ii/awholynewcollection_0: non ok status: 500, message:Server Error
	at __randomizedtesting.SeedInfo.seed([29A54686BD207A15:A1F1795C13DC17ED]:0)
	at org.apache.solr.client.solrj.impl.HttpSolrClient.executeMethod(HttpSolrClient.java:509)
	at org.apache.solr.client.solrj.impl.HttpSolrClient.request(HttpSolrClient.java:240)
	at org.apache.solr.client.solrj.impl.HttpSolrClient.request(HttpSolrClient.java:229)
	at org.apache.solr.client.solrj.SolrRequest.process(SolrRequest.java:150)
	at org.apache.solr.client.solrj.SolrClient.query(SolrClient.java:943)
	at org.apache.solr.client.solrj.SolrClient.query(SolrClient.java:958)
	at org.apache.solr.cloud.AbstractFullDistribZkTestBase.waitForNon403or404or503(AbstractFullDistribZkTestBase.java:1774)
	at org.apache.solr.cloud.CollectionsAPIDistributedZkTest.testCollectionsAPI(CollectionsAPIDistributedZkTest.java:664)
	at org.apache.solr.cloud.CollectionsAPIDistributedZkTest.test(CollectionsAPIDistributedZkTest.java:160)
	at sun.reflect.NativeMethodAccessorImpl.invoke0(Native Method)
	at sun.reflect.NativeMethodAccessorImpl.invoke(NativeMethodAccessorImpl.java:62)
	at sun.reflect.DelegatingMethodAccessorImpl.invoke(DelegatingMethodAccessorImpl.java:43)
	at java.lang.reflect.Method.invoke(Method.java:497)
	at com.carrotsearch.randomizedtesting.RandomizedRunner.invoke(RandomizedRunner.java:1764)
	at com.carrotsearch.randomizedtesting.RandomizedRunner$8.evaluate(RandomizedRunner.java:871)
	at com.carrotsearch.randomizedtesting.RandomizedRunner$9.evaluate(RandomizedRunner.java:907)
	at com.carrotsearch.randomizedtesting.RandomizedRunner$10.evaluate(RandomizedRunner.java:921)
	at org.apache.solr.BaseDistributedSearchTestCase$ShardsRepeatRule$ShardsFixedStatement.callStatement(BaseDistributedSearchTestCase.java:965)
	at org.apache.solr.BaseDistributedSearchTestCase$ShardsRepeatRule$ShardsStatement.evaluate(BaseDistributedSearchTestCase.java:940)
	at com.carrotsearch.randomizedtesting.rules.SystemPropertiesRestoreRule$1.evaluate(SystemPropertiesRestoreRule.java:57)
	at org.apache.lucene.util.TestRuleSetupTeardownChained$1.evaluate(TestRuleSetupTeardownChained.java:50)
	at org.apache.lucene.util.AbstractBeforeAfterRule$1.evaluate(AbstractBeforeAfterRule.java:46)
	at org.apache.lucene.util.TestRuleThreadAndTestName$1.evaluate(TestRuleThreadAndTestName.java:49)
	at org.apache.lucene.util.TestRuleIgnoreAfterMaxFailures$1.evaluate(TestRuleIgnoreAfterMaxFailures.java:65)
	at org.apache.lucene.util.TestRuleMarkFailure$1.evaluate(TestRuleMarkFailure.java:48)
	at com.carrotsearch.randomizedtesting.rules.StatementAdapter.evaluate(StatementAdapter.java:36)
	at com.carrotsearch.randomizedtesting.ThreadLeakControl$StatementRunner.run(ThreadLeakControl.java:367)
	at com.carrotsearch.randomizedtesting.ThreadLeakControl.forkTimeoutingTask(ThreadLeakControl.java:809)
	at com.carrotsearch.randomizedtesting.ThreadLeakControl$3.evaluate(ThreadLeakControl.java:460)
	at com.carrotsearch.randomizedtesting.RandomizedRunner.runSingleTest(RandomizedRunner.java:880)
	at com.carrotsearch.randomizedtesting.RandomizedRunner$5.evaluate(RandomizedRunner.java:781)
	at com.carrotsearch.randomizedtesting.RandomizedRunner$6.evaluate(RandomizedRunner.java:816)
	at com.carrotsearch.randomizedtesting.RandomizedRunner$7.evaluate(RandomizedRunner.java:827)
	at com.carrotsearch.randomizedtesting.rules.StatementAdapter.evaluate(StatementAdapter.java:36)
	at com.carrotsearch.randomizedtesting.rules.SystemPropertiesRestoreRule$1.evaluate(SystemPropertiesRestoreRule.java:57)
	at org.apache.lucene.util.AbstractBeforeAfterRule$1.evaluate(AbstractBeforeAfterRule.java:46)
	at com.carrotsearch.randomizedtesting.rules.StatementAdapter.evaluate(StatementAdapter.java:36)
	at org.apache.lucene.util.TestRuleStoreClassName$1.evaluate(TestRuleStoreClassName.java:42)
	at com.carrotsearch.randomizedtesting.rules.NoShadowingOrOverridesOnMethodsRule$1.evaluate(NoShadowingOrOverridesOnMethodsRule.java:40)
	at com.carrotsearch.randomizedtesting.rules.NoShadowingOrOverridesOnMethodsRule$1.evaluate(NoShadowingOrOverridesOnMethodsRule.java:40)
	at com.carrotsearch.randomizedtesting.rules.StatementAdapter.evaluate(StatementAdapter.java:36)
	at com.carrotsearch.randomizedtesting.rules.StatementAdapter.evaluate(StatementAdapter.java:36)
	at com.carrotsearch.randomizedtesting.rules.StatementAdapter.evaluate(StatementAdapter.java:36)
	at org.apache.lucene.util.TestRuleAssertionsRequired$1.evaluate(TestRuleAssertionsRequired.java:54)
	at org.apache.lucene.util.TestRuleMarkFailure$1.evaluate(TestRuleMarkFailure.java:48)
	at org.apache.lucene.util.TestRuleIgnoreAfterMaxFailures$1.evaluate(TestRuleIgnoreAfterMaxFailures.java:65)
	at org.apache.lucene.util.TestRuleIgnoreTestSuites$1.evaluate(TestRuleIgnoreTestSuites.java:55)
	at com.carrotsearch.randomizedtesting.rules.StatementAdapter.evaluate(StatementAdapter.java:36)
	at com.carrotsearch.randomizedtesting.ThreadLeakControl$StatementRunner.run(ThreadLeakControl.java:367)
	at java.lang.Thread.run(Thread.java:745)


FAILED:  junit.framework.TestSuite.org.apache.solr.cloud.CollectionsAPIDistributedZkTest

Error Message:
5 threads leaked from SUITE scope at org.apache.solr.cloud.CollectionsAPIDistributedZkTest:     1) Thread[id=11694, name=zkCallback-1548-thread-2, state=TIMED_WAITING, group=TGRP-CollectionsAPIDistributedZkTest]         at sun.misc.Unsafe.park(Native Method)         at java.util.concurrent.locks.LockSupport.parkNanos(LockSupport.java:215)         at java.util.concurrent.SynchronousQueue$TransferStack.awaitFulfill(SynchronousQueue.java:460)         at java.util.concurrent.SynchronousQueue$TransferStack.transfer(SynchronousQueue.java:362)         at java.util.concurrent.SynchronousQueue.poll(SynchronousQueue.java:941)         at java.util.concurrent.ThreadPoolExecutor.getTask(ThreadPoolExecutor.java:1066)         at java.util.concurrent.ThreadPoolExecutor.runWorker(ThreadPoolExecutor.java:1127)         at java.util.concurrent.ThreadPoolExecutor$Worker.run(ThreadPoolExecutor.java:617)         at java.lang.Thread.run(Thread.java:745)    2) Thread[id=9621, name=TEST-CollectionsAPIDistributedZkTest.test-seed#[29A54686BD207A15]-SendThread(127.0.0.1:53112), state=TIMED_WAITING, group=TGRP-CollectionsAPIDistributedZkTest]         at java.lang.Thread.sleep(Native Method)         at org.apache.zookeeper.ClientCnxn$SendThread.run(ClientCnxn.java:994)    3) Thread[id=9622, name=TEST-CollectionsAPIDistributedZkTest.test-seed#[29A54686BD207A15]-EventThread, state=WAITING, group=TGRP-CollectionsAPIDistributedZkTest]         at sun.misc.Unsafe.park(Native Method)         at java.util.concurrent.locks.LockSupport.park(LockSupport.java:175)         at java.util.concurrent.locks.AbstractQueuedSynchronizer$ConditionObject.await(AbstractQueuedSynchronizer.java:2039)         at java.util.concurrent.LinkedBlockingQueue.take(LinkedBlockingQueue.java:442)         at org.apache.zookeeper.ClientCnxn$EventThread.run(ClientCnxn.java:494)    4) Thread[id=11695, name=zkCallback-1548-thread-3, state=TIMED_WAITING, group=TGRP-CollectionsAPIDistributedZkTest]         at sun.misc.Unsafe.park(Native Method)         at java.util.concurrent.locks.LockSupport.parkNanos(LockSupport.java:215)         at java.util.concurrent.SynchronousQueue$TransferStack.awaitFulfill(SynchronousQueue.java:460)         at java.util.concurrent.SynchronousQueue$TransferStack.transfer(SynchronousQueue.java:362)         at java.util.concurrent.SynchronousQueue.poll(SynchronousQueue.java:941)         at java.util.concurrent.ThreadPoolExecutor.getTask(ThreadPoolExecutor.java:1066)         at java.util.concurrent.ThreadPoolExecutor.runWorker(ThreadPoolExecutor.java:1127)         at java.util.concurrent.ThreadPoolExecutor$Worker.run(ThreadPoolExecutor.java:617)         at java.lang.Thread.run(Thread.java:745)    5) Thread[id=9623, name=zkCallback-1548-thread-1, state=TIMED_WAITING, group=TGRP-CollectionsAPIDistributedZkTest]         at sun.misc.Unsafe.park(Native Method)         at java.util.concurrent.locks.LockSupport.parkNanos(LockSupport.java:215)         at java.util.concurrent.SynchronousQueue$TransferStack.awaitFulfill(SynchronousQueue.java:460)         at java.util.concurrent.SynchronousQueue$TransferStack.transfer(SynchronousQueue.java:362)         at java.util.concurrent.SynchronousQueue.poll(SynchronousQueue.java:941)         at java.util.concurrent.ThreadPoolExecutor.getTask(ThreadPoolExecutor.java:1066)         at java.util.concurrent.ThreadPoolExecutor.runWorker(ThreadPoolExecutor.java:1127)         at java.util.concurrent.ThreadPoolExecutor$Worker.run(ThreadPoolExecutor.java:617)         at java.lang.Thread.run(Thread.java:745)

Stack Trace:
com.carrotsearch.randomizedtesting.ThreadLeakError: 5 threads leaked from SUITE scope at org.apache.solr.cloud.CollectionsAPIDistributedZkTest: 
   1) Thread[id=11694, name=zkCallback-1548-thread-2, state=TIMED_WAITING, group=TGRP-CollectionsAPIDistributedZkTest]
        at sun.misc.Unsafe.park(Native Method)
        at java.util.concurrent.locks.LockSupport.parkNanos(LockSupport.java:215)
        at java.util.concurrent.SynchronousQueue$TransferStack.awaitFulfill(SynchronousQueue.java:460)
        at java.util.concurrent.SynchronousQueue$TransferStack.transfer(SynchronousQueue.java:362)
        at java.util.concurrent.SynchronousQueue.poll(SynchronousQueue.java:941)
        at java.util.concurrent.ThreadPoolExecutor.getTask(ThreadPoolExecutor.java:1066)
        at java.util.concurrent.ThreadPoolExecutor.runWorker(ThreadPoolExecutor.java:1127)
        at java.util.concurrent.ThreadPoolExecutor$Worker.run(ThreadPoolExecutor.java:617)
        at java.lang.Thread.run(Thread.java:745)
   2) Thread[id=9621, name=TEST-CollectionsAPIDistributedZkTest.test-seed#[29A54686BD207A15]-SendThread(127.0.0.1:53112), state=TIMED_WAITING, group=TGRP-CollectionsAPIDistributedZkTest]
        at java.lang.Thread.sleep(Native Method)
        at org.apache.zookeeper.ClientCnxn$SendThread.run(ClientCnxn.java:994)
   3) Thread[id=9622, name=TEST-CollectionsAPIDistributedZkTest.test-seed#[29A54686BD207A15]-EventThread, state=WAITING, group=TGRP-CollectionsAPIDistributedZkTest]
        at sun.misc.Unsafe.park(Native Method)
        at java.util.concurrent.locks.LockSupport.park(LockSupport.java:175)
        at java.util.concurrent.locks.AbstractQueuedSynchronizer$ConditionObject.await(AbstractQueuedSynchronizer.java:2039)
        at java.util.concurrent.LinkedBlockingQueue.take(LinkedBlockingQueue.java:442)
        at org.apache.zookeeper.ClientCnxn$EventThread.run(ClientCnxn.java:494)
   4) Thread[id=11695, name=zkCallback-1548-thread-3, state=TIMED_WAITING, group=TGRP-CollectionsAPIDistributedZkTest]
        at sun.misc.Unsafe.park(Native Method)
        at java.util.concurrent.locks.LockSupport.parkNanos(LockSupport.java:215)
        at java.util.concurrent.SynchronousQueue$TransferStack.awaitFulfill(SynchronousQueue.java:460)
        at java.util.concurrent.SynchronousQueue$TransferStack.transfer(SynchronousQueue.java:362)
        at java.util.concurrent.SynchronousQueue.poll(SynchronousQueue.java:941)
        at java.util.concurrent.ThreadPoolExecutor.getTask(ThreadPoolExecutor.java:1066)
        at java.util.concurrent.ThreadPoolExecutor.runWorker(ThreadPoolExecutor.java:1127)
        at java.util.concurrent.ThreadPoolExecutor$Worker.run(ThreadPoolExecutor.java:617)
        at java.lang.Thread.run(Thread.java:745)
   5) Thread[id=9623, name=zkCallback-1548-thread-1, state=TIMED_WAITING, group=TGRP-CollectionsAPIDistributedZkTest]
        at sun.misc.Unsafe.park(Native Method)
        at java.util.concurrent.locks.LockSupport.parkNanos(LockSupport.java:215)
        at java.util.concurrent.SynchronousQueue$TransferStack.awaitFulfill(SynchronousQueue.java:460)
        at java.util.concurrent.SynchronousQueue$TransferStack.transfer(SynchronousQueue.java:362)
        at java.util.concurrent.SynchronousQueue.poll(SynchronousQueue.java:941)
        at java.util.concurrent.ThreadPoolExecutor.getTask(ThreadPoolExecutor.java:1066)
        at java.util.concurrent.ThreadPoolExecutor.runWorker(ThreadPoolExecutor.java:1127)
        at java.util.concurrent.ThreadPoolExecutor$Worker.run(ThreadPoolExecutor.java:617)
        at java.lang.Thread.run(Thread.java:745)
	at __randomizedtesting.SeedInfo.seed([29A54686BD207A15]:0)


FAILED:  junit.framework.TestSuite.org.apache.solr.cloud.CollectionsAPIDistributedZkTest

Error Message:
There are still zombie threads that couldn't be terminated:    1) Thread[id=11694, name=zkCallback-1548-thread-2, state=TIMED_WAITING, group=TGRP-CollectionsAPIDistributedZkTest]         at sun.misc.Unsafe.park(Native Method)         at java.util.concurrent.locks.LockSupport.parkNanos(LockSupport.java:215)         at java.util.concurrent.SynchronousQueue$TransferStack.awaitFulfill(SynchronousQueue.java:460)         at java.util.concurrent.SynchronousQueue$TransferStack.transfer(SynchronousQueue.java:362)         at java.util.concurrent.SynchronousQueue.poll(SynchronousQueue.java:941)         at java.util.concurrent.ThreadPoolExecutor.getTask(ThreadPoolExecutor.java:1066)         at java.util.concurrent.ThreadPoolExecutor.runWorker(ThreadPoolExecutor.java:1127)         at java.util.concurrent.ThreadPoolExecutor$Worker.run(ThreadPoolExecutor.java:617)         at java.lang.Thread.run(Thread.java:745)    2) Thread[id=9621, name=TEST-CollectionsAPIDistributedZkTest.test-seed#[29A54686BD207A15]-SendThread(127.0.0.1:53112), state=TIMED_WAITING, group=TGRP-CollectionsAPIDistributedZkTest]         at java.lang.Thread.sleep(Native Method)         at org.apache.zookeeper.ClientCnxn$SendThread.run(ClientCnxn.java:994)    3) Thread[id=11695, name=zkCallback-1548-thread-3, state=TIMED_WAITING, group=TGRP-CollectionsAPIDistributedZkTest]         at sun.misc.Unsafe.park(Native Method)         at java.util.concurrent.locks.LockSupport.parkNanos(LockSupport.java:215)         at java.util.concurrent.SynchronousQueue$TransferStack.awaitFulfill(SynchronousQueue.java:460)         at java.util.concurrent.SynchronousQueue$TransferStack.transfer(SynchronousQueue.java:362)         at java.util.concurrent.SynchronousQueue.poll(SynchronousQueue.java:941)         at java.util.concurrent.ThreadPoolExecutor.getTask(ThreadPoolExecutor.java:1066)         at java.util.concurrent.ThreadPoolExecutor.runWorker(ThreadPoolExecutor.java:1127)         at java.util.concurrent.ThreadPoolExecutor$Worker.run(ThreadPoolExecutor.java:617)         at java.lang.Thread.run(Thread.java:745)    4) Thread[id=9623, name=zkCallback-1548-thread-1, state=TIMED_WAITING, group=TGRP-CollectionsAPIDistributedZkTest]         at sun.misc.Unsafe.park(Native Method)         at java.util.concurrent.locks.LockSupport.parkNanos(LockSupport.java:215)         at java.util.concurrent.SynchronousQueue$TransferStack.awaitFulfill(SynchronousQueue.java:460)         at java.util.concurrent.SynchronousQueue$TransferStack.transfer(SynchronousQueue.java:362)         at java.util.concurrent.SynchronousQueue.poll(SynchronousQueue.java:941)         at java.util.concurrent.ThreadPoolExecutor.getTask(ThreadPoolExecutor.java:1066)         at java.util.concurrent.ThreadPoolExecutor.runWorker(ThreadPoolExecutor.java:1127)         at java.util.concurrent.ThreadPoolExecutor$Worker.run(ThreadPoolExecutor.java:617)         at java.lang.Thread.run(Thread.java:745)

Stack Trace:
com.carrotsearch.randomizedtesting.ThreadLeakError: There are still zombie threads that couldn't be terminated:
   1) Thread[id=11694, name=zkCallback-1548-thread-2, state=TIMED_WAITING, group=TGRP-CollectionsAPIDistributedZkTest]
        at sun.misc.Unsafe.park(Native Method)
        at java.util.concurrent.locks.LockSupport.parkNanos(LockSupport.java:215)
        at java.util.concurrent.SynchronousQueue$TransferStack.awaitFulfill(SynchronousQueue.java:460)
        at java.util.concurrent.SynchronousQueue$TransferStack.transfer(SynchronousQueue.java:362)
        at java.util.concurrent.SynchronousQueue.poll(SynchronousQueue.java:941)
        at java.util.concurrent.ThreadPoolExecutor.getTask(ThreadPoolExecutor.java:1066)
        at java.util.concurrent.ThreadPoolExecutor.runWorker(ThreadPoolExecutor.java:1127)
        at java.util.concurrent.ThreadPoolExecutor$Worker.run(ThreadPoolExecutor.java:617)
        at java.lang.Thread.run(Thread.java:745)
   2) Thread[id=9621, name=TEST-CollectionsAPIDistributedZkTest.test-seed#[29A54686BD207A15]-SendThread(127.0.0.1:53112), state=TIMED_WAITING, group=TGRP-CollectionsAPIDistributedZkTest]
        at java.lang.Thread.sleep(Native Method)
        at org.apache.zookeeper.ClientCnxn$SendThread.run(ClientCnxn.java:994)
   3) Thread[id=11695, name=zkCallback-1548-thread-3, state=TIMED_WAITING, group=TGRP-CollectionsAPIDistributedZkTest]
        at sun.misc.Unsafe.park(Native Method)
        at java.util.concurrent.locks.LockSupport.parkNanos(LockSupport.java:215)
        at java.util.concurrent.SynchronousQueue$TransferStack.awaitFulfill(SynchronousQueue.java:460)
        at java.util.concurrent.SynchronousQueue$TransferStack.transfer(SynchronousQueue.java:362)
        at java.util.concurrent.SynchronousQueue.poll(SynchronousQueue.java:941)
        at java.util.concurrent.ThreadPoolExecutor.getTask(ThreadPoolExecutor.java:1066)
        at java.util.concurrent.ThreadPoolExecutor.runWorker(ThreadPoolExecutor.java:1127)
        at java.util.concurrent.ThreadPoolExecutor$Worker.run(ThreadPoolExecutor.java:617)
        at java.lang.Thread.run(Thread.java:745)
   4) Thread[id=9623, name=zkCallback-1548-thread-1, state=TIMED_WAITING, group=TGRP-CollectionsAPIDistributedZkTest]
        at sun.misc.Unsafe.park(Native Method)
        at java.util.concurrent.locks.LockSupport.parkNanos(LockSupport.java:215)
        at java.util.concurrent.SynchronousQueue$TransferStack.awaitFulfill(SynchronousQueue.java:460)
        at java.util.concurrent.SynchronousQueue$TransferStack.transfer(SynchronousQueue.java:362)
        at java.util.concurrent.SynchronousQueue.poll(SynchronousQueue.java:941)
        at java.util.concurrent.ThreadPoolExecutor.getTask(ThreadPoolExecutor.java:1066)
        at java.util.concurrent.ThreadPoolExecutor.runWorker(ThreadPoolExecutor.java:1127)
        at java.util.concurrent.ThreadPoolExecutor$Worker.run(ThreadPoolExecutor.java:617)
        at java.lang.Thread.run(Thread.java:745)
	at __randomizedtesting.SeedInfo.seed([29A54686BD207A15]:0)




Build Log:
[...truncated 10278 lines...]
   [junit4] Suite: org.apache.solr.cloud.CollectionsAPIDistributedZkTest
   [junit4]   2> Creating dataDir: /export/home/jenkins/workspace/Lucene-Solr-trunk-Solaris/solr/build/solr-core/test/J0/temp/solr.cloud.CollectionsAPIDistributedZkTest_29A54686BD207A15-001/init-core-data-001
   [junit4]   2> 1406525 INFO  (SUITE-CollectionsAPIDistributedZkTest-seed#[29A54686BD207A15]-worker) [    ] o.a.s.SolrTestCaseJ4 Randomized ssl (false) and clientAuth (false)
   [junit4]   2> 1406525 INFO  (SUITE-CollectionsAPIDistributedZkTest-seed#[29A54686BD207A15]-worker) [    ] o.a.s.BaseDistributedSearchTestCase Setting hostContext system property: /_/ii
   [junit4]   2> 1406527 INFO  (TEST-CollectionsAPIDistributedZkTest.test-seed#[29A54686BD207A15]) [    ] o.a.s.c.ZkTestServer STARTING ZK TEST SERVER
   [junit4]   2> 1406527 INFO  (Thread-4108) [    ] o.a.s.c.ZkTestServer client port:0.0.0.0/0.0.0.0:0
   [junit4]   2> 1406527 INFO  (Thread-4108) [    ] o.a.s.c.ZkTestServer Starting server
   [junit4]   2> 1406627 INFO  (TEST-CollectionsAPIDistributedZkTest.test-seed#[29A54686BD207A15]) [    ] o.a.s.c.ZkTestServer start zk server on port:53112
   [junit4]   2> 1406627 INFO  (TEST-CollectionsAPIDistributedZkTest.test-seed#[29A54686BD207A15]) [    ] o.a.s.c.c.SolrZkClient Using default ZkCredentialsProvider
   [junit4]   2> 1406628 INFO  (TEST-CollectionsAPIDistributedZkTest.test-seed#[29A54686BD207A15]) [    ] o.a.s.c.c.ConnectionManager Waiting for client to connect to ZooKeeper
   [junit4]   2> 1406631 INFO  (zkCallback-1511-thread-1) [    ] o.a.s.c.c.ConnectionManager Watcher org.apache.solr.common.cloud.ConnectionManager@60c4d40 name:ZooKeeperConnection Watcher:127.0.0.1:53112 got event WatchedEvent state:SyncConnected type:None path:null path:null type:None
   [junit4]   2> 1406631 INFO  (TEST-CollectionsAPIDistributedZkTest.test-seed#[29A54686BD207A15]) [    ] o.a.s.c.c.ConnectionManager Client is connected to ZooKeeper
   [junit4]   2> 1406631 INFO  (TEST-CollectionsAPIDistributedZkTest.test-seed#[29A54686BD207A15]) [    ] o.a.s.c.c.SolrZkClient Using default ZkACLProvider
   [junit4]   2> 1406631 INFO  (TEST-CollectionsAPIDistributedZkTest.test-seed#[29A54686BD207A15]) [    ] o.a.s.c.c.SolrZkClient makePath: /solr
   [junit4]   2> 1406635 INFO  (TEST-CollectionsAPIDistributedZkTest.test-seed#[29A54686BD207A15]) [    ] o.a.s.c.c.SolrZkClient Using default ZkCredentialsProvider
   [junit4]   2> 1406635 INFO  (TEST-CollectionsAPIDistributedZkTest.test-seed#[29A54686BD207A15]) [    ] o.a.s.c.c.ConnectionManager Waiting for client to connect to ZooKeeper
   [junit4]   2> 1406636 INFO  (zkCallback-1512-thread-1) [    ] o.a.s.c.c.ConnectionManager Watcher org.apache.solr.common.cloud.ConnectionManager@187ef63 name:ZooKeeperConnection Watcher:127.0.0.1:53112/solr got event WatchedEvent state:SyncConnected type:None path:null path:null type:None
   [junit4]   2> 1406637 INFO  (TEST-CollectionsAPIDistributedZkTest.test-seed#[29A54686BD207A15]) [    ] o.a.s.c.c.ConnectionManager Client is connected to ZooKeeper
   [junit4]   2> 1406637 INFO  (TEST-CollectionsAPIDistributedZkTest.test-seed#[29A54686BD207A15]) [    ] o.a.s.c.c.SolrZkClient Using default ZkACLProvider
   [junit4]   2> 1406637 INFO  (TEST-CollectionsAPIDistributedZkTest.test-seed#[29A54686BD207A15]) [    ] o.a.s.c.c.SolrZkClient makePath: /collections/collection1
   [junit4]   2> 1406639 INFO  (TEST-CollectionsAPIDistributedZkTest.test-seed#[29A54686BD207A15]) [    ] o.a.s.c.c.SolrZkClient makePath: /collections/collection1/shards
   [junit4]   2> 1406642 INFO  (TEST-CollectionsAPIDistributedZkTest.test-seed#[29A54686BD207A15]) [    ] o.a.s.c.c.SolrZkClient makePath: /collections/control_collection
   [junit4]   2> 1406643 INFO  (TEST-CollectionsAPIDistributedZkTest.test-seed#[29A54686BD207A15]) [    ] o.a.s.c.c.SolrZkClient makePath: /collections/control_collection/shards
   [junit4]   2> 1406646 INFO  (TEST-CollectionsAPIDistributedZkTest.test-seed#[29A54686BD207A15]) [    ] o.a.s.c.AbstractZkTestCase put /export/home/jenkins/workspace/Lucene-Solr-trunk-Solaris/solr/core/src/test-files/solr/collection1/conf/solrconfig-tlog.xml to /configs/conf1/solrconfig.xml
   [junit4]   2> 1406647 INFO  (TEST-CollectionsAPIDistributedZkTest.test-seed#[29A54686BD207A15]) [    ] o.a.s.c.c.SolrZkClient makePath: /configs/conf1/solrconfig.xml
   [junit4]   2> 1406651 INFO  (TEST-CollectionsAPIDistributedZkTest.test-seed#[29A54686BD207A15]) [    ] o.a.s.c.AbstractZkTestCase put /export/home/jenkins/workspace/Lucene-Solr-trunk-Solaris/solr/core/src/test-files/solr/collection1/conf/schema.xml to /configs/conf1/schema.xml
   [junit4]   2> 1406651 INFO  (TEST-CollectionsAPIDistributedZkTest.test-seed#[29A54686BD207A15]) [    ] o.a.s.c.c.SolrZkClient makePath: /configs/conf1/schema.xml
   [junit4]   2> 1406654 INFO  (TEST-CollectionsAPIDistributedZkTest.test-seed#[29A54686BD207A15]) [    ] o.a.s.c.AbstractZkTestCase put /export/home/jenkins/workspace/Lucene-Solr-trunk-Solaris/solr/core/src/test-files/solr/collection1/conf/solrconfig.snippet.randomindexconfig.xml to /configs/conf1/solrconfig.snippet.randomindexconfig.xml
   [junit4]   2> 1406654 INFO  (TEST-CollectionsAPIDistributedZkTest.test-seed#[29A54686BD207A15]) [    ] o.a.s.c.c.SolrZkClient makePath: /configs/conf1/solrconfig.snippet.randomindexconfig.xml
   [junit4]   2> 1406657 INFO  (TEST-CollectionsAPIDistributedZkTest.test-seed#[29A54686BD207A15]) [    ] o.a.s.c.AbstractZkTestCase put /export/home/jenkins/workspace/Lucene-Solr-trunk-Solaris/solr/core/src/test-files/solr/collection1/conf/stopwords.txt to /configs/conf1/stopwords.txt
   [junit4]   2> 1406657 INFO  (TEST-CollectionsAPIDistributedZkTest.test-seed#[29A54686BD207A15]) [    ] o.a.s.c.c.SolrZkClient makePath: /configs/conf1/stopwords.txt
   [junit4]   2> 1406660 INFO  (TEST-CollectionsAPIDistributedZkTest.test-seed#[29A54686BD207A15]) [    ] o.a.s.c.AbstractZkTestCase put /export/home/jenkins/workspace/Lucene-Solr-trunk-Solaris/solr/core/src/test-files/solr/collection1/conf/protwords.txt to /configs/conf1/protwords.txt
   [junit4]   2> 1406660 INFO  (TEST-CollectionsAPIDistributedZkTest.test-seed#[29A54686BD207A15]) [    ] o.a.s.c.c.SolrZkClient makePath: /configs/conf1/protwords.txt
   [junit4]   2> 1406663 INFO  (TEST-CollectionsAPIDistributedZkTest.test-seed#[29A54686BD207A15]) [    ] o.a.s.c.AbstractZkTestCase put /export/home/jenkins/workspace/Lucene-Solr-trunk-Solaris/solr/core/src/test-files/solr/collection1/conf/currency.xml to /configs/conf1/currency.xml
   [junit4]   2> 1406663 INFO  (TEST-CollectionsAPIDistributedZkTest.test-seed#[29A54686BD207A15]) [    ] o.a.s.c.c.SolrZkClient makePath: /configs/conf1/currency.xml
   [junit4]   2> 1406665 INFO  (TEST-CollectionsAPIDistributedZkTest.test-seed#[29A54686BD207A15]) [    ] o.a.s.c.AbstractZkTestCase put /export/home/jenkins/workspace/Lucene-Solr-trunk-Solaris/solr/core/src/test-files/solr/collection1/conf/enumsConfig.xml to /configs/conf1/enumsConfig.xml
   [junit4]   2> 1406665 INFO  (TEST-CollectionsAPIDistributedZkTest.test-seed#[29A54686BD207A15]) [    ] o.a.s.c.c.SolrZkClient makePath: /configs/conf1/enumsConfig.xml
   [junit4]   2> 1406668 INFO  (TEST-CollectionsAPIDistributedZkTest.test-seed#[29A54686BD207A15]) [    ] o.a.s.c.AbstractZkTestCase put /export/home/jenkins/workspace/Lucene-Solr-trunk-Solaris/solr/core/src/test-files/solr/collection1/conf/open-exchange-rates.json to /configs/conf1/open-exchange-rates.json
   [junit4]   2> 1406668 INFO  (TEST-CollectionsAPIDistributedZkTest.test-seed#[29A54686BD207A15]) [    ] o.a.s.c.c.SolrZkClient makePath: /configs/conf1/open-exchange-rates.json
   [junit4]   2> 1406671 INFO  (TEST-CollectionsAPIDistributedZkTest.test-seed#[29A54686BD207A15]) [    ] o.a.s.c.AbstractZkTestCase put /export/home/jenkins/workspace/Lucene-Solr-trunk-Solaris/solr/core/src/test-files/solr/collection1/conf/mapping-ISOLatin1Accent.txt to /configs/conf1/mapping-ISOLatin1Accent.txt
   [junit4]   2> 1406671 INFO  (TEST-CollectionsAPIDistributedZkTest.test-seed#[29A54686BD207A15]) [    ] o.a.s.c.c.SolrZkClient makePath: /configs/conf1/mapping-ISOLatin1Accent.txt
   [junit4]   2> 1406674 INFO  (TEST-CollectionsAPIDistributedZkTest.test-seed#[29A54686BD207A15]) [    ] o.a.s.c.AbstractZkTestCase put /export/home/jenkins/workspace/Lucene-Solr-trunk-Solaris/solr/core/src/test-files/solr/collection1/conf/old_synonyms.txt to /configs/conf1/old_synonyms.txt
   [junit4]   2> 1406694 INFO  (TEST-CollectionsAPIDistributedZkTest.test-seed#[29A54686BD207A15]) [    ] o.a.s.c.c.SolrZkClient makePath: /configs/conf1/old_synonyms.txt
   [junit4]   2> 1406696 INFO  (TEST-CollectionsAPIDistributedZkTest.test-seed#[29A54686BD207A15]) [    ] o.a.s.c.AbstractZkTestCase put /export/home/jenkins/workspace/Lucene-Solr-trunk-Solaris/solr/core/src/test-files/solr/collection1/conf/synonyms.txt to /configs/conf1/synonyms.txt
   [junit4]   2> 1406697 INFO  (TEST-CollectionsAPIDistributedZkTest.test-seed#[29A54686BD207A15]) [    ] o.a.s.c.c.SolrZkClient makePath: /configs/conf1/synonyms.txt
   [junit4]   2> 1406869 INFO  (TEST-CollectionsAPIDistributedZkTest.test-seed#[29A54686BD207A15]) [    ] o.a.s.SolrTestCaseJ4 Writing core.properties file to /export/home/jenkins/workspace/Lucene-Solr-trunk-Solaris/solr/build/solr-core/test/J0/temp/solr.cloud.CollectionsAPIDistributedZkTest_29A54686BD207A15-001/control-001/cores/collection1
   [junit4]   2> 1406871 INFO  (TEST-CollectionsAPIDistributedZkTest.test-seed#[29A54686BD207A15]) [    ] o.e.j.s.Server jetty-9.2.13.v20150730
   [junit4]   2> 1406873 INFO  (TEST-CollectionsAPIDistributedZkTest.test-seed#[29A54686BD207A15]) [    ] o.e.j.s.h.ContextHandler Started o.e.j.s.ServletContextHandler@33ea7a41{/_/ii,null,AVAILABLE}
   [junit4]   2> 1406876 INFO  (TEST-CollectionsAPIDistributedZkTest.test-seed#[29A54686BD207A15]) [    ] o.e.j.s.ServerConnector Started ServerConnector@c0c3dc6{HTTP/1.1}{127.0.0.1:51082}
   [junit4]   2> 1406876 INFO  (TEST-CollectionsAPIDistributedZkTest.test-seed#[29A54686BD207A15]) [    ] o.e.j.s.Server Started @1411237ms
   [junit4]   2> 1406876 INFO  (TEST-CollectionsAPIDistributedZkTest.test-seed#[29A54686BD207A15]) [    ] o.a.s.c.s.e.JettySolrRunner Jetty properties: {solr.data.dir=/export/home/jenkins/workspace/Lucene-Solr-trunk-Solaris/solr/build/solr-core/test/J0/temp/solr.cloud.CollectionsAPIDistributedZkTest_29A54686BD207A15-001/tempDir-001/control/data, hostContext=/_/ii, hostPort=51082, coreRootDirectory=/export/home/jenkins/workspace/Lucene-Solr-trunk-Solaris/solr/build/solr-core/test/J0/temp/solr.cloud.CollectionsAPIDistributedZkTest_29A54686BD207A15-001/control-001/cores}
   [junit4]   2> 1406876 INFO  (TEST-CollectionsAPIDistributedZkTest.test-seed#[29A54686BD207A15]) [    ] o.a.s.s.SolrDispatchFilter SolrDispatchFilter.init(): sun.misc.Launcher$AppClassLoader@659e0bfd
   [junit4]   2> 1406877 INFO  (TEST-CollectionsAPIDistributedZkTest.test-seed#[29A54686BD207A15]) [    ] o.a.s.c.SolrResourceLoader new SolrResourceLoader for directory: '/export/home/jenkins/workspace/Lucene-Solr-trunk-Solaris/solr/build/solr-core/test/J0/temp/solr.cloud.CollectionsAPIDistributedZkTest_29A54686BD207A15-001/control-001'
   [junit4]   2> 1406877 INFO  (TEST-CollectionsAPIDistributedZkTest.test-seed#[29A54686BD207A15]) [    ] o.a.s.c.SolrResourceLoader JNDI not configured for solr (NoInitialContextEx)
   [junit4]   2> 1406877 INFO  (TEST-CollectionsAPIDistributedZkTest.test-seed#[29A54686BD207A15]) [    ] o.a.s.c.SolrResourceLoader solr home defaulted to 'solr/' (could not find system property or JNDI)
   [junit4]   2> 1406877 INFO  (TEST-CollectionsAPIDistributedZkTest.test-seed#[29A54686BD207A15]) [    ] o.a.s.c.c.SolrZkClient Using default ZkCredentialsProvider
   [junit4]   2> 1406878 INFO  (TEST-CollectionsAPIDistributedZkTest.test-seed#[29A54686BD207A15]) [    ] o.a.s.c.c.ConnectionManager Waiting for client to connect to ZooKeeper
   [junit4]   2> 1406880 INFO  (zkCallback-1513-thread-1) [    ] o.a.s.c.c.ConnectionManager Watcher org.apache.solr.common.cloud.ConnectionManager@63da1ddb name:ZooKeeperConnection Watcher:127.0.0.1:53112/solr got event WatchedEvent state:SyncConnected type:None path:null path:null type:None
   [junit4]   2> 1406880 INFO  (TEST-CollectionsAPIDistributedZkTest.test-seed#[29A54686BD207A15]) [    ] o.a.s.c.c.ConnectionManager Client is connected to ZooKeeper
   [junit4]   2> 1406881 INFO  (TEST-CollectionsAPIDistributedZkTest.test-seed#[29A54686BD207A15]) [    ] o.a.s.c.c.SolrZkClient Using default ZkACLProvider
   [junit4]   2> 1406882 INFO  (TEST-CollectionsAPIDistributedZkTest.test-seed#[29A54686BD207A15]) [    ] o.a.s.s.SolrDispatchFilter Loading solr.xml from SolrHome (not found in ZooKeeper)
   [junit4]   2> 1406882 INFO  (TEST-CollectionsAPIDistributedZkTest.test-seed#[29A54686BD207A15]) [    ] o.a.s.c.SolrXmlConfig Loading container configuration from /export/home/jenkins/workspace/Lucene-Solr-trunk-Solaris/solr/build/solr-core/test/J0/temp/solr.cloud.CollectionsAPIDistributedZkTest_29A54686BD207A15-001/control-001/solr.xml
   [junit4]   2> 1406888 INFO  (TEST-CollectionsAPIDistributedZkTest.test-seed#[29A54686BD207A15]) [    ] o.a.s.c.CorePropertiesLocator Config-defined core root directory: /export/home/jenkins/workspace/Lucene-Solr-trunk-Solaris/solr/build/solr-core/test/J0/temp/solr.cloud.CollectionsAPIDistributedZkTest_29A54686BD207A15-001/control-001/cores
   [junit4]   2> 1406888 INFO  (TEST-CollectionsAPIDistributedZkTest.test-seed#[29A54686BD207A15]) [    ] o.a.s.c.CoreContainer New CoreContainer 487086433
   [junit4]   2> 1406888 INFO  (TEST-CollectionsAPIDistributedZkTest.test-seed#[29A54686BD207A15]) [    ] o.a.s.c.CoreContainer Loading cores into CoreContainer [instanceDir=/export/home/jenkins/workspace/Lucene-Solr-trunk-Solaris/solr/build/solr-core/test/J0/temp/solr.cloud.CollectionsAPIDistributedZkTest_29A54686BD207A15-001/control-001]
   [junit4]   2> 1406888 WARN  (TEST-CollectionsAPIDistributedZkTest.test-seed#[29A54686BD207A15]) [    ] o.a.s.c.CoreContainer Couldn't add files from /export/home/jenkins/workspace/Lucene-Solr-trunk-Solaris/solr/build/solr-core/test/J0/temp/solr.cloud.CollectionsAPIDistributedZkTest_29A54686BD207A15-001/control-001/lib to classpath: /export/home/jenkins/workspace/Lucene-Solr-trunk-Solaris/solr/build/solr-core/test/J0/temp/solr.cloud.CollectionsAPIDistributedZkTest_29A54686BD207A15-001/control-001/lib
   [junit4]   2> 1406888 INFO  (TEST-CollectionsAPIDistributedZkTest.test-seed#[29A54686BD207A15]) [    ] o.a.s.h.c.HttpShardHandlerFactory created with socketTimeout : 90000,urlScheme : ,connTimeout : 15000,maxConnectionsPerHost : 20,maxConnections : 10000,corePoolSize : 0,maximumPoolSize : 2147483647,maxThreadIdleTime : 5,sizeOfQueue : -1,fairnessPolicy : false,useRetries : false,
   [junit4]   2> 1406890 INFO  (TEST-CollectionsAPIDistributedZkTest.test-seed#[29A54686BD207A15]) [    ] o.a.s.u.UpdateShardHandler Creating UpdateShardHandler HTTP client with params: socketTimeout=340000&connTimeout=45000&retry=true
   [junit4]   2> 1406890 INFO  (TEST-CollectionsAPIDistributedZkTest.test-seed#[29A54686BD207A15]) [    ] o.a.s.l.LogWatcher SLF4J impl is org.slf4j.impl.Log4jLoggerFactory
   [junit4]   2> 1406890 INFO  (TEST-CollectionsAPIDistributedZkTest.test-seed#[29A54686BD207A15]) [    ] o.a.s.l.LogWatcher Registering Log Listener [Log4j (org.slf4j.impl.Log4jLoggerFactory)]
   [junit4]   2> 1406891 INFO  (TEST-CollectionsAPIDistributedZkTest.test-seed#[29A54686BD207A15]) [    ] o.a.s.c.ZkContainer Zookeeper client=127.0.0.1:53112/solr
   [junit4]   2> 1406891 INFO  (TEST-CollectionsAPIDistributedZkTest.test-seed#[29A54686BD207A15]) [    ] o.a.s.c.ZkController zkHost includes chroot
   [junit4]   2> 1406891 INFO  (TEST-CollectionsAPIDistributedZkTest.test-seed#[29A54686BD207A15]) [    ] o.a.s.c.c.SolrZkClient Using default ZkCredentialsProvider
   [junit4]   2> 1406891 INFO  (TEST-CollectionsAPIDistributedZkTest.test-seed#[29A54686BD207A15]) [    ] o.a.s.c.c.ConnectionManager Waiting for client to connect to ZooKeeper
   [junit4]   2> 1406893 INFO  (zkCallback-1516-thread-1) [    ] o.a.s.c.c.ConnectionManager Watcher org.apache.solr.common.cloud.ConnectionManager@66ad2680 name:ZooKeeperConnection Watcher:127.0.0.1:53112 got event WatchedEvent state:SyncConnected type:None path:null path:null type:None
   [junit4]   2> 1406893 INFO  (TEST-CollectionsAPIDistributedZkTest.test-seed#[29A54686BD207A15]) [    ] o.a.s.c.c.ConnectionManager Client is connected to ZooKeeper
   [junit4]   2> 1406894 INFO  (TEST-CollectionsAPIDistributedZkTest.test-seed#[29A54686BD207A15]) [    ] o.a.s.c.c.SolrZkClient Using default ZkACLProvider
   [junit4]   2> 1406896 INFO  (TEST-CollectionsAPIDistributedZkTest.test-seed#[29A54686BD207A15]) [n:127.0.0.1:51082__%2Fii    ] o.a.s.c.c.ConnectionManager Waiting for client to connect to ZooKeeper
   [junit4]   2> 1406898 INFO  (zkCallback-1517-thread-1-processing-n:127.0.0.1:51082__%2Fii) [n:127.0.0.1:51082__%2Fii    ] o.a.s.c.c.ConnectionManager Watcher org.apache.solr.common.cloud.ConnectionManager@6d71de20 name:ZooKeeperConnection Watcher:127.0.0.1:53112/solr got event WatchedEvent state:SyncConnected type:None path:null path:null type:None
   [junit4]   2> 1406898 INFO  (TEST-CollectionsAPIDistributedZkTest.test-seed#[29A54686BD207A15]) [n:127.0.0.1:51082__%2Fii    ] o.a.s.c.c.ConnectionManager Client is connected to ZooKeeper
   [junit4]   2> 1406899 INFO  (TEST-CollectionsAPIDistributedZkTest.test-seed#[29A54686BD207A15]) [n:127.0.0.1:51082__%2Fii    ] o.a.s.c.c.SolrZkClient makePath: /overseer/queue
   [junit4]   2> 1406902 INFO  (TEST-CollectionsAPIDistributedZkTest.test-seed#[29A54686BD207A15]) [n:127.0.0.1:51082__%2Fii    ] o.a.s.c.c.SolrZkClient makePath: /overseer/collection-queue-work
   [junit4]   2> 1406907 INFO  (TEST-CollectionsAPIDistributedZkTest.test-seed#[29A54686BD207A15]) [n:127.0.0.1:51082__%2Fii    ] o.a.s.c.c.SolrZkClient makePath: /overseer/collection-map-running
   [junit4]   2> 1406910 INFO  (TEST-CollectionsAPIDistributedZkTest.test-seed#[29A54686BD207A15]) [n:127.0.0.1:51082__%2Fii    ] o.a.s.c.c.SolrZkClient makePath: /overseer/collection-map-completed
   [junit4]   2> 1406913 INFO  (TEST-CollectionsAPIDistributedZkTest.test-seed#[29A54686BD207A15]) [n:127.0.0.1:51082__%2Fii    ] o.a.s.c.c.SolrZkClient makePath: /overseer/collection-map-failure
   [junit4]   2> 1406916 INFO  (TEST-CollectionsAPIDistributedZkTest.test-seed#[29A54686BD207A15]) [n:127.0.0.1:51082__%2Fii    ] o.a.s.c.c.SolrZkClient makePath: /live_nodes
   [junit4]   2> 1406918 INFO  (TEST-CollectionsAPIDistributedZkTest.test-seed#[29A54686BD207A15]) [n:127.0.0.1:51082__%2Fii    ] o.a.s.c.c.SolrZkClient makePath: /aliases.json
   [junit4]   2> 1406921 INFO  (TEST-CollectionsAPIDistributedZkTest.test-seed#[29A54686BD207A15]) [n:127.0.0.1:51082__%2Fii    ] o.a.s.c.c.SolrZkClient makePath: /clusterstate.json
   [junit4]   2> 1406923 INFO  (TEST-CollectionsAPIDistributedZkTest.test-seed#[29A54686BD207A15]) [n:127.0.0.1:51082__%2Fii    ] o.a.s.c.c.SolrZkClient makePath: /security.json
   [junit4]   2> 1406943 INFO  (TEST-CollectionsAPIDistributedZkTest.test-seed#[29A54686BD207A15]) [n:127.0.0.1:51082__%2Fii    ] o.a.s.c.ZkController Register node as live in ZooKeeper:/live_nodes/127.0.0.1:51082__%2Fii
   [junit4]   2> 1406944 INFO  (TEST-CollectionsAPIDistributedZkTest.test-seed#[29A54686BD207A15]) [n:127.0.0.1:51082__%2Fii    ] o.a.s.c.c.SolrZkClient makePath: /live_nodes/127.0.0.1:51082__%2Fii
   [junit4]   2> 1406947 INFO  (TEST-CollectionsAPIDistributedZkTest.test-seed#[29A54686BD207A15]) [n:127.0.0.1:51082__%2Fii    ] o.a.s.c.c.SolrZkClient makePath: /overseer_elect
   [junit4]   2> 1406950 INFO  (TEST-CollectionsAPIDistributedZkTest.test-seed#[29A54686BD207A15]) [n:127.0.0.1:51082__%2Fii    ] o.a.s.c.c.SolrZkClient makePath: /overseer_elect/election
   [junit4]   2> 1406954 INFO  (TEST-CollectionsAPIDistributedZkTest.test-seed#[29A54686BD207A15]) [n:127.0.0.1:51082__%2Fii    ] o.a.s.c.Overseer Overseer (id=null) closing
   [junit4]   2> 1406955 INFO  (TEST-CollectionsAPIDistributedZkTest.test-seed#[29A54686BD207A15]) [n:127.0.0.1:51082__%2Fii    ] o.a.s.c.LeaderElector Joined leadership election with path: /overseer_elect/election/95204195568844804-127.0.0.1:51082__%2Fii-n_0000000000
   [junit4]   2> 1406959 INFO  (TEST-CollectionsAPIDistributedZkTest.test-seed#[29A54686BD207A15]) [n:127.0.0.1:51082__%2Fii    ] o.a.s.c.OverseerElectionContext I am going to be the leader 127.0.0.1:51082__%2Fii
   [junit4]   2> 1406959 INFO  (TEST-CollectionsAPIDistributedZkTest.test-seed#[29A54686BD207A15]) [n:127.0.0.1:51082__%2Fii    ] o.a.s.c.c.SolrZkClient makePath: /overseer_elect/leader
   [junit4]   2> 1406964 INFO  (TEST-CollectionsAPIDistributedZkTest.test-seed#[29A54686BD207A15]) [n:127.0.0.1:51082__%2Fii    ] o.a.s.c.Overseer Overseer (id=95204195568844804-127.0.0.1:51082__%2Fii-n_0000000000) starting
   [junit4]   2> 1406967 INFO  (TEST-CollectionsAPIDistributedZkTest.test-seed#[29A54686BD207A15]) [n:127.0.0.1:51082__%2Fii    ] o.a.s.c.c.SolrZkClient makePath: /overseer/queue-work
   [junit4]   2> 1406978 INFO  (TEST-CollectionsAPIDistributedZkTest.test-seed#[29A54686BD207A15]) [n:127.0.0.1:51082__%2Fii    ] o.a.s.c.OverseerAutoReplicaFailoverThread Starting OverseerAutoReplicaFailoverThread autoReplicaFailoverWorkLoopDelay=10000 autoReplicaFailoverWaitAfterExpiration=10000 autoReplicaFailoverBadNodeExpiration=60000
   [junit4]   2> 1406978 INFO  (TEST-CollectionsAPIDistributedZkTest.test-seed#[29A54686BD207A15]) [n:127.0.0.1:51082__%2Fii    ] o.a.s.c.c.ZkStateReader Updating cluster state from ZooKeeper... 
   [junit4]   2> 1406980 INFO  (OverseerStateUpdate-95204195568844804-127.0.0.1:51082__%2Fii-n_0000000000) [n:127.0.0.1:51082__%2Fii    ] o.a.s.c.Overseer Starting to work on the main queue
   [junit4]   2> 1406980 INFO  (OverseerCollectionConfigSetProcessor-95204195568844804-127.0.0.1:51082__%2Fii-n_0000000000) [n:127.0.0.1:51082__%2Fii    ] o.a.s.c.OverseerTaskProcessor Process current queue of overseer operations
   [junit4]   2> 1407009 INFO  (TEST-CollectionsAPIDistributedZkTest.test-seed#[29A54686BD207A15]) [n:127.0.0.1:51082__%2Fii    ] o.a.s.c.CoreContainer Security conf doesn't exist. Skipping setup for authorization module.
   [junit4]   2> 1407009 INFO  (TEST-CollectionsAPIDistributedZkTest.test-seed#[29A54686BD207A15]) [n:127.0.0.1:51082__%2Fii    ] o.a.s.c.CoreContainer No authentication plugin used.
   [junit4]   2> 1407010 INFO  (TEST-CollectionsAPIDistributedZkTest.test-seed#[29A54686BD207A15]) [n:127.0.0.1:51082__%2Fii    ] o.a.s.c.CorePropertiesLocator Looking for core definitions underneath /export/home/jenkins/workspace/Lucene-Solr-trunk-Solaris/solr/build/solr-core/test/J0/temp/solr.cloud.CollectionsAPIDistributedZkTest_29A54686BD207A15-001/control-001/cores
   [junit4]   2> 1407011 INFO  (TEST-CollectionsAPIDistributedZkTest.test-seed#[29A54686BD207A15]) [n:127.0.0.1:51082__%2Fii    ] o.a.s.c.CoreDescriptor Created CoreDescriptor: {name=collection1, config=solrconfig.xml, transient=false, schema=schema.xml, loadOnStartup=true, configSetProperties=configsetprops.json, collection=control_collection, coreNodeName=, dataDir=data/, shard=}
   [junit4]   2> 1407011 INFO  (TEST-CollectionsAPIDistributedZkTest.test-seed#[29A54686BD207A15]) [n:127.0.0.1:51082__%2Fii    ] o.a.s.c.CorePropertiesLocator Found core collection1 in /export/home/jenkins/workspace/Lucene-Solr-trunk-Solaris/solr/build/solr-core/test/J0/temp/solr.cloud.CollectionsAPIDistributedZkTest_29A54686BD207A15-001/control-001/cores/collection1
   [junit4]   2> 1407011 INFO  (TEST-CollectionsAPIDistributedZkTest.test-seed#[29A54686BD207A15]) [n:127.0.0.1:51082__%2Fii    ] o.a.s.c.CorePropertiesLocator Found 1 core definitions
   [junit4]   2> 1407013 INFO  (TEST-CollectionsAPIDistributedZkTest.test-seed#[29A54686BD207A15]) [n:127.0.0.1:51082__%2Fii    ] o.a.s.s.SolrDispatchFilter user.dir=/export/home/jenkins/workspace/Lucene-Solr-trunk-Solaris/solr/build/solr-core/test/J0
   [junit4]   2> 1407013 INFO  (TEST-CollectionsAPIDistributedZkTest.test-seed#[29A54686BD207A15]) [n:127.0.0.1:51082__%2Fii    ] o.a.s.s.SolrDispatchFilter SolrDispatchFilter.init() done
   [junit4]   2> 1407013 INFO  (coreLoadExecutor-4351-thread-1-processing-n:127.0.0.1:51082__%2Fii) [n:127.0.0.1:51082__%2Fii c:control_collection   x:collection1] o.a.s.c.ZkController publishing state=down
   [junit4]   2> 1407013 INFO  (coreLoadExecutor-4351-thread-1-processing-n:127.0.0.1:51082__%2Fii) [n:127.0.0.1:51082__%2Fii c:control_collection   x:collection1] o.a.s.c.ZkController numShards not found on descriptor - reading it from system property
   [junit4]   2> 1407016 INFO  (OverseerStateUpdate-95204195568844804-127.0.0.1:51082__%2Fii-n_0000000000) [n:127.0.0.1:51082__%2Fii    ] o.a.s.c.Overseer processMessage: queueSize: 1, message = {
   [junit4]   2>   "core":"collection1",
   [junit4]   2>   "roles":null,
   [junit4]   2>   "base_url":"http://127.0.0.1:51082/_/ii",
   [junit4]   2>   "node_name":"127.0.0.1:51082__%2Fii",
   [junit4]   2>   "numShards":"1",
   [junit4]   2>   "state":"down",
   [junit4]   2>   "shard":null,
   [junit4]   2>   "collection":"control_collection",
   [junit4]   2>   "operation":"state"} current state version: 0
   [junit4]   2> 1407017 INFO  (coreLoadExecutor-4351-thread-1-processing-n:127.0.0.1:51082__%2Fii) [n:127.0.0.1:51082__%2Fii c:control_collection   x:collection1] o.a.s.c.ZkController look for our core node name
   [junit4]   2> 1407018 INFO  (OverseerStateUpdate-95204195568844804-127.0.0.1:51082__%2Fii-n_0000000000) [n:127.0.0.1:51082__%2Fii    ] o.a.s.c.o.ReplicaMutator Update state numShards=1 message={
   [junit4]   2>   "core":"collection1",
   [junit4]   2>   "roles":null,
   [junit4]   2>   "base_url":"http://127.0.0.1:51082/_/ii",
   [junit4]   2>   "node_name":"127.0.0.1:51082__%2Fii",
   [junit4]   2>   "numShards":"1",
   [junit4]   2>   "state":"down",
   [junit4]   2>   "shard":null,
   [junit4]   2>   "collection":"control_collection",
   [junit4]   2>   "operation":"state"}
   [junit4]   2> 1407018 INFO  (OverseerStateUpdate-95204195568844804-127.0.0.1:51082__%2Fii-n_0000000000) [n:127.0.0.1:51082__%2Fii    ] o.a.s.c.o.ClusterStateMutator building a new cName: control_collection
   [junit4]   2> 1407019 INFO  (OverseerStateUpdate-95204195568844804-127.0.0.1:51082__%2Fii-n_0000000000) [n:127.0.0.1:51082__%2Fii    ] o.a.s.c.o.ReplicaMutator Assigning new node to shard shard=shard1
   [junit4]   2> 1407021 INFO  (zkCallback-1517-thread-1-processing-n:127.0.0.1:51082__%2Fii) [n:127.0.0.1:51082__%2Fii    ] o.a.s.c.c.ZkStateReader A cluster state change: [WatchedEvent state:SyncConnected type:NodeDataChanged path:/clusterstate.json], has occurred - updating... (live nodes size: [1])
   [junit4]   2> 1408019 INFO  (coreLoadExecutor-4351-thread-1-processing-n:127.0.0.1:51082__%2Fii) [n:127.0.0.1:51082__%2Fii c:control_collection   x:collection1] o.a.s.c.ZkController waiting to find shard id in clusterstate for collection1
   [junit4]   2> 1408019 INFO  (coreLoadExecutor-4351-thread-1-processing-n:127.0.0.1:51082__%2Fii) [n:127.0.0.1:51082__%2Fii c:control_collection   x:collection1] o.a.s.c.ZkController Check for collection zkNode:control_collection
   [junit4]   2> 1408019 INFO  (coreLoadExecutor-4351-thread-1-processing-n:127.0.0.1:51082__%2Fii) [n:127.0.0.1:51082__%2Fii c:control_collection   x:collection1] o.a.s.c.ZkController Collection zkNode exists
   [junit4]   2> 1408019 INFO  (coreLoadExecutor-4351-thread-1-processing-n:127.0.0.1:51082__%2Fii) [n:127.0.0.1:51082__%2Fii c:control_collection   x:collection1] o.a.s.c.c.ZkStateReader Load collection config from: [/collections/control_collection]
   [junit4]   2> 1408020 INFO  (coreLoadExecutor-4351-thread-1-processing-n:127.0.0.1:51082__%2Fii) [n:127.0.0.1:51082__%2Fii c:control_collection   x:collection1] o.a.s.c.c.ZkStateReader path=[/collections/control_collection] [configName]=[conf1] specified config exists in ZooKeeper
   [junit4]   2> 1408020 INFO  (coreLoadExecutor-4351-thread-1-processing-n:127.0.0.1:51082__%2Fii) [n:127.0.0.1:51082__%2Fii c:control_collection   x:collection1] o.a.s.c.SolrResourceLoader new SolrResourceLoader for directory: '/export/home/jenkins/workspace/Lucene-Solr-trunk-Solaris/solr/build/solr-core/test/J0/temp/solr.cloud.CollectionsAPIDistributedZkTest_29A54686BD207A15-001/control-001/cores/collection1'
   [junit4]   2> 1408020 INFO  (coreLoadExecutor-4351-thread-1-processing-n:127.0.0.1:51082__%2Fii) [n:127.0.0.1:51082__%2Fii c:control_collection   x:collection1] o.a.s.c.SolrResourceLoader JNDI not configured for solr (NoInitialContextEx)
   [junit4]   2> 1408021 INFO  (coreLoadExecutor-4351-thread-1-processing-n:127.0.0.1:51082__%2Fii) [n:127.0.0.1:51082__%2Fii c:control_collection   x:collection1] o.a.s.c.SolrResourceLoader solr home defaulted to 'solr/' (could not find system property or JNDI)
   [junit4]   2> 1408023 INFO  (coreLoadExecutor-4351-thread-1-processing-n:127.0.0.1:51082__%2Fii) [n:127.0.0.1:51082__%2Fii c:control_collection   x:collection1] o.a.s.c.Config loaded config solrconfig.xml with version 0 
   [junit4]   2> 1408028 INFO  (coreLoadExecutor-4351-thread-1-processing-n:127.0.0.1:51082__%2Fii) [n:127.0.0.1:51082__%2Fii c:control_collection   x:collection1] o.a.s.c.SolrConfig current version of requestparams : -1
   [junit4]   2> 1408031 INFO  (coreLoadExecutor-4351-thread-1-processing-n:127.0.0.1:51082__%2Fii) [n:127.0.0.1:51082__%2Fii c:control_collection   x:collection1] o.a.s.c.SolrConfig Using Lucene MatchVersion: 6.0.0
   [junit4]   2> 1408038 INFO  (coreLoadExecutor-4351-thread-1-processing-n:127.0.0.1:51082__%2Fii) [n:127.0.0.1:51082__%2Fii c:control_collection   x:collection1] o.a.s.c.SolrConfig Loaded SolrConfig: solrconfig.xml
   [junit4]   2> 1408044 INFO  (coreLoadExecutor-4351-thread-1-processing-n:127.0.0.1:51082__%2Fii) [n:127.0.0.1:51082__%2Fii c:control_collection   x:collection1] o.a.s.s.IndexSchema [collection1] Schema name=test
   [junit4]   2> 1408123 INFO  (coreLoadExecutor-4351-thread-1-processing-n:127.0.0.1:51082__%2Fii) [n:127.0.0.1:51082__%2Fii c:control_collection   x:collection1] o.a.s.s.OpenExchangeRatesOrgProvider Initialized with rates=open-exchange-rates.json, refreshInterval=1440.
   [junit4]   2> 1408129 INFO  (coreLoadExecutor-4351-thread-1-processing-n:127.0.0.1:51082__%2Fii) [n:127.0.0.1:51082__%2Fii c:control_collection   x:collection1] o.a.s.s.IndexSchema default search field in schema is text
   [junit4]   2> 1408130 INFO  (coreLoadExecutor-4351-thread-1-processing-n:127.0.0.1:51082__%2Fii) [n:127.0.0.1:51082__%2Fii c:control_collection   x:collection1] o.a.s.s.IndexSchema unique key field: id
   [junit4]   2> 1408141 INFO  (coreLoadExecutor-4351-thread-1-processing-n:127.0.0.1:51082__%2Fii) [n:127.0.0.1:51082__%2Fii c:control_collection   x:collection1] o.a.s.s.FileExchangeRateProvider Reloading exchange rates from file currency.xml
   [junit4]   2> 1408144 INFO  (coreLoadExecutor-4351-thread-1-processing-n:127.0.0.1:51082__%2Fii) [n:127.0.0.1:51082__%2Fii c:control_collection   x:collection1] o.a.s.s.FileExchangeRateProvider Reloading exchange rates from file currency.xml
   [junit4]   2> 1408146 INFO  (coreLoadExecutor-4351-thread-1-processing-n:127.0.0.1:51082__%2Fii) [n:127.0.0.1:51082__%2Fii c:control_collection   x:collection1] o.a.s.s.OpenExchangeRatesOrgProvider Reloading exchange rates from open-exchange-rates.json
   [junit4]   2> 1408147 INFO  (coreLoadExecutor-4351-thread-1-processing-n:127.0.0.1:51082__%2Fii) [n:127.0.0.1:51082__%2Fii c:control_collection   x:collection1] o.a.s.s.OpenExchangeRatesOrgProvider Reloading exchange rates from open-exchange-rates.json
   [junit4]   2> 1408149 INFO  (coreLoadExecutor-4351-thread-1-processing-n:127.0.0.1:51082__%2Fii) [n:127.0.0.1:51082__%2Fii c:control_collection   x:collection1] o.a.s.c.ConfigSetProperties Did not find ConfigSet properties, assuming default properties: Can't find resource 'configsetprops.json' in classpath or '/configs/conf1', cwd=/export/home/jenkins/workspace/Lucene-Solr-trunk-Solaris/solr/build/solr-core/test/J0
   [junit4]   2> 1408149 INFO  (coreLoadExecutor-4351-thread-1-processing-n:127.0.0.1:51082__%2Fii) [n:127.0.0.1:51082__%2Fii c:control_collection   x:collection1] o.a.s.c.CoreContainer Creating SolrCore 'collection1' using configuration from collection control_collection
   [junit4]   2> 1408149 INFO  (coreLoadExecutor-4351-thread-1-processing-n:127.0.0.1:51082__%2Fii) [n:127.0.0.1:51082__%2Fii c:control_collection s:shard1 r:core_node1 x:collection1] o.a.s.c.SolrCore org.apache.solr.core.MockDirectoryFactory
   [junit4]   2> 1408150 INFO  (coreLoadExecutor-4351-thread-1-processing-n:127.0.0.1:51082__%2Fii) [n:127.0.0.1:51082__%2Fii c:control_collection s:shard1 r:core_node1 x:collection1] o.a.s.c.SolrCore [[collection1] ] Opening new SolrCore at [/export/home/jenkins/workspace/Lucene-Solr-trunk-Solaris/solr/build/solr-core/test/J0/temp/solr.cloud.CollectionsAPIDistributedZkTest_29A54686BD207A15-001/control-001/cores/collection1], dataDir=[/export/home/jenkins/workspace/Lucene-Solr-trunk-Solaris/solr/build/solr-core/test/J0/temp/solr.cloud.CollectionsAPIDistributedZkTest_29A54686BD207A15-001/control-001/cores/collection1/data/]
   [junit4]   2> 1408150 INFO  (coreLoadExecutor-4351-thread-1-processing-n:127.0.0.1:51082__%2Fii) [n:127.0.0.1:51082__%2Fii c:control_collection s:shard1 r:core_node1 x:collection1] o.a.s.c.JmxMonitoredMap JMX monitoring is enabled. Adding Solr mbeans to JMX Server: com.sun.jmx.mbeanserver.JmxMBeanServer@3d04f3cc
   [junit4]   2> 1408150 INFO  (coreLoadExecutor-4351-thread-1-processing-n:127.0.0.1:51082__%2Fii) [n:127.0.0.1:51082__%2Fii c:control_collection s:shard1 r:core_node1 x:collection1] o.a.s.c.CachingDirectoryFactory return new directory for /export/home/jenkins/workspace/Lucene-Solr-trunk-Solaris/solr/build/solr-core/test/J0/temp/solr.cloud.CollectionsAPIDistributedZkTest_29A54686BD207A15-001/control-001/cores/collection1/data
   [junit4]   2> 1408150 INFO  (coreLoadExecutor-4351-thread-1-processing-n:127.0.0.1:51082__%2Fii) [n:127.0.0.1:51082__%2Fii c:control_collection s:shard1 r:core_node1 x:collection1] o.a.s.c.SolrCore New index directory detected: old=null new=/export/home/jenkins/workspace/Lucene-Solr-trunk-Solaris/solr/build/solr-core/test/J0/temp/solr.cloud.CollectionsAPIDistributedZkTest_29A54686BD207A15-001/control-001/cores/collection1/data/index/
   [junit4]   2> 1408150 WARN  (coreLoadExecutor-4351-thread-1-processing-n:127.0.0.1:51082__%2Fii) [n:127.0.0.1:51082__%2Fii c:control_collection s:shard1 r:core_node1 x:collection1] o.a.s.c.SolrCore [collection1] Solr index directory '/export/home/jenkins/workspace/Lucene-Solr-trunk-Solaris/solr/build/solr-core/test/J0/temp/solr.cloud.CollectionsAPIDistributedZkTest_29A54686BD207A15-001/control-001/cores/collection1/data/index' doesn't exist. Creating new index...
   [junit4]   2> 1408150 INFO  (coreLoadExecutor-4351-thread-1-processing-n:127.0.0.1:51082__%2Fii) [n:127.0.0.1:51082__%2Fii c:control_collection s:shard1 r:core_node1 x:collection1] o.a.s.c.CachingDirectoryFactory return new directory for /export/home/jenkins/workspace/Lucene-Solr-trunk-Solaris/solr/build/solr-core/test/J0/temp/solr.cloud.CollectionsAPIDistributedZkTest_29A54686BD207A15-001/control-001/cores/collection1/data/index
   [junit4]   2> 1408151 INFO  (coreLoadExecutor-4351-thread-1-processing-n:127.0.0.1:51082__%2Fii) [n:127.0.0.1:51082__%2Fii c:control_collection s:shard1 r:core_node1 x:collection1] o.a.s.u.RandomMergePolicy RandomMergePolicy wrapping class org.apache.lucene.index.TieredMergePolicy: [TieredMergePolicy: maxMergeAtOnce=33, maxMergeAtOnceExplicit=45, maxMergedSegmentMB=87.62890625, floorSegmentMB=0.5166015625, forceMergeDeletesPctAllowed=14.803922686846908, segmentsPerTier=34.0, maxCFSSegmentSizeMB=8.796093022207999E12, noCFSRatio=0.16582622022236526
   [junit4]   2> 1408151 INFO  (coreLoadExecutor-4351-thread-1-processing-n:127.0.0.1:51082__%2Fii) [n:127.0.0.1:51082__%2Fii c:control_collection s:shard1 r:core_node1 x:collection1] o.a.s.c.SolrDeletionPolicy SolrDeletionPolicy.onCommit: commits: num=1
   [junit4]   2> 	commit{dir=MockDirectoryWrapper(RAMDirectory@524d08d lockFactory=org.apache.lucene.store.SingleInstanceLockFactory@7166ebcf),segFN=segments_1,generation=1}
   [junit4]   2> 1408151 INFO  (coreLoadExecutor-4351-thread-1-processing-n:127.0.0.1:51082__%2Fii) [n:127.0.0.1:51082__%2Fii c:control_collection s:shard1 r:core_node1 x:collection1] o.a.s.c.SolrDeletionPolicy newest commit generation = 1
   [junit4]   2> 1408151 INFO  (OldIndexDirectoryCleanupThreadForCore-collection1) [n:127.0.0.1:51082__%2Fii c:control_collection s:shard1 r:core_node1 x:collection1] o.a.s.c.SolrCore Looking for old index directories to cleanup for core collection1 in /export/home/jenkins/workspace/Lucene-Solr-trunk-Solaris/solr/build/solr-core/test/J0/temp/solr.cloud.CollectionsAPIDistributedZkTest_29A54686BD207A15-001/control-001/cores/collection1/data/
   [junit4]   2> 1408152 WARN  (OldIndexDirectoryCleanupThreadForCore-collection1) [n:127.0.0.1:51082__%2Fii c:control_collection s:shard1 r:core_node1 x:collection1] o.a.s.c.DirectoryFactory /export/home/jenkins/workspace/Lucene-Solr-trunk-Solaris/solr/build/solr-core/test/J0/temp/solr.cloud.CollectionsAPIDistributedZkTest_29A54686BD207A15-001/control-001/cores/collection1/data/ does not point to a valid data directory; skipping clean-up of old index directories.
   [junit4]   2> 1408153 INFO  (coreLoadExecutor-4351-thread-1-processing-n:127.0.0.1:51082__%2Fii) [n:127.0.0.1:51082__%2Fii c:control_collection s:shard1 r:core_node1 x:collection1] o.a.s.u.p.UpdateRequestProcessorChain creating updateRequestProcessorChain "nodistrib"
   [junit4]   2> 1408154 INFO  (coreLoadExecutor-4351-thread-1-processing-n:127.0.0.1:51082__%2Fii) [n:127.0.0.1:51082__%2Fii c:control_collection s:shard1 r:core_node1 x:collection1] o.a.s.u.p.UpdateRequestProcessorChain creating updateRequestProcessorChain "dedupe"
   [junit4]   2> 1408154 INFO  (coreLoadExecutor-4351-thread-1-processing-n:127.0.0.1:51082__%2Fii) [n:127.0.0.1:51082__%2Fii c:control_collection s:shard1 r:core_node1 x:collection1] o.a.s.u.p.UpdateRequestProcessorChain inserting DistributedUpdateProcessorFactory into updateRequestProcessorChain "dedupe"
   [junit4]   2> 1408154 INFO  (coreLoadExecutor-4351-thread-1-processing-n:127.0.0.1:51082__%2Fii) [n:127.0.0.1:51082__%2Fii c:control_collection s:shard1 r:core_node1 x:collection1] o.a.s.u.p.UpdateRequestProcessorChain creating updateRequestProcessorChain "stored_sig"
   [junit4]   2> 1408154 INFO  (coreLoadExecutor-4351-thread-1-processing-n:127.0.0.1:51082__%2Fii) [n:127.0.0.1:51082__%2Fii c:control_collection s:shard1 r:core_node1 x:collection1] o.a.s.u.p.UpdateRequestProcessorChain inserting DistributedUpdateProcessorFactory into updateRequestProcessorChain "stored_sig"
   [junit4]   2> 1408154 INFO  (coreLoadExecutor-4351-thread-1-processing-n:127.0.0.1:51082__%2Fii) [n:127.0.0.1:51082__%2Fii c:control_collection s:shard1 r:core_node1 x:collection1] o.a.s.u.p.UpdateRequestProcessorChain creating updateRequestProcessorChain "distrib-dup-test-chain-explicit"
   [junit4]   2> 1408154 INFO  (coreLoadExecutor-4351-thread-1-processing-n:127.0.0.1:51082__%2Fii) [n:127.0.0.1:51082__%2Fii c:control_collection s:shard1 r:core_node1 x:collection1] o.a.s.u.p.UpdateRequestProcessorChain creating updateRequestProcessorChain "distrib-dup-test-chain-implicit"
   [junit4]   2> 1408154 INFO  (coreLoadExecutor-4351-thread-1-processing-n:127.0.0.1:51082__%2Fii) [n:127.0.0.1:51082__%2Fii c:control_collection s:shard1 r:core_node1 x:collection1] o.a.s.u.p.UpdateRequestProcessorChain inserting DistributedUpdateProcessorFactory into updateRequestProcessorChain "distrib-dup-test-chain-implicit"
   [junit4]   2> 1408154 INFO  (coreLoadExecutor-4351-thread-1-processing-n:127.0.0.1:51082__%2Fii) [n:127.0.0.1:51082__%2Fii c:control_collection s:shard1 r:core_node1 x:collection1] o.a.s.c.SolrCore no updateRequestProcessorChain defined as default, creating implicit default
   [junit4]   2> 1408154 WARN  (coreLoadExecutor-4351-thread-1-processing-n:127.0.0.1:51082__%2Fii) [n:127.0.0.1:51082__%2Fii c:control_collection s:shard1 r:core_node1 x:collection1] o.a.s.c.RequestHandlers INVALID paramSet a in requestHandler {type = requestHandler,name = /dump,class = DumpRequestHandler,args = {defaults={a=A,b=B}}}
   [junit4]   2> 1408156 INFO  (coreLoadExecutor-4351-thread-1-processing-n:127.0.0.1:51082__%2Fii) [n:127.0.0.1:51082__%2Fii c:control_collection s:shard1 r:core_node1 x:collection1] o.a.s.h.l.XMLLoader xsltCacheLifetimeSeconds=60
   [junit4]   2> 1408157 INFO  (coreLoadExecutor-4351-thread-1-processing-n:127.0.0.1:51082__%2Fii) [n:127.0.0.1:51082__%2Fii c:control_collection s:shard1 r:core_node1 x:collection1] o.a.s.h.l.XMLLoader xsltCacheLifetimeSeconds=60
   [junit4]   2> 1408158 INFO  (coreLoadExecutor-4351-thread-1-processing-n:127.0.0.1:51082__%2Fii) [n:127.0.0.1:51082__%2Fii c:control_collection s:shard1 r:core_node1 x:collection1] o.a.s.h.l.XMLLoader xsltCacheLifetimeSeconds=60
   [junit4]   2> 1408159 INFO  (coreLoadExecutor-4351-thread-1-processing-n:127.0.0.1:51082__%2Fii) [n:127.0.0.1:51082__%2Fii c:control_collection s:shard1 r:core_node1 x:collection1] o.a.s.h.l.XMLLoader xsltCacheLifetimeSeconds=60
   [junit4]   2> 1408162 INFO  (coreLoadExecutor-4351-thread-1-processing-n:127.0.0.1:51082__%2Fii) [n:127.0.0.1:51082__%2Fii c:control_collection s:shard1 r:core_node1 x:collection1] o.a.s.c.RequestHandlers Registered paths: /admin/mbeans,standard,/dump,/update/csv,/sql,/update/json/docs,/admin/luke,/export,/admin/segments,/get,/admin/system,/replication,/admin/properties,/config,/stream,/schema,/admin/plugins,/admin/logging,/update/json,/admin/threads,/admin/ping,/update,/admin/file
   [junit4]   2> 1408162 INFO  (coreLoadExecutor-4351-thread-1-processing-n:127.0.0.1:51082__%2Fii) [n:127.0.0.1:51082__%2Fii c:control_collection s:shard1 r:core_node1 x:collection1] o.a.s.c.SolrCore Using default statsCache cache: org.apache.solr.search.stats.LocalStatsCache
   [junit4]   2> 1408163 INFO  (coreLoadExecutor-4351-thread-1-processing-n:127.0.0.1:51082__%2Fii) [n:127.0.0.1:51082__%2Fii c:control_collection s:shard1 r:core_node1 x:collection1] o.a.s.u.UpdateHandler Using UpdateLog implementation: org.apache.solr.update.UpdateLog
   [junit4]   2> 1408163 INFO  (coreLoadExecutor-4351-thread-1-processing-n:127.0.0.1:51082__%2Fii) [n:127.0.0.1:51082__%2Fii c:control_collection s:shard1 r:core_node1 x:collection1] o.a.s.u.UpdateLog Initializing UpdateLog: dataDir= defaultSyncLevel=FLUSH numRecordsToKeep=100 maxNumLogsToKeep=10 numVersionBuckets=65536
   [junit4]   2> 1408164 INFO  (coreLoadExecutor-4351-thread-1-processing-n:127.0.0.1:51082__%2Fii) [n:127.0.0.1:51082__%2Fii c:control_collection s:shard1 r:core_node1 x:collection1] o.a.s.u.CommitTracker Hard AutoCommit: disabled
   [junit4]   2> 1408164 INFO  (coreLoadExecutor-4351-thread-1-processing-n:127.0.0.1:51082__%2Fii) [n:127.0.0.1:51082__%2Fii c:control_collection s:shard1 r:core_node1 x:collection1] o.a.s.u.CommitTracker Soft AutoCommit: disabled
   [junit4]   2> 1408164 INFO  (coreLoadExecutor-4351-thread-1-processing-n:127.0.0.1:51082__%2Fii) [n:127.0.0.1:51082__%2Fii c:control_collection s:shard1 r:core_node1 x:collection1] o.a.s.u.RandomMergePolicy RandomMergePolicy wrapping class org.apache.lucene.index.LogDocMergePolicy: [LogDocMergePolicy: minMergeSize=1000, mergeFactor=15, maxMergeSize=9223372036854775807, maxMergeSizeForForcedMerge=9223372036854775807, calibrateSizeByDeletes=false, maxMergeDocs=2147483647, maxCFSSegmentSizeMB=8.796093022207999E12, noCFSRatio=0.1619958427160583]
   [junit4]   2> 1408164 INFO  (coreLoadExecutor-4351-thread-1-processing-n:127.0.0.1:51082__%2Fii) [n:127.0.0.1:51082__%2Fii c:control_collection s:shard1 r:core_node1 x:collection1] o.a.s.c.SolrDeletionPolicy SolrDeletionPolicy.onInit: commits: num=1
   [junit4]   2> 	commit{dir=MockDirectoryWrapper(RAMDirectory@524d08d lockFactory=org.apache.lucene.store.SingleInstanceLockFactory@7166ebcf),segFN=segments_1,generation=1}
   [junit4]   2> 1408165 INFO  (coreLoadExecutor-4351-thread-1-processing-n:127.0.0.1:51082__%2Fii) [n:127.0.0.1:51082__%2Fii c:control_collection s:shard1 r:core_node1 x:collection1] o.a.s.c.SolrDeletionPolicy newest commit generation = 1
   [junit4]   2> 1408165 INFO  (coreLoadExecutor-4351-thread-1-processing-n:127.0.0.1:51082__%2Fii) [n:127.0.0.1:51082__%2Fii c:control_collection s:shard1 r:core_node1 x:collection1] o.a.s.s.SolrIndexSearcher Opening [Searcher@23fef72f[collection1] main]
   [junit4]   2> 1408165 INFO  (coreLoadExecutor-4351-thread-1-processing-n:127.0.0.1:51082__%2Fii) [n:127.0.0.1:51082__%2Fii c:control_collection s:shard1 r:core_node1 x:collection1] o.a.s.c.c.ZkStateReader Load collection config from: [/collections/control_collection]
   [junit4]   2> 1408166 INFO  (coreLoadExecutor-4351-thread-1-processing-n:127.0.0.1:51082__%2Fii) [n:127.0.0.1:51082__%2Fii c:control_collection s:shard1 r:core_node1 x:collection1] o.a.s.c.c.ZkStateReader path=[/collections/control_collection] [configName]=[conf1] specified config exists in ZooKeeper
   [junit4]   2> 1408166 INFO  (coreLoadExecutor-4351-thread-1-processing-n:127.0.0.1:51082__%2Fii) [n:127.0.0.1:51082__%2Fii c:control_collection s:shard1 r:core_node1 x:collection1] o.a.s.r.ManagedResourceStorage Setting up ZooKeeper-based storage for the RestManager with znodeBase: /configs/conf1
   [junit4]   2> 1408167 INFO  (coreLoadExecutor-4351-thread-1-processing-n:127.0.0.1:51082__%2Fii) [n:127.0.0.1:51082__%2Fii c:control_collection s:shard1 r:core_node1 x:collection1] o.a.s.r.ManagedResourceStorage Configured ZooKeeperStorageIO with znodeBase: /configs/conf1
   [junit4]   2> 1408167 INFO  (coreLoadExecutor-4351-thread-1-processing-n:127.0.0.1:51082__%2Fii) [n:127.0.0.1:51082__%2Fii c:control_collection s:shard1 r:core_node1 x:collection1] o.a.s.r.RestManager Initializing RestManager with initArgs: {}
   [junit4]   2> 1408167 INFO  (coreLoadExecutor-4351-thread-1-processing-n:127.0.0.1:51082__%2Fii) [n:127.0.0.1:51082__%2Fii c:control_collection s:shard1 r:core_node1 x:collection1] o.a.s.r.ManagedResourceStorage Reading _rest_managed.json using ZooKeeperStorageIO:path=/configs/conf1
   [junit4]   2> 1408167 INFO  (coreLoadExecutor-4351-thread-1-processing-n:127.0.0.1:51082__%2Fii) [n:127.0.0.1:51082__%2Fii c:control_collection s:shard1 r:core_node1 x:collection1] o.a.s.r.ManagedResourceStorage No data found for znode /configs/conf1/_rest_managed.json
   [junit4]   2> 1408167 INFO  (coreLoadExecutor-4351-thread-1-processing-n:127.0.0.1:51082__%2Fii) [n:127.0.0.1:51082__%2Fii c:control_collection s:shard1 r:core_node1 x:collection1] o.a.s.r.ManagedResourceStorage Loaded null at path _rest_managed.json using ZooKeeperStorageIO:path=/configs/conf1
   [junit4]   2> 1408167 INFO  (coreLoadExecutor-4351-thread-1-processing-n:127.0.0.1:51082__%2Fii) [n:127.0.0.1:51082__%2Fii c:control_collection s:shard1 r:core_node1 x:collection1] o.a.s.r.RestManager Initializing 0 registered ManagedResources
   [junit4]   2> 1408168 INFO  (coreLoadExecutor-4351-thread-1-processing-n:127.0.0.1:51082__%2Fii) [n:127.0.0.1:51082__%2Fii c:control_collection s:shard1 r:core_node1 x:collection1] o.a.s.h.ReplicationHandler Commits will be reserved for  10000
   [junit4]   2> 1408168 INFO  (searcherExecutor-4352-thread-1-processing-n:127.0.0.1:51082__%2Fii x:collection1 s:shard1 c:control_collection r:core_node1) [n:127.0.0.1:51082__%2Fii c:control_collection s:shard1 r:core_node1 x:collection1] o.a.s.c.SolrCore [collection1] Registered new searcher Searcher@23fef72f[collection1] main{ExitableDirectoryReader(UninvertingDirectoryReader())}
   [junit4]   2> 1408168 INFO  (coreLoadExecutor-4351-thread-1-processing-n:127.0.0.1:51082__%2Fii) [n:127.0.0.1:51082__%2Fii c:control_collection s:shard1 r:core_node1 x:collection1] o.a.s.u.UpdateLog Looking up max value of version field to seed version buckets
   [junit4]   2> 1408168 INFO  (coreLoadExecutor-4351-thread-1-processing-n:127.0.0.1:51082__%2Fii) [n:127.0.0.1:51082__%2Fii c:control_collection s:shard1 r:core_node1 x:collection1] o.a.s.u.VersionInfo Refreshing highest value of _version_ for 65536 version buckets from index
   [junit4]   2> 1408168 INFO  (coreLoadExecutor-4351-thread-1-processing-n:127.0.0.1:51082__%2Fii) [n:127.0.0.1:51082__%2Fii c:control_collection s:shard1 r:core_node1 x:collection1] o.a.s.u.VersionInfo No terms found for _version_, cannot seed version bucket highest value from index
   [junit4]   2> 1408168 INFO  (coreLoadExecutor-4351-thread-1-processing-n:127.0.0.1:51082__%2Fii) [n:127.0.0.1:51082__%2Fii c:control_collection s:shard1 r:core_node1 x:collection1] o.a.s.u.UpdateLog Could not find max version in index or recent updates, using new clock 1523267130819084288
   [junit4]   2> 1408170 INFO  (coreLoadExecutor-4351-thread-1-processing-n:127.0.0.1:51082__%2Fii) [n:127.0.0.1:51082__%2Fii c:control_collection s:shard1 r:core_node1 x:collection1] o.a.s.u.UpdateLog Took 2.0ms to seed version buckets with highest version 1523267130819084288
   [junit4]   2> 1408170 INFO  (coreLoadExecutor-4351-thread-1-processing-n:127.0.0.1:51082__%2Fii) [n:127.0.0.1:51082__%2Fii c:control_collection s:shard1 r:core_node1 x:collection1] o.a.s.c.ZkController watch zkdir /configs/conf1
   [junit4]   2> 1408171 INFO  (coreLoadExecutor-4351-thread-1-processing-n:127.0.0.1:51082__%2Fii) [n:127.0.0.1:51082__%2Fii c:control_collection s:shard1 r:core_node1 x:collection1] o.a.s.c.CoreContainer registering core: collection1
   [junit4]   2> 1408172 INFO  (coreZkRegister-4345-thread-1-processing-n:127.0.0.1:51082__%2Fii x:collection1 s:shard1 c:control_collection r:core_node1) [n:127.0.0.1:51082__%2Fii c:control_collection s:shard1 r:core_node1 x:collection1] o.a.s.c.ZkController Register replica - core:collection1 address:http://127.0.0.1:51082/_/ii collection:control_collection shard:shard1
   [junit4]   2> 1408173 INFO  (coreZkRegister-4345-thread-1-processing-n:127.0.0.1:51082__%2Fii x:collection1 s:shard1 c:control_collection r:core_node1) [n:127.0.0.1:51082__%2Fii c:control_collection s:shard1 r:core_node1 x:collection1] o.a.s.c.c.SolrZkClient makePath: /collections/control_collection/leader_elect/shard1/election
   [junit4]   2> 1408178 INFO  (coreZkRegister-4345-thread-1-processing-n:127.0.0.1:51082__%2Fii x:collection1 s:shard1 c:control_collection r:core_node1) [n:127.0.0.1:51082__%2Fii c:control_collection s:shard1 r:core_node1 x:collection1] o.a.s.c.LeaderElector Joined leadership election with path: /collections/control_collection/leader_elect/shard1/election/95204195568844804-core_node1-n_0000000000
   [junit4]   2> 1408179 INFO  (coreZkRegister-4345-thread-1-processing-n:127.0.0.1:51082__%2Fii x:collection1 s:shard1 c:control_collection r:core_node1) [n:127.0.0.1:51082__%2Fii c:control_collection s:shard1 r:core_node1 x:collection1] o.a.s.c.ShardLeaderElectionContext Running the leader process for shard=shard1 and weAreReplacement=false and leaderVoteWait=180000
   [junit4]   2> 1408182 INFO  (coreZkRegister-4345-thread-1-processing-n:127.0.0.1:51082__%2Fii x:collection1 s:shard1 c:control_collection r:core_node1) [n:127.0.0.1:51082__%2Fii c:control_collection s:shard1 r:core_node1 x:collection1] o.a.s.c.ShardLeaderElectionContext Enough replicas found to continue.
   [junit4]   2> 1408182 INFO  (coreZkRegister-4345-thread-1-processing-n:127.0.0.1:51082__%2Fii x:collection1 s:shard1 c:control_collection r:core_node1) [n:127.0.0.1:51082__%2Fii c:control_collection s:shard1 r:core_node1 x:collection1] o.a.s.c.ShardLeaderElectionContext I may be the new leader - try and sync
   [junit4]   2> 1408182 INFO  (coreZkRegister-4345-thread-1-processing-n:127.0.0.1:51082__%2Fii x:collection1 s:shard1 c:control_collection r:core_node1) [n:127.0.0.1:51082__%2Fii c:control_collection s:shard1 r:core_node1 x:collection1] o.a.s.c.SyncStrategy Sync replicas to http://127.0.0.1:51082/_/ii/collection1/
   [junit4]   2> 1408182 INFO  (coreZkRegister-4345-thread-1-processing-n:127.0.0.1:51082__%2Fii x:collection1 s:shard1 c:control_collection r:core_node1) [n:127.0.0.1:51082__%2Fii c:control_collection s:shard1 r:core_node1 x:collection1] o.a.s.c.SyncStrategy Sync Success - now sync replicas to me
   [junit4]   2> 1408182 INFO  (coreZkRegister-4345-thread-1-processing-n:127.0.0.1:51082__%2Fii x:collection1 s:shard1 c:control_collection r:core_node1) [n:127.0.0.1:51082__%2Fii c:control_collection s:shard1 r:core_node1 x:collection1] o.a.s.c.SyncStrategy http://127.0.0.1:51082/_/ii/collection1/ has no replicas
   [junit4]   2> 1408182 INFO  (OverseerStateUpdate-95204195568844804-127.0.0.1:51082__%2Fii-n_0000000000) [n:127.0.0.1:51082__%2Fii    ] o.a.s.c.Overseer processMessage: queueSize: 1, message = {
   [junit4]   2>   "operation":"leader",
   [junit4]   2>   "shard":"shard1",
   [junit4]   2>   "collection":"control_collection"} current state version: 1
   [junit4]   2> 1408183 INFO  (coreZkRegister-4345-thread-1-processing-n:127.0.0.1:51082__%2Fii x:collection1 s:shard1 c:control_collection r:core_node1) [n:127.0.0.1:51082__%2Fii c:control_collection s:shard1 r:core_node1 x:collection1] o.a.s.c.c.SolrZkClient makePath: /collections/control_collection/leaders/shard1
   [junit4]   2> 1408187 INFO  (coreZkRegister-4345-thread-1-processing-n:127.0.0.1:51082__%2Fii x:collection1 s:shard1 c:control_collection r:core_node1) [n:127.0.0.1:51082__%2Fii c:control_collection s:shard1 r:core_node1 x:collection1] o.a.s.c.ShardLeaderElectionContextBase Creating leader registration node
   [junit4]   2> 1408190 INFO  (coreZkRegister-4345-thread-1-processing-n:127.0.0.1:51082__%2Fii x:collection1 s:shard1 c:control_collection r:core_node1) [n:127.0.0.1:51082__%2Fii c:control_collection s:shard1 r:core_node1 x:collection1] o.a.s.c.ShardLeaderElectionContext I am the new leader: http://127.0.0.1:51082/_/ii/collection1/ shard1
   [junit4]   2> 1408191 INFO  (OverseerStateUpdate-95204195568844804-127.0.0.1:51082__%2Fii-n_0000000000) [n:127.0.0.1:51082__%2Fii    ] o.a.s.c.Overseer processMessage: queueSize: 1, message = {
   [junit4]   2>   "operation":"leader",
   [junit4]   2>   "shard":"shard1",
   [junit4]   2>   "collection":"control_collection",
   [junit4]   2>   "base_url":"http://127.0.0.1:51082/_/ii",
   [junit4]   2>   "core":"collection1",
   [junit4]   2>   "state":"active"} current state version: 1
   [junit4]   2> 1408294 INFO  (zkCallback-1517-thread-1-processing-n:127.0.0.1:51082__%2Fii) [n:127.0.0.1:51082__%2Fii    ] o.a.s.c.c.ZkStateReader A cluster state change: [WatchedEvent state:SyncConnected type:NodeDataChanged path:/clusterstate.json], has occurred - updating... (live nodes size: [1])
   [junit4]   2> 1408345 INFO  (coreZkRegister-4345-thread-1-processing-n:127.0.0.1:51082__%2Fii x:collection1 s:shard1 c:control_collection r:core_node1) [n:127.0.0.1:51082__%2Fii c:control_collection s:shard1 r:core_node1 x:collection1] o.a.s.c.ZkController We are http://127.0.0.1:51082/_/ii/collection1/ and leader is http://127.0.0.1:51082/_/ii/collection1/
   [junit4]   2> 1408345 INFO  (coreZkRegister-4345-thread-1-processing-n:127.0.0.1:51082__%2Fii x:collection1 s:shard1 c:control_collection r:core_node1) [n:127.0.0.1:51082__%2Fii c:control_collection s:shard1 r:core_node1 x:collection1] o.a.s.c.ZkController No LogReplay needed for core=collection1 baseURL=http://127.0.0.1:51082/_/ii
   [junit4]   2> 1408345 INFO  (coreZkRegister-4345-thread-1-processing-n:127.0.0.1:51082__%2Fii x:collection1 s:shard1 c:control_collection r:core_node1) [n:127.0.0.1:51082__%2Fii c:control_collection s:shard1 r:core_node1 x:collection1] o.a.s.c.ZkController I am the leader, no recovery necessary
   [junit4]   2> 1408345 INFO  (coreZkRegister-4345-thread-1-processing-n:127.0.0.1:51082__%2Fii x:collection1 s:shard1 c:control_collection r:core_node1) [n:127.0.0.1:51082__%2Fii c:control_collection s:shard1 r:core_node1 x:collection1] o.a.s.c.ZkController publishing state=active
   [junit4]   2> 1408345 INFO  (coreZkRegister-4345-thread-1-processing-n:127.0.0.1:51082__%2Fii x:collection1 s:shard1 c:control_collection r:core_node1) [n:127.0.0.1:51082__%2Fii c:control_collection s:shard1 r:core_node1 x:collection1] o.a.s.c.ZkController numShards not found on descriptor - reading it from system property
   [junit4]   2> 1408348 INFO  (OverseerStateUpdate-95204195568844804-127.0.0.1:51082__%2Fii-n_0000000000) [n:127.0.0.1:51082__%2Fii    ] o.a.s.c.Overseer processMessage: queueSize: 1, message = {
   [junit4]   2>   "core":"collection1",
   [junit4]   2>   "core_node_name":"core_node1",
   [junit4]   2>   "roles":null,
   [junit4]   2>   "base_url":"http://127.0.0.1:51082/_/ii",
   [junit4]   2>   "node_name":"127.0.0.1:51082__%2Fii",
   [junit4]   2>   "numShards":"1",
   [junit4]   2>   "state":"active",
   [junit4]   2>   "shard":"shard1",
   [junit4]   2>   "collection":"control_collection",
   [junit4]   2>   "operation":"state"} current state version: 2
   [junit4]   2> 1408348 INFO  (OverseerStateUpdate-95204195568844804-127.0.0.1:51082__%2Fii-n_0000000000) [n:127.0.0.1:51082__%2Fii    ] o.a.s.c.o.ReplicaMutator Update state numShards=1 message={
   [junit4]   2>   "core":"collection1",
   [junit4]   2>   "core_node_name":"core_node1",
   [junit4]   2>   "roles":null,
   [junit4]   2>   "base_url":"http://127.0.0.1:51082/_/ii",
   [junit4]   2>   "node_name":"127.0.0.1:51082__%2Fii",
   [junit4]   2>   "numShards":"1",
   [junit4]   2>   "state":"active",
   [junit4]   2>   "shard":"shard1",
   [junit4]   2>   "collection":"control_collection",
   [junit4]   2>   "operation":"state"}
   [junit4]   2> 1408452 INFO  (zkCallback-1517-thread-1-processing-n:127.0.0.1:51082__%2Fii) [n:127.0.0.1:51082__%2Fii    ] o.a.s.c.c.ZkStateReader A cluster state change: [WatchedEvent state:SyncConnected type:NodeDataChanged path:/clusterstate.json], has occurred - updating... (live nodes size: [1])
   [junit4]   2> 1408520 INFO  (TEST-CollectionsAPIDistributedZkTest.test-seed#[29A54686BD207A15]) [    ] o.a.s.c.c.SolrZkClient Using default ZkCredentialsProvider
   [junit4]   2> 1408520 INFO  (TEST-CollectionsAPIDistributedZkTest.test-seed#[29A54686BD207A15]) [    ] o.a.s.c.c.ConnectionManager Waiting for client to connect to ZooKeeper
   [junit4]   2> 1408522 INFO  (zkCallback-1519-thread-1) [    ] o.a.s.c.c.ConnectionManager Watcher org.apache.solr.common.cloud.ConnectionManager@750e898b name:ZooKeeperConnection Watcher:127.0.0.1:53112/solr got event WatchedEvent state:SyncConnected type:None path:null path:null type:None
   [junit4]   2> 1408522 INFO  (TEST-CollectionsAPIDistributedZkTest.test-seed#[29A54686BD207A15]) [    ] o.a.s.c.c.ConnectionManager Client is connected to ZooKeeper
   [junit4]   2> 1408522 INFO  (TEST-CollectionsAPIDistributedZkTest.test-seed#[29A54686BD207A15]) [    ] o.a.s.c.c.SolrZkClient Using default ZkACLProvider
   [junit4]   2> 1408522 INFO  (TEST-CollectionsAPIDistributedZkTest.test-seed#[29A54686BD207A15]) [    ] o.a.s.c.c.ZkStateReader Updating cluster state from ZooKeeper... 
   [junit4]   2> 1408526 INFO  (TEST-CollectionsAPIDistributedZkTest.test-seed#[29A54686BD207A15]) [    ] o.a.s.c.ChaosMonkey monkey: init - expire sessions:false cause connection loss:false
   [junit4]   2> 1408526 INFO  (TEST-CollectionsAPIDistributedZkTest.test-seed#[29A54686BD207A15]) [    ] o.a.s.c.AbstractFullDistribZkTestBase Creating collection1 with stateFormat=2
   [junit4]   2> 1408526 INFO  (TEST-CollectionsAPIDistributedZkTest.test-seed#[29A54686BD207A15]) [    ] o.a.s.c.c.SolrZkClient Using default ZkCredentialsProvider
   [junit4]   2> 1408526 INFO  (TEST-CollectionsAPIDistributedZkTest.test-seed#[29A54686BD207A15]) [    ] o.a.s.c.c.ConnectionManager Waiting for client to connect to ZooKeeper
   [junit4]   2> 1408528 INFO  (zkCallback-1520-thread-1) [    ] o.a.s.c.c.ConnectionManager Watcher org.apache.solr.common.cloud.ConnectionManager@86202e4 name:ZooKeeperConnection Watcher:127.0.0.1:53112/solr got event WatchedEvent state:SyncConnected type:None path:null path:null type:None
   [junit4]   2> 1408528 INFO  (TEST-CollectionsAPIDistributedZkTest.test-seed#[29A54686BD207A15]) [    ] o.a.s.c.c.ConnectionManager Client is connected to ZooKeeper
   [junit4]   2> 1408528 INFO  (TEST-CollectionsAPIDistributedZkTest.test-seed#[29A54686BD207A15]) [    ] o.a.s.c.c.SolrZkClient Using default ZkACLProvider
   [junit4]   2> 1408532 INFO  (OverseerStateUpdate-95204195568844804-127.0.0.1:51082__%2Fii-n_0000000000) [n:127.0.0.1:51082__%2Fii    ] o.a.s.c.Overseer processMessage: queueSize: 1, message = {
   [junit4]   2>   "operation":"create",
   [junit4]   2>   "name":"collection1",
   [junit4]   2>   "numShards":"2",
   [junit4]   2>   "stateFormat":"2"} current state version: 3
   [junit4]   2> 1408532 INFO  (OverseerStateUpdate-95204195568844804-127.0.0.1:51082__%2Fii-n_0000000000) [n:127.0.0.1:51082__%2Fii    ] o.a.s.c.o.ClusterStateMutator building a new cName: collection1
   [junit4]   2> 1408636 INFO  (OverseerStateUpdate-95204195568844804-127.0.0.1:51082__%2Fii-n_0000000000) [n:127.0.0.1:51082__%2Fii    ] o.a.s.c.o.ZkStateWriter going to create_collection /collections/collection1/state.json
   [junit4]   2> 1409030 INFO  (TEST-CollectionsAPIDistributedZkTest.test-seed#[29A54686BD207A15]) [    ] o.a.s.SolrTestCaseJ4 Writing core.properties file to /export/home/jenkins/workspace/Lucene-Solr-trunk-Solaris/solr/build/solr-core/test/J0/temp/solr.cloud.CollectionsAPIDistributedZkTest_29A54686BD207A15-001/shard-1-001/cores/collection1
   [junit4]   2> 1409031 INFO  (TEST-CollectionsAPIDistributedZkTest.test-seed#[29A54686BD207A15]) [    ] o.a.s.c.AbstractFullDistribZkTestBase create jetty 1 in directory /export/home/jenkins/workspace/Lucene-Solr-trunk-Solaris/solr/build/solr-core/test/J0/temp/solr.cloud.CollectionsAPIDistributedZkTest_29A54686BD207A15-001/shard-1-001
   [junit4]   2> 1409032 INFO  (TEST-CollectionsAPIDistributedZkTest.test-seed#[29A54686BD207A15]) [    ] o.e.j.s.Server jetty-9.2.13.v20150730
   [junit4]   2> 1409035 INFO  (TEST-CollectionsAPIDistributedZkTest.test-seed#[29A54686BD207A15]) [    ] o.e.j.s.h.ContextHandler Started o.e.j.s.ServletContextHandler@5a49ac2a{/_/ii,null,AVAILABLE}
   [junit4]   2> 1409035 INFO  (TEST-CollectionsAPIDistributedZkTest.test-seed#[29A54686BD207A15]) [    ] o.e.j.s.ServerConnector Started ServerConnector@5f3afd9f{HTTP/1.1}{127.0.0.1:55305}
   [junit4]   2> 1409035 INFO  (TEST-CollectionsAPIDistributedZkTest.test-seed#[29A54686BD207A15]) [    ] o.e.j.s.Server Started @1413397ms
   [junit4]   2> 1409035 INFO  (TEST-CollectionsAPIDistributedZkTest.test-seed#[29A54686BD207A15]) [    ] o.a.s.c.s.e.JettySolrRunner Jetty properties: {solr.data.dir=/export/home/jenkins/workspace/Lucene-Solr-trunk-Solaris/solr/build/solr-core/test/J0/temp/solr.cloud.CollectionsAPIDistributedZkTest_29A54686BD207A15-001/tempDir-001/jetty1, solrconfig=solrconfig.xml, hostContext=/_/ii, hostPort=55305, coreRootDirectory=/export/home/jenkins/workspace/Lucene-Solr-trunk-Solaris/solr/build/solr-core/test/J0/temp/solr.cloud.CollectionsAPIDistributedZkTest_29A54686BD207A15-001/shard-1-001/cores}
   [junit4]   2> 1409036 INFO  (TEST-CollectionsAPIDistributedZkTest.test-seed#[29A54686BD207A15]) [    ] o.a.s.s.SolrDispatchFilter SolrDispatchFilter.init(): sun.misc.Launcher$AppClassLoader@659e0bfd
   [junit4]   2> 1409036 INFO  (TEST-CollectionsAPIDistributedZkTest.test-seed#[29A54686BD207A15]) [    ] o.a.s.c.SolrResourceLoader new SolrResourceLoader for directory: '/export/home/jenkins/workspace/Lucene-Solr-trunk-Solaris/solr/build/solr-core/test/J0/temp/solr.cloud.CollectionsAPIDistributedZkTest_29A54686BD207A15-001/shard-1-001'
   [junit4]   2> 1409036 INFO  (TEST-CollectionsAPIDistributedZkTest.test-seed#[29A54686BD207A15]) [    ] o.a.s.c.SolrResourceLoader JNDI not configured for solr (NoInitialContextEx)
   [junit4]   2> 1409036 INFO  (TEST-CollectionsAPIDistributedZkTest.test-seed#[29A54686BD207A15]) [    ] o.a.s.c.SolrResourceLoader solr home defaulted to 'solr/' (could not find system property or JNDI)
   [junit4]   2> 1409036 INFO  (TEST-CollectionsAPIDistributedZkTest.test-seed#[29A54686BD207A15]) [    ] o.a.s.c.c.SolrZkClient Using default ZkCredentialsProvider
   [junit4]   2> 1409037 INFO  (TEST-CollectionsAPIDistributedZkTest.test-seed#[29A54686BD207A15]) [    ] o.a.s.c.c.ConnectionManager Waiting for client to connect to ZooKeeper
   [junit4]   2> 1409038 INFO  (zkCallback-1521-thread-1) [    ] o.a.s.c.c.ConnectionManager Watcher org.apache.solr.common.cloud.ConnectionManager@521bfb39 name:ZooKeeperConnection Watcher:127.0.0.1:53112/solr got event WatchedEvent state:SyncConnected type:None path:null path:null type:None
   [junit4]   2> 1409039 INFO  (TEST-CollectionsAPIDistributedZkTest.test-seed#[29A54686BD207A15]) [    ] o.a.s.c.c.ConnectionManager Client is connected to ZooKeeper
   [junit4]   2> 1409039 INFO  (TEST-CollectionsAPIDistributedZkTest.test-seed#[29A54686BD207A15]) [    ] o.a.s.c.c.SolrZkClient Using default ZkACLProvider
   [junit4]   2> 1409040 INFO  (TEST-CollectionsAPIDistributedZkTest.test-seed#[29A54686BD207A15]) [    ] o.a.s.s.SolrDispatchFilter Loading solr.xml from SolrHome (not found in ZooKeeper)
   [junit4]   2> 1409040 INFO  (TEST-CollectionsAPIDistributedZkTest.test-seed#[29A54686BD207A15]) [    ] o.a.s.c.SolrXmlConfig Loading container configuration from /export/home/jenkins/workspace/Lucene-Solr-trunk-Solaris/solr/build/solr-core/test/J0/temp/solr.cloud.CollectionsAPIDistributedZkTest_29A54686BD207A15-001/shard-1-001/solr.xml
   [junit4]   2> 1409045 INFO  (TEST-CollectionsAPIDistributedZkTest.test-seed#[29A54686BD207A15]) [    ] o.a.s.c.CorePropertiesLocator Config-defined core root directory: /export/home/jenkins/workspace/Lucene-Solr-trunk-Solaris/solr/build/solr-core/test/J0/temp/solr.cloud.CollectionsAPIDistributedZkTest_29A54686BD207A15-001/shard-1-001/cores
   [junit4]   2> 1409045 INFO  (TEST-CollectionsAPIDistributedZkTest.test-seed#[29A54686BD207A15]) [    ] o.a.s.c.CoreContainer New CoreContainer 806077880
   [junit4]   2> 1409045 INFO  (TEST-CollectionsAPIDistributedZkTest.test-seed#[29A54686BD207A15]) [    ] o.a.s.c.CoreContainer Loading cores into CoreContainer [instanceDir=/export/home/jenkins/workspace/Lucene-Solr-trunk-Solaris/solr/build/solr-core/test/J0/temp/solr.cloud.CollectionsAPIDistributedZkTest_29A54686BD207A15-001/shard-1-001]
   [junit4]   2> 1409046 WARN  (TEST-CollectionsAPIDistributedZkTest.test-seed#[29A54686BD207A15]) [    ] o.a.s.c.CoreContainer Couldn't add files from /export/home/jenkins/workspace/Lucene-Solr-trunk-Solaris/solr/build/solr-core/test/J0/temp/solr.cloud.CollectionsAPIDistributedZkTest_29A54686BD207A15-001/shard-1-001/lib to classpath: /export/home/jenkins/workspace/Lucene-Solr-trunk-Solaris/solr/build/solr-core/test/J0/temp/solr.cloud.CollectionsAPIDistributedZkTest_29A54686BD207A15-001/shard-1-001/lib
   [junit4]   2> 1409046 INFO  (TEST-CollectionsAPIDistributedZkTest.test-seed#[29A54686BD207A15]) [    ] o.a.s.h.c.HttpShardHandlerFactory created with socketTimeout : 90000,urlScheme : ,connTimeout : 15000,maxConnectionsPerHost : 20,maxConnections : 10000,corePoolSize : 0,maximumPoolSize : 2147483647,maxThreadIdleTime : 5,sizeOfQueue : -1,fairnessPolicy : false,useRetries : false,
   [junit4]   2> 1409047 INFO  (TEST-CollectionsAPIDistributedZkTest.test-seed#[29A54686BD207A15]) [    ] o.a.s.u.UpdateShardHandler Creating UpdateShardHandler HTTP client with params: socketTimeout=340000&connTimeout=45000&retry=true
   [junit4]   2> 1409047 INFO  (TEST-CollectionsAPIDistributedZkTest.test-seed#[29A54686BD207A15]) [    ] o.a.s.l.LogWatcher SLF4J impl is org.slf4j.impl.Log4jLoggerFactory
   [junit4]   2> 1409047 INFO  (TEST-CollectionsAPIDistributedZkTest.test-seed#[29A54686BD207A15]) [    ] o.a.s.l.LogWatcher Registering Log Listener [Log4j (org.slf4j.impl.Log4jLoggerFactory)]
   [junit4]   2> 1409047 INFO  (TEST-CollectionsAPIDistributedZkTest.test-seed#[29A54686BD207A15]) [    ] o.a.s.c.ZkContainer Zookeeper client=127.0.0.1:53112/solr
   [junit4]   2> 1409047 INFO  (TEST-CollectionsAPIDistributedZkTest.test-seed#[29A54686BD207A15]) [    ] o.a.s.c.ZkController zkHost includes chroot
   [junit4]   2> 1409048 INFO  (TEST-CollectionsAPIDistributedZkTest.test-seed#[29A54686BD207A15]) [    ] o.a.s.c.c.SolrZkClient Using default ZkCredentialsProvider
   [junit4]   2> 1409048 INFO  (TEST-CollectionsAPIDistributedZkTest.test-seed#[29A54686BD207A15]) [    ] o.a.s.c.c.ConnectionManager Waiting for client to connect to ZooKeeper
   [junit4]   2> 1409050 INFO  (zkCallback-1524-thread-1) [    ] o.a.s.c.c.ConnectionManager Watcher org.apache.solr.common.cloud.ConnectionManager@1290f4b4 name:ZooKeeperConnection Watcher:127.0.0.1:53112 got event WatchedEvent state:SyncConnected type:None path:null path:null type:None
   [junit4]   2> 1409050 INFO  (TEST-CollectionsAPIDistributedZkTest.test-seed#[29A54686BD207A15]) [    ] o.a.s.c.c.ConnectionManager Client is connected to ZooKeeper
   [junit4]   2> 1409050 INFO  (TEST-CollectionsAPIDistributedZkTest.test-seed#[29A54686BD207A15]) [    ] o.a.s.c.c.SolrZkClient Using default ZkACLProvider
   [junit4]   2> 1409052 INFO  (TEST-CollectionsAPIDistributedZkTest.test-seed#[29A54686BD207A15]) [n:127.0.0.1:55305__%2Fii    ] o.a.s.c.c.ConnectionManager Waiting for client to connect to ZooKeeper
   [junit4]   2> 1409054 INFO  (zkCallback-1525-thread-1-processing-n:127.0.0.1:55305__%2Fii) [n:127.0.0.1:55305__%2Fii    ] o.a.s.c.c.ConnectionManager Watcher org.apache.solr.common.cloud.ConnectionManager@79be882b name:ZooKeeperConnection Watcher:127.0.0.1:53112/solr got event WatchedEvent state:SyncConnected type:None path:null path:null type:None
   [junit4]   2> 1409054 INFO  (TEST-CollectionsAPIDistributedZkTest.test-seed#[29A54686BD207A15]) [n:127.0.0.1:55305__%2Fii    ] o.a.s.c.c.ConnectionManager Client is connected to ZooKeeper
   [junit4]   2> 1409061 INFO  (TEST-CollectionsAPIDistributedZkTest.test-seed#[29A54686BD207A15]) [n:127.0.0.1:55305__%2Fii    ] o.a.s.c.c.ZkStateReader Updating cluster state from ZooKeeper... 
   [junit4]   2> 1410076 INFO  (TEST-CollectionsAPIDistributedZkTest.test-seed#[29A54686BD207A15]) [n:127.0.0.1:55305__%2Fii    ] o.a.s.c.ZkController Register node as live in ZooKeeper:/live_nodes/127.0.0.1:55305__%2Fii
   [junit4]   2> 1410080 INFO  (TEST-CollectionsAPIDistributedZkTest.test-seed#[29A54686BD207A15]) [n:127.0.0.1:55305__%2Fii    ] o.a.s.c.c.SolrZkClient makePath: /live_nodes/127.0.0.1:55305__%2Fii
   [junit4]   2> 1410086 INFO  (zkCallback-1517-thread-1-processing-n:127.0.0.1:51082__%2Fii) [n:127.0.0.1:51082__%2Fii    ] o.a.s.c.c.ZkStateReader A live node change: [WatchedEvent state:SyncConnected type:NodeChildrenChanged path:/live_nodes], has occurred - updating... (

[...truncated too long message...]

rocessorTest, SolrRequestParserTest, HdfsChaosMonkeyNothingIsSafeTest, TestUpdate, ConjunctionSolrSpellCheckerTest, ClusterStateTest, TestExceedMaxTermLength, URLClassifyProcessorTest, TestMissingGroups, BasicDistributedZkTest, CollectionsAPIDistributedZkTest]
   [junit4]   2> NOTE: reproduce with: ant test  -Dtestcase=CollectionsAPIDistributedZkTest -Dtests.seed=29A54686BD207A15 -Dtests.slow=true -Dtests.locale=ar_MA -Dtests.timezone=Antarctica/Casey -Dtests.asserts=true -Dtests.file.encoding=UTF-8
   [junit4] ERROR   0.00s J0 | CollectionsAPIDistributedZkTest (suite) <<<
   [junit4]    > Throwable #1: com.carrotsearch.randomizedtesting.ThreadLeakError: 5 threads leaked from SUITE scope at org.apache.solr.cloud.CollectionsAPIDistributedZkTest: 
   [junit4]    >    1) Thread[id=11694, name=zkCallback-1548-thread-2, state=TIMED_WAITING, group=TGRP-CollectionsAPIDistributedZkTest]
   [junit4]    >         at sun.misc.Unsafe.park(Native Method)
   [junit4]    >         at java.util.concurrent.locks.LockSupport.parkNanos(LockSupport.java:215)
   [junit4]    >         at java.util.concurrent.SynchronousQueue$TransferStack.awaitFulfill(SynchronousQueue.java:460)
   [junit4]    >         at java.util.concurrent.SynchronousQueue$TransferStack.transfer(SynchronousQueue.java:362)
   [junit4]    >         at java.util.concurrent.SynchronousQueue.poll(SynchronousQueue.java:941)
   [junit4]    >         at java.util.concurrent.ThreadPoolExecutor.getTask(ThreadPoolExecutor.java:1066)
   [junit4]    >         at java.util.concurrent.ThreadPoolExecutor.runWorker(ThreadPoolExecutor.java:1127)
   [junit4]    >         at java.util.concurrent.ThreadPoolExecutor$Worker.run(ThreadPoolExecutor.java:617)
   [junit4]    >         at java.lang.Thread.run(Thread.java:745)
   [junit4]    >    2) Thread[id=9621, name=TEST-CollectionsAPIDistributedZkTest.test-seed#[29A54686BD207A15]-SendThread(127.0.0.1:53112), state=TIMED_WAITING, group=TGRP-CollectionsAPIDistributedZkTest]
   [junit4]    >         at java.lang.Thread.sleep(Native Method)
   [junit4]    >         at org.apache.zookeeper.ClientCnxn$SendThread.run(ClientCnxn.java:994)
   [junit4]    >    3) Thread[id=9622, name=TEST-CollectionsAPIDistributedZkTest.test-seed#[29A54686BD207A15]-EventThread, state=WAITING, group=TGRP-CollectionsAPIDistributedZkTest]
   [junit4]    >         at sun.misc.Unsafe.park(Native Method)
   [junit4]    >         at java.util.concurrent.locks.LockSupport.park(LockSupport.java:175)
   [junit4]    >         at java.util.concurrent.locks.AbstractQueuedSynchronizer$ConditionObject.await(AbstractQueuedSynchronizer.java:2039)
   [junit4]    >         at java.util.concurrent.LinkedBlockingQueue.take(LinkedBlockingQueue.java:442)
   [junit4]    >         at org.apache.zookeeper.ClientCnxn$EventThread.run(ClientCnxn.java:494)
   [junit4]    >    4) Thread[id=11695, name=zkCallback-1548-thread-3, state=TIMED_WAITING, group=TGRP-CollectionsAPIDistributedZkTest]
   [junit4]    >         at sun.misc.Unsafe.park(Native Method)
   [junit4]    >         at java.util.concurrent.locks.LockSupport.parkNanos(LockSupport.java:215)
   [junit4]    >         at java.util.concurrent.SynchronousQueue$TransferStack.awaitFulfill(SynchronousQueue.java:460)
   [junit4]    >         at java.util.concurrent.SynchronousQueue$TransferStack.transfer(SynchronousQueue.java:362)
   [junit4]    >         at java.util.concurrent.SynchronousQueue.poll(SynchronousQueue.java:941)
   [junit4]    >         at java.util.concurrent.ThreadPoolExecutor.getTask(ThreadPoolExecutor.java:1066)
   [junit4]    >         at java.util.concurrent.ThreadPoolExecutor.runWorker(ThreadPoolExecutor.java:1127)
   [junit4]    >         at java.util.concurrent.ThreadPoolExecutor$Worker.run(ThreadPoolExecutor.java:617)
   [junit4]    >         at java.lang.Thread.run(Thread.java:745)
   [junit4]    >    5) Thread[id=9623, name=zkCallback-1548-thread-1, state=TIMED_WAITING, group=TGRP-CollectionsAPIDistributedZkTest]
   [junit4]    >         at sun.misc.Unsafe.park(Native Method)
   [junit4]    >         at java.util.concurrent.locks.LockSupport.parkNanos(LockSupport.java:215)
   [junit4]    >         at java.util.concurrent.SynchronousQueue$TransferStack.awaitFulfill(SynchronousQueue.java:460)
   [junit4]    >         at java.util.concurrent.SynchronousQueue$TransferStack.transfer(SynchronousQueue.java:362)
   [junit4]    >         at java.util.concurrent.SynchronousQueue.poll(SynchronousQueue.java:941)
   [junit4]    >         at java.util.concurrent.ThreadPoolExecutor.getTask(ThreadPoolExecutor.java:1066)
   [junit4]    >         at java.util.concurrent.ThreadPoolExecutor.runWorker(ThreadPoolExecutor.java:1127)
   [junit4]    >         at java.util.concurrent.ThreadPoolExecutor$Worker.run(ThreadPoolExecutor.java:617)
   [junit4]    >         at java.lang.Thread.run(Thread.java:745)
   [junit4]    > 	at __randomizedtesting.SeedInfo.seed([29A54686BD207A15]:0)Throwable #2: com.carrotsearch.randomizedtesting.ThreadLeakError: There are still zombie threads that couldn't be terminated:
   [junit4]    >    1) Thread[id=11694, name=zkCallback-1548-thread-2, state=TIMED_WAITING, group=TGRP-CollectionsAPIDistributedZkTest]
   [junit4]    >         at sun.misc.Unsafe.park(Native Method)
   [junit4]    >         at java.util.concurrent.locks.LockSupport.parkNanos(LockSupport.java:215)
   [junit4]    >         at java.util.concurrent.SynchronousQueue$TransferStack.awaitFulfill(SynchronousQueue.java:460)
   [junit4]    >         at java.util.concurrent.SynchronousQueue$TransferStack.transfer(SynchronousQueue.java:362)
   [junit4]    >         at java.util.concurrent.SynchronousQueue.poll(SynchronousQueue.java:941)
   [junit4]    >         at java.util.concurrent.ThreadPoolExecutor.getTask(ThreadPoolExecutor.java:1066)
   [junit4]    >         at java.util.concurrent.ThreadPoolExecutor.runWorker(ThreadPoolExecutor.java:1127)
   [junit4]    >         at java.util.concurrent.ThreadPoolExecutor$Worker.run(ThreadPoolExecutor.java:617)
   [junit4]    >         at java.lang.Thread.run(Thread.java:745)
   [junit4]    >    2) Thread[id=9621, name=TEST-CollectionsAPIDistributedZkTest.test-seed#[29A54686BD207A15]-SendThread(127.0.0.1:53112), state=TIMED_WAITING, group=TGRP-CollectionsAPIDistributedZkTest]
   [junit4]    >         at java.lang.Thread.sleep(Native Method)
   [junit4]    >         at org.apache.zookeeper.ClientCnxn$SendThread.run(ClientCnxn.java:994)
   [junit4]    >    3) Thread[id=11695, name=zkCallback-1548-thread-3, state=TIMED_WAITING, group=TGRP-CollectionsAPIDistributedZkTest]
   [junit4]    >         at sun.misc.Unsafe.park(Native Method)
   [junit4]    >         at java.util.concurrent.locks.LockSupport.parkNanos(LockSupport.java:215)
   [junit4]    >         at java.util.concurrent.SynchronousQueue$TransferStack.awaitFulfill(SynchronousQueue.java:460)
   [junit4]    >         at java.util.concurrent.SynchronousQueue$TransferStack.transfer(SynchronousQueue.java:362)
   [junit4]    >         at java.util.concurrent.SynchronousQueue.poll(SynchronousQueue.java:941)
   [junit4]    >         at java.util.concurrent.ThreadPoolExecutor.getTask(ThreadPoolExecutor.java:1066)
   [junit4]    >         at java.util.concurrent.ThreadPoolExecutor.runWorker(ThreadPoolExecutor.java:1127)
   [junit4]    >         at java.util.concurrent.ThreadPoolExecutor$Worker.run(ThreadPoolExecutor.java:617)
   [junit4]    >         at java.lang.Thread.run(Thread.java:745)
   [junit4]    >    4) Thread[id=9623, name=zkCallback-1548-thread-1, state=TIMED_WAITING, group=TGRP-CollectionsAPIDistributedZkTest]
   [junit4]    >         at sun.misc.Unsafe.park(Native Method)
   [junit4]    >         at java.util.concurrent.locks.LockSupport.parkNanos(LockSupport.java:215)
   [junit4]    >         at java.util.concurrent.SynchronousQueue$TransferStack.awaitFulfill(SynchronousQueue.java:460)
   [junit4]    >         at java.util.concurrent.SynchronousQueue$TransferStack.transfer(SynchronousQueue.java:362)
   [junit4]    >         at java.util.concurrent.SynchronousQueue.poll(SynchronousQueue.java:941)
   [junit4]    >         at java.util.concurrent.ThreadPoolExecutor.getTask(ThreadPoolExecutor.java:1066)
   [junit4]    >         at java.util.concurrent.ThreadPoolExecutor.runWorker(ThreadPoolExecutor.java:1127)
   [junit4]    >         at java.util.concurrent.ThreadPoolExecutor$Worker.run(ThreadPoolExecutor.java:617)
   [junit4]    >         at java.lang.Thread.run(Thread.java:745)
   [junit4]    > 	at __randomizedtesting.SeedInfo.seed([29A54686BD207A15]:0)
   [junit4] Completed [291/576 (1!)] on J0 in 78.31s, 1 test, 3 errors <<< FAILURES!

[...truncated 941 lines...]
BUILD FAILED
/export/home/jenkins/workspace/Lucene-Solr-trunk-Solaris/build.xml:784: The following error occurred while executing this line:
/export/home/jenkins/workspace/Lucene-Solr-trunk-Solaris/build.xml:728: The following error occurred while executing this line:
/export/home/jenkins/workspace/Lucene-Solr-trunk-Solaris/build.xml:59: The following error occurred while executing this line:
/export/home/jenkins/workspace/Lucene-Solr-trunk-Solaris/solr/build.xml:233: The following error occurred while executing this line:
/export/home/jenkins/workspace/Lucene-Solr-trunk-Solaris/solr/common-build.xml:522: The following error occurred while executing this line:
/export/home/jenkins/workspace/Lucene-Solr-trunk-Solaris/lucene/common-build.xml:1424: The following error occurred while executing this line:
/export/home/jenkins/workspace/Lucene-Solr-trunk-Solaris/lucene/common-build.xml:981: There were test failures: 576 suites (8 ignored), 2305 tests, 2 suite-level errors, 1 error, 951 ignored (67 assumptions) [seed: 29A54686BD207A15]

Total time: 47 minutes 54 seconds
Build step 'Invoke Ant' marked build as failure
Archiving artifacts
[WARNINGS] Skipping publisher since build result is FAILURE
Recording test results
Email was triggered for: Failure - Any
Sending email for trigger: Failure - Any



Mime
View raw message