lucene-dev mailing list archives

Site index · List index
Message view « Date » · « Thread »
Top « Date » · « Thread »
From Apache Jenkins Server <jenk...@builds.apache.org>
Subject [JENKINS] Lucene-Solr-Tests-5.x-Java7 - Build # 3920 - Failure
Date Thu, 14 Jan 2016 01:12:02 GMT
Build: https://builds.apache.org/job/Lucene-Solr-Tests-5.x-Java7/3920/

2 tests failed.
FAILED:  org.apache.solr.cloud.DistributedVersionInfoTest.test

Error Message:
Test abandoned because suite timeout was reached.

Stack Trace:
java.lang.Exception: Test abandoned because suite timeout was reached.
	at __randomizedtesting.SeedInfo.seed([C6E178125FEE0741]:0)


FAILED:  junit.framework.TestSuite.org.apache.solr.cloud.DistributedVersionInfoTest

Error Message:
Suite timeout exceeded (>= 7200000 msec).

Stack Trace:
java.lang.Exception: Suite timeout exceeded (>= 7200000 msec).
	at __randomizedtesting.SeedInfo.seed([C6E178125FEE0741]:0)




Build Log:
[...truncated 11772 lines...]
   [junit4] Suite: org.apache.solr.cloud.DistributedVersionInfoTest
   [junit4]   2> Creating dataDir: /x1/jenkins/jenkins-slave/workspace/Lucene-Solr-Tests-5.x-Java7/solr/build/solr-core/test/J1/temp/solr.cloud.DistributedVersionInfoTest_C6E178125FEE0741-001/init-core-data-001
   [junit4]   2> 1721262 INFO  (SUITE-DistributedVersionInfoTest-seed#[C6E178125FEE0741]-worker) [    ] o.a.s.BaseDistributedSearchTestCase Setting hostContext system property: /brauc/v
   [junit4]   2> 1721266 INFO  (TEST-DistributedVersionInfoTest.test-seed#[C6E178125FEE0741]) [    ] o.a.s.c.ZkTestServer STARTING ZK TEST SERVER
   [junit4]   2> 1721266 INFO  (Thread-7694) [    ] o.a.s.c.ZkTestServer client port:0.0.0.0/0.0.0.0:0
   [junit4]   2> 1721266 INFO  (Thread-7694) [    ] o.a.s.c.ZkTestServer Starting server
   [junit4]   2> 1721366 INFO  (TEST-DistributedVersionInfoTest.test-seed#[C6E178125FEE0741]) [    ] o.a.s.c.ZkTestServer start zk server on port:53991
   [junit4]   2> 1721367 INFO  (TEST-DistributedVersionInfoTest.test-seed#[C6E178125FEE0741]) [    ] o.a.s.c.c.SolrZkClient Using default ZkCredentialsProvider
   [junit4]   2> 1721367 INFO  (TEST-DistributedVersionInfoTest.test-seed#[C6E178125FEE0741]) [    ] o.a.s.c.c.ConnectionManager Waiting for client to connect to ZooKeeper
   [junit4]   2> 1721370 INFO  (zkCallback-2580-thread-1) [    ] o.a.s.c.c.ConnectionManager Watcher org.apache.solr.common.cloud.ConnectionManager@3eb1bb68 name:ZooKeeperConnection Watcher:127.0.0.1:53991 got event WatchedEvent state:SyncConnected type:None path:null path:null type:None
   [junit4]   2> 1721370 INFO  (TEST-DistributedVersionInfoTest.test-seed#[C6E178125FEE0741]) [    ] o.a.s.c.c.ConnectionManager Client is connected to ZooKeeper
   [junit4]   2> 1721370 INFO  (TEST-DistributedVersionInfoTest.test-seed#[C6E178125FEE0741]) [    ] o.a.s.c.c.SolrZkClient Using default ZkACLProvider
   [junit4]   2> 1721370 INFO  (TEST-DistributedVersionInfoTest.test-seed#[C6E178125FEE0741]) [    ] o.a.s.c.c.SolrZkClient makePath: /solr
   [junit4]   2> 1721373 INFO  (TEST-DistributedVersionInfoTest.test-seed#[C6E178125FEE0741]) [    ] o.a.s.c.c.SolrZkClient Using default ZkCredentialsProvider
   [junit4]   2> 1721373 INFO  (TEST-DistributedVersionInfoTest.test-seed#[C6E178125FEE0741]) [    ] o.a.s.c.c.ConnectionManager Waiting for client to connect to ZooKeeper
   [junit4]   2> 1721375 INFO  (zkCallback-2581-thread-1) [    ] o.a.s.c.c.ConnectionManager Watcher org.apache.solr.common.cloud.ConnectionManager@7e0bdda9 name:ZooKeeperConnection Watcher:127.0.0.1:53991/solr got event WatchedEvent state:SyncConnected type:None path:null path:null type:None
   [junit4]   2> 1721375 INFO  (TEST-DistributedVersionInfoTest.test-seed#[C6E178125FEE0741]) [    ] o.a.s.c.c.ConnectionManager Client is connected to ZooKeeper
   [junit4]   2> 1721375 INFO  (TEST-DistributedVersionInfoTest.test-seed#[C6E178125FEE0741]) [    ] o.a.s.c.c.SolrZkClient Using default ZkACLProvider
   [junit4]   2> 1721375 INFO  (TEST-DistributedVersionInfoTest.test-seed#[C6E178125FEE0741]) [    ] o.a.s.c.c.SolrZkClient makePath: /collections/collection1
   [junit4]   2> 1721377 INFO  (TEST-DistributedVersionInfoTest.test-seed#[C6E178125FEE0741]) [    ] o.a.s.c.c.SolrZkClient makePath: /collections/collection1/shards
   [junit4]   2> 1721379 INFO  (TEST-DistributedVersionInfoTest.test-seed#[C6E178125FEE0741]) [    ] o.a.s.c.c.SolrZkClient makePath: /collections/control_collection
   [junit4]   2> 1721380 INFO  (TEST-DistributedVersionInfoTest.test-seed#[C6E178125FEE0741]) [    ] o.a.s.c.c.SolrZkClient makePath: /collections/control_collection/shards
   [junit4]   2> 1721381 INFO  (TEST-DistributedVersionInfoTest.test-seed#[C6E178125FEE0741]) [    ] o.a.s.c.AbstractZkTestCase put /x1/jenkins/jenkins-slave/workspace/Lucene-Solr-Tests-5.x-Java7/solr/core/src/test-files/solr/collection1/conf/solrconfig-tlog.xml to /configs/conf1/solrconfig.xml
   [junit4]   2> 1721382 INFO  (TEST-DistributedVersionInfoTest.test-seed#[C6E178125FEE0741]) [    ] o.a.s.c.c.SolrZkClient makePath: /configs/conf1/solrconfig.xml
   [junit4]   2> 1721384 INFO  (TEST-DistributedVersionInfoTest.test-seed#[C6E178125FEE0741]) [    ] o.a.s.c.AbstractZkTestCase put /x1/jenkins/jenkins-slave/workspace/Lucene-Solr-Tests-5.x-Java7/solr/core/src/test-files/solr/collection1/conf/schema.xml to /configs/conf1/schema.xml
   [junit4]   2> 1721384 INFO  (TEST-DistributedVersionInfoTest.test-seed#[C6E178125FEE0741]) [    ] o.a.s.c.c.SolrZkClient makePath: /configs/conf1/schema.xml
   [junit4]   2> 1721386 INFO  (TEST-DistributedVersionInfoTest.test-seed#[C6E178125FEE0741]) [    ] o.a.s.c.AbstractZkTestCase put /x1/jenkins/jenkins-slave/workspace/Lucene-Solr-Tests-5.x-Java7/solr/core/src/test-files/solr/collection1/conf/solrconfig.snippet.randomindexconfig.xml to /configs/conf1/solrconfig.snippet.randomindexconfig.xml
   [junit4]   2> 1721386 INFO  (TEST-DistributedVersionInfoTest.test-seed#[C6E178125FEE0741]) [    ] o.a.s.c.c.SolrZkClient makePath: /configs/conf1/solrconfig.snippet.randomindexconfig.xml
   [junit4]   2> 1721388 INFO  (TEST-DistributedVersionInfoTest.test-seed#[C6E178125FEE0741]) [    ] o.a.s.c.AbstractZkTestCase put /x1/jenkins/jenkins-slave/workspace/Lucene-Solr-Tests-5.x-Java7/solr/core/src/test-files/solr/collection1/conf/stopwords.txt to /configs/conf1/stopwords.txt
   [junit4]   2> 1721388 INFO  (TEST-DistributedVersionInfoTest.test-seed#[C6E178125FEE0741]) [    ] o.a.s.c.c.SolrZkClient makePath: /configs/conf1/stopwords.txt
   [junit4]   2> 1721390 INFO  (TEST-DistributedVersionInfoTest.test-seed#[C6E178125FEE0741]) [    ] o.a.s.c.AbstractZkTestCase put /x1/jenkins/jenkins-slave/workspace/Lucene-Solr-Tests-5.x-Java7/solr/core/src/test-files/solr/collection1/conf/protwords.txt to /configs/conf1/protwords.txt
   [junit4]   2> 1721390 INFO  (TEST-DistributedVersionInfoTest.test-seed#[C6E178125FEE0741]) [    ] o.a.s.c.c.SolrZkClient makePath: /configs/conf1/protwords.txt
   [junit4]   2> 1721391 INFO  (TEST-DistributedVersionInfoTest.test-seed#[C6E178125FEE0741]) [    ] o.a.s.c.AbstractZkTestCase put /x1/jenkins/jenkins-slave/workspace/Lucene-Solr-Tests-5.x-Java7/solr/core/src/test-files/solr/collection1/conf/currency.xml to /configs/conf1/currency.xml
   [junit4]   2> 1721391 INFO  (TEST-DistributedVersionInfoTest.test-seed#[C6E178125FEE0741]) [    ] o.a.s.c.c.SolrZkClient makePath: /configs/conf1/currency.xml
   [junit4]   2> 1721393 INFO  (TEST-DistributedVersionInfoTest.test-seed#[C6E178125FEE0741]) [    ] o.a.s.c.AbstractZkTestCase put /x1/jenkins/jenkins-slave/workspace/Lucene-Solr-Tests-5.x-Java7/solr/core/src/test-files/solr/collection1/conf/enumsConfig.xml to /configs/conf1/enumsConfig.xml
   [junit4]   2> 1721393 INFO  (TEST-DistributedVersionInfoTest.test-seed#[C6E178125FEE0741]) [    ] o.a.s.c.c.SolrZkClient makePath: /configs/conf1/enumsConfig.xml
   [junit4]   2> 1721395 INFO  (TEST-DistributedVersionInfoTest.test-seed#[C6E178125FEE0741]) [    ] o.a.s.c.AbstractZkTestCase put /x1/jenkins/jenkins-slave/workspace/Lucene-Solr-Tests-5.x-Java7/solr/core/src/test-files/solr/collection1/conf/open-exchange-rates.json to /configs/conf1/open-exchange-rates.json
   [junit4]   2> 1721395 INFO  (TEST-DistributedVersionInfoTest.test-seed#[C6E178125FEE0741]) [    ] o.a.s.c.c.SolrZkClient makePath: /configs/conf1/open-exchange-rates.json
   [junit4]   2> 1721397 INFO  (TEST-DistributedVersionInfoTest.test-seed#[C6E178125FEE0741]) [    ] o.a.s.c.AbstractZkTestCase put /x1/jenkins/jenkins-slave/workspace/Lucene-Solr-Tests-5.x-Java7/solr/core/src/test-files/solr/collection1/conf/mapping-ISOLatin1Accent.txt to /configs/conf1/mapping-ISOLatin1Accent.txt
   [junit4]   2> 1721397 INFO  (TEST-DistributedVersionInfoTest.test-seed#[C6E178125FEE0741]) [    ] o.a.s.c.c.SolrZkClient makePath: /configs/conf1/mapping-ISOLatin1Accent.txt
   [junit4]   2> 1721398 INFO  (TEST-DistributedVersionInfoTest.test-seed#[C6E178125FEE0741]) [    ] o.a.s.c.AbstractZkTestCase put /x1/jenkins/jenkins-slave/workspace/Lucene-Solr-Tests-5.x-Java7/solr/core/src/test-files/solr/collection1/conf/old_synonyms.txt to /configs/conf1/old_synonyms.txt
   [junit4]   2> 1721399 INFO  (TEST-DistributedVersionInfoTest.test-seed#[C6E178125FEE0741]) [    ] o.a.s.c.c.SolrZkClient makePath: /configs/conf1/old_synonyms.txt
   [junit4]   2> 1721400 INFO  (TEST-DistributedVersionInfoTest.test-seed#[C6E178125FEE0741]) [    ] o.a.s.c.AbstractZkTestCase put /x1/jenkins/jenkins-slave/workspace/Lucene-Solr-Tests-5.x-Java7/solr/core/src/test-files/solr/collection1/conf/synonyms.txt to /configs/conf1/synonyms.txt
   [junit4]   2> 1721400 INFO  (TEST-DistributedVersionInfoTest.test-seed#[C6E178125FEE0741]) [    ] o.a.s.c.c.SolrZkClient makePath: /configs/conf1/synonyms.txt
   [junit4]   2> 1721698 INFO  (TEST-DistributedVersionInfoTest.test-seed#[C6E178125FEE0741]) [    ] o.a.s.SolrTestCaseJ4 Writing core.properties file to /x1/jenkins/jenkins-slave/workspace/Lucene-Solr-Tests-5.x-Java7/solr/build/solr-core/test/J1/temp/solr.cloud.DistributedVersionInfoTest_C6E178125FEE0741-001/control-001/cores/collection1
   [junit4]   2> 1721699 INFO  (TEST-DistributedVersionInfoTest.test-seed#[C6E178125FEE0741]) [    ] o.e.j.s.Server jetty-9.2.13.v20150730
   [junit4]   2> 1721701 INFO  (TEST-DistributedVersionInfoTest.test-seed#[C6E178125FEE0741]) [    ] o.e.j.s.h.ContextHandler Started o.e.j.s.ServletContextHandler@e5956b8{/brauc/v,null,AVAILABLE}
   [junit4]   2> 1721702 INFO  (TEST-DistributedVersionInfoTest.test-seed#[C6E178125FEE0741]) [    ] o.e.j.s.ServerConnector Started ServerConnector@3f738207{HTTP/1.1}{127.0.0.1:34699}
   [junit4]   2> 1721702 INFO  (TEST-DistributedVersionInfoTest.test-seed#[C6E178125FEE0741]) [    ] o.e.j.s.Server Started @1724396ms
   [junit4]   2> 1721702 INFO  (TEST-DistributedVersionInfoTest.test-seed#[C6E178125FEE0741]) [    ] o.a.s.c.s.e.JettySolrRunner Jetty properties: {hostContext=/brauc/v, solr.data.dir=/x1/jenkins/jenkins-slave/workspace/Lucene-Solr-Tests-5.x-Java7/solr/build/solr-core/test/J1/temp/solr.cloud.DistributedVersionInfoTest_C6E178125FEE0741-001/tempDir-001/control/data, hostPort=34699, coreRootDirectory=/x1/jenkins/jenkins-slave/workspace/Lucene-Solr-Tests-5.x-Java7/solr/build/solr-core/test/J1/../../../../../../../../../../x1/jenkins/jenkins-slave/workspace/Lucene-Solr-Tests-5.x-Java7/solr/build/solr-core/test/J1/temp/solr.cloud.DistributedVersionInfoTest_C6E178125FEE0741-001/control-001/cores}
   [junit4]   2> 1721702 INFO  (TEST-DistributedVersionInfoTest.test-seed#[C6E178125FEE0741]) [    ] o.a.s.s.SolrDispatchFilter SolrDispatchFilter.init(): sun.misc.Launcher$AppClassLoader@3827de24
   [junit4]   2> 1721702 INFO  (TEST-DistributedVersionInfoTest.test-seed#[C6E178125FEE0741]) [    ] o.a.s.c.SolrResourceLoader new SolrResourceLoader for directory: '/x1/jenkins/jenkins-slave/workspace/Lucene-Solr-Tests-5.x-Java7/solr/build/solr-core/test/J1/temp/solr.cloud.DistributedVersionInfoTest_C6E178125FEE0741-001/control-001'
   [junit4]   2> 1721702 INFO  (TEST-DistributedVersionInfoTest.test-seed#[C6E178125FEE0741]) [    ] o.a.s.c.SolrResourceLoader JNDI not configured for solr (NoInitialContextEx)
   [junit4]   2> 1721702 INFO  (TEST-DistributedVersionInfoTest.test-seed#[C6E178125FEE0741]) [    ] o.a.s.c.SolrResourceLoader solr home defaulted to 'solr/' (could not find system property or JNDI)
   [junit4]   2> 1721703 INFO  (TEST-DistributedVersionInfoTest.test-seed#[C6E178125FEE0741]) [    ] o.a.s.c.c.SolrZkClient Using default ZkCredentialsProvider
   [junit4]   2> 1721703 INFO  (TEST-DistributedVersionInfoTest.test-seed#[C6E178125FEE0741]) [    ] o.a.s.c.c.ConnectionManager Waiting for client to connect to ZooKeeper
   [junit4]   2> 1721705 INFO  (zkCallback-2582-thread-1) [    ] o.a.s.c.c.ConnectionManager Watcher org.apache.solr.common.cloud.ConnectionManager@4d5a59b3 name:ZooKeeperConnection Watcher:127.0.0.1:53991/solr got event WatchedEvent state:SyncConnected type:None path:null path:null type:None
   [junit4]   2> 1721705 INFO  (TEST-DistributedVersionInfoTest.test-seed#[C6E178125FEE0741]) [    ] o.a.s.c.c.ConnectionManager Client is connected to ZooKeeper
   [junit4]   2> 1721705 INFO  (TEST-DistributedVersionInfoTest.test-seed#[C6E178125FEE0741]) [    ] o.a.s.c.c.SolrZkClient Using default ZkACLProvider
   [junit4]   2> 1721706 INFO  (TEST-DistributedVersionInfoTest.test-seed#[C6E178125FEE0741]) [    ] o.a.s.s.SolrDispatchFilter Loading solr.xml from SolrHome (not found in ZooKeeper)
   [junit4]   2> 1721706 INFO  (TEST-DistributedVersionInfoTest.test-seed#[C6E178125FEE0741]) [    ] o.a.s.c.SolrXmlConfig Loading container configuration from /x1/jenkins/jenkins-slave/workspace/Lucene-Solr-Tests-5.x-Java7/solr/build/solr-core/test/J1/temp/solr.cloud.DistributedVersionInfoTest_C6E178125FEE0741-001/control-001/solr.xml
   [junit4]   2> 1721722 INFO  (TEST-DistributedVersionInfoTest.test-seed#[C6E178125FEE0741]) [    ] o.a.s.c.CorePropertiesLocator Config-defined core root directory: /x1/jenkins/jenkins-slave/workspace/Lucene-Solr-Tests-5.x-Java7/solr/build/solr-core/test/J1/../../../../../../../../../../x1/jenkins/jenkins-slave/workspace/Lucene-Solr-Tests-5.x-Java7/solr/build/solr-core/test/J1/temp/solr.cloud.DistributedVersionInfoTest_C6E178125FEE0741-001/control-001/cores
   [junit4]   2> 1721722 INFO  (TEST-DistributedVersionInfoTest.test-seed#[C6E178125FEE0741]) [    ] o.a.s.c.CoreContainer New CoreContainer 484927148
   [junit4]   2> 1721722 INFO  (TEST-DistributedVersionInfoTest.test-seed#[C6E178125FEE0741]) [    ] o.a.s.c.CoreContainer Loading cores into CoreContainer [instanceDir=/x1/jenkins/jenkins-slave/workspace/Lucene-Solr-Tests-5.x-Java7/solr/build/solr-core/test/J1/temp/solr.cloud.DistributedVersionInfoTest_C6E178125FEE0741-001/control-001]
   [junit4]   2> 1721722 WARN  (TEST-DistributedVersionInfoTest.test-seed#[C6E178125FEE0741]) [    ] o.a.s.c.CoreContainer Couldn't add files from /x1/jenkins/jenkins-slave/workspace/Lucene-Solr-Tests-5.x-Java7/solr/build/solr-core/test/J1/temp/solr.cloud.DistributedVersionInfoTest_C6E178125FEE0741-001/control-001/lib to classpath: /x1/jenkins/jenkins-slave/workspace/Lucene-Solr-Tests-5.x-Java7/solr/build/solr-core/test/J1/temp/solr.cloud.DistributedVersionInfoTest_C6E178125FEE0741-001/control-001/lib
   [junit4]   2> 1721723 INFO  (TEST-DistributedVersionInfoTest.test-seed#[C6E178125FEE0741]) [    ] o.a.s.h.c.HttpShardHandlerFactory created with socketTimeout : 90000,urlScheme : ,connTimeout : 15000,maxConnectionsPerHost : 20,maxConnections : 10000,corePoolSize : 0,maximumPoolSize : 2147483647,maxThreadIdleTime : 5,sizeOfQueue : -1,fairnessPolicy : false,useRetries : false,
   [junit4]   2> 1721724 INFO  (TEST-DistributedVersionInfoTest.test-seed#[C6E178125FEE0741]) [    ] o.a.s.u.UpdateShardHandler Creating UpdateShardHandler HTTP client with params: socketTimeout=340000&connTimeout=45000&retry=true
   [junit4]   2> 1721724 INFO  (TEST-DistributedVersionInfoTest.test-seed#[C6E178125FEE0741]) [    ] o.a.s.l.LogWatcher SLF4J impl is org.slf4j.impl.Log4jLoggerFactory
   [junit4]   2> 1721724 INFO  (TEST-DistributedVersionInfoTest.test-seed#[C6E178125FEE0741]) [    ] o.a.s.l.LogWatcher Registering Log Listener [Log4j (org.slf4j.impl.Log4jLoggerFactory)]
   [junit4]   2> 1721725 INFO  (TEST-DistributedVersionInfoTest.test-seed#[C6E178125FEE0741]) [    ] o.a.s.c.ZkContainer Zookeeper client=127.0.0.1:53991/solr
   [junit4]   2> 1721725 INFO  (TEST-DistributedVersionInfoTest.test-seed#[C6E178125FEE0741]) [    ] o.a.s.c.ZkController zkHost includes chroot
   [junit4]   2> 1721725 INFO  (TEST-DistributedVersionInfoTest.test-seed#[C6E178125FEE0741]) [    ] o.a.s.c.c.SolrZkClient Using default ZkCredentialsProvider
   [junit4]   2> 1721725 INFO  (TEST-DistributedVersionInfoTest.test-seed#[C6E178125FEE0741]) [    ] o.a.s.c.c.ConnectionManager Waiting for client to connect to ZooKeeper
   [junit4]   2> 1721727 INFO  (zkCallback-2584-thread-1) [    ] o.a.s.c.c.ConnectionManager Watcher org.apache.solr.common.cloud.ConnectionManager@647e488 name:ZooKeeperConnection Watcher:127.0.0.1:53991 got event WatchedEvent state:SyncConnected type:None path:null path:null type:None
   [junit4]   2> 1721727 INFO  (TEST-DistributedVersionInfoTest.test-seed#[C6E178125FEE0741]) [    ] o.a.s.c.c.ConnectionManager Client is connected to ZooKeeper
   [junit4]   2> 1721727 INFO  (TEST-DistributedVersionInfoTest.test-seed#[C6E178125FEE0741]) [    ] o.a.s.c.c.SolrZkClient Using default ZkACLProvider
   [junit4]   2> 1721729 INFO  (TEST-DistributedVersionInfoTest.test-seed#[C6E178125FEE0741]) [n:127.0.0.1:34699_brauc%2Fv    ] o.a.s.c.c.ConnectionManager Waiting for client to connect to ZooKeeper
   [junit4]   2> 1721730 INFO  (zkCallback-2585-thread-1-processing-n:127.0.0.1:34699_brauc%2Fv) [n:127.0.0.1:34699_brauc%2Fv    ] o.a.s.c.c.ConnectionManager Watcher org.apache.solr.common.cloud.ConnectionManager@5802a4c5 name:ZooKeeperConnection Watcher:127.0.0.1:53991/solr got event WatchedEvent state:SyncConnected type:None path:null path:null type:None
   [junit4]   2> 1721730 INFO  (TEST-DistributedVersionInfoTest.test-seed#[C6E178125FEE0741]) [n:127.0.0.1:34699_brauc%2Fv    ] o.a.s.c.c.ConnectionManager Client is connected to ZooKeeper
   [junit4]   2> 1721731 INFO  (TEST-DistributedVersionInfoTest.test-seed#[C6E178125FEE0741]) [n:127.0.0.1:34699_brauc%2Fv    ] o.a.s.c.c.SolrZkClient makePath: /overseer/queue
   [junit4]   2> 1721733 INFO  (TEST-DistributedVersionInfoTest.test-seed#[C6E178125FEE0741]) [n:127.0.0.1:34699_brauc%2Fv    ] o.a.s.c.c.SolrZkClient makePath: /overseer/collection-queue-work
   [junit4]   2> 1721736 INFO  (TEST-DistributedVersionInfoTest.test-seed#[C6E178125FEE0741]) [n:127.0.0.1:34699_brauc%2Fv    ] o.a.s.c.c.SolrZkClient makePath: /overseer/collection-map-running
   [junit4]   2> 1721737 INFO  (TEST-DistributedVersionInfoTest.test-seed#[C6E178125FEE0741]) [n:127.0.0.1:34699_brauc%2Fv    ] o.a.s.c.c.SolrZkClient makePath: /overseer/collection-map-completed
   [junit4]   2> 1721739 INFO  (TEST-DistributedVersionInfoTest.test-seed#[C6E178125FEE0741]) [n:127.0.0.1:34699_brauc%2Fv    ] o.a.s.c.c.SolrZkClient makePath: /overseer/collection-map-failure
   [junit4]   2> 1721741 INFO  (TEST-DistributedVersionInfoTest.test-seed#[C6E178125FEE0741]) [n:127.0.0.1:34699_brauc%2Fv    ] o.a.s.c.c.SolrZkClient makePath: /live_nodes
   [junit4]   2> 1721743 INFO  (TEST-DistributedVersionInfoTest.test-seed#[C6E178125FEE0741]) [n:127.0.0.1:34699_brauc%2Fv    ] o.a.s.c.c.SolrZkClient makePath: /aliases.json
   [junit4]   2> 1721744 INFO  (TEST-DistributedVersionInfoTest.test-seed#[C6E178125FEE0741]) [n:127.0.0.1:34699_brauc%2Fv    ] o.a.s.c.c.SolrZkClient makePath: /clusterstate.json
   [junit4]   2> 1721746 INFO  (TEST-DistributedVersionInfoTest.test-seed#[C6E178125FEE0741]) [n:127.0.0.1:34699_brauc%2Fv    ] o.a.s.c.c.SolrZkClient makePath: /security.json
   [junit4]   2> 1721747 INFO  (TEST-DistributedVersionInfoTest.test-seed#[C6E178125FEE0741]) [n:127.0.0.1:34699_brauc%2Fv    ] o.a.s.c.ZkController Register node as live in ZooKeeper:/live_nodes/127.0.0.1:34699_brauc%2Fv
   [junit4]   2> 1721747 INFO  (TEST-DistributedVersionInfoTest.test-seed#[C6E178125FEE0741]) [n:127.0.0.1:34699_brauc%2Fv    ] o.a.s.c.c.SolrZkClient makePath: /live_nodes/127.0.0.1:34699_brauc%2Fv
   [junit4]   2> 1721749 INFO  (TEST-DistributedVersionInfoTest.test-seed#[C6E178125FEE0741]) [n:127.0.0.1:34699_brauc%2Fv    ] o.a.s.c.c.SolrZkClient makePath: /overseer_elect
   [junit4]   2> 1721750 INFO  (TEST-DistributedVersionInfoTest.test-seed#[C6E178125FEE0741]) [n:127.0.0.1:34699_brauc%2Fv    ] o.a.s.c.c.SolrZkClient makePath: /overseer_elect/election
   [junit4]   2> 1721751 INFO  (TEST-DistributedVersionInfoTest.test-seed#[C6E178125FEE0741]) [n:127.0.0.1:34699_brauc%2Fv    ] o.a.s.c.Overseer Overseer (id=null) closing
   [junit4]   2> 1721752 INFO  (TEST-DistributedVersionInfoTest.test-seed#[C6E178125FEE0741]) [n:127.0.0.1:34699_brauc%2Fv    ] o.a.s.c.LeaderElector Joined leadership election with path: /overseer_elect/election/95205887736414212-127.0.0.1:34699_brauc%2Fv-n_0000000000
   [junit4]   2> 1721752 INFO  (TEST-DistributedVersionInfoTest.test-seed#[C6E178125FEE0741]) [n:127.0.0.1:34699_brauc%2Fv    ] o.a.s.c.OverseerElectionContext I am going to be the leader 127.0.0.1:34699_brauc%2Fv
   [junit4]   2> 1721752 INFO  (TEST-DistributedVersionInfoTest.test-seed#[C6E178125FEE0741]) [n:127.0.0.1:34699_brauc%2Fv    ] o.a.s.c.c.SolrZkClient makePath: /overseer_elect/leader
   [junit4]   2> 1721754 INFO  (TEST-DistributedVersionInfoTest.test-seed#[C6E178125FEE0741]) [n:127.0.0.1:34699_brauc%2Fv    ] o.a.s.c.Overseer Overseer (id=95205887736414212-127.0.0.1:34699_brauc%2Fv-n_0000000000) starting
   [junit4]   2> 1721756 INFO  (TEST-DistributedVersionInfoTest.test-seed#[C6E178125FEE0741]) [n:127.0.0.1:34699_brauc%2Fv    ] o.a.s.c.c.SolrZkClient makePath: /overseer/queue-work
   [junit4]   2> 1721762 INFO  (TEST-DistributedVersionInfoTest.test-seed#[C6E178125FEE0741]) [n:127.0.0.1:34699_brauc%2Fv    ] o.a.s.c.OverseerAutoReplicaFailoverThread Starting OverseerAutoReplicaFailoverThread autoReplicaFailoverWorkLoopDelay=10000 autoReplicaFailoverWaitAfterExpiration=30000 autoReplicaFailoverBadNodeExpiration=60000
   [junit4]   2> 1721762 INFO  (OverseerCollectionConfigSetProcessor-95205887736414212-127.0.0.1:34699_brauc%2Fv-n_0000000000) [n:127.0.0.1:34699_brauc%2Fv    ] o.a.s.c.OverseerTaskProcessor Process current queue of overseer operations
   [junit4]   2> 1721762 INFO  (TEST-DistributedVersionInfoTest.test-seed#[C6E178125FEE0741]) [n:127.0.0.1:34699_brauc%2Fv    ] o.a.s.c.c.ZkStateReader Updating cluster state from ZooKeeper... 
   [junit4]   2> 1721762 INFO  (OverseerStateUpdate-95205887736414212-127.0.0.1:34699_brauc%2Fv-n_0000000000) [n:127.0.0.1:34699_brauc%2Fv    ] o.a.s.c.Overseer Starting to work on the main queue
   [junit4]   2> 1721780 INFO  (TEST-DistributedVersionInfoTest.test-seed#[C6E178125FEE0741]) [n:127.0.0.1:34699_brauc%2Fv    ] o.a.s.c.CoreContainer Security conf doesn't exist. Skipping setup for authorization module.
   [junit4]   2> 1721780 INFO  (TEST-DistributedVersionInfoTest.test-seed#[C6E178125FEE0741]) [n:127.0.0.1:34699_brauc%2Fv    ] o.a.s.c.CoreContainer No authentication plugin used.
   [junit4]   2> 1721781 INFO  (TEST-DistributedVersionInfoTest.test-seed#[C6E178125FEE0741]) [n:127.0.0.1:34699_brauc%2Fv    ] o.a.s.c.CorePropertiesLocator Looking for core definitions underneath /x1/jenkins/jenkins-slave/workspace/Lucene-Solr-Tests-5.x-Java7/solr/build/solr-core/test/J1/../../../../../../../../../../x1/jenkins/jenkins-slave/workspace/Lucene-Solr-Tests-5.x-Java7/solr/build/solr-core/test/J1/temp/solr.cloud.DistributedVersionInfoTest_C6E178125FEE0741-001/control-001/cores
   [junit4]   2> 1721783 INFO  (TEST-DistributedVersionInfoTest.test-seed#[C6E178125FEE0741]) [n:127.0.0.1:34699_brauc%2Fv    ] o.a.s.c.CoreDescriptor Created CoreDescriptor: {configSetProperties=configsetprops.json, name=collection1, loadOnStartup=true, coreNodeName=, transient=false, schema=schema.xml, collection=control_collection, shard=, config=solrconfig.xml, dataDir=data/}
   [junit4]   2> 1721783 INFO  (TEST-DistributedVersionInfoTest.test-seed#[C6E178125FEE0741]) [n:127.0.0.1:34699_brauc%2Fv    ] o.a.s.c.CorePropertiesLocator Found core collection1 in /x1/jenkins/jenkins-slave/workspace/Lucene-Solr-Tests-5.x-Java7/solr/build/solr-core/test/J1/../../../../../../../../../../x1/jenkins/jenkins-slave/workspace/Lucene-Solr-Tests-5.x-Java7/solr/build/solr-core/test/J1/temp/solr.cloud.DistributedVersionInfoTest_C6E178125FEE0741-001/control-001/cores/collection1
   [junit4]   2> 1721783 INFO  (TEST-DistributedVersionInfoTest.test-seed#[C6E178125FEE0741]) [n:127.0.0.1:34699_brauc%2Fv    ] o.a.s.c.CorePropertiesLocator Found 1 core definitions
   [junit4]   2> 1721784 INFO  (TEST-DistributedVersionInfoTest.test-seed#[C6E178125FEE0741]) [n:127.0.0.1:34699_brauc%2Fv    ] o.a.s.s.SolrDispatchFilter user.dir=/x1/jenkins/jenkins-slave/workspace/Lucene-Solr-Tests-5.x-Java7/solr/build/solr-core/test/J1
   [junit4]   2> 1721784 INFO  (TEST-DistributedVersionInfoTest.test-seed#[C6E178125FEE0741]) [n:127.0.0.1:34699_brauc%2Fv    ] o.a.s.s.SolrDispatchFilter SolrDispatchFilter.init() done
   [junit4]   2> 1721784 INFO  (coreLoadExecutor-5273-thread-1-processing-n:127.0.0.1:34699_brauc%2Fv) [n:127.0.0.1:34699_brauc%2Fv c:control_collection   x:collection1] o.a.s.c.ZkController publishing state=down
   [junit4]   2> 1721784 INFO  (coreLoadExecutor-5273-thread-1-processing-n:127.0.0.1:34699_brauc%2Fv) [n:127.0.0.1:34699_brauc%2Fv c:control_collection   x:collection1] o.a.s.c.ZkController numShards not found on descriptor - reading it from system property
   [junit4]   2> 1721786 INFO  (OverseerStateUpdate-95205887736414212-127.0.0.1:34699_brauc%2Fv-n_0000000000) [n:127.0.0.1:34699_brauc%2Fv    ] o.a.s.c.Overseer processMessage: queueSize: 1, message = {
   [junit4]   2>   "operation":"state",
   [junit4]   2>   "numShards":"1",
   [junit4]   2>   "node_name":"127.0.0.1:34699_brauc%2Fv",
   [junit4]   2>   "roles":null,
   [junit4]   2>   "core":"collection1",
   [junit4]   2>   "collection":"control_collection",
   [junit4]   2>   "shard":null,
   [junit4]   2>   "base_url":"http://127.0.0.1:34699/brauc/v",
   [junit4]   2>   "state":"down"} current state version: 0
   [junit4]   2> 1721786 INFO  (coreLoadExecutor-5273-thread-1-processing-n:127.0.0.1:34699_brauc%2Fv) [n:127.0.0.1:34699_brauc%2Fv c:control_collection   x:collection1] o.a.s.c.ZkController look for our core node name
   [junit4]   2> 1721786 INFO  (OverseerStateUpdate-95205887736414212-127.0.0.1:34699_brauc%2Fv-n_0000000000) [n:127.0.0.1:34699_brauc%2Fv    ] o.a.s.c.o.ReplicaMutator Update state numShards=1 message={
   [junit4]   2>   "operation":"state",
   [junit4]   2>   "numShards":"1",
   [junit4]   2>   "node_name":"127.0.0.1:34699_brauc%2Fv",
   [junit4]   2>   "roles":null,
   [junit4]   2>   "core":"collection1",
   [junit4]   2>   "collection":"control_collection",
   [junit4]   2>   "shard":null,
   [junit4]   2>   "base_url":"http://127.0.0.1:34699/brauc/v",
   [junit4]   2>   "state":"down"}
   [junit4]   2> 1721787 INFO  (OverseerStateUpdate-95205887736414212-127.0.0.1:34699_brauc%2Fv-n_0000000000) [n:127.0.0.1:34699_brauc%2Fv    ] o.a.s.c.o.ClusterStateMutator building a new cName: control_collection
   [junit4]   2> 1721787 INFO  (OverseerStateUpdate-95205887736414212-127.0.0.1:34699_brauc%2Fv-n_0000000000) [n:127.0.0.1:34699_brauc%2Fv    ] o.a.s.c.o.ReplicaMutator Assigning new node to shard shard=shard1
   [junit4]   2> 1721788 INFO  (zkCallback-2585-thread-1-processing-n:127.0.0.1:34699_brauc%2Fv) [n:127.0.0.1:34699_brauc%2Fv    ] o.a.s.c.c.ZkStateReader A cluster state change: [WatchedEvent state:SyncConnected type:NodeDataChanged path:/clusterstate.json], has occurred - updating... (live nodes size: [1])
   [junit4]   2> 1722787 INFO  (coreLoadExecutor-5273-thread-1-processing-n:127.0.0.1:34699_brauc%2Fv) [n:127.0.0.1:34699_brauc%2Fv c:control_collection   x:collection1] o.a.s.c.ZkController waiting to find shard id in clusterstate for collection1
   [junit4]   2> 1722787 INFO  (coreLoadExecutor-5273-thread-1-processing-n:127.0.0.1:34699_brauc%2Fv) [n:127.0.0.1:34699_brauc%2Fv c:control_collection   x:collection1] o.a.s.c.ZkController Check for collection zkNode:control_collection
   [junit4]   2> 1722787 INFO  (coreLoadExecutor-5273-thread-1-processing-n:127.0.0.1:34699_brauc%2Fv) [n:127.0.0.1:34699_brauc%2Fv c:control_collection   x:collection1] o.a.s.c.ZkController Collection zkNode exists
   [junit4]   2> 1722787 INFO  (coreLoadExecutor-5273-thread-1-processing-n:127.0.0.1:34699_brauc%2Fv) [n:127.0.0.1:34699_brauc%2Fv c:control_collection   x:collection1] o.a.s.c.c.ZkStateReader Load collection config from: [/collections/control_collection]
   [junit4]   2> 1722788 INFO  (coreLoadExecutor-5273-thread-1-processing-n:127.0.0.1:34699_brauc%2Fv) [n:127.0.0.1:34699_brauc%2Fv c:control_collection   x:collection1] o.a.s.c.c.ZkStateReader path=[/collections/control_collection] [configName]=[conf1] specified config exists in ZooKeeper
   [junit4]   2> 1722788 INFO  (coreLoadExecutor-5273-thread-1-processing-n:127.0.0.1:34699_brauc%2Fv) [n:127.0.0.1:34699_brauc%2Fv c:control_collection   x:collection1] o.a.s.c.SolrResourceLoader new SolrResourceLoader for directory: '/x1/jenkins/jenkins-slave/workspace/Lucene-Solr-Tests-5.x-Java7/solr/build/solr-core/test/J1/temp/solr.cloud.DistributedVersionInfoTest_C6E178125FEE0741-001/control-001/cores/collection1'
   [junit4]   2> 1722788 INFO  (coreLoadExecutor-5273-thread-1-processing-n:127.0.0.1:34699_brauc%2Fv) [n:127.0.0.1:34699_brauc%2Fv c:control_collection   x:collection1] o.a.s.c.SolrResourceLoader JNDI not configured for solr (NoInitialContextEx)
   [junit4]   2> 1722788 INFO  (coreLoadExecutor-5273-thread-1-processing-n:127.0.0.1:34699_brauc%2Fv) [n:127.0.0.1:34699_brauc%2Fv c:control_collection   x:collection1] o.a.s.c.SolrResourceLoader solr home defaulted to 'solr/' (could not find system property or JNDI)
   [junit4]   2> 1722791 INFO  (coreLoadExecutor-5273-thread-1-processing-n:127.0.0.1:34699_brauc%2Fv) [n:127.0.0.1:34699_brauc%2Fv c:control_collection   x:collection1] o.a.s.c.Config loaded config solrconfig.xml with version 0 
   [junit4]   2> 1722797 INFO  (coreLoadExecutor-5273-thread-1-processing-n:127.0.0.1:34699_brauc%2Fv) [n:127.0.0.1:34699_brauc%2Fv c:control_collection   x:collection1] o.a.s.c.SolrConfig current version of requestparams : -1
   [junit4]   2> 1722812 INFO  (coreLoadExecutor-5273-thread-1-processing-n:127.0.0.1:34699_brauc%2Fv) [n:127.0.0.1:34699_brauc%2Fv c:control_collection   x:collection1] o.a.s.c.SolrConfig Using Lucene MatchVersion: 5.5.0
   [junit4]   2> 1722845 INFO  (coreLoadExecutor-5273-thread-1-processing-n:127.0.0.1:34699_brauc%2Fv) [n:127.0.0.1:34699_brauc%2Fv c:control_collection   x:collection1] o.a.s.c.SolrConfig Loaded SolrConfig: solrconfig.xml
   [junit4]   2> 1722853 INFO  (coreLoadExecutor-5273-thread-1-processing-n:127.0.0.1:34699_brauc%2Fv) [n:127.0.0.1:34699_brauc%2Fv c:control_collection   x:collection1] o.a.s.s.IndexSchema [collection1] Schema name=test
   [junit4]   2> 1723109 INFO  (coreLoadExecutor-5273-thread-1-processing-n:127.0.0.1:34699_brauc%2Fv) [n:127.0.0.1:34699_brauc%2Fv c:control_collection   x:collection1] o.a.s.s.OpenExchangeRatesOrgProvider Initialized with rates=open-exchange-rates.json, refreshInterval=1440.
   [junit4]   2> 1723117 INFO  (coreLoadExecutor-5273-thread-1-processing-n:127.0.0.1:34699_brauc%2Fv) [n:127.0.0.1:34699_brauc%2Fv c:control_collection   x:collection1] o.a.s.s.IndexSchema default search field in schema is text
   [junit4]   2> 1723119 INFO  (coreLoadExecutor-5273-thread-1-processing-n:127.0.0.1:34699_brauc%2Fv) [n:127.0.0.1:34699_brauc%2Fv c:control_collection   x:collection1] o.a.s.s.IndexSchema unique key field: id
   [junit4]   2> 1723129 INFO  (coreLoadExecutor-5273-thread-1-processing-n:127.0.0.1:34699_brauc%2Fv) [n:127.0.0.1:34699_brauc%2Fv c:control_collection   x:collection1] o.a.s.s.FileExchangeRateProvider Reloading exchange rates from file currency.xml
   [junit4]   2> 1723133 INFO  (coreLoadExecutor-5273-thread-1-processing-n:127.0.0.1:34699_brauc%2Fv) [n:127.0.0.1:34699_brauc%2Fv c:control_collection   x:collection1] o.a.s.s.FileExchangeRateProvider Reloading exchange rates from file currency.xml
   [junit4]   2> 1723136 INFO  (coreLoadExecutor-5273-thread-1-processing-n:127.0.0.1:34699_brauc%2Fv) [n:127.0.0.1:34699_brauc%2Fv c:control_collection   x:collection1] o.a.s.s.OpenExchangeRatesOrgProvider Reloading exchange rates from open-exchange-rates.json
   [junit4]   2> 1723137 INFO  (coreLoadExecutor-5273-thread-1-processing-n:127.0.0.1:34699_brauc%2Fv) [n:127.0.0.1:34699_brauc%2Fv c:control_collection   x:collection1] o.a.s.s.OpenExchangeRatesOrgProvider Reloading exchange rates from open-exchange-rates.json
   [junit4]   2> 1723138 INFO  (coreLoadExecutor-5273-thread-1-processing-n:127.0.0.1:34699_brauc%2Fv) [n:127.0.0.1:34699_brauc%2Fv c:control_collection   x:collection1] o.a.s.c.ConfigSetProperties Did not find ConfigSet properties, assuming default properties: Can't find resource 'configsetprops.json' in classpath or '/configs/conf1', cwd=/x1/jenkins/jenkins-slave/workspace/Lucene-Solr-Tests-5.x-Java7/solr/build/solr-core/test/J1
   [junit4]   2> 1723138 INFO  (coreLoadExecutor-5273-thread-1-processing-n:127.0.0.1:34699_brauc%2Fv) [n:127.0.0.1:34699_brauc%2Fv c:control_collection   x:collection1] o.a.s.c.CoreContainer Creating SolrCore 'collection1' using configuration from collection control_collection
   [junit4]   2> 1723139 INFO  (coreLoadExecutor-5273-thread-1-processing-n:127.0.0.1:34699_brauc%2Fv) [n:127.0.0.1:34699_brauc%2Fv c:control_collection s:shard1 r:core_node1 x:collection1] o.a.s.c.SolrCore org.apache.solr.core.MockDirectoryFactory
   [junit4]   2> 1723139 INFO  (coreLoadExecutor-5273-thread-1-processing-n:127.0.0.1:34699_brauc%2Fv) [n:127.0.0.1:34699_brauc%2Fv c:control_collection s:shard1 r:core_node1 x:collection1] o.a.s.c.SolrCore [[collection1] ] Opening new SolrCore at [/x1/jenkins/jenkins-slave/workspace/Lucene-Solr-Tests-5.x-Java7/solr/build/solr-core/test/J1/temp/solr.cloud.DistributedVersionInfoTest_C6E178125FEE0741-001/control-001/cores/collection1], dataDir=[/x1/jenkins/jenkins-slave/workspace/Lucene-Solr-Tests-5.x-Java7/solr/build/solr-core/test/J1/../../../../../../../../../../x1/jenkins/jenkins-slave/workspace/Lucene-Solr-Tests-5.x-Java7/solr/build/solr-core/test/J1/temp/solr.cloud.DistributedVersionInfoTest_C6E178125FEE0741-001/control-001/cores/collection1/data/]
   [junit4]   2> 1723139 INFO  (coreLoadExecutor-5273-thread-1-processing-n:127.0.0.1:34699_brauc%2Fv) [n:127.0.0.1:34699_brauc%2Fv c:control_collection s:shard1 r:core_node1 x:collection1] o.a.s.c.JmxMonitoredMap JMX monitoring is enabled. Adding Solr mbeans to JMX Server: com.sun.jmx.mbeanserver.JmxMBeanServer@3f6df4c9
   [junit4]   2> 1723140 INFO  (coreLoadExecutor-5273-thread-1-processing-n:127.0.0.1:34699_brauc%2Fv) [n:127.0.0.1:34699_brauc%2Fv c:control_collection s:shard1 r:core_node1 x:collection1] o.a.s.c.CachingDirectoryFactory return new directory for /x1/jenkins/jenkins-slave/workspace/Lucene-Solr-Tests-5.x-Java7/solr/build/solr-core/test/J1/../../../../../../../../../../x1/jenkins/jenkins-slave/workspace/Lucene-Solr-Tests-5.x-Java7/solr/build/solr-core/test/J1/temp/solr.cloud.DistributedVersionInfoTest_C6E178125FEE0741-001/control-001/cores/collection1/data
   [junit4]   2> 1723140 INFO  (coreLoadExecutor-5273-thread-1-processing-n:127.0.0.1:34699_brauc%2Fv) [n:127.0.0.1:34699_brauc%2Fv c:control_collection s:shard1 r:core_node1 x:collection1] o.a.s.c.SolrCore New index directory detected: old=null new=/x1/jenkins/jenkins-slave/workspace/Lucene-Solr-Tests-5.x-Java7/solr/build/solr-core/test/J1/../../../../../../../../../../x1/jenkins/jenkins-slave/workspace/Lucene-Solr-Tests-5.x-Java7/solr/build/solr-core/test/J1/temp/solr.cloud.DistributedVersionInfoTest_C6E178125FEE0741-001/control-001/cores/collection1/data/index/
   [junit4]   2> 1723140 WARN  (coreLoadExecutor-5273-thread-1-processing-n:127.0.0.1:34699_brauc%2Fv) [n:127.0.0.1:34699_brauc%2Fv c:control_collection s:shard1 r:core_node1 x:collection1] o.a.s.c.SolrCore [collection1] Solr index directory '/x1/jenkins/jenkins-slave/workspace/Lucene-Solr-Tests-5.x-Java7/solr/build/solr-core/test/J1/../../../../../../../../../../x1/jenkins/jenkins-slave/workspace/Lucene-Solr-Tests-5.x-Java7/solr/build/solr-core/test/J1/temp/solr.cloud.DistributedVersionInfoTest_C6E178125FEE0741-001/control-001/cores/collection1/data/index' doesn't exist. Creating new index...
   [junit4]   2> 1723140 INFO  (coreLoadExecutor-5273-thread-1-processing-n:127.0.0.1:34699_brauc%2Fv) [n:127.0.0.1:34699_brauc%2Fv c:control_collection s:shard1 r:core_node1 x:collection1] o.a.s.c.CachingDirectoryFactory return new directory for /x1/jenkins/jenkins-slave/workspace/Lucene-Solr-Tests-5.x-Java7/solr/build/solr-core/test/J1/../../../../../../../../../../x1/jenkins/jenkins-slave/workspace/Lucene-Solr-Tests-5.x-Java7/solr/build/solr-core/test/J1/temp/solr.cloud.DistributedVersionInfoTest_C6E178125FEE0741-001/control-001/cores/collection1/data/index
   [junit4]   2> 1723141 INFO  (coreLoadExecutor-5273-thread-1-processing-n:127.0.0.1:34699_brauc%2Fv) [n:127.0.0.1:34699_brauc%2Fv c:control_collection s:shard1 r:core_node1 x:collection1] o.a.s.u.RandomMergePolicy RandomMergePolicy wrapping class org.apache.lucene.index.AlcoholicMergePolicy: [AlcoholicMergePolicy: minMergeSize=0, mergeFactor=10, maxMergeSize=1580232013, maxMergeSizeForForcedMerge=9223372036854775807, calibrateSizeByDeletes=true, maxMergeDocs=2147483647, maxCFSSegmentSizeMB=8.796093022207999E12, noCFSRatio=0.1]
   [junit4]   2> 1723141 INFO  (coreLoadExecutor-5273-thread-1-processing-n:127.0.0.1:34699_brauc%2Fv) [n:127.0.0.1:34699_brauc%2Fv c:control_collection s:shard1 r:core_node1 x:collection1] o.a.s.c.SolrDeletionPolicy SolrDeletionPolicy.onCommit: commits: num=1
   [junit4]   2> 	commit{dir=MockDirectoryWrapper(RAMDirectory@16949f6b lockFactory=org.apache.lucene.store.SingleInstanceLockFactory@776e3561),segFN=segments_1,generation=1}
   [junit4]   2> 1723141 INFO  (coreLoadExecutor-5273-thread-1-processing-n:127.0.0.1:34699_brauc%2Fv) [n:127.0.0.1:34699_brauc%2Fv c:control_collection s:shard1 r:core_node1 x:collection1] o.a.s.c.SolrDeletionPolicy newest commit generation = 1
   [junit4]   2> 1723142 INFO  (OldIndexDirectoryCleanupThreadForCore-collection1) [n:127.0.0.1:34699_brauc%2Fv c:control_collection s:shard1 r:core_node1 x:collection1] o.a.s.c.SolrCore Looking for old index directories to cleanup for core collection1 in /x1/jenkins/jenkins-slave/workspace/Lucene-Solr-Tests-5.x-Java7/solr/build/solr-core/test/J1/../../../../../../../../../../x1/jenkins/jenkins-slave/workspace/Lucene-Solr-Tests-5.x-Java7/solr/build/solr-core/test/J1/temp/solr.cloud.DistributedVersionInfoTest_C6E178125FEE0741-001/control-001/cores/collection1/data/
   [junit4]   2> 1723142 WARN  (OldIndexDirectoryCleanupThreadForCore-collection1) [n:127.0.0.1:34699_brauc%2Fv c:control_collection s:shard1 r:core_node1 x:collection1] o.a.s.c.DirectoryFactory /x1/jenkins/jenkins-slave/workspace/Lucene-Solr-Tests-5.x-Java7/solr/build/solr-core/test/J1/../../../../../../../../../../x1/jenkins/jenkins-slave/workspace/Lucene-Solr-Tests-5.x-Java7/solr/build/solr-core/test/J1/temp/solr.cloud.DistributedVersionInfoTest_C6E178125FEE0741-001/control-001/cores/collection1/data/ does not point to a valid data directory; skipping clean-up of old index directories.
   [junit4]   2> 1723146 INFO  (coreLoadExecutor-5273-thread-1-processing-n:127.0.0.1:34699_brauc%2Fv) [n:127.0.0.1:34699_brauc%2Fv c:control_collection s:shard1 r:core_node1 x:collection1] o.a.s.u.p.UpdateRequestProcessorChain creating updateRequestProcessorChain "nodistrib"
   [junit4]   2> 1723146 INFO  (coreLoadExecutor-5273-thread-1-processing-n:127.0.0.1:34699_brauc%2Fv) [n:127.0.0.1:34699_brauc%2Fv c:control_collection s:shard1 r:core_node1 x:collection1] o.a.s.u.p.UpdateRequestProcessorChain creating updateRequestProcessorChain "dedupe"
   [junit4]   2> 1723146 INFO  (coreLoadExecutor-5273-thread-1-processing-n:127.0.0.1:34699_brauc%2Fv) [n:127.0.0.1:34699_brauc%2Fv c:control_collection s:shard1 r:core_node1 x:collection1] o.a.s.u.p.UpdateRequestProcessorChain inserting DistributedUpdateProcessorFactory into updateRequestProcessorChain "dedupe"
   [junit4]   2> 1723146 INFO  (coreLoadExecutor-5273-thread-1-processing-n:127.0.0.1:34699_brauc%2Fv) [n:127.0.0.1:34699_brauc%2Fv c:control_collection s:shard1 r:core_node1 x:collection1] o.a.s.u.p.UpdateRequestProcessorChain creating updateRequestProcessorChain "stored_sig"
   [junit4]   2> 1723146 INFO  (coreLoadExecutor-5273-thread-1-processing-n:127.0.0.1:34699_brauc%2Fv) [n:127.0.0.1:34699_brauc%2Fv c:control_collection s:shard1 r:core_node1 x:collection1] o.a.s.u.p.UpdateRequestProcessorChain inserting DistributedUpdateProcessorFactory into updateRequestProcessorChain "stored_sig"
   [junit4]   2> 1723147 INFO  (coreLoadExecutor-5273-thread-1-processing-n:127.0.0.1:34699_brauc%2Fv) [n:127.0.0.1:34699_brauc%2Fv c:control_collection s:shard1 r:core_node1 x:collection1] o.a.s.u.p.UpdateRequestProcessorChain creating updateRequestProcessorChain "distrib-dup-test-chain-explicit"
   [junit4]   2> 1723147 INFO  (coreLoadExecutor-5273-thread-1-processing-n:127.0.0.1:34699_brauc%2Fv) [n:127.0.0.1:34699_brauc%2Fv c:control_collection s:shard1 r:core_node1 x:collection1] o.a.s.u.p.UpdateRequestProcessorChain creating updateRequestProcessorChain "distrib-dup-test-chain-implicit"
   [junit4]   2> 1723147 INFO  (coreLoadExecutor-5273-thread-1-processing-n:127.0.0.1:34699_brauc%2Fv) [n:127.0.0.1:34699_brauc%2Fv c:control_collection s:shard1 r:core_node1 x:collection1] o.a.s.u.p.UpdateRequestProcessorChain inserting DistributedUpdateProcessorFactory into updateRequestProcessorChain "distrib-dup-test-chain-implicit"
   [junit4]   2> 1723147 INFO  (coreLoadExecutor-5273-thread-1-processing-n:127.0.0.1:34699_brauc%2Fv) [n:127.0.0.1:34699_brauc%2Fv c:control_collection s:shard1 r:core_node1 x:collection1] o.a.s.c.SolrCore no updateRequestProcessorChain defined as default, creating implicit default
   [junit4]   2> 1723147 WARN  (coreLoadExecutor-5273-thread-1-processing-n:127.0.0.1:34699_brauc%2Fv) [n:127.0.0.1:34699_brauc%2Fv c:control_collection s:shard1 r:core_node1 x:collection1] o.a.s.c.RequestHandlers INVALID paramSet a in requestHandler {type = requestHandler,name = /dump,class = DumpRequestHandler,args = {defaults={a=A,b=B}}}
   [junit4]   2> 1723151 INFO  (coreLoadExecutor-5273-thread-1-processing-n:127.0.0.1:34699_brauc%2Fv) [n:127.0.0.1:34699_brauc%2Fv c:control_collection s:shard1 r:core_node1 x:collection1] o.a.s.h.l.XMLLoader xsltCacheLifetimeSeconds=60
   [junit4]   2> 1723152 INFO  (coreLoadExecutor-5273-thread-1-processing-n:127.0.0.1:34699_brauc%2Fv) [n:127.0.0.1:34699_brauc%2Fv c:control_collection s:shard1 r:core_node1 x:collection1] o.a.s.h.l.XMLLoader xsltCacheLifetimeSeconds=60
   [junit4]   2> 1723153 INFO  (coreLoadExecutor-5273-thread-1-processing-n:127.0.0.1:34699_brauc%2Fv) [n:127.0.0.1:34699_brauc%2Fv c:control_collection s:shard1 r:core_node1 x:collection1] o.a.s.h.l.XMLLoader xsltCacheLifetimeSeconds=60
   [junit4]   2> 1723155 INFO  (coreLoadExecutor-5273-thread-1-processing-n:127.0.0.1:34699_brauc%2Fv) [n:127.0.0.1:34699_brauc%2Fv c:control_collection s:shard1 r:core_node1 x:collection1] o.a.s.h.l.XMLLoader xsltCacheLifetimeSeconds=60
   [junit4]   2> 1723158 INFO  (coreLoadExecutor-5273-thread-1-processing-n:127.0.0.1:34699_brauc%2Fv) [n:127.0.0.1:34699_brauc%2Fv c:control_collection s:shard1 r:core_node1 x:collection1] o.a.s.c.RequestHandlers Registered paths: /admin/threads,/update/json/docs,/admin/file,/config,/replication,/update/csv,/admin/plugins,/schema,standard,/admin/logging,/admin/segments,/dump,/admin/luke,/update/json,/admin/mbeans,/get,/update,/admin/properties,/admin/system,/admin/ping
   [junit4]   2> 1723160 INFO  (coreLoadExecutor-5273-thread-1-processing-n:127.0.0.1:34699_brauc%2Fv) [n:127.0.0.1:34699_brauc%2Fv c:control_collection s:shard1 r:core_node1 x:collection1] o.a.s.c.SolrCore Using default statsCache cache: org.apache.solr.search.stats.LocalStatsCache
   [junit4]   2> 1723160 INFO  (coreLoadExecutor-5273-thread-1-processing-n:127.0.0.1:34699_brauc%2Fv) [n:127.0.0.1:34699_brauc%2Fv c:control_collection s:shard1 r:core_node1 x:collection1] o.a.s.u.UpdateHandler Using UpdateLog implementation: org.apache.solr.update.UpdateLog
   [junit4]   2> 1723160 INFO  (coreLoadExecutor-5273-thread-1-processing-n:127.0.0.1:34699_brauc%2Fv) [n:127.0.0.1:34699_brauc%2Fv c:control_collection s:shard1 r:core_node1 x:collection1] o.a.s.u.UpdateLog Initializing UpdateLog: dataDir= defaultSyncLevel=FLUSH numRecordsToKeep=100 maxNumLogsToKeep=10 numVersionBuckets=65536
   [junit4]   2> 1723161 INFO  (coreLoadExecutor-5273-thread-1-processing-n:127.0.0.1:34699_brauc%2Fv) [n:127.0.0.1:34699_brauc%2Fv c:control_collection s:shard1 r:core_node1 x:collection1] o.a.s.u.CommitTracker Hard AutoCommit: disabled
   [junit4]   2> 1723162 INFO  (coreLoadExecutor-5273-thread-1-processing-n:127.0.0.1:34699_brauc%2Fv) [n:127.0.0.1:34699_brauc%2Fv c:control_collection s:shard1 r:core_node1 x:collection1] o.a.s.u.CommitTracker Soft AutoCommit: disabled
   [junit4]   2> 1723162 INFO  (coreLoadExecutor-5273-thread-1-processing-n:127.0.0.1:34699_brauc%2Fv) [n:127.0.0.1:34699_brauc%2Fv c:control_collection s:shard1 r:core_node1 x:collection1] o.a.s.u.RandomMergePolicy RandomMergePolicy wrapping class org.apache.lucene.index.LogDocMergePolicy: [LogDocMergePolicy: minMergeSize=1000, mergeFactor=40, maxMergeSize=9223372036854775807, maxMergeSizeForForcedMerge=9223372036854775807, calibrateSizeByDeletes=true, maxMergeDocs=2147483647, maxCFSSegmentSizeMB=8.796093022207999E12, noCFSRatio=0.8154085107586625]
   [junit4]   2> 1723163 INFO  (coreLoadExecutor-5273-thread-1-processing-n:127.0.0.1:34699_brauc%2Fv) [n:127.0.0.1:34699_brauc%2Fv c:control_collection s:shard1 r:core_node1 x:collection1] o.a.s.c.SolrDeletionPolicy SolrDeletionPolicy.onInit: commits: num=1
   [junit4]   2> 	commit{dir=MockDirectoryWrapper(RAMDirectory@16949f6b lockFactory=org.apache.lucene.store.SingleInstanceLockFactory@776e3561),segFN=segments_1,generation=1}
   [junit4]   2> 1723163 INFO  (coreLoadExecutor-5273-thread-1-processing-n:127.0.0.1:34699_brauc%2Fv) [n:127.0.0.1:34699_brauc%2Fv c:control_collection s:shard1 r:core_node1 x:collection1] o.a.s.c.SolrDeletionPolicy newest commit generation = 1
   [junit4]   2> 1723163 INFO  (coreLoadExecutor-5273-thread-1-processing-n:127.0.0.1:34699_brauc%2Fv) [n:127.0.0.1:34699_brauc%2Fv c:control_collection s:shard1 r:core_node1 x:collection1] o.a.s.s.SolrIndexSearcher Opening Searcher@492bd2d8[collection1] main
   [junit4]   2> 1723163 INFO  (coreLoadExecutor-5273-thread-1-processing-n:127.0.0.1:34699_brauc%2Fv) [n:127.0.0.1:34699_brauc%2Fv c:control_collection s:shard1 r:core_node1 x:collection1] o.a.s.c.c.ZkStateReader Load collection config from: [/collections/control_collection]
   [junit4]   2> 1723164 INFO  (coreLoadExecutor-5273-thread-1-processing-n:127.0.0.1:34699_brauc%2Fv) [n:127.0.0.1:34699_brauc%2Fv c:control_collection s:shard1 r:core_node1 x:collection1] o.a.s.c.c.ZkStateReader path=[/collections/control_collection] [configName]=[conf1] specified config exists in ZooKeeper
   [junit4]   2> 1723164 INFO  (coreLoadExecutor-5273-thread-1-processing-n:127.0.0.1:34699_brauc%2Fv) [n:127.0.0.1:34699_brauc%2Fv c:control_collection s:shard1 r:core_node1 x:collection1] o.a.s.r.ManagedResourceStorage Setting up ZooKeeper-based storage for the RestManager with znodeBase: /configs/conf1
   [junit4]   2> 1723164 INFO  (coreLoadExecutor-5273-thread-1-processing-n:127.0.0.1:34699_brauc%2Fv) [n:127.0.0.1:34699_brauc%2Fv c:control_collection s:shard1 r:core_node1 x:collection1] o.a.s.r.ManagedResourceStorage Configured ZooKeeperStorageIO with znodeBase: /configs/conf1
   [junit4]   2> 1723164 INFO  (coreLoadExecutor-5273-thread-1-processing-n:127.0.0.1:34699_brauc%2Fv) [n:127.0.0.1:34699_brauc%2Fv c:control_collection s:shard1 r:core_node1 x:collection1] o.a.s.r.RestManager Initializing RestManager with initArgs: {}
   [junit4]   2> 1723164 INFO  (coreLoadExecutor-5273-thread-1-processing-n:127.0.0.1:34699_brauc%2Fv) [n:127.0.0.1:34699_brauc%2Fv c:control_collection s:shard1 r:core_node1 x:collection1] o.a.s.r.ManagedResourceStorage Reading _rest_managed.json using ZooKeeperStorageIO:path=/configs/conf1
   [junit4]   2> 1723165 INFO  (coreLoadExecutor-5273-thread-1-processing-n:127.0.0.1:34699_brauc%2Fv) [n:127.0.0.1:34699_brauc%2Fv c:control_collection s:shard1 r:core_node1 x:collection1] o.a.s.r.ManagedResourceStorage No data found for znode /configs/conf1/_rest_managed.json
   [junit4]   2> 1723165 INFO  (coreLoadExecutor-5273-thread-1-processing-n:127.0.0.1:34699_brauc%2Fv) [n:127.0.0.1:34699_brauc%2Fv c:control_collection s:shard1 r:core_node1 x:collection1] o.a.s.r.ManagedResourceStorage Loaded null at path _rest_managed.json using ZooKeeperStorageIO:path=/configs/conf1
   [junit4]   2> 1723165 INFO  (coreLoadExecutor-5273-thread-1-processing-n:127.0.0.1:34699_brauc%2Fv) [n:127.0.0.1:34699_brauc%2Fv c:control_collection s:shard1 r:core_node1 x:collection1] o.a.s.r.RestManager Initializing 0 registered ManagedResources
   [junit4]   2> 1723165 INFO  (coreLoadExecutor-5273-thread-1-processing-n:127.0.0.1:34699_brauc%2Fv) [n:127.0.0.1:34699_brauc%2Fv c:control_collection s:shard1 r:core_node1 x:collection1] o.a.s.h.ReplicationHandler Commits will be reserved for  10000
   [junit4]   2> 1723166 INFO  (searcherExecutor-5274-thread-1-processing-n:127.0.0.1:34699_brauc%2Fv x:collection1 r:core_node1 c:control_collection s:shard1) [n:127.0.0.1:34699_brauc%2Fv c:control_collection s:shard1 r:core_node1 x:collection1] o.a.s.c.SolrCore [collection1] Registered new searcher Searcher@492bd2d8[collection1] main{ExitableDirectoryReader(UninvertingDirectoryReader())}
   [junit4]   2> 1723166 INFO  (coreLoadExecutor-5273-thread-1-processing-n:127.0.0.1:34699_brauc%2Fv) [n:127.0.0.1:34699_brauc%2Fv c:control_collection s:shard1 r:core_node1 x:collection1] o.a.s.u.UpdateLog Looking up max value of version field to seed version buckets
   [junit4]   2> 1723166 INFO  (coreLoadExecutor-5273-thread-1-processing-n:127.0.0.1:34699_brauc%2Fv) [n:127.0.0.1:34699_brauc%2Fv c:control_collection s:shard1 r:core_node1 x:collection1] o.a.s.u.VersionInfo Refreshing highest value of _version_ for 65536 version buckets from index
   [junit4]   2> 1723166 INFO  (coreLoadExecutor-5273-thread-1-processing-n:127.0.0.1:34699_brauc%2Fv) [n:127.0.0.1:34699_brauc%2Fv c:control_collection s:shard1 r:core_node1 x:collection1] o.a.s.u.VersionInfo No terms found for _version_, cannot seed version bucket highest value from index
   [junit4]   2> 1723166 INFO  (coreLoadExecutor-5273-thread-1-processing-n:127.0.0.1:34699_brauc%2Fv) [n:127.0.0.1:34699_brauc%2Fv c:control_collection s:shard1 r:core_node1 x:collection1] o.a.s.u.UpdateLog Could not find max version in index or recent updates, using new clock 1523294205772824576
   [junit4]   2> 1723168 INFO  (coreLoadExecutor-5273-thread-1-processing-n:127.0.0.1:34699_brauc%2Fv) [n:127.0.0.1:34699_brauc%2Fv c:control_collection s:shard1 r:core_node1 x:collection1] o.a.s.u.UpdateLog Took 2.0ms to seed version buckets with highest version 1523294205772824576
   [junit4]   2> 1723168 INFO  (coreLoadExecutor-5273-thread-1-processing-n:127.0.0.1:34699_brauc%2Fv) [n:127.0.0.1:34699_brauc%2Fv c:control_collection s:shard1 r:core_node1 x:collection1] o.a.s.c.ZkController watch zkdir /configs/conf1
   [junit4]   2> 1723169 INFO  (coreLoadExecutor-5273-thread-1-processing-n:127.0.0.1:34699_brauc%2Fv) [n:127.0.0.1:34699_brauc%2Fv c:control_collection s:shard1 r:core_node1 x:collection1] o.a.s.c.CoreContainer registering core: collection1
   [junit4]   2> 1723169 INFO  (coreZkRegister-5267-thread-1-processing-n:127.0.0.1:34699_brauc%2Fv x:collection1 r:core_node1 c:control_collection s:shard1) [n:127.0.0.1:34699_brauc%2Fv c:control_collection s:shard1 r:core_node1 x:collection1] o.a.s.c.ZkController Register replica - core:collection1 address:http://127.0.0.1:34699/brauc/v collection:control_collection shard:shard1
   [junit4]   2> 1723170 INFO  (coreZkRegister-5267-thread-1-processing-n:127.0.0.1:34699_brauc%2Fv x:collection1 r:core_node1 c:control_collection s:shard1) [n:127.0.0.1:34699_brauc%2Fv c:control_collection s:shard1 r:core_node1 x:collection1] o.a.s.c.c.SolrZkClient makePath: /collections/control_collection/leader_elect/shard1/election
   [junit4]   2> 1723174 INFO  (coreZkRegister-5267-thread-1-processing-n:127.0.0.1:34699_brauc%2Fv x:collection1 r:core_node1 c:control_collection s:shard1) [n:127.0.0.1:34699_brauc%2Fv c:control_collection s:shard1 r:core_node1 x:collection1] o.a.s.c.LeaderElector Joined leadership election with path: /collections/control_collection/leader_elect/shard1/election/95205887736414212-core_node1-n_0000000000
   [junit4]   2> 1723174 INFO  (coreZkRegister-5267-thread-1-processing-n:127.0.0.1:34699_brauc%2Fv x:collection1 r:core_node1 c:control_collection s:shard1) [n:127.0.0.1:34699_brauc%2Fv c:control_collection s:shard1 r:core_node1 x:collection1] o.a.s.c.ShardLeaderElectionContext Running the leader process for shard=shard1 and weAreReplacement=false and leaderVoteWait=10000
   [junit4]   2> 1723177 INFO  (coreZkRegister-5267-thread-1-processing-n:127.0.0.1:34699_brauc%2Fv x:collection1 r:core_node1 c:control_collection s:shard1) [n:127.0.0.1:34699_brauc%2Fv c:control_collection s:shard1 r:core_node1 x:collection1] o.a.s.c.ShardLeaderElectionContext Enough replicas found to continue.
   [junit4]   2> 1723177 INFO  (coreZkRegister-5267-thread-1-processing-n:127.0.0.1:34699_brauc%2Fv x:collection1 r:core_node1 c:control_collection s:shard1) [n:127.0.0.1:34699_brauc%2Fv c:control_collection s:shard1 r:core_node1 x:collection1] o.a.s.c.ShardLeaderElectionContext I may be the new leader - try and sync
   [junit4]   2> 1723177 INFO  (OverseerStateUpdate-95205887736414212-127.0.0.1:34699_brauc%2Fv-n_0000000000) [n:127.0.0.1:34699_brauc%2Fv    ] o.a.s.c.Overseer processMessage: queueSize: 1, message = {
   [junit4]   2>   "operation":"leader",
   [junit4]   2>   "shard":"shard1",
   [junit4]   2>   "collection":"control_collection"} current state version: 1
   [junit4]   2> 1723177 INFO  (coreZkRegister-5267-thread-1-processing-n:127.0.0.1:34699_brauc%2Fv x:collection1 r:core_node1 c:control_collection s:shard1) [n:127.0.0.1:34699_brauc%2Fv c:control_collection s:shard1 r:core_node1 x:collection1] o.a.s.c.SyncStrategy Sync replicas to http://127.0.0.1:34699/brauc/v/collection1/
   [junit4]   2> 1723177 INFO  (coreZkRegister-5267-thread-1-processing-n:127.0.0.1:34699_brauc%2Fv x:collection1 r:core_node1 c:control_collection s:shard1) [n:127.0.0.1:34699_brauc%2Fv c:control_collection s:shard1 r:core_node1 x:collection1] o.a.s.c.SyncStrategy Sync Success - now sync replicas to me
   [junit4]   2> 1723177 INFO  (coreZkRegister-5267-thread-1-processing-n:127.0.0.1:34699_brauc%2Fv x:collection1 r:core_node1 c:control_collection s:shard1) [n:127.0.0.1:34699_brauc%2Fv c:control_collection s:shard1 r:core_node1 x:collection1] o.a.s.c.SyncStrategy http://127.0.0.1:34699/brauc/v/collection1/ has no replicas
   [junit4]   2> 1723179 INFO  (coreZkRegister-5267-thread-1-processing-n:127.0.0.1:34699_brauc%2Fv x:collection1 r:core_node1 c:control_collection s:shard1) [n:127.0.0.1:34699_brauc%2Fv c:control_collection s:shard1 r:core_node1 x:collection1] o.a.s.c.c.SolrZkClient makePath: /collections/control_collection/leaders/shard1
   [junit4]   2> 1723181 INFO  (coreZkRegister-5267-thread-1-processing-n:127.0.0.1:34699_brauc%2Fv x:collection1 r:core_node1 c:control_collection s:shard1) [n:127.0.0.1:34699_brauc%2Fv c:control_collection s:shard1 r:core_node1 x:collection1] o.a.s.c.ShardLeaderElectionContextBase Creating leader registration node
   [junit4]   2> 1723183 INFO  (coreZkRegister-5267-thread-1-processing-n:127.0.0.1:34699_brauc%2Fv x:collection1 r:core_node1 c:control_collection s:shard1) [n:127.0.0.1:34699_brauc%2Fv c:control_collection s:shard1 r:core_node1 x:collection1] o.a.s.c.ShardLeaderElectionContext I am the new leader: http://127.0.0.1:34699/brauc/v/collection1/ shard1
   [junit4]   2> 1723184 INFO  (OverseerStateUpdate-95205887736414212-127.0.0.1:34699_brauc%2Fv-n_0000000000) [n:127.0.0.1:34699_brauc%2Fv    ] o.a.s.c.Overseer processMessage: queueSize: 1, message = {
   [junit4]   2>   "operation":"leader",
   [junit4]   2>   "shard":"shard1",
   [junit4]   2>   "collection":"control_collection",
   [junit4]   2>   "base_url":"http://127.0.0.1:34699/brauc/v",
   [junit4]   2>   "core":"collection1",
   [junit4]   2>   "state":"active"} current state version: 1
   [junit4]   2> 1723286 INFO  (TEST-DistributedVersionInfoTest.test-seed#[C6E178125FEE0741]) [    ] o.a.s.c.c.SolrZkClient Using default ZkCredentialsProvider
   [junit4]   2> 1723286 INFO  (zkCallback-2585-thread-1-processing-n:127.0.0.1:34699_brauc%2Fv) [n:127.0.0.1:34699_brauc%2Fv    ] o.a.s.c.c.ZkStateReader A cluster state change: [WatchedEvent state:SyncConnected type:NodeDataChanged path:/clusterstate.json], has occurred - updating... (live nodes size: [1])
   [junit4]   2> 1723286 INFO  (TEST-DistributedVersionInfoTest.test-seed#[C6E178125FEE0741]) [    ] o.a.s.c.c.ConnectionManager Waiting for client to connect to ZooKeeper
   [junit4]   2> 1723288 INFO  (zkCallback-2587-thread-1) [    ] o.a.s.c.c.ConnectionManager Watcher org.apache.solr.common.cloud.ConnectionManager@2fd1d0cb name:ZooKeeperConnection Watcher:127.0.0.1:53991/solr got event WatchedEvent state:SyncConnected type:None path:null path:null type:None
   [junit4]   2> 1723288 INFO  (TEST-DistributedVersionInfoTest.test-seed#[C6E178125FEE0741]) [    ] o.a.s.c.c.ConnectionManager Client is connected to ZooKeeper
   [junit4]   2> 1723288 INFO  (TEST-DistributedVersionInfoTest.test-seed#[C6E178125FEE0741]) [    ] o.a.s.c.c.SolrZkClient Using default ZkACLProvider
   [junit4]   2> 1723288 INFO  (TEST-DistributedVersionInfoTest.test-seed#[C6E178125FEE0741]) [    ] o.a.s.c.c.ZkStateReader Updating cluster state from ZooKeeper... 
   [junit4]   2> 1723291 INFO  (TEST-DistributedVersionInfoTest.test-seed#[C6E178125FEE0741]) [    ] o.a.s.c.ChaosMonkey monkey: init - expire sessions:false cause connection loss:false
   [junit4]   2> 1723291 INFO  (TEST-DistributedVersionInfoTest.test-seed#[C6E178125FEE0741]) [    ] o.a.s.c.AbstractFullDistribZkTestBase Creating collection1 with stateFormat=2
   [junit4]   2> 1723291 INFO  (TEST-DistributedVersionInfoTest.test-seed#[C6E178125FEE0741]) [    ] o.a.s.c.c.SolrZkClient Using default ZkCredentialsProvider
   [junit4]   2> 1723291 INFO  (TEST-DistributedVersionInfoTest.test-seed#[C6E178125FEE0741]) [    ] o.a.s.c.c.ConnectionManager Waiting for client to connect to ZooKeeper
   [junit4]   2> 1723292 INFO  (zkCallback-2588-thread-1) [    ] o.a.s.c.c.ConnectionManager Watcher org.apache.solr.common.cloud.ConnectionManager@7b24a5dc name:ZooKeeperConnection Watcher:127.0.0.1:53991/solr got event WatchedEvent state:SyncConnected type:None path:null path:null type:None
   [junit4]   2> 1723293 INFO  (TEST-DistributedVersionInfoTest.test-seed#[C6E178125FEE0741]) [    ] o.a.s.c.c.ConnectionManager Client is connected to ZooKeeper
   [junit4]   2> 1723293 INFO  (TEST-DistributedVersionInfoTest.test-seed#[C6E178125FEE0741]) [    ] o.a.s.c.c.SolrZkClient Using default ZkACLProvider
   [junit4]   2> 1723295 INFO  (OverseerStateUpdate-95205887736414212-127.0.0.1:34699_brauc%2Fv-n_0000000000) [n:127.0.0.1:34699_brauc%2Fv    ] o.a.s.c.Overseer processMessage: queueSize: 1, message = {
   [junit4]   2>   "operation":"create",
   [junit4]   2>   "name":"collection1",
   [junit4]   2>   "numShards":"2",
   [junit4]   2>   "stateFormat":"2"} current state version: 2
   [junit4]   2> 1723295 INFO  (OverseerStateUpdate-95205887736414212-127.0.0.1:34699_brauc%2Fv-n_0000000000) [n:127.0.0.1:34699_brauc%2Fv    ] o.a.s.c.o.ClusterStateMutator building a new cName: collection1
   [junit4]   2> 1723335 INFO  (coreZkRegister-5267-thread-1-processing-n:127.0.0.1:34699_brauc%2Fv x:collection1 r:core_node1 c:control_collection s:shard1) [n:127.0.0.1:34699_brauc%2Fv c:control_collection s:shard1 r:core_node1 x:collection1] o.a.s.c.ZkController We are http://127.0.0.1:34699/brauc/v/collection1/ and leader is http://127.0.0.1:34699/brauc/v/collection1/
   [junit4]   2> 1723335 INFO  (coreZkRegister-5267-thread-1-processing-n:127.0.0.1:34699_brauc%2Fv x:collection1 r:core_node1 c:control_collection s:shard1) [n:127.0.0.1:34699_brauc%2Fv c:control_collection s:shard1 r:core_node1 x:collection1] o.a.s.c.ZkController No LogReplay needed for core=collection1 baseURL=http://127.0.0.1:34699/brauc/v
   [junit4]   2> 1723335 INFO  (coreZkRegister-5267-thread-1-processing-n:127.0.0.1:34699_brauc%2Fv x:collection1 r:core_node1 c:control_collection s:shard1) [n:127.0.0.1:34699_brauc%2Fv c:control_collection s:shard1 r:core_node1 x:collection1] o.a.s.c.ZkController I am the leader, no recovery necessary
   [junit4]   2> 1723335 INFO  (coreZkRegister-5267-thread-1-processing-n:127.0.0.1:34699_brauc%2Fv x:collection1 r:core_node1 c:control_collection s:shard1) [n:127.0.0.1:34699_brauc%2Fv c:control_collection s:shard1 r:core_node1 x:collection1] o.a.s.c.ZkController publishing state=active
   [junit4]   2> 1723335 INFO  (coreZkRegister-5267-thread-1-processing-n:127.0.0.1:34699_brauc%2Fv x:collection1 r:core_node1 c:control_collection s:shard1) [n:127.0.0.1:34699_brauc%2Fv c:control_collection s:shard1 r:core_node1 x:collection1] o.a.s.c.ZkController numShards not found on descriptor - reading it from system property
   [junit4]   2> 1723337 INFO  (OverseerStateUpdate-95205887736414212-127.0.0.1:34699_brauc%2Fv-n_0000000000) [n:127.0.0.1:34699_brauc%2Fv    ] o.a.s.c.Overseer processMessage: queueSize: 1, message = {
   [junit4]   2>   "operation":"state",
   [junit4]   2>   "numShards":"2",
   [junit4]   2>   "node_name":"127.0.0.1:34699_brauc%2Fv",
   [junit4]   2>   "roles":null,
   [junit4]   2>   "core":"collection1",
   [junit4]   2>   "core_node_name":"core_node1",
   [junit4]   2>   "collection":"control_collection",
   [junit4]   2>   "shard":"shard1",
   [junit4]   2>   "base_url":"http://127.0.0.1:34699/brauc/v",
   [junit4]   2>   "state":"active"} current state version: 2
   [junit4]   2> 1723338 INFO  (OverseerStateUpdate-95205887736414212-127.0.0.1:34699_brauc%2Fv-n_0000000000) [n:127.0.0.1:34699_brauc%2Fv    ] o.a.s.c.o.ReplicaMutator Update state numShards=2 message={
   [junit4]   2>   "operation":"state",
   [junit4]   2>   "numShards":"2",
   [junit4]   2>   "node_name":"127.0.0.1:34699_brauc%2Fv",
   [junit4]   2>   "roles":null,
   [junit4]   2>   "core":"collection1",
   [junit4]   2>   "core_node_name":"core_node1",
   [junit4]   2>   "collection":"control_collection",
   [junit4]   2>   "shard":"shard1",
   [junit4]   2>   "base_url":"http://127.0.0.1:34699/brauc/v",
   [junit4]   2>   "state":"active"}
   [junit4]   2> 1723338 INFO  (OverseerStateUpdate-95205887736414212-127.0.0.1:34699_brauc%2Fv-n_0000000000) [n:127.0.0.1:34699_brauc%2Fv    ] o.a.s.c.o.ZkStateWriter going to create_collection /collections/collection1/state.json
   [junit4]   2> 1723442 INFO  (zkCallback-2587-thread-1) [    ] o.a.s.c.c.ZkStateReader A cluster state change: [WatchedEvent state:SyncConnected type:NodeDataChanged path:/clusterstate.json], has occurred - updating... (live nodes size: [1])
   [junit4]   2> 1723442 INFO  (zkCallback-2585-thread-2-processing-n:127.0.0.1:34699_brauc%2Fv) [n:127.0.0.1:34699_brauc%2Fv    ] o.a.s.c.c.ZkStateReader A cluster state change: [WatchedEvent state:SyncConnected type:NodeDataChanged path:/clusterstate.json], has occurred - updating... (live nodes size: [1])
   [junit4]   2> 1723599 INFO  (TEST-DistributedVersionInfoTest.test-seed#[C6E178125FEE0741]) [    ] o.a.s.SolrTestCaseJ4 Writing core.properties file to /x1/jenkins/jenkins-slave/workspace/Lucene-Solr-Tests-5.x-Java7/solr/build/solr-core/test/J1/temp/solr.cloud.DistributedVersionInfoTest_C6E178125FEE0741-001/shard-1-001/cores/collection1
   [junit4]   2> 1723599 INFO  (TEST-DistributedVersionInfoTest.test-seed#[C6E178125FEE0741]) [    ] o.a.s.c.AbstractFullDistribZkTestBase create jetty 1 in directory /x1/jenkins/jenkins-slave/workspace/Lucene-Solr-Tests-5.x-Java7/solr/build/solr-core/test/J1/temp/solr.cloud.DistributedVersionInfoTest_C6E178125FEE0741-001/shard-1-001
   [junit4]   2> 1723600 INFO  (TEST-DistributedVersionInfoTest.test-seed#[C6E178125FEE0741]) [    ] o.e.j.s.Server jetty-9.2.13.v20150730
   [junit4]   2> 1723602 INFO  (TEST-DistributedVersionInfoTest.test-seed#[C6E178125FEE0741]) [    ] o.e.j.s.h.ContextHandler Started o.e.j.s.ServletContextHandler@7b22bf1b{/brauc/v,null,AVAILABLE}
   [junit4]   2> 1723602 INFO  (TEST-DistributedVersionInfoTest.test-seed#[C6E178125FEE0741]) [    ] o.e.j.s.ServerConnector Started ServerConnector@4bc67519{HTTP/1.1}{127.0.0.1:38396}
   [junit4]   2> 1723603 INFO  (TEST-DistributedVersionInfoTest.test-seed#[C6E178125FEE0741]) [    ] o.e.j.s.Server Started @1726297ms
   [junit4]   2> 1723603 INFO  (TEST-DistributedVersionInfoTest.test-seed#[C6E178125FEE0741]) [    ] o.a.s.c.s.e.JettySolrRunner Jetty properties: {hostContext=/brauc/v, coreRootDirectory=/x1/jenkins/jenkins-slave/workspace/Lucene-Solr-Tests-5.x-Java7/solr/build/solr-core/test/J1/../../../../../../../../../../x1/jenkins/jenkins-slave/workspace/Lucene-Solr-Tests-5.x-Java7/solr/build/solr-core/test/J1/temp/solr.cloud.DistributedVersionInfoTest_C6E178125FEE0741-001/shard-1-001/cores, solr.data.dir=/x1/jenkins/jenkins-slave/workspace/Lucene-Solr-Tests-5.x-Java7/solr/build/solr-core/test/J1/temp/solr.cloud.DistributedVersionInfoTest_C6E178125FEE0741-001/tempDir-001/jetty1, hostPort=38396, solrconfig=solrconfig.xml}
   [junit4]   2> 1723603 INFO  (TEST-DistributedVersionInfoTest.test-seed#[C6E178125FEE0741]) [    ] o.a.s.s.SolrDispatchFilter SolrDispatchFilter.init(): sun.misc.Launcher$AppClassLoader@3827de24
   [junit4]   2> 1723603 INFO  (TEST-DistributedVersionInfoTest.test-seed#[C6E178125FEE0741]) [    ] o.a.s.c.SolrResourceLoader new SolrResourceLoader for directory: '/x1/jenkins/jenkins-slave/workspace/Lucene-Solr-Tests-5.x-Java7/solr/build/solr-core/test/J1/temp/solr.cloud.DistributedVersionInfoTest_C6E178125FEE0741-001/shard-1-001'
   [junit4]   2> 1723603 INFO  (TEST-DistributedVersionInfoTest.test-seed#[C6E178125FEE0741]) [    ] o.a.s.c.SolrResourceLoader JNDI not configured for solr (NoInitialContextEx)
   [junit4]   2> 1723603 INFO  (TEST-DistributedVersionInfoTest.test-seed#[C6E178125FEE0741]) [    ] o.a.s.c.SolrResourceLoader solr home defaulted to 'solr/' (could not find system property or JNDI)
   [junit4]   2> 1723604 INFO  (TEST-DistributedVersionInfoTest.test-seed#[C6E178125FEE0741]) [    ] o.a.s.c.c.SolrZkClient Using default ZkCredentialsProvider
   [junit4]   2> 1723604 INFO  (TEST-DistributedVersionInfoTest.test-seed#[C6E178125FEE0741]) [    ] o.a.s.c.c.ConnectionManager Waiting for client to connect to ZooKeeper
   [junit4]   2> 1723606 INFO  (zkCallback-2589-thread-1) [    ] o.a.s.c.c.ConnectionManager Watcher org.apache.solr.common.cloud.ConnectionManager@788a6858 name:ZooKeeperConnection Watcher:127.0.0.1:53991/solr got event WatchedEvent state:SyncConnected type:None path:null path:null type:None
   [junit4]   2> 1723606 INFO  (TEST-DistributedVersionInfoTest.test-seed#[C6E178125FEE0741]) [    ] o.a.s.c.c.ConnectionManager Client is connected to ZooKeeper
   [junit4]   2> 1723606 INFO  (TEST-DistributedVersionInfoTest.test-seed#[C6E178125FEE0741]) [    ] o.a.s.c.c.SolrZkClient Using default ZkACLProvider
   [junit4]   2> 1723607 INFO  (TEST-DistributedVersionInfoTest.test-seed#[C6E178125FEE0741]) [    ] o.a.s.s.SolrDispatchFilter Loading solr.xml from SolrHome (not found in ZooKeeper)
   [junit4]   2> 1723607 INFO  (TEST-DistributedVersionInfoTest.test-seed#[C6E178125FEE0741]) [    ] o.a.s.c.SolrXmlConfig Loading container configuration from /x1/jenkins/jenkins-slave/workspace/Lucene-Solr-Tests-5.x-Java7/solr/build/solr-core/test/J1/temp/solr.cloud.DistributedVersionInfoTest_C6E178125FEE0741-001/shard-1-001/solr.xml
   [junit4]   2> 1723622 INFO  (TEST-DistributedVersionInfoTest.test-seed#[C6E178125FEE0741]) [    ] o.a.s.c.CorePropertiesLocator Config-defined core root directory: /x1/jenkins/jenkins-slave/workspace/Lucene-Solr-Tests-5.x-Java7/solr/build/solr-core/test/J1/../../../../../../../../../../x1/jenkins/jenkins-slave/workspace/Lucene-Solr-Tests-5.x-Java7/solr/build/solr-core/test/J1/temp/solr.cloud.DistributedVersionInfoTest_C6E178125FEE0741-001/shard-1-001/cores
   [junit4]   2> 1723623 INFO  (TEST-DistributedVersionInfoTest.test-seed#[C6E178125FEE0741]) [    ] o.a.s.c.CoreContainer New CoreContainer 1873125867
   [junit4]   2> 1723623 INFO  (TEST-DistributedVersionInfoTest.test-seed#[C6E178125FEE0741]) [    ] o.a.s.c.CoreContainer Loading cores into CoreContainer [instanceDir=/x1/jenkins/jenkins-slave/workspace/Lucene-Solr-Tests-5.x-Java7/solr/build/solr-core/test/J1/temp/solr.cloud.DistributedVersionInfoTest_C6E178125FEE0741-001/shard-1-001]
   [junit4]   2> 1723623 WARN  (TEST-DistributedVersionInfoTest.test-seed#[C6E178125FEE0741]) [    ] o.a.s.c.CoreContainer Couldn't add files from /x1/jenkins/jenkins-slave/workspace/Lucene-Solr-Tests-5.x-Java7/solr/build/solr-core/test/J1/temp/solr.cloud.DistributedVersionInfoTest_C6E178125FEE0741-001/shard-1-001/lib to classpath: /x1/jenkins/jenkins-slave/workspace/Lucene-Solr-Tests-5.x-Java7/solr/build/solr-core/test/J1/temp/solr.cloud.DistributedVersionInfoTest_C6E178125FEE0741-001/shard-1-001/lib
   [junit4]   2> 1723623 INFO  (TEST-DistributedVersionInfoTest.test-seed#[C6E178125FEE0741]) [    ] o.a.s.h.c.HttpShardHandlerFactory created with socketTimeout : 90000,urlScheme : ,connTimeout : 15000,maxConnectionsPerHost : 20,maxConnections : 10000,corePoolSize : 0,maximumPoolSize : 2147483647,maxThreadIdleTime : 5,sizeOfQueue : -1,fairnessPolicy : false,useRetries : false,
   [junit4]   2> 1723624 INFO  (TEST-DistributedVersionInfoTest.test-seed#[C6E178125FEE0741]) [    ] o.a.s.u.UpdateShardHandler Creating UpdateShardHandler HTTP client with params: socketTimeout=340000&connTimeout=45000&retry=true
   [junit4]   2> 1723625 INFO  (TEST-DistributedVersionInfoTest.test-seed#[C6E178125FEE0741]) [    ] o.a.s.l.LogWatcher SLF4J impl is org.slf4j.impl.Log4jLoggerFactory
   [junit4]   2> 1723625 INFO  (TEST-DistributedVersionInfoTest.test-seed#[C6E178125FEE0741]) [    ] o.a.s.l.LogWatcher Registering Log Listener [Log4j (org.slf4j.impl.Log4jLoggerFactory)]
   [junit4]   2> 1723625 INFO  (TEST-DistributedVersionInfoTest.test-seed#[C6E178125FEE0741]) [    ] o.a.s.c.ZkContainer Zookeeper client=127.0.0.1:53991/solr
   [junit4]   2> 1723625 INFO  (TEST-DistributedVersionInfoTest.test-seed#[C6E178125FEE0741]) [    ] o.a.s.c.ZkController zkHost includes chroot
   [junit4]   2> 1723625 INFO  (TEST-DistributedVersionInfoTest.test-seed#[C6E178125FEE0741]) [    ] o.a.s.c.c.SolrZkClient Using default ZkCredentialsProvider
   [junit4]   2> 1723626 INFO  (TEST-DistributedVersionInfoTest.test-seed#[C6E178125FEE0741]) [    ] o.a.s.c.c.ConnectionManager Waiting for client to connect to ZooKeeper
   [junit4]   2> 1723627 INFO  (zkCallback-2591-thread-1) [    ] o.a.s.c.c.ConnectionManager Watcher org.apache.solr.common.cloud.ConnectionManager@720c176a name:ZooKeeperConnection Watcher:127.0.0.1:53991 got event WatchedEvent state:SyncConnected type:None path:null path:null type:None
   [junit4]   2> 1723627 INFO  (TEST-DistributedVersionInfoTest.test-seed#[C6E178125FEE0741]) [    ] o.a.s.c.c.ConnectionManager Client is connected to ZooKeeper
   [junit4]   2> 1723628 INFO  (TEST-DistributedVersionInfoTest.test-seed#[C6E178125FEE0741]) [    ] o.a.s.c.c.SolrZkClient Using default ZkACLProvider
   [junit4]   2> 1723629 INFO  (TEST-DistributedVersionInfoTest.test-seed#[C6E178125FEE0741]) [n:127.0.0.1:38396_brauc%2Fv    ] o.a.s.c.c.ConnectionManager Waiting for client to connect to ZooKeeper
   [junit4]   2> 1723630 INFO  (zkCallback-2592-thread-1-processing-n:127.0.0.1:38396_brauc%2Fv) [n:127.0.0.1:38396_brauc%2Fv    ] o.a.s.c.c.ConnectionManager Watcher org.apache.solr.common.cloud.ConnectionManager@7c8932ab name:ZooKeeperConnection Watcher:127.0.0.1:53991/solr got event WatchedEvent state:SyncConnected type:None path:null path:null type:None
   [junit4]   2> 1723631 INFO  (TEST-DistributedVersionInfoTest.test-seed#[C6E178125FEE0741]) [n:127.0.0.1:38396_brauc%2Fv    ] o.a.s.c.c.ConnectionManager Client is connected to ZooKeeper
   [junit4]   2> 1723636 INFO  (TEST-DistributedVersionInfoTest.test-seed#[C6E178125FEE0741]) [n:127.0.0.1:38396_brauc%2Fv    ] o.a.s.c.c.ZkStateReader Updating cluster state from ZooKeeper... 
   [junit4]   2> 1724643 INFO  (TEST-DistributedVersionInfoTest.test-seed#[C6E178125FEE0741]) [n:127.0.0.1:38396_brauc%2Fv    ] o.a.s.c.ZkController Register node as live in ZooKeeper:/live_nodes/127.0.0.1:38396_brauc%2Fv
   [junit4]   2> 1724643 INFO  (TEST-DistributedVersionInfoTest.test-seed#[C6E178125FEE0741]) [n:127.0.0.1:38396_brauc%2Fv    ] o.a.s.c.c.SolrZkClient makePath: /live_nodes/127.0.0.1:38396_brauc%2Fv
   [junit4]   2> 1724644 INFO  (zkCallback-2587-thread-1) [    ] o.a.s.c.c.ZkStateReader A live node change: [WatchedEvent state:SyncConnected type:NodeChildrenChanged path:/live_nodes], has occurred - updating... (live nodes size: [1])
   [junit4]   2> 1724644 INFO  (zkCallback-2585-thread-2-processing-n:127.0.0.1:34699_brauc%2Fv) [n:127.0.0.1:34699_brauc%2Fv    ] o.a.s.c.c.ZkStateReader A live node change: [WatchedEvent state:SyncConnected type:NodeChildrenChanged path:/live_nodes], has occurred - updating... (live nodes size: [1])
   [junit4]   2> 1724644 INFO  (zkCallback-2592-thread-1-processing-n:127.0.0.1:38396_brauc%2Fv) [n:127.0.0.1:38396_brauc%2Fv    ] o.a.s.c.c.ZkStateReader A live node change: [WatchedEvent state:SyncConnected type:NodeChildrenChanged path:/live_nodes], has occurred - updating... (live nodes size: [1])
   [junit4]   2> 1724646 INFO  (TEST-DistributedVersionInfoTest.test-seed#[C6E178125FEE0741]) [n:127.0.0.1:38396_brauc%2Fv    ] o.a.s.c.Overseer Overseer (id=null) closing
   [junit4]   2> 1724647 INFO  (TEST-DistributedVersionInfoTest.test-seed#[C6E178125FEE0741]) [n:127.0.0.1:38396_brauc%2Fv    ] o.a.s.c.LeaderElector Joined leadership election with path: /overseer_elect/election/95205887736414217-127.0.0.1:38396_brauc%2Fv-n_0000000001
   [junit4]   2> 1724647 INFO  (TEST-DistributedVersionInfoTest.test-seed#[C6E178125FEE0741]) [n:127.0.0.1:38396_brauc%2Fv    ] o.a.s.c.LeaderElector Watching path /overseer_elect/election/95205887736414212-127.0.0.1:34699_brauc%2Fv-n_0000000000 to know if I could be the leader
   [junit4]   2> 1724657 INFO  (TEST-DistributedVersionInfoTest.test-seed#[C6E178125FEE0741]) [n:127.0.0.1:38396_brauc%2Fv    ] o.a.s.c.CoreContainer Security conf doesn't exist. Skipping setup for authorization module.
   [junit4]   2> 1724657 INFO  (TEST-DistributedVersionInfoTest.test-seed#[C6E178125FEE0741]) [n:127.0.0.1:38396_brauc%2Fv    ] o.a.s.c.CoreContainer No authentication plugin used.
   [junit4]   2> 1724658 INFO  (TEST-DistributedVersionInfoTest.test-seed#[C6E178125FEE0741]) [n:127.0.0.1:38396_brauc%2Fv    ] o.a.s.c.CorePropertiesLocator Looking for core definitions underneath /x1/jenkins/jenkins-slave/workspace/Lucene-Solr-Tests-5.x-Java7/solr/build/solr-core/test/J1/../../../../../../../../../../x1/jenkins/jenkins-slave/workspace/Lucene-Solr-Tests-5.x-Java7/solr/build/solr-core/test/J1/temp/solr.cloud.DistributedVersionInfoTest_C6E178125FEE0741-001/shard-1-001/cores
   [junit4]   2> 1724659 INFO  (TEST-DistributedVersionInfoTest.test-seed#[C6E178125FEE0741]) [n:127.0.0.1:38396_brauc%2Fv    ] o.a.s.c.CoreDescriptor Created CoreDescriptor: {name=collection1, collection=collection1, coreNodeName=, config=solrconfig.xml, dataDir=data/, loadOnStartup=true, transient=false, schema=schema.xml, shard=, configSetProperties=configsetprops.json}
   [junit4]   2> 1724659 INFO  (TEST-DistributedVersionInfoTest.test-seed#[C6E178125FEE0741]) [n:127.0.0.1:38396_brauc%2Fv    ] o.a.s.c.CorePropertiesLocator Found core collection1 in /x1/jenkins/jenkins-slave/workspace/Lucene-Solr-Tests-5.x-Java7/solr/build/solr-core/test/J1/../../../../../../../../../../x1/jenkins/jenkins-slave/workspace/Lucene-Solr-Tests-5.x-Java7/solr/build/solr-core/test/J1/temp/solr.cloud.DistributedVersionInfoTest_C6E178125FEE0741-001/shard-1-001/cores/collection1
   [junit4]   2> 1724659 INFO  (TEST-DistributedVersionInfoTest.test-seed#[C6E178125FEE0741]) [n:127.0.0.1:38396_brauc%2Fv    ] o.a.s.c.CorePropertiesLocator Found 1 core definitions
   [junit4]   2> 1724660 INFO  (TEST-DistributedVersionInfoTest.test-seed#[C6E178125FEE0741]) [n:127.0.0.1:38396_brauc%2Fv    ] o.a.s.s.SolrDispatchFilter user.dir=/x1/jenkins/jenkins-slave/workspace/Lucene-Solr-Tests-5.x-Java7/solr/build/solr-core/test/J1
   [junit4]   2> 1724660 INFO  (TEST-DistributedVersionInfoTest.test-seed#[C6E178125FEE0741]) [n:127.0.0.1:38396_brauc%2Fv    ] o.a.s.s.SolrDispatchFilter SolrDispatchFilter.init() done
   [junit4]   2> 1724661 INFO  (coreLoadExecutor-5284-thread-1-processing-n:127.0.0.1:38396_brauc%2Fv) [n:127.0.0.1:38396_brauc%2Fv c:collection1   x:collection1] o.a.s.c.ZkController publishing state=down
   [junit4]   2> 1724661 INFO  (coreLoadExecutor-5284-thread-1-processing-n:127.0.0.1:38396_brauc%2Fv) [n:127.0.0.1:38396_brauc%2Fv c:collection1   x:collection1] o.a.s.c.ZkController numShards not found on descriptor - reading it from system property
   [junit4]   2> 1724662 INFO  (coreLoadExecutor-5284-thread-1-processing-n:127.0.0.1:38396_brauc%2Fv) [n:127.0.0.1:38396_brauc%2Fv c:collection1   x:collection1] o.a.s.c.ZkController Registering watch for collection collection1
   [junit4]   2> 1724662 INFO  (OverseerStateUpdate-95205887736414212-127.0.0.1:34699_brauc%2Fv-n_0000000000) [n:127.0.0.1:34699_brauc%2Fv    ] o.a.s.c.Overseer processMessage: queueSize: 1, message = {
   [junit4]   2>   "operation":"state",
   [junit4]   2>   "numShards":"2",
   [junit4]   2>   "node_name":"127.0.0.1:38396_brauc%2Fv",
   [junit4]   2>   "roles":null,
   [junit4]   2>   "core":"collection1",
   [junit4]   2>   "collection":"collection1",
   [junit4]   2>   "shard":null,
   [junit4]   2>   "base_url":"http://127.0.0.1:38396/brauc/v",
   [junit4]   2>   "state":"down"} current state version: 3
   [junit4]   2> 1724662 INFO  (coreLoadExecutor-5284-thread-1-processing-n:127.0.0.1:38396_brauc%2Fv) [n:127.0.0.1:38396_brauc%2Fv c:collection1   x:collection1] o.a.s.c.c.ZkStateReader addZkWatch [collection1]
   [junit4]   2> 1724663 INFO  (OverseerStateUpdate-95205887736414212-127.0.0.1:34699_brauc%2Fv-n_0000000000) [n:127.0.0.1:34699_brauc%2Fv    ] o.a.s.c.o.ReplicaMutator Update state numShards=2 message={
   [junit4]   2>   "operation":"state",
   [junit4]   2>   "numShards":"2",
   [junit4]   2>   "node_name":"127.0.0.1:38396_brauc%2Fv",
   [junit4]   2>   "roles":null,
   [junit4]   2>   "core":"collection1",
   [junit4]   2>   "collection":"collection1",
   [junit4]   2>   "shard":null,
   [junit4]   2>   "base_url":"http://127.0.0.1:38396/brauc/v",
   [junit4]   2>   "state":"down"}
   [junit4]   2> 1724663 INFO  (OverseerStateUpdate-95205887736414212-127.0.0.1:34699_brauc%2Fv-n_0000000000) [n:127.0.0.1:34699_brauc%2Fv    ] o.a.s.c.o.ReplicaMutator Collection already exists with numShards=2
   [junit4]   2> 1724663 INFO  (OverseerStateUpdate-95205887736414212-127.0.0.1:34699_brauc%2Fv-n_0000000000) [n:127.0.0.1:34699_brauc%2Fv    ] o.a.s.c.o.ReplicaMutator Assigning new node to shard shard=shard1
   [junit4]   2> 1724663 INFO  (coreLoadExecutor-5284-thread-1-processing-n:127.0.0.1:38396_brauc%2Fv) [n:127.0.0.1:38396_brauc%2Fv c:collection1   x:collection1] o.a.s.c.c.ZkStateReader Add data for [collection1] ver [0]
   [junit4]   2> 1724663 INFO  (coreLoadExecutor-5284-thread-1-processing-n:127.0.0.1:38396_brauc%2Fv) [n:127.0.0.1:38396_brauc%2Fv c:collection1   x:collection1] o.a.s.c.ZkController look for our core node name
   [junit4]   2> 1724766 INFO  (OverseerStateUpdate-95205887736414212-127.0.0.1:34699_brauc%2Fv-n_0000000000) [n:127.0.0.1:34699_brauc%2Fv    ] o.a.s.c.o.ZkStateWriter going to update_collection /collections/collection1/state.json version: 0
   [junit4]   2> 1724766 INFO  (zkCallback-2592-thread-1-processing-n:127.0.0.1:38396_brauc%2Fv) [n:127.0.0.1:38396_brauc%2Fv    ] o.a.s.c.c.ZkStateReader A cluster state change: [WatchedEvent state:SyncConnected type:NodeDataChanged path:/collections/collection1/state.json] for collection [collection1] has occurred - updating... (live nodes size: [2])
   [junit4]   2> 1724767 INFO  (zkCallback-2592-thread-1-processing-n:127.0.0.1:38396_brauc%2Fv) [n:127.0.0.1:38396_brauc%2Fv    ] o.a.s.c.c.ZkStateReader Updating data for [collection1] from [0] to [1]
   [junit4]   2> 1725664 INFO  (coreLoadExecutor-5284-thread-1-processing-n:127.0.0.1:38396_brauc%2Fv) [n:127.0.0.1:38396_brauc%2Fv c:collection1   x:collection1] o.a.s.c.ZkController waiting to find shard id in clusterstate for collection1
   [junit4]   2> 1725664 INFO  (coreLoadExecutor-5284-thread-1-processing-n:127.0.0.1:38396_brauc%2Fv) [n:127.0.0.1:38396_brauc%2Fv c:collection1   x:collection1] o.a.s.c.ZkController Check for collection zkNode:collection1
   [junit4]   2> 1725665 INFO  (coreLoadExecutor-5284-thread-1-processing-n:127.0.0.1:38396_brauc%2Fv) [n:127.0.0.1:38396_brauc%2Fv c:collection1   x:collection1] o.a.s.c.ZkController Collection zkNode exists
   [junit4]   2> 1725665 INFO  (coreLoadExecutor-5284-thread-1-processing-n:127.0.0.1:38396_brauc%2Fv) [n:127.0.0.1:38396_brauc%2Fv c:collection1   x:collection1] o.a.s.c.c.ZkStateReader Load collection config from: [/collections/collection1]
   [junit4]   2> 1725665 INFO  (coreLoadExecutor-5284-thread-1-processing-n:127.0.0.1:38396_brauc%2Fv) [n:127.0.0.1:38396_brauc%2Fv c:collection1   x:collection1] o.a.s.c.c.ZkStateReader path=[/collections/collection1] [configName]=[conf1] specified config exists in ZooKeeper
   [junit4]   2> 1725665 INFO  (coreLoadExecutor-5284-thread-1-processing-n:127.0.0.1:38396_brauc%2Fv) [n:127.0.0.1:38396_brauc%2Fv c:collection1   x:collection1] o.a.s.c.SolrResourceLoader new SolrResourceLoader for directory: '/x1/jenkins/jenkins-slave/workspace/Lucene-Solr-Tests-5.x-Java7/solr/build/solr-core/test/J1/temp/solr.cloud.DistributedVersionInfoTest_C6E178125FEE0741-001/shard-1-001/cores/collection1'
   [junit4]   2> 1725666 INFO  (coreLoadExecutor-5284-thread-1-processing-n:127.0.0.1:38396_brauc%2Fv) [n:127.0.0.1:38396_brauc%2Fv c:collection1   x:collection1] o.a.s.c.SolrResourceLoader JNDI not configured for solr (NoInitialContextEx)
   [junit4]   2> 1725666 INFO  (coreLoadExecutor-5284-thread-1-processing-n:127.0.0.1:38396_brauc%2Fv) [n:127.0.0.1:38396_brauc%2Fv c:collection1   x:collection1] o.a.s.c.SolrResourceLoader solr home defaulted to 'solr/' (could not find system property or JNDI)
   [junit4]   2> 1725667 INFO  (coreLoadExecutor-5284-thread-1-processing-n:127.0.0.1:38396_brauc%2Fv) [n:127.0.0.1:38396_brauc%2Fv c:collection1   x:collection1] o.a.s.c.Config loaded config solrconfig.xml with version 0 
   [junit4]   2> 1725673 INFO  (coreLoadExecutor-5284-thread-1-processing-n:127.0.0.1:38396_brauc%2Fv) [n:127.0.0.1:38396_brauc%2Fv c:collection1   x:collection1] o.a.s.c.SolrConfig current version of requestparams : -1
   [junit4]   2> 1725688 INFO  (coreLoadExecutor-5284-thread-1-processing-n:127.0.0.1:38396_brauc%2Fv) [n:127.0.0.1:38396_brauc%2Fv c:collection1   x:collection1] o.a.s.c.SolrConfig Using Lucene MatchVersion: 5.5.0
   [junit4]   2> 1725730 INFO  (coreLoadExecutor-5284-thread-1-processing-n:127.0.0.1:38396_brauc%2Fv) [n:127.0.0.1:38396_brauc%2Fv c:collection1   x:collection1] o.a.s.c.SolrConfig Loaded SolrConfig: solrconfig.xml
   [junit4]   2> 1725738 INFO  (coreLoadExecutor-5284-thread-1-processing-n:127.0.0.1:38396_brauc%2Fv) [n:127.0.0.1:38396_brauc%2Fv c:collection1   x:collection1] o.a.s.s.IndexSchema [collection1] Schema name=test
   [junit4]   2> 1725989 INFO  (coreLoadExecutor-5284-thread-1-processing-n:127.0.0.1:38396_brauc%2Fv) [n:127.0.0.1:38396_brauc%2Fv c:collection1   x:collection1] o.a.s.s.OpenExchangeRatesOrgProvider Initialized with rates=open-exchange-rates.json, refreshInterval=1440.
   [junit4]   2> 1725997 INFO  (coreLoadExecutor-5284-thread-1-processing-n:127.0.0.1:38396_brauc%2Fv) [n:127.0.0.1:38396_brauc%2Fv c:collection1   x:collection1] o.a.s.s.IndexSchema default search field in schema is text
   [junit4]   2> 1725998 INFO  (coreLoadExecutor-5284-thread-1-processing-n:127.0.0.1:38396_brauc%2Fv) [n:127.0.0.1:38396_brauc%2Fv c:collection1   x:collection1] o.a.s.s.IndexSchema unique key field: id
   [junit4]   2> 1726008 INFO  (coreLoadExecutor-5284-thread-1-processing-n:127.0.0.1:38396_brauc%2Fv) [n:127.0.0.1:38396_brauc%2Fv c:collection1   x:collection1] o.a.s.s.FileExchangeRateProvider Reloading exchange rates from file currency.xml
   [junit4]   2> 1726011 INFO  (coreLoadExecutor-5284-thread-1-processing-n:127.0.0.1:38396_brauc%2Fv) [n:127.0.0.1:38396_brauc%2Fv c:collection1   x:collection1] o.a.s.s.FileExchangeRateProvider Reloading exchange rates from file currency.xml
   [junit4]   2> 1726014 INFO  (coreLoadExecutor-5284-thread-1-processing-n:127.0.0.1:38396_brauc%2Fv) [n:127.0.0.1:38396_brauc%2Fv c:collection1   x:collection1] o.a.s.s.OpenExchangeRatesOrgProvider Reloading exchange rates from open-exchange-rates.json
   [junit4]   2> 1726015 INFO  (coreLoadExecutor-5284-thread-1-processing-n:127.0.0.1:38396_brauc%2Fv) [n:127.0.0.1:38396_brauc%2Fv c:collection1   x:collection1] o.a.s.s.OpenExchangeRatesOrgProvider Reloading exchange rates from open-exchange-rates.json
   [junit4]   2> 1726017 INFO  (coreLoadExecutor-5284-thread-1-processing-n:127.0.0.1:38396_brauc%2Fv) [n:127.0.0.1:38396_brauc%2Fv c:collection1   x:collection1] o.a.s.c.ConfigSetProperties Did not find ConfigSet properties, assuming default properties: Can't find resource 'configsetprops.json' in classpath or '/configs/conf1', cwd=/x1/jenkins/jenkins-slave/workspace/Lucene-Solr-Tests-5.x-Java7/solr/build/solr-core/test/J1
   [junit4]   2> 1726017 INFO  (coreLoadExecutor-5284-thread-1-processing-n:127.0.0.1:38396_brauc%2Fv) [n:127.0.0.1:38396_brauc%2Fv c:collection1   x:collection1] o.a.s.c.CoreContainer Creating SolrCore 'collection1' using configuration from collection collection1
   [junit4]   2> 1726017 INFO  (coreLoadExecutor-5284-thread-1-processing-n:127.0.0.1:38396_brauc%2Fv) [n:127.0.0.1:38396_brauc%2Fv c:collection1 s:shard1 r:core_node1 x:collection1] o.a.s.c.SolrCore org.apache.solr.core.MockDirectoryFactory
   [junit4]   2> 1726018 INFO  (coreLoadExecutor-5284-thread-1-processing-n:127.0.0.1:38396_brauc%2Fv) [n:127.0.0.1:38396_brauc%2Fv c:collection1 s:shard1 r:core_node1 x:collection1] o.a.s.c.SolrCore [[collection1] ] Opening new SolrCore at [/x1/jenkins/jenkins-slave/workspace/Lucene-Solr-Tests-5.x-Java7/solr/build/solr-core/test/J1/temp/solr.cloud.DistributedVersionInfoTest_C6E178125FEE0741-001/shard-1-001/cores/collection1], dataDir=[/x1/jenkins/jenkins-slave/workspace/Lucene-Solr-Tests-5.x-Java7/solr/build/solr-core/test/J1/../../../../../../../../../../x1/jenkins/jenkins-slave/workspace/Lucene-Solr-Tests-5.x-Java7/solr/build/solr-core/test/J1/temp/solr.cloud.DistributedVersionInfoTest_C6E178125FEE0741-001/shard-1-001/cores/collection1/data/]
   [junit4]   2> 1726018 INFO  (coreLoadExecutor-5284-thread-1-processing-n:127.0.0.1:38396_brauc%2Fv) [n:127.0.0.1:38396_brauc%2Fv c:collection1 s:shard1 r:core_node1 x:collection1] o.a.s.c.JmxMonitoredMap JMX monitoring is enabled. Adding Solr mbeans to JMX Server: com.sun.jmx.mbeanserver.JmxMBeanServer@3f6df4c9
   [junit4]   2> 1726018 INFO  (coreLoadExecutor-5284-thread-1-processing-n:127.0.0.1:38396_brauc%2Fv) [n:127.0.0.1:38396_brauc%2Fv c:collection1 s:shard1 r:core_node1 x:collection1] o.a.s.c.CachingDirectoryFactory return new directory for /x1/jenkins/jenkins-slave/workspace/Lucene-Solr-Tests-5.x-Java7/solr/build/solr-core/test/J1/../../../../../../../../../../x1/jenkins/jenkins-slave/workspace/Lucene-Solr-Tests-5.x-Java7/solr/build/solr-core/test/J1/temp/solr.cloud.DistributedVersionInfoTest_C6E178125FEE0741-001/shard-1-001/cores/collection1/data
   [junit4]   2> 1726018 INFO  (coreLoadExecutor-5284-thread-1-processing-n:127.0.0.1:38396_brauc%2Fv) [n:127.0.0.1:38396_brauc%2Fv c:collection1 s:shard1 r:core_node1 x:collection1] o.a.s.c.SolrCore New index directory detected: old=null new=/x1/jenkins/jenkins-slave/workspace/Lucene-Solr-Tests-5.x-Java7/solr/build/solr-core/test/J1/../../../../../../../../../../x1/jenkins/jenkins-slave/workspace/Lucene-Solr-Tests-5.x-Java7/solr/build/solr-core/test/J1/temp/solr.cloud.DistributedVersionInfoTest_C6E178125FEE0741-001/shard-1-001/cores/collection1/data/index/
   [junit4]   2> 1726019 WARN  (coreLoadExecutor-5284-thread-1-processing-n:127.0.0.1:38396_brauc%2Fv) [n:127.0.0.1:38396_brauc%2Fv c:collection1 s:shard1 r:core_node1 x:collection1] o.a.s.c.SolrCore [collection1] Solr index directory '/x1/jenkins/jenkins-slave/workspace/Lucene-Solr-Tests-5.x-Java7/solr/build/solr-core/test/J1/../../../../../../../../../../x1/jenkins/jenkins-slave/workspace/Lucene-Solr-Tests-5.x-Java7/solr/build/solr-core/test/J1/temp/solr.cloud.DistributedVersionInfoTest_C6E178125FEE0741-001/shard-1-001/cores/collection1/data/index' doesn't exist. Creating new index...
   [junit4]   2> 1726019 INFO  (coreLoadExecutor-5284-thread-1-processing-n:127.0.0.1:38396_brauc%2Fv) [n:127.0.0.1:38396_brauc%2Fv c:collection1 s:shard1 r:core_node1 x:collection1] o.a.s.c.CachingDirectoryFactory return new directory for /x1/jenkins/jenkins-slave/workspace/Lucene-Solr-Tests-5.

[...truncated too long message...]

.NonBlockingThread.run(NonBlockingThread.java:52)
   [junit4]   2>         at org.eclipse.jetty.util.thread.QueuedThreadPool.runJob(QueuedThreadPool.java:635)
   [junit4]   2>         at org.eclipse.jetty.util.thread.QueuedThreadPool$3.run(QueuedThreadPool.java:555)
   [junit4]   2>         at java.lang.Thread.run(Thread.java:745)
   [junit4]   2>    6) Thread[id=17127, name=TEST-DistributedVersionInfoTest.test-seed#[C6E178125FEE0741]-SendThread(127.0.0.1:53991), state=TIMED_WAITING, group=TGRP-DistributedVersionInfoTest]
   [junit4]   2>         at java.lang.Thread.sleep(Native Method)
   [junit4]   2>         at org.apache.zookeeper.client.StaticHostProvider.next(StaticHostProvider.java:101)
   [junit4]   2>         at org.apache.zookeeper.ClientCnxn$SendThread.startConnect(ClientCnxn.java:940)
   [junit4]   2>         at org.apache.zookeeper.ClientCnxn$SendThread.run(ClientCnxn.java:1003)
   [junit4]   2>    7) Thread[id=17119, name=Scheduler-1577867658, state=TIMED_WAITING, group=TGRP-DistributedVersionInfoTest]
   [junit4]   2>         at sun.misc.Unsafe.park(Native Method)
   [junit4]   2>         at java.util.concurrent.locks.LockSupport.parkNanos(LockSupport.java:226)
   [junit4]   2>         at java.util.concurrent.locks.AbstractQueuedSynchronizer$ConditionObject.awaitNanos(AbstractQueuedSynchronizer.java:2082)
   [junit4]   2>         at java.util.concurrent.ScheduledThreadPoolExecutor$DelayedWorkQueue.take(ScheduledThreadPoolExecutor.java:1090)
   [junit4]   2>         at java.util.concurrent.ScheduledThreadPoolExecutor$DelayedWorkQueue.take(ScheduledThreadPoolExecutor.java:807)
   [junit4]   2>         at java.util.concurrent.ThreadPoolExecutor.getTask(ThreadPoolExecutor.java:1068)
   [junit4]   2>         at java.util.concurrent.ThreadPoolExecutor.runWorker(ThreadPoolExecutor.java:1130)
   [junit4]   2>         at java.util.concurrent.ThreadPoolExecutor$Worker.run(ThreadPoolExecutor.java:615)
   [junit4]   2>         at java.lang.Thread.run(Thread.java:745)
   [junit4]   2>    8) Thread[id=17131, name=Thread-7757, state=WAITING, group=TGRP-DistributedVersionInfoTest]
   [junit4]   2>         at java.lang.Object.wait(Native Method)
   [junit4]   2>         at java.lang.Object.wait(Object.java:503)
   [junit4]   2>         at org.apache.solr.core.CloserThread.run(CoreContainer.java:1243)
   [junit4]   2>    9) Thread[id=17135, name=searcherExecutor-5318-thread-1, state=WAITING, group=TGRP-DistributedVersionInfoTest]
   [junit4]   2>         at sun.misc.Unsafe.park(Native Method)
   [junit4]   2>         at java.util.concurrent.locks.LockSupport.park(LockSupport.java:186)
   [junit4]   2>         at java.util.concurrent.locks.AbstractQueuedSynchronizer$ConditionObject.await(AbstractQueuedSynchronizer.java:2043)
   [junit4]   2>         at java.util.concurrent.LinkedBlockingQueue.take(LinkedBlockingQueue.java:442)
   [junit4]   2>         at java.util.concurrent.ThreadPoolExecutor.getTask(ThreadPoolExecutor.java:1068)
   [junit4]   2>         at java.util.concurrent.ThreadPoolExecutor.runWorker(ThreadPoolExecutor.java:1130)
   [junit4]   2>         at java.util.concurrent.ThreadPoolExecutor$Worker.run(ThreadPoolExecutor.java:615)
   [junit4]   2>         at java.lang.Thread.run(Thread.java:745)
   [junit4]   2>   10) Thread[id=17139, name=updateExecutor-2603-thread-1, state=TIMED_WAITING, group=TGRP-DistributedVersionInfoTest]
   [junit4]   2>         at sun.misc.Unsafe.park(Native Method)
   [junit4]   2>         at java.util.concurrent.locks.LockSupport.parkNanos(LockSupport.java:226)
   [junit4]   2>         at java.util.concurrent.SynchronousQueue$TransferStack.awaitFulfill(SynchronousQueue.java:460)
   [junit4]   2>         at java.util.concurrent.SynchronousQueue$TransferStack.transfer(SynchronousQueue.java:359)
   [junit4]   2>         at java.util.concurrent.SynchronousQueue.poll(SynchronousQueue.java:942)
   [junit4]   2>         at java.util.concurrent.ThreadPoolExecutor.getTask(ThreadPoolExecutor.java:1068)
   [junit4]   2>         at java.util.concurrent.ThreadPoolExecutor.runWorker(ThreadPoolExecutor.java:1130)
   [junit4]   2>         at java.util.concurrent.ThreadPoolExecutor$Worker.run(ThreadPoolExecutor.java:615)
   [junit4]   2>         at java.lang.Thread.run(Thread.java:745)
   [junit4]   2> NOTE: test params are: codec=Asserting(Lucene54): {}, docValues:{}, sim=DefaultSimilarity, locale=ar, timezone=Africa/Ceuta
   [junit4]   2> NOTE: Linux 3.13.0-52-generic amd64/Oracle Corporation 1.7.0_80 (64-bit)/cpus=4,threads=18,free=156381536,total=501219328
   [junit4]   2> NOTE: All tests run in this JVM: [TestSystemIdResolver, TestFastLRUCache, DistributedExpandComponentTest, ZkSolrClientTest, PKIAuthenticationIntegrationTest, DistributedQueryComponentCustomSortTest, FileUtilsTest, TestSolrConfigHandlerCloud, TestTestInjection, CSVRequestHandlerTest, ShardRoutingCustomTest, TestStandardQParsers, TestRawTransformer, TestBM25SimilarityFactory, ChaosMonkeySafeLeaderTest, SecurityConfHandlerTest, ConvertedLegacyTest, TestCryptoKeys, ChaosMonkeyNothingIsSafeTest, TestOrdValues, NotRequiredUniqueKeyTest, MergeStrategyTest, TestAddFieldRealTimeGet, AsyncMigrateRouteKeyTest, TestNonDefinedSimilarityFactory, AnalyticsMergeStrategyTest, TestReplicaProperties, DistributedIntervalFacetingTest, TestBinaryResponseWriter, VMParamsZkACLAndCredentialsProvidersTest, TestPivotHelperCode, TestQueryUtils, TestSurroundQueryParser, DistanceFunctionTest, CloudMLTQParserTest, TestDistributedGrouping, SolrIndexSplitterTest, SSLMigrationTest, DocumentBuilderTest, CollectionTooManyReplicasTest, TestSolrConfigHandler, DistributedTermsComponentTest, TestExactStatsCache, CoreAdminRequestStatusTest, FastVectorHighlighterTest, TestRecoveryHdfs, MBeansHandlerTest, DirectoryFactoryTest, TestSimpleQParserPlugin, LeaderInitiatedRecoveryOnCommitTest, LoggingHandlerTest, WordBreakSolrSpellCheckerTest, TestDefaultStatsCache, SpatialFilterTest, TestManagedResource, BlockCacheTest, TermVectorComponentTest, MoreLikeThisHandlerTest, TestClusterStateMutator, TestSolrDeletionPolicy2, BlockJoinFacetDistribTest, HLLSerializationTest, TestSimpleTrackingShardHandler, OverseerCollectionConfigSetProcessorTest, TestConfigSetsAPI, ForceLeaderTest, SortByFunctionTest, TermsComponentTest, TestSolrCoreProperties, AddSchemaFieldsUpdateProcessorFactoryTest, SchemaVersionSpecificBehaviorTest, DocValuesTest, BadCopyFieldTest, ShardRoutingTest, OpenCloseCoreStressTest, TestFileDictionaryLookup, DocExpirationUpdateProcessorFactoryTest, TestSerializedLuceneMatchVersion, TestCloudSchemaless, TestDFRSimilarityFactory, TestCodecSupport, BasicFunctionalityTest, TimeZoneUtilsTest, AliasIntegrationTest, TestReplicationHandlerBackup, NumericFieldsTest, TestQueryTypes, TestPartialUpdateDeduplication, ZkCLITest, TestRandomCollapseQParserPlugin, TestUpdate, TestXmlQParser, SyncSliceTest, BasicZkTest, FullSolrCloudDistribCmdsTest, ClusterStateUpdateTest, TestRandomFaceting, LeaderElectionTest, TestZkChroot, TestFaceting, TestHashPartitioner, ZkControllerTest, TestCoreContainer, SimpleFacetsTest, SolrCoreTest, SpellCheckComponentTest, TestGroupingSearch, QueryElevationComponentTest, PeerSyncTest, TestFunctionQuery, DirectUpdateHandlerTest, TestIndexSearcher, SoftAutoCommitTest, SolrCoreCheckLockOnStartupTest, TestRemoteStreaming, CacheHeaderTest, StandardRequestHandlerTest, TestOmitPositions, RequestHandlersTest, IndexSchemaRuntimeFieldTest, SolrPluginUtilsTest, UpdateRequestProcessorFactoryTest, UniqFieldsUpdateProcessorFactoryTest, TestPHPSerializedResponseWriter, TestSolrIndexConfig, CopyFieldTest, TestMergePolicyConfig, MultiTermTest, TestBinaryField, OutputWriterTest, SpellPossibilityIteratorTest, TestXIncludeConfig, TestLMDirichletSimilarityFactory, TestFastWriter, ScriptEngineTest, URLClassifyProcessorTest, DateMathParserTest, PrimUtilsTest, TestSuggestSpellingConverter, DateFieldTest, DistributedMLTComponentTest, TestCursorMarkWithoutUniqueKey, TestHighlightDedupGrouping, ConnectionReuseTest, ConfigSetsAPITest, DeleteShardTest, DistributedQueueTest, DistributedVersionInfoTest]
   [junit4]   2> NOTE: reproduce with: ant test  -Dtestcase=DistributedVersionInfoTest -Dtests.seed=C6E178125FEE0741 -Dtests.multiplier=2 -Dtests.slow=true -Dtests.locale=ar -Dtests.timezone=Africa/Ceuta -Dtests.asserts=true -Dtests.file.encoding=US-ASCII
   [junit4] ERROR   0.00s J1 | DistributedVersionInfoTest (suite) <<<
   [junit4]    > Throwable #1: java.lang.Exception: Suite timeout exceeded (>= 7200000 msec).
   [junit4]    > 	at __randomizedtesting.SeedInfo.seed([C6E178125FEE0741]:0)
   [junit4] Completed [565/565 (1!)] on J1 in 7223.80s, 1 test, 2 errors <<< FAILURES!

[...truncated 12 lines...]
BUILD FAILED
/x1/jenkins/jenkins-slave/workspace/Lucene-Solr-Tests-5.x-Java7/build.xml:794: The following error occurred while executing this line:
/x1/jenkins/jenkins-slave/workspace/Lucene-Solr-Tests-5.x-Java7/build.xml:738: The following error occurred while executing this line:
/x1/jenkins/jenkins-slave/workspace/Lucene-Solr-Tests-5.x-Java7/build.xml:59: The following error occurred while executing this line:
/x1/jenkins/jenkins-slave/workspace/Lucene-Solr-Tests-5.x-Java7/solr/build.xml:233: The following error occurred while executing this line:
/x1/jenkins/jenkins-slave/workspace/Lucene-Solr-Tests-5.x-Java7/solr/common-build.xml:532: The following error occurred while executing this line:
/x1/jenkins/jenkins-slave/workspace/Lucene-Solr-Tests-5.x-Java7/lucene/common-build.xml:1444: The following error occurred while executing this line:
/x1/jenkins/jenkins-slave/workspace/Lucene-Solr-Tests-5.x-Java7/lucene/common-build.xml:1000: There were test failures: 565 suites (7 ignored), 2254 tests, 1 suite-level error, 1 error, 54 ignored (39 assumptions) [seed: C6E178125FEE0741]

Total time: 176 minutes 25 seconds
Build step 'Invoke Ant' marked build as failure
Archiving artifacts
Recording test results
Email was triggered for: Failure - Any
Sending email for trigger: Failure - Any



Mime
View raw message