lucene-dev mailing list archives

Site index · List index
Message view « Date » · « Thread »
Top « Date » · « Thread »
From Policeman Jenkins Server <jenk...@thetaphi.de>
Subject [JENKINS] Lucene-Solr-5.x-Windows (32bit/jdk1.8.0_66) - Build # 5394 - Still Failing!
Date Tue, 05 Jan 2016 13:27:23 GMT
Build: http://jenkins.thetaphi.de/job/Lucene-Solr-5.x-Windows/5394/
Java: 32bit/jdk1.8.0_66 -server -XX:+UseG1GC

8 tests failed.
FAILED:  org.apache.solr.cloud.CloudExitableDirectoryReaderTest.test

Error Message:
partialResults were expected expected:<true> but was:<null>

Stack Trace:
java.lang.AssertionError: partialResults were expected expected:<true> but was:<null>
	at __randomizedtesting.SeedInfo.seed([AB6E62193E7C069E:233A5DC390806B66]:0)
	at org.junit.Assert.fail(Assert.java:93)
	at org.junit.Assert.failNotEquals(Assert.java:647)
	at org.junit.Assert.assertEquals(Assert.java:128)
	at org.apache.solr.cloud.CloudExitableDirectoryReaderTest.assertPartialResults(CloudExitableDirectoryReaderTest.java:102)
	at org.apache.solr.cloud.CloudExitableDirectoryReaderTest.doTimeoutTests(CloudExitableDirectoryReaderTest.java:73)
	at org.apache.solr.cloud.CloudExitableDirectoryReaderTest.test(CloudExitableDirectoryReaderTest.java:52)
	at sun.reflect.NativeMethodAccessorImpl.invoke0(Native Method)
	at sun.reflect.NativeMethodAccessorImpl.invoke(NativeMethodAccessorImpl.java:62)
	at sun.reflect.DelegatingMethodAccessorImpl.invoke(DelegatingMethodAccessorImpl.java:43)
	at java.lang.reflect.Method.invoke(Method.java:497)
	at com.carrotsearch.randomizedtesting.RandomizedRunner.invoke(RandomizedRunner.java:1764)
	at com.carrotsearch.randomizedtesting.RandomizedRunner$8.evaluate(RandomizedRunner.java:871)
	at com.carrotsearch.randomizedtesting.RandomizedRunner$9.evaluate(RandomizedRunner.java:907)
	at com.carrotsearch.randomizedtesting.RandomizedRunner$10.evaluate(RandomizedRunner.java:921)
	at org.apache.solr.BaseDistributedSearchTestCase$ShardsRepeatRule$ShardsFixedStatement.callStatement(BaseDistributedSearchTestCase.java:965)
	at org.apache.solr.BaseDistributedSearchTestCase$ShardsRepeatRule$ShardsStatement.evaluate(BaseDistributedSearchTestCase.java:940)
	at com.carrotsearch.randomizedtesting.rules.SystemPropertiesRestoreRule$1.evaluate(SystemPropertiesRestoreRule.java:57)
	at org.apache.lucene.util.TestRuleSetupTeardownChained$1.evaluate(TestRuleSetupTeardownChained.java:50)
	at org.apache.lucene.util.AbstractBeforeAfterRule$1.evaluate(AbstractBeforeAfterRule.java:46)
	at org.apache.lucene.util.TestRuleThreadAndTestName$1.evaluate(TestRuleThreadAndTestName.java:49)
	at org.apache.lucene.util.TestRuleIgnoreAfterMaxFailures$1.evaluate(TestRuleIgnoreAfterMaxFailures.java:65)
	at org.apache.lucene.util.TestRuleMarkFailure$1.evaluate(TestRuleMarkFailure.java:48)
	at com.carrotsearch.randomizedtesting.rules.StatementAdapter.evaluate(StatementAdapter.java:36)
	at com.carrotsearch.randomizedtesting.ThreadLeakControl$StatementRunner.run(ThreadLeakControl.java:367)
	at com.carrotsearch.randomizedtesting.ThreadLeakControl.forkTimeoutingTask(ThreadLeakControl.java:809)
	at com.carrotsearch.randomizedtesting.ThreadLeakControl$3.evaluate(ThreadLeakControl.java:460)
	at com.carrotsearch.randomizedtesting.RandomizedRunner.runSingleTest(RandomizedRunner.java:880)
	at com.carrotsearch.randomizedtesting.RandomizedRunner$5.evaluate(RandomizedRunner.java:781)
	at com.carrotsearch.randomizedtesting.RandomizedRunner$6.evaluate(RandomizedRunner.java:816)
	at com.carrotsearch.randomizedtesting.RandomizedRunner$7.evaluate(RandomizedRunner.java:827)
	at com.carrotsearch.randomizedtesting.rules.StatementAdapter.evaluate(StatementAdapter.java:36)
	at com.carrotsearch.randomizedtesting.rules.SystemPropertiesRestoreRule$1.evaluate(SystemPropertiesRestoreRule.java:57)
	at org.apache.lucene.util.AbstractBeforeAfterRule$1.evaluate(AbstractBeforeAfterRule.java:46)
	at com.carrotsearch.randomizedtesting.rules.StatementAdapter.evaluate(StatementAdapter.java:36)
	at org.apache.lucene.util.TestRuleStoreClassName$1.evaluate(TestRuleStoreClassName.java:42)
	at com.carrotsearch.randomizedtesting.rules.NoShadowingOrOverridesOnMethodsRule$1.evaluate(NoShadowingOrOverridesOnMethodsRule.java:40)
	at com.carrotsearch.randomizedtesting.rules.NoShadowingOrOverridesOnMethodsRule$1.evaluate(NoShadowingOrOverridesOnMethodsRule.java:40)
	at com.carrotsearch.randomizedtesting.rules.StatementAdapter.evaluate(StatementAdapter.java:36)
	at com.carrotsearch.randomizedtesting.rules.StatementAdapter.evaluate(StatementAdapter.java:36)
	at com.carrotsearch.randomizedtesting.rules.StatementAdapter.evaluate(StatementAdapter.java:36)
	at org.apache.lucene.util.TestRuleAssertionsRequired$1.evaluate(TestRuleAssertionsRequired.java:54)
	at org.apache.lucene.util.TestRuleMarkFailure$1.evaluate(TestRuleMarkFailure.java:48)
	at org.apache.lucene.util.TestRuleIgnoreAfterMaxFailures$1.evaluate(TestRuleIgnoreAfterMaxFailures.java:65)
	at org.apache.lucene.util.TestRuleIgnoreTestSuites$1.evaluate(TestRuleIgnoreTestSuites.java:55)
	at com.carrotsearch.randomizedtesting.rules.StatementAdapter.evaluate(StatementAdapter.java:36)
	at com.carrotsearch.randomizedtesting.ThreadLeakControl$StatementRunner.run(ThreadLeakControl.java:367)
	at java.lang.Thread.run(Thread.java:745)


FAILED:  org.apache.solr.cloud.DistributedVersionInfoTest.test

Error Message:
Doc with id=1 not found in http://127.0.0.1:54169/c8n_vers_1x3_shard1_replica3 due to: Path not found: /id; rsp={doc=null}

Stack Trace:
java.lang.AssertionError: Doc with id=1 not found in http://127.0.0.1:54169/c8n_vers_1x3_shard1_replica3 due to: Path not found: /id; rsp={doc=null}
	at __randomizedtesting.SeedInfo.seed([AB6E62193E7C069E:233A5DC390806B66]:0)
	at org.junit.Assert.fail(Assert.java:93)
	at org.junit.Assert.assertTrue(Assert.java:43)
	at org.apache.solr.cloud.DistributedVersionInfoTest.assertDocExists(DistributedVersionInfoTest.java:367)
	at org.apache.solr.cloud.DistributedVersionInfoTest.assertDocsExistInAllReplicas(DistributedVersionInfoTest.java:334)
	at org.apache.solr.cloud.DistributedVersionInfoTest.testReplicaVersionHandling(DistributedVersionInfoTest.java:100)
	at org.apache.solr.cloud.DistributedVersionInfoTest.test(DistributedVersionInfoTest.java:75)
	at sun.reflect.NativeMethodAccessorImpl.invoke0(Native Method)
	at sun.reflect.NativeMethodAccessorImpl.invoke(NativeMethodAccessorImpl.java:62)
	at sun.reflect.DelegatingMethodAccessorImpl.invoke(DelegatingMethodAccessorImpl.java:43)
	at java.lang.reflect.Method.invoke(Method.java:497)
	at com.carrotsearch.randomizedtesting.RandomizedRunner.invoke(RandomizedRunner.java:1764)
	at com.carrotsearch.randomizedtesting.RandomizedRunner$8.evaluate(RandomizedRunner.java:871)
	at com.carrotsearch.randomizedtesting.RandomizedRunner$9.evaluate(RandomizedRunner.java:907)
	at com.carrotsearch.randomizedtesting.RandomizedRunner$10.evaluate(RandomizedRunner.java:921)
	at org.apache.solr.BaseDistributedSearchTestCase$ShardsRepeatRule$ShardsFixedStatement.callStatement(BaseDistributedSearchTestCase.java:965)
	at org.apache.solr.BaseDistributedSearchTestCase$ShardsRepeatRule$ShardsStatement.evaluate(BaseDistributedSearchTestCase.java:940)
	at com.carrotsearch.randomizedtesting.rules.SystemPropertiesRestoreRule$1.evaluate(SystemPropertiesRestoreRule.java:57)
	at org.apache.lucene.util.TestRuleSetupTeardownChained$1.evaluate(TestRuleSetupTeardownChained.java:50)
	at org.apache.lucene.util.AbstractBeforeAfterRule$1.evaluate(AbstractBeforeAfterRule.java:46)
	at org.apache.lucene.util.TestRuleThreadAndTestName$1.evaluate(TestRuleThreadAndTestName.java:49)
	at org.apache.lucene.util.TestRuleIgnoreAfterMaxFailures$1.evaluate(TestRuleIgnoreAfterMaxFailures.java:65)
	at org.apache.lucene.util.TestRuleMarkFailure$1.evaluate(TestRuleMarkFailure.java:48)
	at com.carrotsearch.randomizedtesting.rules.StatementAdapter.evaluate(StatementAdapter.java:36)
	at com.carrotsearch.randomizedtesting.ThreadLeakControl$StatementRunner.run(ThreadLeakControl.java:367)
	at com.carrotsearch.randomizedtesting.ThreadLeakControl.forkTimeoutingTask(ThreadLeakControl.java:809)
	at com.carrotsearch.randomizedtesting.ThreadLeakControl$3.evaluate(ThreadLeakControl.java:460)
	at com.carrotsearch.randomizedtesting.RandomizedRunner.runSingleTest(RandomizedRunner.java:880)
	at com.carrotsearch.randomizedtesting.RandomizedRunner$5.evaluate(RandomizedRunner.java:781)
	at com.carrotsearch.randomizedtesting.RandomizedRunner$6.evaluate(RandomizedRunner.java:816)
	at com.carrotsearch.randomizedtesting.RandomizedRunner$7.evaluate(RandomizedRunner.java:827)
	at com.carrotsearch.randomizedtesting.rules.StatementAdapter.evaluate(StatementAdapter.java:36)
	at com.carrotsearch.randomizedtesting.rules.SystemPropertiesRestoreRule$1.evaluate(SystemPropertiesRestoreRule.java:57)
	at org.apache.lucene.util.AbstractBeforeAfterRule$1.evaluate(AbstractBeforeAfterRule.java:46)
	at com.carrotsearch.randomizedtesting.rules.StatementAdapter.evaluate(StatementAdapter.java:36)
	at org.apache.lucene.util.TestRuleStoreClassName$1.evaluate(TestRuleStoreClassName.java:42)
	at com.carrotsearch.randomizedtesting.rules.NoShadowingOrOverridesOnMethodsRule$1.evaluate(NoShadowingOrOverridesOnMethodsRule.java:40)
	at com.carrotsearch.randomizedtesting.rules.NoShadowingOrOverridesOnMethodsRule$1.evaluate(NoShadowingOrOverridesOnMethodsRule.java:40)
	at com.carrotsearch.randomizedtesting.rules.StatementAdapter.evaluate(StatementAdapter.java:36)
	at com.carrotsearch.randomizedtesting.rules.StatementAdapter.evaluate(StatementAdapter.java:36)
	at com.carrotsearch.randomizedtesting.rules.StatementAdapter.evaluate(StatementAdapter.java:36)
	at org.apache.lucene.util.TestRuleAssertionsRequired$1.evaluate(TestRuleAssertionsRequired.java:54)
	at org.apache.lucene.util.TestRuleMarkFailure$1.evaluate(TestRuleMarkFailure.java:48)
	at org.apache.lucene.util.TestRuleIgnoreAfterMaxFailures$1.evaluate(TestRuleIgnoreAfterMaxFailures.java:65)
	at org.apache.lucene.util.TestRuleIgnoreTestSuites$1.evaluate(TestRuleIgnoreTestSuites.java:55)
	at com.carrotsearch.randomizedtesting.rules.StatementAdapter.evaluate(StatementAdapter.java:36)
	at com.carrotsearch.randomizedtesting.ThreadLeakControl$StatementRunner.run(ThreadLeakControl.java:367)
	at java.lang.Thread.run(Thread.java:745)


FAILED:  org.apache.solr.cloud.HttpPartitionTest.test

Error Message:
Unexpected achieved replication factor expected:<2> but was:<1>

Stack Trace:
java.lang.AssertionError: Unexpected achieved replication factor expected:<2> but was:<1>
	at __randomizedtesting.SeedInfo.seed([AB6E62193E7C069E:233A5DC390806B66]:0)
	at org.junit.Assert.fail(Assert.java:93)
	at org.junit.Assert.failNotEquals(Assert.java:647)
	at org.junit.Assert.assertEquals(Assert.java:128)
	at org.junit.Assert.assertEquals(Assert.java:472)
	at org.apache.solr.cloud.HttpPartitionTest.testMinRf(HttpPartitionTest.java:212)
	at org.apache.solr.cloud.HttpPartitionTest.test(HttpPartitionTest.java:104)
	at sun.reflect.NativeMethodAccessorImpl.invoke0(Native Method)
	at sun.reflect.NativeMethodAccessorImpl.invoke(NativeMethodAccessorImpl.java:62)
	at sun.reflect.DelegatingMethodAccessorImpl.invoke(DelegatingMethodAccessorImpl.java:43)
	at java.lang.reflect.Method.invoke(Method.java:497)
	at com.carrotsearch.randomizedtesting.RandomizedRunner.invoke(RandomizedRunner.java:1764)
	at com.carrotsearch.randomizedtesting.RandomizedRunner$8.evaluate(RandomizedRunner.java:871)
	at com.carrotsearch.randomizedtesting.RandomizedRunner$9.evaluate(RandomizedRunner.java:907)
	at com.carrotsearch.randomizedtesting.RandomizedRunner$10.evaluate(RandomizedRunner.java:921)
	at org.apache.solr.BaseDistributedSearchTestCase$ShardsRepeatRule$ShardsFixedStatement.callStatement(BaseDistributedSearchTestCase.java:965)
	at org.apache.solr.BaseDistributedSearchTestCase$ShardsRepeatRule$ShardsStatement.evaluate(BaseDistributedSearchTestCase.java:940)
	at com.carrotsearch.randomizedtesting.rules.SystemPropertiesRestoreRule$1.evaluate(SystemPropertiesRestoreRule.java:57)
	at org.apache.lucene.util.TestRuleSetupTeardownChained$1.evaluate(TestRuleSetupTeardownChained.java:50)
	at org.apache.lucene.util.AbstractBeforeAfterRule$1.evaluate(AbstractBeforeAfterRule.java:46)
	at org.apache.lucene.util.TestRuleThreadAndTestName$1.evaluate(TestRuleThreadAndTestName.java:49)
	at org.apache.lucene.util.TestRuleIgnoreAfterMaxFailures$1.evaluate(TestRuleIgnoreAfterMaxFailures.java:65)
	at org.apache.lucene.util.TestRuleMarkFailure$1.evaluate(TestRuleMarkFailure.java:48)
	at com.carrotsearch.randomizedtesting.rules.StatementAdapter.evaluate(StatementAdapter.java:36)
	at com.carrotsearch.randomizedtesting.ThreadLeakControl$StatementRunner.run(ThreadLeakControl.java:367)
	at com.carrotsearch.randomizedtesting.ThreadLeakControl.forkTimeoutingTask(ThreadLeakControl.java:809)
	at com.carrotsearch.randomizedtesting.ThreadLeakControl$3.evaluate(ThreadLeakControl.java:460)
	at com.carrotsearch.randomizedtesting.RandomizedRunner.runSingleTest(RandomizedRunner.java:880)
	at com.carrotsearch.randomizedtesting.RandomizedRunner$5.evaluate(RandomizedRunner.java:781)
	at com.carrotsearch.randomizedtesting.RandomizedRunner$6.evaluate(RandomizedRunner.java:816)
	at com.carrotsearch.randomizedtesting.RandomizedRunner$7.evaluate(RandomizedRunner.java:827)
	at com.carrotsearch.randomizedtesting.rules.StatementAdapter.evaluate(StatementAdapter.java:36)
	at com.carrotsearch.randomizedtesting.rules.SystemPropertiesRestoreRule$1.evaluate(SystemPropertiesRestoreRule.java:57)
	at org.apache.lucene.util.AbstractBeforeAfterRule$1.evaluate(AbstractBeforeAfterRule.java:46)
	at com.carrotsearch.randomizedtesting.rules.StatementAdapter.evaluate(StatementAdapter.java:36)
	at org.apache.lucene.util.TestRuleStoreClassName$1.evaluate(TestRuleStoreClassName.java:42)
	at com.carrotsearch.randomizedtesting.rules.NoShadowingOrOverridesOnMethodsRule$1.evaluate(NoShadowingOrOverridesOnMethodsRule.java:40)
	at com.carrotsearch.randomizedtesting.rules.NoShadowingOrOverridesOnMethodsRule$1.evaluate(NoShadowingOrOverridesOnMethodsRule.java:40)
	at com.carrotsearch.randomizedtesting.rules.StatementAdapter.evaluate(StatementAdapter.java:36)
	at com.carrotsearch.randomizedtesting.rules.StatementAdapter.evaluate(StatementAdapter.java:36)
	at com.carrotsearch.randomizedtesting.rules.StatementAdapter.evaluate(StatementAdapter.java:36)
	at org.apache.lucene.util.TestRuleAssertionsRequired$1.evaluate(TestRuleAssertionsRequired.java:54)
	at org.apache.lucene.util.TestRuleMarkFailure$1.evaluate(TestRuleMarkFailure.java:48)
	at org.apache.lucene.util.TestRuleIgnoreAfterMaxFailures$1.evaluate(TestRuleIgnoreAfterMaxFailures.java:65)
	at org.apache.lucene.util.TestRuleIgnoreTestSuites$1.evaluate(TestRuleIgnoreTestSuites.java:55)
	at com.carrotsearch.randomizedtesting.rules.StatementAdapter.evaluate(StatementAdapter.java:36)
	at com.carrotsearch.randomizedtesting.ThreadLeakControl$StatementRunner.run(ThreadLeakControl.java:367)
	at java.lang.Thread.run(Thread.java:745)


FAILED:  org.apache.solr.cloud.ShardSplitTest.test

Error Message:
There are still nodes recoverying - waited for 330 seconds

Stack Trace:
java.lang.AssertionError: There are still nodes recoverying - waited for 330 seconds
	at __randomizedtesting.SeedInfo.seed([AB6E62193E7C069E:233A5DC390806B66]:0)
	at org.junit.Assert.fail(Assert.java:93)
	at org.apache.solr.cloud.AbstractDistribZkTestBase.waitForRecoveriesToFinish(AbstractDistribZkTestBase.java:175)
	at org.apache.solr.cloud.AbstractDistribZkTestBase.waitForRecoveriesToFinish(AbstractDistribZkTestBase.java:136)
	at org.apache.solr.cloud.AbstractDistribZkTestBase.waitForRecoveriesToFinish(AbstractDistribZkTestBase.java:131)
	at org.apache.solr.cloud.AbstractFullDistribZkTestBase.waitForRecoveriesToFinish(AbstractFullDistribZkTestBase.java:825)
	at org.apache.solr.cloud.ShardSplitTest.splitByUniqueKeyTest(ShardSplitTest.java:219)
	at org.apache.solr.cloud.ShardSplitTest.test(ShardSplitTest.java:82)
	at sun.reflect.NativeMethodAccessorImpl.invoke0(Native Method)
	at sun.reflect.NativeMethodAccessorImpl.invoke(NativeMethodAccessorImpl.java:62)
	at sun.reflect.DelegatingMethodAccessorImpl.invoke(DelegatingMethodAccessorImpl.java:43)
	at java.lang.reflect.Method.invoke(Method.java:497)
	at com.carrotsearch.randomizedtesting.RandomizedRunner.invoke(RandomizedRunner.java:1764)
	at com.carrotsearch.randomizedtesting.RandomizedRunner$8.evaluate(RandomizedRunner.java:871)
	at com.carrotsearch.randomizedtesting.RandomizedRunner$9.evaluate(RandomizedRunner.java:907)
	at com.carrotsearch.randomizedtesting.RandomizedRunner$10.evaluate(RandomizedRunner.java:921)
	at org.apache.solr.BaseDistributedSearchTestCase$ShardsRepeatRule$ShardsFixedStatement.callStatement(BaseDistributedSearchTestCase.java:965)
	at org.apache.solr.BaseDistributedSearchTestCase$ShardsRepeatRule$ShardsStatement.evaluate(BaseDistributedSearchTestCase.java:940)
	at com.carrotsearch.randomizedtesting.rules.SystemPropertiesRestoreRule$1.evaluate(SystemPropertiesRestoreRule.java:57)
	at org.apache.lucene.util.TestRuleSetupTeardownChained$1.evaluate(TestRuleSetupTeardownChained.java:50)
	at org.apache.lucene.util.AbstractBeforeAfterRule$1.evaluate(AbstractBeforeAfterRule.java:46)
	at org.apache.lucene.util.TestRuleThreadAndTestName$1.evaluate(TestRuleThreadAndTestName.java:49)
	at org.apache.lucene.util.TestRuleIgnoreAfterMaxFailures$1.evaluate(TestRuleIgnoreAfterMaxFailures.java:65)
	at org.apache.lucene.util.TestRuleMarkFailure$1.evaluate(TestRuleMarkFailure.java:48)
	at com.carrotsearch.randomizedtesting.rules.StatementAdapter.evaluate(StatementAdapter.java:36)
	at com.carrotsearch.randomizedtesting.ThreadLeakControl$StatementRunner.run(ThreadLeakControl.java:367)
	at com.carrotsearch.randomizedtesting.ThreadLeakControl.forkTimeoutingTask(ThreadLeakControl.java:809)
	at com.carrotsearch.randomizedtesting.ThreadLeakControl$3.evaluate(ThreadLeakControl.java:460)
	at com.carrotsearch.randomizedtesting.RandomizedRunner.runSingleTest(RandomizedRunner.java:880)
	at com.carrotsearch.randomizedtesting.RandomizedRunner$5.evaluate(RandomizedRunner.java:781)
	at com.carrotsearch.randomizedtesting.RandomizedRunner$6.evaluate(RandomizedRunner.java:816)
	at com.carrotsearch.randomizedtesting.RandomizedRunner$7.evaluate(RandomizedRunner.java:827)
	at com.carrotsearch.randomizedtesting.rules.StatementAdapter.evaluate(StatementAdapter.java:36)
	at com.carrotsearch.randomizedtesting.rules.SystemPropertiesRestoreRule$1.evaluate(SystemPropertiesRestoreRule.java:57)
	at org.apache.lucene.util.AbstractBeforeAfterRule$1.evaluate(AbstractBeforeAfterRule.java:46)
	at com.carrotsearch.randomizedtesting.rules.StatementAdapter.evaluate(StatementAdapter.java:36)
	at org.apache.lucene.util.TestRuleStoreClassName$1.evaluate(TestRuleStoreClassName.java:42)
	at com.carrotsearch.randomizedtesting.rules.NoShadowingOrOverridesOnMethodsRule$1.evaluate(NoShadowingOrOverridesOnMethodsRule.java:40)
	at com.carrotsearch.randomizedtesting.rules.NoShadowingOrOverridesOnMethodsRule$1.evaluate(NoShadowingOrOverridesOnMethodsRule.java:40)
	at com.carrotsearch.randomizedtesting.rules.StatementAdapter.evaluate(StatementAdapter.java:36)
	at com.carrotsearch.randomizedtesting.rules.StatementAdapter.evaluate(StatementAdapter.java:36)
	at com.carrotsearch.randomizedtesting.rules.StatementAdapter.evaluate(StatementAdapter.java:36)
	at org.apache.lucene.util.TestRuleAssertionsRequired$1.evaluate(TestRuleAssertionsRequired.java:54)
	at org.apache.lucene.util.TestRuleMarkFailure$1.evaluate(TestRuleMarkFailure.java:48)
	at org.apache.lucene.util.TestRuleIgnoreAfterMaxFailures$1.evaluate(TestRuleIgnoreAfterMaxFailures.java:65)
	at org.apache.lucene.util.TestRuleIgnoreTestSuites$1.evaluate(TestRuleIgnoreTestSuites.java:55)
	at com.carrotsearch.randomizedtesting.rules.StatementAdapter.evaluate(StatementAdapter.java:36)
	at com.carrotsearch.randomizedtesting.ThreadLeakControl$StatementRunner.run(ThreadLeakControl.java:367)
	at java.lang.Thread.run(Thread.java:745)


FAILED:  org.apache.solr.cloud.SyncSliceTest.test

Error Message:


Stack Trace:
java.lang.AssertionError
	at __randomizedtesting.SeedInfo.seed([AB6E62193E7C069E:233A5DC390806B66]:0)
	at org.junit.Assert.fail(Assert.java:92)
	at org.junit.Assert.assertTrue(Assert.java:43)
	at org.junit.Assert.assertNotNull(Assert.java:526)
	at org.junit.Assert.assertNotNull(Assert.java:537)
	at org.apache.solr.cloud.SyncSliceTest.test(SyncSliceTest.java:101)
	at sun.reflect.NativeMethodAccessorImpl.invoke0(Native Method)
	at sun.reflect.NativeMethodAccessorImpl.invoke(NativeMethodAccessorImpl.java:62)
	at sun.reflect.DelegatingMethodAccessorImpl.invoke(DelegatingMethodAccessorImpl.java:43)
	at java.lang.reflect.Method.invoke(Method.java:497)
	at com.carrotsearch.randomizedtesting.RandomizedRunner.invoke(RandomizedRunner.java:1764)
	at com.carrotsearch.randomizedtesting.RandomizedRunner$8.evaluate(RandomizedRunner.java:871)
	at com.carrotsearch.randomizedtesting.RandomizedRunner$9.evaluate(RandomizedRunner.java:907)
	at com.carrotsearch.randomizedtesting.RandomizedRunner$10.evaluate(RandomizedRunner.java:921)
	at org.apache.solr.BaseDistributedSearchTestCase$ShardsRepeatRule$ShardsFixedStatement.callStatement(BaseDistributedSearchTestCase.java:965)
	at org.apache.solr.BaseDistributedSearchTestCase$ShardsRepeatRule$ShardsStatement.evaluate(BaseDistributedSearchTestCase.java:940)
	at com.carrotsearch.randomizedtesting.rules.SystemPropertiesRestoreRule$1.evaluate(SystemPropertiesRestoreRule.java:57)
	at org.apache.lucene.util.TestRuleSetupTeardownChained$1.evaluate(TestRuleSetupTeardownChained.java:50)
	at org.apache.lucene.util.AbstractBeforeAfterRule$1.evaluate(AbstractBeforeAfterRule.java:46)
	at org.apache.lucene.util.TestRuleThreadAndTestName$1.evaluate(TestRuleThreadAndTestName.java:49)
	at org.apache.lucene.util.TestRuleIgnoreAfterMaxFailures$1.evaluate(TestRuleIgnoreAfterMaxFailures.java:65)
	at org.apache.lucene.util.TestRuleMarkFailure$1.evaluate(TestRuleMarkFailure.java:48)
	at com.carrotsearch.randomizedtesting.rules.StatementAdapter.evaluate(StatementAdapter.java:36)
	at com.carrotsearch.randomizedtesting.ThreadLeakControl$StatementRunner.run(ThreadLeakControl.java:367)
	at com.carrotsearch.randomizedtesting.ThreadLeakControl.forkTimeoutingTask(ThreadLeakControl.java:809)
	at com.carrotsearch.randomizedtesting.ThreadLeakControl$3.evaluate(ThreadLeakControl.java:460)
	at com.carrotsearch.randomizedtesting.RandomizedRunner.runSingleTest(RandomizedRunner.java:880)
	at com.carrotsearch.randomizedtesting.RandomizedRunner$5.evaluate(RandomizedRunner.java:781)
	at com.carrotsearch.randomizedtesting.RandomizedRunner$6.evaluate(RandomizedRunner.java:816)
	at com.carrotsearch.randomizedtesting.RandomizedRunner$7.evaluate(RandomizedRunner.java:827)
	at com.carrotsearch.randomizedtesting.rules.StatementAdapter.evaluate(StatementAdapter.java:36)
	at com.carrotsearch.randomizedtesting.rules.SystemPropertiesRestoreRule$1.evaluate(SystemPropertiesRestoreRule.java:57)
	at org.apache.lucene.util.AbstractBeforeAfterRule$1.evaluate(AbstractBeforeAfterRule.java:46)
	at com.carrotsearch.randomizedtesting.rules.StatementAdapter.evaluate(StatementAdapter.java:36)
	at org.apache.lucene.util.TestRuleStoreClassName$1.evaluate(TestRuleStoreClassName.java:42)
	at com.carrotsearch.randomizedtesting.rules.NoShadowingOrOverridesOnMethodsRule$1.evaluate(NoShadowingOrOverridesOnMethodsRule.java:40)
	at com.carrotsearch.randomizedtesting.rules.NoShadowingOrOverridesOnMethodsRule$1.evaluate(NoShadowingOrOverridesOnMethodsRule.java:40)
	at com.carrotsearch.randomizedtesting.rules.StatementAdapter.evaluate(StatementAdapter.java:36)
	at com.carrotsearch.randomizedtesting.rules.StatementAdapter.evaluate(StatementAdapter.java:36)
	at com.carrotsearch.randomizedtesting.rules.StatementAdapter.evaluate(StatementAdapter.java:36)
	at org.apache.lucene.util.TestRuleAssertionsRequired$1.evaluate(TestRuleAssertionsRequired.java:54)
	at org.apache.lucene.util.TestRuleMarkFailure$1.evaluate(TestRuleMarkFailure.java:48)
	at org.apache.lucene.util.TestRuleIgnoreAfterMaxFailures$1.evaluate(TestRuleIgnoreAfterMaxFailures.java:65)
	at org.apache.lucene.util.TestRuleIgnoreTestSuites$1.evaluate(TestRuleIgnoreTestSuites.java:55)
	at com.carrotsearch.randomizedtesting.rules.StatementAdapter.evaluate(StatementAdapter.java:36)
	at com.carrotsearch.randomizedtesting.ThreadLeakControl$StatementRunner.run(ThreadLeakControl.java:367)
	at java.lang.Thread.run(Thread.java:745)


FAILED:  org.apache.solr.cloud.TestAuthenticationFramework.testCollectionCreateSearchDelete

Error Message:
expected:<1> but was:<0>

Stack Trace:
java.lang.AssertionError: expected:<1> but was:<0>
	at __randomizedtesting.SeedInfo.seed([AB6E62193E7C069E:894CCBCB994EC3B]:0)
	at org.junit.Assert.fail(Assert.java:93)
	at org.junit.Assert.failNotEquals(Assert.java:647)
	at org.junit.Assert.assertEquals(Assert.java:128)
	at org.junit.Assert.assertEquals(Assert.java:472)
	at org.junit.Assert.assertEquals(Assert.java:456)
	at org.apache.solr.cloud.TestMiniSolrCloudCluster.testCollectionCreateSearchDelete(TestMiniSolrCloudCluster.java:159)
	at sun.reflect.NativeMethodAccessorImpl.invoke0(Native Method)
	at sun.reflect.NativeMethodAccessorImpl.invoke(NativeMethodAccessorImpl.java:62)
	at sun.reflect.DelegatingMethodAccessorImpl.invoke(DelegatingMethodAccessorImpl.java:43)
	at java.lang.reflect.Method.invoke(Method.java:497)
	at com.carrotsearch.randomizedtesting.RandomizedRunner.invoke(RandomizedRunner.java:1764)
	at com.carrotsearch.randomizedtesting.RandomizedRunner$8.evaluate(RandomizedRunner.java:871)
	at com.carrotsearch.randomizedtesting.RandomizedRunner$9.evaluate(RandomizedRunner.java:907)
	at com.carrotsearch.randomizedtesting.RandomizedRunner$10.evaluate(RandomizedRunner.java:921)
	at com.carrotsearch.randomizedtesting.rules.SystemPropertiesRestoreRule$1.evaluate(SystemPropertiesRestoreRule.java:57)
	at org.apache.lucene.util.TestRuleSetupTeardownChained$1.evaluate(TestRuleSetupTeardownChained.java:50)
	at org.apache.lucene.util.AbstractBeforeAfterRule$1.evaluate(AbstractBeforeAfterRule.java:46)
	at org.apache.lucene.util.TestRuleThreadAndTestName$1.evaluate(TestRuleThreadAndTestName.java:49)
	at org.apache.lucene.util.TestRuleIgnoreAfterMaxFailures$1.evaluate(TestRuleIgnoreAfterMaxFailures.java:65)
	at org.apache.lucene.util.TestRuleMarkFailure$1.evaluate(TestRuleMarkFailure.java:48)
	at com.carrotsearch.randomizedtesting.rules.StatementAdapter.evaluate(StatementAdapter.java:36)
	at com.carrotsearch.randomizedtesting.ThreadLeakControl$StatementRunner.run(ThreadLeakControl.java:367)
	at com.carrotsearch.randomizedtesting.ThreadLeakControl.forkTimeoutingTask(ThreadLeakControl.java:809)
	at com.carrotsearch.randomizedtesting.ThreadLeakControl$3.evaluate(ThreadLeakControl.java:460)
	at com.carrotsearch.randomizedtesting.RandomizedRunner.runSingleTest(RandomizedRunner.java:880)
	at com.carrotsearch.randomizedtesting.RandomizedRunner$5.evaluate(RandomizedRunner.java:781)
	at com.carrotsearch.randomizedtesting.RandomizedRunner$6.evaluate(RandomizedRunner.java:816)
	at com.carrotsearch.randomizedtesting.RandomizedRunner$7.evaluate(RandomizedRunner.java:827)
	at com.carrotsearch.randomizedtesting.rules.StatementAdapter.evaluate(StatementAdapter.java:36)
	at com.carrotsearch.randomizedtesting.rules.SystemPropertiesRestoreRule$1.evaluate(SystemPropertiesRestoreRule.java:57)
	at org.apache.lucene.util.AbstractBeforeAfterRule$1.evaluate(AbstractBeforeAfterRule.java:46)
	at com.carrotsearch.randomizedtesting.rules.StatementAdapter.evaluate(StatementAdapter.java:36)
	at org.apache.lucene.util.TestRuleStoreClassName$1.evaluate(TestRuleStoreClassName.java:42)
	at com.carrotsearch.randomizedtesting.rules.NoShadowingOrOverridesOnMethodsRule$1.evaluate(NoShadowingOrOverridesOnMethodsRule.java:40)
	at com.carrotsearch.randomizedtesting.rules.NoShadowingOrOverridesOnMethodsRule$1.evaluate(NoShadowingOrOverridesOnMethodsRule.java:40)
	at com.carrotsearch.randomizedtesting.rules.StatementAdapter.evaluate(StatementAdapter.java:36)
	at com.carrotsearch.randomizedtesting.rules.StatementAdapter.evaluate(StatementAdapter.java:36)
	at com.carrotsearch.randomizedtesting.rules.StatementAdapter.evaluate(StatementAdapter.java:36)
	at org.apache.lucene.util.TestRuleAssertionsRequired$1.evaluate(TestRuleAssertionsRequired.java:54)
	at org.apache.lucene.util.TestRuleMarkFailure$1.evaluate(TestRuleMarkFailure.java:48)
	at org.apache.lucene.util.TestRuleIgnoreAfterMaxFailures$1.evaluate(TestRuleIgnoreAfterMaxFailures.java:65)
	at org.apache.lucene.util.TestRuleIgnoreTestSuites$1.evaluate(TestRuleIgnoreTestSuites.java:55)
	at com.carrotsearch.randomizedtesting.rules.StatementAdapter.evaluate(StatementAdapter.java:36)
	at com.carrotsearch.randomizedtesting.ThreadLeakControl$StatementRunner.run(ThreadLeakControl.java:367)
	at java.lang.Thread.run(Thread.java:745)


FAILED:  org.apache.solr.cloud.TestAuthenticationFramework.testBasics

Error Message:
expected:<1> but was:<0>

Stack Trace:
java.lang.AssertionError: expected:<1> but was:<0>
	at __randomizedtesting.SeedInfo.seed([AB6E62193E7C069E:96B6CC35069258EE]:0)
	at org.junit.Assert.fail(Assert.java:93)
	at org.junit.Assert.failNotEquals(Assert.java:647)
	at org.junit.Assert.assertEquals(Assert.java:128)
	at org.junit.Assert.assertEquals(Assert.java:472)
	at org.junit.Assert.assertEquals(Assert.java:456)
	at org.apache.solr.cloud.TestMiniSolrCloudCluster.testCollectionCreateSearchDelete(TestMiniSolrCloudCluster.java:211)
	at org.apache.solr.cloud.TestAuthenticationFramework.testBasics(TestAuthenticationFramework.java:93)
	at sun.reflect.NativeMethodAccessorImpl.invoke0(Native Method)
	at sun.reflect.NativeMethodAccessorImpl.invoke(NativeMethodAccessorImpl.java:62)
	at sun.reflect.DelegatingMethodAccessorImpl.invoke(DelegatingMethodAccessorImpl.java:43)
	at java.lang.reflect.Method.invoke(Method.java:497)
	at com.carrotsearch.randomizedtesting.RandomizedRunner.invoke(RandomizedRunner.java:1764)
	at com.carrotsearch.randomizedtesting.RandomizedRunner$8.evaluate(RandomizedRunner.java:871)
	at com.carrotsearch.randomizedtesting.RandomizedRunner$9.evaluate(RandomizedRunner.java:907)
	at com.carrotsearch.randomizedtesting.RandomizedRunner$10.evaluate(RandomizedRunner.java:921)
	at com.carrotsearch.randomizedtesting.rules.SystemPropertiesRestoreRule$1.evaluate(SystemPropertiesRestoreRule.java:57)
	at org.apache.lucene.util.TestRuleSetupTeardownChained$1.evaluate(TestRuleSetupTeardownChained.java:50)
	at org.apache.lucene.util.AbstractBeforeAfterRule$1.evaluate(AbstractBeforeAfterRule.java:46)
	at org.apache.lucene.util.TestRuleThreadAndTestName$1.evaluate(TestRuleThreadAndTestName.java:49)
	at org.apache.lucene.util.TestRuleIgnoreAfterMaxFailures$1.evaluate(TestRuleIgnoreAfterMaxFailures.java:65)
	at org.apache.lucene.util.TestRuleMarkFailure$1.evaluate(TestRuleMarkFailure.java:48)
	at com.carrotsearch.randomizedtesting.rules.StatementAdapter.evaluate(StatementAdapter.java:36)
	at com.carrotsearch.randomizedtesting.ThreadLeakControl$StatementRunner.run(ThreadLeakControl.java:367)
	at com.carrotsearch.randomizedtesting.ThreadLeakControl.forkTimeoutingTask(ThreadLeakControl.java:809)
	at com.carrotsearch.randomizedtesting.ThreadLeakControl$3.evaluate(ThreadLeakControl.java:460)
	at com.carrotsearch.randomizedtesting.RandomizedRunner.runSingleTest(RandomizedRunner.java:880)
	at com.carrotsearch.randomizedtesting.RandomizedRunner$5.evaluate(RandomizedRunner.java:781)
	at com.carrotsearch.randomizedtesting.RandomizedRunner$6.evaluate(RandomizedRunner.java:816)
	at com.carrotsearch.randomizedtesting.RandomizedRunner$7.evaluate(RandomizedRunner.java:827)
	at com.carrotsearch.randomizedtesting.rules.StatementAdapter.evaluate(StatementAdapter.java:36)
	at com.carrotsearch.randomizedtesting.rules.SystemPropertiesRestoreRule$1.evaluate(SystemPropertiesRestoreRule.java:57)
	at org.apache.lucene.util.AbstractBeforeAfterRule$1.evaluate(AbstractBeforeAfterRule.java:46)
	at com.carrotsearch.randomizedtesting.rules.StatementAdapter.evaluate(StatementAdapter.java:36)
	at org.apache.lucene.util.TestRuleStoreClassName$1.evaluate(TestRuleStoreClassName.java:42)
	at com.carrotsearch.randomizedtesting.rules.NoShadowingOrOverridesOnMethodsRule$1.evaluate(NoShadowingOrOverridesOnMethodsRule.java:40)
	at com.carrotsearch.randomizedtesting.rules.NoShadowingOrOverridesOnMethodsRule$1.evaluate(NoShadowingOrOverridesOnMethodsRule.java:40)
	at com.carrotsearch.randomizedtesting.rules.StatementAdapter.evaluate(StatementAdapter.java:36)
	at com.carrotsearch.randomizedtesting.rules.StatementAdapter.evaluate(StatementAdapter.java:36)
	at com.carrotsearch.randomizedtesting.rules.StatementAdapter.evaluate(StatementAdapter.java:36)
	at org.apache.lucene.util.TestRuleAssertionsRequired$1.evaluate(TestRuleAssertionsRequired.java:54)
	at org.apache.lucene.util.TestRuleMarkFailure$1.evaluate(TestRuleMarkFailure.java:48)
	at org.apache.lucene.util.TestRuleIgnoreAfterMaxFailures$1.evaluate(TestRuleIgnoreAfterMaxFailures.java:65)
	at org.apache.lucene.util.TestRuleIgnoreTestSuites$1.evaluate(TestRuleIgnoreTestSuites.java:55)
	at com.carrotsearch.randomizedtesting.rules.StatementAdapter.evaluate(StatementAdapter.java:36)
	at com.carrotsearch.randomizedtesting.ThreadLeakControl$StatementRunner.run(ThreadLeakControl.java:367)
	at java.lang.Thread.run(Thread.java:745)


FAILED:  org.apache.solr.core.TestArbitraryIndexDir.testLoadNewIndexDir

Error Message:
Exception during query

Stack Trace:
java.lang.RuntimeException: Exception during query
	at __randomizedtesting.SeedInfo.seed([AB6E62193E7C069E:4234D921A0E59636]:0)
	at org.apache.solr.SolrTestCaseJ4.assertQ(SolrTestCaseJ4.java:753)
	at org.apache.solr.core.TestArbitraryIndexDir.testLoadNewIndexDir(TestArbitraryIndexDir.java:107)
	at sun.reflect.NativeMethodAccessorImpl.invoke0(Native Method)
	at sun.reflect.NativeMethodAccessorImpl.invoke(NativeMethodAccessorImpl.java:62)
	at sun.reflect.DelegatingMethodAccessorImpl.invoke(DelegatingMethodAccessorImpl.java:43)
	at java.lang.reflect.Method.invoke(Method.java:497)
	at com.carrotsearch.randomizedtesting.RandomizedRunner.invoke(RandomizedRunner.java:1764)
	at com.carrotsearch.randomizedtesting.RandomizedRunner$8.evaluate(RandomizedRunner.java:871)
	at com.carrotsearch.randomizedtesting.RandomizedRunner$9.evaluate(RandomizedRunner.java:907)
	at com.carrotsearch.randomizedtesting.RandomizedRunner$10.evaluate(RandomizedRunner.java:921)
	at com.carrotsearch.randomizedtesting.rules.SystemPropertiesRestoreRule$1.evaluate(SystemPropertiesRestoreRule.java:57)
	at com.carrotsearch.randomizedtesting.rules.SystemPropertiesRestoreRule$1.evaluate(SystemPropertiesRestoreRule.java:57)
	at org.apache.lucene.util.TestRuleSetupTeardownChained$1.evaluate(TestRuleSetupTeardownChained.java:50)
	at org.apache.lucene.util.AbstractBeforeAfterRule$1.evaluate(AbstractBeforeAfterRule.java:46)
	at org.apache.lucene.util.TestRuleThreadAndTestName$1.evaluate(TestRuleThreadAndTestName.java:49)
	at org.apache.lucene.util.TestRuleIgnoreAfterMaxFailures$1.evaluate(TestRuleIgnoreAfterMaxFailures.java:65)
	at org.apache.lucene.util.TestRuleMarkFailure$1.evaluate(TestRuleMarkFailure.java:48)
	at com.carrotsearch.randomizedtesting.rules.StatementAdapter.evaluate(StatementAdapter.java:36)
	at com.carrotsearch.randomizedtesting.ThreadLeakControl$StatementRunner.run(ThreadLeakControl.java:367)
	at com.carrotsearch.randomizedtesting.ThreadLeakControl.forkTimeoutingTask(ThreadLeakControl.java:809)
	at com.carrotsearch.randomizedtesting.ThreadLeakControl$3.evaluate(ThreadLeakControl.java:460)
	at com.carrotsearch.randomizedtesting.RandomizedRunner.runSingleTest(RandomizedRunner.java:880)
	at com.carrotsearch.randomizedtesting.RandomizedRunner$5.evaluate(RandomizedRunner.java:781)
	at com.carrotsearch.randomizedtesting.RandomizedRunner$6.evaluate(RandomizedRunner.java:816)
	at com.carrotsearch.randomizedtesting.RandomizedRunner$7.evaluate(RandomizedRunner.java:827)
	at com.carrotsearch.randomizedtesting.rules.StatementAdapter.evaluate(StatementAdapter.java:36)
	at com.carrotsearch.randomizedtesting.rules.SystemPropertiesRestoreRule$1.evaluate(SystemPropertiesRestoreRule.java:57)
	at org.apache.lucene.util.AbstractBeforeAfterRule$1.evaluate(AbstractBeforeAfterRule.java:46)
	at com.carrotsearch.randomizedtesting.rules.StatementAdapter.evaluate(StatementAdapter.java:36)
	at org.apache.lucene.util.TestRuleStoreClassName$1.evaluate(TestRuleStoreClassName.java:42)
	at com.carrotsearch.randomizedtesting.rules.NoShadowingOrOverridesOnMethodsRule$1.evaluate(NoShadowingOrOverridesOnMethodsRule.java:40)
	at com.carrotsearch.randomizedtesting.rules.NoShadowingOrOverridesOnMethodsRule$1.evaluate(NoShadowingOrOverridesOnMethodsRule.java:40)
	at com.carrotsearch.randomizedtesting.rules.StatementAdapter.evaluate(StatementAdapter.java:36)
	at com.carrotsearch.randomizedtesting.rules.StatementAdapter.evaluate(StatementAdapter.java:36)
	at com.carrotsearch.randomizedtesting.rules.StatementAdapter.evaluate(StatementAdapter.java:36)
	at org.apache.lucene.util.TestRuleAssertionsRequired$1.evaluate(TestRuleAssertionsRequired.java:54)
	at org.apache.lucene.util.TestRuleMarkFailure$1.evaluate(TestRuleMarkFailure.java:48)
	at org.apache.lucene.util.TestRuleIgnoreAfterMaxFailures$1.evaluate(TestRuleIgnoreAfterMaxFailures.java:65)
	at org.apache.lucene.util.TestRuleIgnoreTestSuites$1.evaluate(TestRuleIgnoreTestSuites.java:55)
	at com.carrotsearch.randomizedtesting.rules.StatementAdapter.evaluate(StatementAdapter.java:36)
	at com.carrotsearch.randomizedtesting.ThreadLeakControl$StatementRunner.run(ThreadLeakControl.java:367)
	at java.lang.Thread.run(Thread.java:745)
Caused by: java.lang.RuntimeException: REQUEST FAILED: xpath=*[count(//doc)=1]
	xml response was: <?xml version="1.0" encoding="UTF-8"?>
<response>
<lst name="responseHeader"><int name="status">0</int><int name="QTime">0</int></lst><result name="response" numFound="0" start="0"></result>
</response>

	request was:q=id:2&qt=standard&start=0&rows=20&version=2.2
	at org.apache.solr.SolrTestCaseJ4.assertQ(SolrTestCaseJ4.java:746)
	... 41 more




Build Log:
[...truncated 10400 lines...]
   [junit4] Suite: org.apache.solr.cloud.TestAuthenticationFramework
   [junit4]   2> 869249 INFO  (TEST-TestAuthenticationFramework.testErrorsInStartup-seed#[AB6E62193E7C069E]) [    ] o.a.s.c.ZkTestServer STARTING ZK TEST SERVER
   [junit4]   2> 869251 INFO  (Thread-2187) [    ] o.a.s.c.ZkTestServer client port:0.0.0.0/0.0.0.0:0
   [junit4]   2> 869251 INFO  (Thread-2187) [    ] o.a.s.c.ZkTestServer Starting server
   [junit4]   2> 869348 INFO  (TEST-TestAuthenticationFramework.testErrorsInStartup-seed#[AB6E62193E7C069E]) [    ] o.a.s.c.ZkTestServer start zk server on port:65067
   [junit4]   2> 869348 INFO  (TEST-TestAuthenticationFramework.testErrorsInStartup-seed#[AB6E62193E7C069E]) [    ] o.a.s.c.c.SolrZkClient Using default ZkCredentialsProvider
   [junit4]   2> 869349 INFO  (TEST-TestAuthenticationFramework.testErrorsInStartup-seed#[AB6E62193E7C069E]) [    ] o.a.s.c.c.ConnectionManager Waiting for client to connect to ZooKeeper
   [junit4]   2> 869421 INFO  (zkCallback-670-thread-1) [    ] o.a.s.c.c.ConnectionManager Watcher org.apache.solr.common.cloud.ConnectionManager@583dc name:ZooKeeperConnection Watcher:127.0.0.1:65067 got event WatchedEvent state:SyncConnected type:None path:null path:null type:None
   [junit4]   2> 869421 INFO  (TEST-TestAuthenticationFramework.testErrorsInStartup-seed#[AB6E62193E7C069E]) [    ] o.a.s.c.c.ConnectionManager Client is connected to ZooKeeper
   [junit4]   2> 869422 INFO  (TEST-TestAuthenticationFramework.testErrorsInStartup-seed#[AB6E62193E7C069E]) [    ] o.a.s.c.c.SolrZkClient Using default ZkACLProvider
   [junit4]   2> 869422 INFO  (TEST-TestAuthenticationFramework.testErrorsInStartup-seed#[AB6E62193E7C069E]) [    ] o.a.s.c.c.SolrZkClient makePath: /solr/solr.xml
   [junit4]   2> 869489 WARN  (NIOServerCxn.Factory:0.0.0.0/0.0.0.0:0) [    ] o.a.z.s.NIOServerCnxn caught end of stream exception
   [junit4]   2> EndOfStreamException: Unable to read additional data from client sessionid 0x15211d6edb70000, likely client has closed socket
   [junit4]   2> 	at org.apache.zookeeper.server.NIOServerCnxn.doIO(NIOServerCnxn.java:228)
   [junit4]   2> 	at org.apache.zookeeper.server.NIOServerCnxnFactory.run(NIOServerCnxnFactory.java:208)
   [junit4]   2> 	at java.lang.Thread.run(Thread.java:745)
   [junit4]   2> 869493 INFO  (jetty-launcher-669-thread-1) [    ] o.e.j.s.Server jetty-9.2.13.v20150730
   [junit4]   2> 869494 INFO  (jetty-launcher-669-thread-3) [    ] o.e.j.s.Server jetty-9.2.13.v20150730
   [junit4]   2> 869497 INFO  (jetty-launcher-669-thread-1) [    ] o.e.j.s.h.ContextHandler Started o.e.j.s.ServletContextHandler@1ed2582{/solr,null,AVAILABLE}
   [junit4]   2> 869520 INFO  (jetty-launcher-669-thread-1) [    ] o.e.j.s.ServerConnector Started ServerConnector@1b48d54{HTTP/1.1}{127.0.0.1:65071}
   [junit4]   2> 869520 INFO  (jetty-launcher-669-thread-1) [    ] o.e.j.s.Server Started @874061ms
   [junit4]   2> 869520 INFO  (jetty-launcher-669-thread-1) [    ] o.a.s.c.s.e.JettySolrRunner Jetty properties: {hostContext=/solr, hostPort=65071}
   [junit4]   2> 869520 INFO  (jetty-launcher-669-thread-1) [    ] o.a.s.s.SolrDispatchFilter SolrDispatchFilter.init(): sun.misc.Launcher$AppClassLoader@e2f2a
   [junit4]   2> 869520 INFO  (jetty-launcher-669-thread-1) [    ] o.a.s.c.SolrResourceLoader new SolrResourceLoader for directory: 'C:\Users\JenkinsSlave\workspace\Lucene-Solr-5.x-Windows\solr\build\solr-core\test\J0\temp\solr.cloud.TestAuthenticationFramework_AB6E62193E7C069E-001\tempDir-001\node1'
   [junit4]   2> 869520 INFO  (jetty-launcher-669-thread-1) [    ] o.a.s.c.SolrResourceLoader JNDI not configured for solr (NoInitialContextEx)
   [junit4]   2> 869520 INFO  (jetty-launcher-669-thread-1) [    ] o.a.s.c.SolrResourceLoader solr home defaulted to 'solr/' (could not find system property or JNDI)
   [junit4]   2> 869521 INFO  (jetty-launcher-669-thread-1) [    ] o.a.s.c.c.SolrZkClient Using default ZkCredentialsProvider
   [junit4]   2> 869522 INFO  (jetty-launcher-669-thread-3) [    ] o.e.j.s.h.ContextHandler Started o.e.j.s.ServletContextHandler@17f1621{/solr,null,AVAILABLE}
   [junit4]   2> 869523 INFO  (jetty-launcher-669-thread-1) [    ] o.a.s.c.c.ConnectionManager Waiting for client to connect to ZooKeeper
   [junit4]   2> 869526 INFO  (jetty-launcher-669-thread-3) [    ] o.e.j.s.ServerConnector Started ServerConnector@12ba46a{HTTP/1.1}{127.0.0.1:65076}
   [junit4]   2> 869526 INFO  (jetty-launcher-669-thread-3) [    ] o.e.j.s.Server Started @874066ms
   [junit4]   2> 869526 INFO  (jetty-launcher-669-thread-3) [    ] o.a.s.c.s.e.JettySolrRunner Jetty properties: {hostContext=/solr, hostPort=65076}
   [junit4]   2> 869526 INFO  (jetty-launcher-669-thread-3) [    ] o.a.s.s.SolrDispatchFilter SolrDispatchFilter.init(): sun.misc.Launcher$AppClassLoader@e2f2a
   [junit4]   2> 869526 INFO  (jetty-launcher-669-thread-3) [    ] o.a.s.c.SolrResourceLoader new SolrResourceLoader for directory: 'C:\Users\JenkinsSlave\workspace\Lucene-Solr-5.x-Windows\solr\build\solr-core\test\J0\temp\solr.cloud.TestAuthenticationFramework_AB6E62193E7C069E-001\tempDir-001\node3'
   [junit4]   2> 869526 INFO  (jetty-launcher-669-thread-3) [    ] o.a.s.c.SolrResourceLoader JNDI not configured for solr (NoInitialContextEx)
   [junit4]   2> 869526 INFO  (jetty-launcher-669-thread-3) [    ] o.a.s.c.SolrResourceLoader solr home defaulted to 'solr/' (could not find system property or JNDI)
   [junit4]   2> 869527 INFO  (jetty-launcher-669-thread-3) [    ] o.a.s.c.c.SolrZkClient Using default ZkCredentialsProvider
   [junit4]   2> 869528 INFO  (jetty-launcher-669-thread-3) [    ] o.a.s.c.c.ConnectionManager Waiting for client to connect to ZooKeeper
   [junit4]   2> 869566 INFO  (zkCallback-671-thread-1) [    ] o.a.s.c.c.ConnectionManager Watcher org.apache.solr.common.cloud.ConnectionManager@513c4b name:ZooKeeperConnection Watcher:127.0.0.1:65067/solr got event WatchedEvent state:SyncConnected type:None path:null path:null type:None
   [junit4]   2> 869566 INFO  (jetty-launcher-669-thread-1) [    ] o.a.s.c.c.ConnectionManager Client is connected to ZooKeeper
   [junit4]   2> 869567 INFO  (jetty-launcher-669-thread-1) [    ] o.a.s.c.c.SolrZkClient Using default ZkACLProvider
   [junit4]   2> 869582 INFO  (jetty-launcher-669-thread-1) [    ] o.a.s.s.SolrDispatchFilter solr.xml found in ZooKeeper. Loading...
   [junit4]   2> 869583 INFO  (zkCallback-672-thread-1) [    ] o.a.s.c.c.ConnectionManager Watcher org.apache.solr.common.cloud.ConnectionManager@46aaf2 name:ZooKeeperConnection Watcher:127.0.0.1:65067/solr got event WatchedEvent state:SyncConnected type:None path:null path:null type:None
   [junit4]   2> 869583 INFO  (jetty-launcher-669-thread-3) [    ] o.a.s.c.c.ConnectionManager Client is connected to ZooKeeper
   [junit4]   2> 869583 INFO  (jetty-launcher-669-thread-3) [    ] o.a.s.c.c.SolrZkClient Using default ZkACLProvider
   [junit4]   2> 869584 INFO  (jetty-launcher-669-thread-3) [    ] o.a.s.s.SolrDispatchFilter solr.xml found in ZooKeeper. Loading...
   [junit4]   2> 869592 WARN  (NIOServerCxn.Factory:0.0.0.0/0.0.0.0:0) [    ] o.a.z.s.NIOServerCnxn caught end of stream exception
   [junit4]   2> EndOfStreamException: Unable to read additional data from client sessionid 0x15211d6edb70001, likely client has closed socket
   [junit4]   2> 	at org.apache.zookeeper.server.NIOServerCnxn.doIO(NIOServerCnxn.java:228)
   [junit4]   2> 	at org.apache.zookeeper.server.NIOServerCnxnFactory.run(NIOServerCnxnFactory.java:208)
   [junit4]   2> 	at java.lang.Thread.run(Thread.java:745)
   [junit4]   2> 869592 INFO  (jetty-launcher-669-thread-1) [    ] o.a.s.c.CorePropertiesLocator Config-defined core root directory: C:\Users\JenkinsSlave\workspace\Lucene-Solr-5.x-Windows\solr\build\solr-core\test\J0\temp\solr.cloud.TestAuthenticationFramework_AB6E62193E7C069E-001\tempDir-001\node1\.
   [junit4]   2> 869593 INFO  (jetty-launcher-669-thread-1) [    ] o.a.s.c.CoreContainer New CoreContainer 4541205
   [junit4]   2> 869593 INFO  (jetty-launcher-669-thread-1) [    ] o.a.s.c.CoreContainer Loading cores into CoreContainer [instanceDir=C:\Users\JenkinsSlave\workspace\Lucene-Solr-5.x-Windows\solr\build\solr-core\test\J0\temp\solr.cloud.TestAuthenticationFramework_AB6E62193E7C069E-001\tempDir-001\node1]
   [junit4]   2> 869593 WARN  (jetty-launcher-669-thread-1) [    ] o.a.s.c.CoreContainer Couldn't add files from C:\Users\JenkinsSlave\workspace\Lucene-Solr-5.x-Windows\solr\build\solr-core\test\J0\temp\solr.cloud.TestAuthenticationFramework_AB6E62193E7C069E-001\tempDir-001\node1\lib to classpath: C:\Users\JenkinsSlave\workspace\Lucene-Solr-5.x-Windows\solr\build\solr-core\test\J0\temp\solr.cloud.TestAuthenticationFramework_AB6E62193E7C069E-001\tempDir-001\node1\lib
   [junit4]   2> 869593 INFO  (jetty-launcher-669-thread-1) [    ] o.a.s.h.c.HttpShardHandlerFactory created with socketTimeout : 90000,urlScheme : ,connTimeout : 15000,maxConnectionsPerHost : 20,maxConnections : 10000,corePoolSize : 0,maximumPoolSize : 2147483647,maxThreadIdleTime : 5,sizeOfQueue : -1,fairnessPolicy : false,useRetries : false,
   [junit4]   2> 869597 INFO  (jetty-launcher-669-thread-1) [    ] o.a.s.u.UpdateShardHandler Creating UpdateShardHandler HTTP client with params: socketTimeout=340000&connTimeout=45000&retry=true
   [junit4]   2> 869597 INFO  (jetty-launcher-669-thread-1) [    ] o.a.s.l.LogWatcher SLF4J impl is org.slf4j.impl.Log4jLoggerFactory
   [junit4]   2> 869597 INFO  (jetty-launcher-669-thread-1) [    ] o.a.s.l.LogWatcher Registering Log Listener [Log4j (org.slf4j.impl.Log4jLoggerFactory)]
   [junit4]   2> 869597 INFO  (jetty-launcher-669-thread-1) [    ] o.a.s.c.ZkContainer Zookeeper client=127.0.0.1:65067/solr
   [junit4]   2> 869597 INFO  (jetty-launcher-669-thread-1) [    ] o.a.s.c.ZkController zkHost includes chroot
   [junit4]   2> 869597 INFO  (jetty-launcher-669-thread-1) [    ] o.a.s.c.c.SolrZkClient Using default ZkCredentialsProvider
   [junit4]   2> 869599 INFO  (jetty-launcher-669-thread-1) [    ] o.a.s.c.c.ConnectionManager Waiting for client to connect to ZooKeeper
   [junit4]   2> 869600 INFO  (jetty-launcher-669-thread-3) [    ] o.a.s.c.CorePropertiesLocator Config-defined core root directory: C:\Users\JenkinsSlave\workspace\Lucene-Solr-5.x-Windows\solr\build\solr-core\test\J0\temp\solr.cloud.TestAuthenticationFramework_AB6E62193E7C069E-001\tempDir-001\node3\.
   [junit4]   2> 869601 INFO  (jetty-launcher-669-thread-3) [    ] o.a.s.c.CoreContainer New CoreContainer 9090710
   [junit4]   2> 869601 INFO  (jetty-launcher-669-thread-3) [    ] o.a.s.c.CoreContainer Loading cores into CoreContainer [instanceDir=C:\Users\JenkinsSlave\workspace\Lucene-Solr-5.x-Windows\solr\build\solr-core\test\J0\temp\solr.cloud.TestAuthenticationFramework_AB6E62193E7C069E-001\tempDir-001\node3]
   [junit4]   2> 869602 WARN  (jetty-launcher-669-thread-3) [    ] o.a.s.c.CoreContainer Couldn't add files from C:\Users\JenkinsSlave\workspace\Lucene-Solr-5.x-Windows\solr\build\solr-core\test\J0\temp\solr.cloud.TestAuthenticationFramework_AB6E62193E7C069E-001\tempDir-001\node3\lib to classpath: C:\Users\JenkinsSlave\workspace\Lucene-Solr-5.x-Windows\solr\build\solr-core\test\J0\temp\solr.cloud.TestAuthenticationFramework_AB6E62193E7C069E-001\tempDir-001\node3\lib
   [junit4]   2> 869602 INFO  (jetty-launcher-669-thread-3) [    ] o.a.s.h.c.HttpShardHandlerFactory created with socketTimeout : 90000,urlScheme : ,connTimeout : 15000,maxConnectionsPerHost : 20,maxConnections : 10000,corePoolSize : 0,maximumPoolSize : 2147483647,maxThreadIdleTime : 5,sizeOfQueue : -1,fairnessPolicy : false,useRetries : false,
   [junit4]   2> 869603 INFO  (jetty-launcher-669-thread-3) [    ] o.a.s.u.UpdateShardHandler Creating UpdateShardHandler HTTP client with params: socketTimeout=340000&connTimeout=45000&retry=true
   [junit4]   2> 869603 INFO  (jetty-launcher-669-thread-3) [    ] o.a.s.l.LogWatcher SLF4J impl is org.slf4j.impl.Log4jLoggerFactory
   [junit4]   2> 869604 INFO  (jetty-launcher-669-thread-3) [    ] o.a.s.l.LogWatcher Registering Log Listener [Log4j (org.slf4j.impl.Log4jLoggerFactory)]
   [junit4]   2> 869604 INFO  (jetty-launcher-669-thread-3) [    ] o.a.s.c.ZkContainer Zookeeper client=127.0.0.1:65067/solr
   [junit4]   2> 869604 INFO  (jetty-launcher-669-thread-3) [    ] o.a.s.c.ZkController zkHost includes chroot
   [junit4]   2> 869604 INFO  (jetty-launcher-669-thread-3) [    ] o.a.s.c.c.SolrZkClient Using default ZkCredentialsProvider
   [junit4]   2> 869605 INFO  (jetty-launcher-669-thread-3) [    ] o.a.s.c.c.ConnectionManager Waiting for client to connect to ZooKeeper
   [junit4]   2> 869609 INFO  (zkCallback-674-thread-1) [    ] o.a.s.c.c.ConnectionManager Watcher org.apache.solr.common.cloud.ConnectionManager@153101f name:ZooKeeperConnection Watcher:127.0.0.1:65067 got event WatchedEvent state:SyncConnected type:None path:null path:null type:None
   [junit4]   2> 869610 INFO  (jetty-launcher-669-thread-1) [    ] o.a.s.c.c.ConnectionManager Client is connected to ZooKeeper
   [junit4]   2> 869611 INFO  (jetty-launcher-669-thread-1) [    ] o.a.s.c.c.SolrZkClient Using default ZkACLProvider
   [junit4]   2> 869612 INFO  (zkCallback-676-thread-1) [    ] o.a.s.c.c.ConnectionManager Watcher org.apache.solr.common.cloud.ConnectionManager@1ff795b name:ZooKeeperConnection Watcher:127.0.0.1:65067 got event WatchedEvent state:SyncConnected type:None path:null path:null type:None
   [junit4]   2> 869612 INFO  (jetty-launcher-669-thread-3) [    ] o.a.s.c.c.ConnectionManager Client is connected to ZooKeeper
   [junit4]   2> 869613 INFO  (jetty-launcher-669-thread-3) [    ] o.a.s.c.c.SolrZkClient Using default ZkACLProvider
   [junit4]   2> 869619 WARN  (NIOServerCxn.Factory:0.0.0.0/0.0.0.0:0) [    ] o.a.z.s.NIOServerCnxn caught end of stream exception
   [junit4]   2> EndOfStreamException: Unable to read additional data from client sessionid 0x15211d6edb70003, likely client has closed socket
   [junit4]   2> 	at org.apache.zookeeper.server.NIOServerCnxn.doIO(NIOServerCnxn.java:228)
   [junit4]   2> 	at org.apache.zookeeper.server.NIOServerCnxnFactory.run(NIOServerCnxnFactory.java:208)
   [junit4]   2> 	at java.lang.Thread.run(Thread.java:745)
   [junit4]   2> 869622 INFO  (jetty-launcher-669-thread-1) [n:127.0.0.1:65071_solr    ] o.a.s.c.c.ConnectionManager Waiting for client to connect to ZooKeeper
   [junit4]   2> 869636 INFO  (jetty-launcher-669-thread-3) [n:127.0.0.1:65076_solr    ] o.a.s.c.c.ConnectionManager Waiting for client to connect to ZooKeeper
   [junit4]   2> 869637 INFO  (zkCallback-677-thread-1-processing-n:127.0.0.1:65071_solr) [n:127.0.0.1:65071_solr    ] o.a.s.c.c.ConnectionManager Watcher org.apache.solr.common.cloud.ConnectionManager@1914dce name:ZooKeeperConnection Watcher:127.0.0.1:65067/solr got event WatchedEvent state:SyncConnected type:None path:null path:null type:None
   [junit4]   2> 869638 INFO  (jetty-launcher-669-thread-1) [n:127.0.0.1:65071_solr    ] o.a.s.c.c.ConnectionManager Client is connected to ZooKeeper
   [junit4]   2> 869661 INFO  (zkCallback-678-thread-1-processing-n:127.0.0.1:65076_solr) [n:127.0.0.1:65076_solr    ] o.a.s.c.c.ConnectionManager Watcher org.apache.solr.common.cloud.ConnectionManager@6b700d name:ZooKeeperConnection Watcher:127.0.0.1:65067/solr got event WatchedEvent state:SyncConnected type:None path:null path:null type:None
   [junit4]   2> 869661 INFO  (jetty-launcher-669-thread-3) [n:127.0.0.1:65076_solr    ] o.a.s.c.c.ConnectionManager Client is connected to ZooKeeper
   [junit4]   2> 869679 INFO  (jetty-launcher-669-thread-1) [n:127.0.0.1:65071_solr    ] o.a.s.c.c.SolrZkClient makePath: /overseer/queue
   [junit4]   2> 869680 INFO  (jetty-launcher-669-thread-3) [n:127.0.0.1:65076_solr    ] o.a.s.c.c.SolrZkClient makePath: /overseer/queue
   [junit4]   2> 869695 INFO  (jetty-launcher-669-thread-1) [n:127.0.0.1:65071_solr    ] o.a.s.c.c.SolrZkClient makePath: /overseer/collection-queue-work
   [junit4]   2> 869698 INFO  (jetty-launcher-669-thread-3) [n:127.0.0.1:65076_solr    ] o.a.s.c.c.SolrZkClient makePath: /overseer/collection-queue-work
   [junit4]   2> 869787 INFO  (jetty-launcher-669-thread-1) [n:127.0.0.1:65071_solr    ] o.a.s.c.c.SolrZkClient makePath: /overseer/collection-map-running
   [junit4]   2> 869788 INFO  (jetty-launcher-669-thread-3) [n:127.0.0.1:65076_solr    ] o.a.s.c.c.SolrZkClient makePath: /overseer/collection-map-running
   [junit4]   2> 869819 INFO  (jetty-launcher-669-thread-1) [n:127.0.0.1:65071_solr    ] o.a.s.c.c.SolrZkClient makePath: /overseer/collection-map-completed
   [junit4]   2> 869850 INFO  (jetty-launcher-669-thread-3) [n:127.0.0.1:65076_solr    ] o.a.s.c.c.SolrZkClient makePath: /overseer/collection-map-failure
   [junit4]   2> 869850 INFO  (jetty-launcher-669-thread-1) [n:127.0.0.1:65071_solr    ] o.a.s.c.c.SolrZkClient makePath: /overseer/collection-map-failure
   [junit4]   2> 869861 INFO  (jetty-launcher-669-thread-1) [n:127.0.0.1:65071_solr    ] o.a.s.c.c.SolrZkClient makePath: /live_nodes
   [junit4]   2> 869862 INFO  (jetty-launcher-669-thread-3) [n:127.0.0.1:65076_solr    ] o.a.s.c.c.SolrZkClient makePath: /live_nodes
   [junit4]   2> 869876 INFO  (jetty-launcher-669-thread-1) [n:127.0.0.1:65071_solr    ] o.a.s.c.c.SolrZkClient makePath: /collections
   [junit4]   2> 869876 INFO  (jetty-launcher-669-thread-3) [n:127.0.0.1:65076_solr    ] o.a.s.c.c.SolrZkClient makePath: /collections
   [junit4]   2> 869905 INFO  (jetty-launcher-669-thread-3) [n:127.0.0.1:65076_solr    ] o.a.s.c.c.SolrZkClient makePath: /aliases.json
   [junit4]   2> 869906 INFO  (jetty-launcher-669-thread-1) [n:127.0.0.1:65071_solr    ] o.a.s.c.c.SolrZkClient makePath: /aliases.json
   [junit4]   2> 869919 INFO  (jetty-launcher-669-thread-1) [n:127.0.0.1:65071_solr    ] o.a.s.c.c.SolrZkClient makePath: /clusterstate.json
   [junit4]   2> 869919 INFO  (jetty-launcher-669-thread-3) [n:127.0.0.1:65076_solr    ] o.a.s.c.c.SolrZkClient makePath: /clusterstate.json
   [junit4]   2> 869943 INFO  (jetty-launcher-669-thread-1) [n:127.0.0.1:65071_solr    ] o.a.s.c.c.SolrZkClient makePath: /security.json
   [junit4]   2> 869946 INFO  (jetty-launcher-669-thread-3) [n:127.0.0.1:65076_solr    ] o.a.s.c.c.SolrZkClient makePath: /security.json
   [junit4]   2> 869950 INFO  (jetty-launcher-669-thread-1) [n:127.0.0.1:65071_solr    ] o.a.s.c.ZkController Register node as live in ZooKeeper:/live_nodes/127.0.0.1:65071_solr
   [junit4]   2> 869956 INFO  (jetty-launcher-669-thread-3) [n:127.0.0.1:65076_solr    ] o.a.s.c.ZkController Register node as live in ZooKeeper:/live_nodes/127.0.0.1:65076_solr
   [junit4]   2> 869959 INFO  (jetty-launcher-669-thread-1) [n:127.0.0.1:65071_solr    ] o.a.s.c.c.SolrZkClient makePath: /live_nodes/127.0.0.1:65071_solr
   [junit4]   2> 869963 INFO  (jetty-launcher-669-thread-3) [n:127.0.0.1:65076_solr    ] o.a.s.c.c.SolrZkClient makePath: /live_nodes/127.0.0.1:65076_solr
   [junit4]   2> 869970 INFO  (jetty-launcher-669-thread-1) [n:127.0.0.1:65071_solr    ] o.a.s.c.c.SolrZkClient makePath: /overseer_elect
   [junit4]   2> 869972 INFO  (jetty-launcher-669-thread-3) [n:127.0.0.1:65076_solr    ] o.a.s.c.c.SolrZkClient makePath: /overseer_elect
   [junit4]   2> 869982 INFO  (jetty-launcher-669-thread-3) [n:127.0.0.1:65076_solr    ] o.a.s.c.c.SolrZkClient makePath: /overseer_elect/election
   [junit4]   2> 869982 INFO  (jetty-launcher-669-thread-1) [n:127.0.0.1:65071_solr    ] o.a.s.c.c.SolrZkClient makePath: /overseer_elect/election
   [junit4]   2> 869985 INFO  (jetty-launcher-669-thread-3) [n:127.0.0.1:65076_solr    ] o.a.s.c.Overseer Overseer (id=null) closing
   [junit4]   2> 869989 INFO  (jetty-launcher-669-thread-1) [n:127.0.0.1:65071_solr    ] o.a.s.c.Overseer Overseer (id=null) closing
   [junit4]   2> 869999 INFO  (jetty-launcher-669-thread-3) [n:127.0.0.1:65076_solr    ] o.a.s.c.LeaderElector Joined leadership election with path: /overseer_elect/election/95158156937068550-127.0.0.1:65076_solr-n_0000000000
   [junit4]   2> 870002 INFO  (jetty-launcher-669-thread-1) [n:127.0.0.1:65071_solr    ] o.a.s.c.LeaderElector Joined leadership election with path: /overseer_elect/election/95158156937068549-127.0.0.1:65071_solr-n_0000000001
   [junit4]   2> 870002 INFO  (jetty-launcher-669-thread-3) [n:127.0.0.1:65076_solr    ] o.a.s.c.OverseerElectionContext I am going to be the leader 127.0.0.1:65076_solr
   [junit4]   2> 870002 INFO  (jetty-launcher-669-thread-3) [n:127.0.0.1:65076_solr    ] o.a.s.c.c.SolrZkClient makePath: /overseer_elect/leader
   [junit4]   2> 870003 INFO  (jetty-launcher-669-thread-1) [n:127.0.0.1:65071_solr    ] o.a.s.c.LeaderElector Watching path /overseer_elect/election/95158156937068550-127.0.0.1:65076_solr-n_0000000000 to know if I could be the leader
   [junit4]   2> 870003 INFO  (jetty-launcher-669-thread-1) [n:127.0.0.1:65071_solr    ] o.a.s.c.c.ZkStateReader Updating cluster state from ZooKeeper... 
   [junit4]   2> 870009 INFO  (jetty-launcher-669-thread-3) [n:127.0.0.1:65076_solr    ] o.a.s.c.Overseer Overseer (id=95158156937068550-127.0.0.1:65076_solr-n_0000000000) starting
   [junit4]   2> 870038 INFO  (jetty-launcher-669-thread-3) [n:127.0.0.1:65076_solr    ] o.a.s.c.c.SolrZkClient makePath: /overseer/queue-work
   [junit4]   2> 870059 INFO  (jetty-launcher-669-thread-1) [n:127.0.0.1:65071_solr    ] o.a.s.c.CoreContainer Security conf doesn't exist. Skipping setup for authorization module.
   [junit4]   2> 870059 INFO  (jetty-launcher-669-thread-1) [n:127.0.0.1:65071_solr    ] o.a.s.c.CoreContainer Authentication plugin class obtained from system property 'authenticationPlugin': org.apache.solr.cloud.TestAuthenticationFramework$MockAuthenticationPlugin
   [junit4]   2> 870063 INFO  (jetty-launcher-669-thread-1) [n:127.0.0.1:65071_solr    ] o.a.s.c.CoreContainer Reconfiguring the shard handler factory and update shard handler.
   [junit4]   2> 870063 INFO  (jetty-launcher-669-thread-1) [n:127.0.0.1:65071_solr    ] o.a.s.h.c.HttpShardHandlerFactory Reconfiguring the default client with: org.apache.solr.cloud.TestAuthenticationFramework$MockAuthenticationPlugin$MockClientConfigurer@12da00f
   [junit4]   2> 870064 INFO  (jetty-launcher-669-thread-1) [n:127.0.0.1:65071_solr    ] o.a.s.u.UpdateShardHandler Reconfiguring the default client with: org.apache.solr.cloud.TestAuthenticationFramework$MockAuthenticationPlugin$MockClientConfigurer@12da00f
   [junit4]   2> 870065 INFO  (jetty-launcher-669-thread-1) [n:127.0.0.1:65071_solr    ] o.a.s.c.CorePropertiesLocator Looking for core definitions underneath C:\Users\JenkinsSlave\workspace\Lucene-Solr-5.x-Windows\solr\build\solr-core\test\J0\temp\solr.cloud.TestAuthenticationFramework_AB6E62193E7C069E-001\tempDir-001\node1\.
   [junit4]   2> 870067 INFO  (jetty-launcher-669-thread-1) [n:127.0.0.1:65071_solr    ] o.a.s.c.CorePropertiesLocator Found 0 core definitions
   [junit4]   2> 870072 INFO  (jetty-launcher-669-thread-1) [n:127.0.0.1:65071_solr    ] o.a.s.s.SolrDispatchFilter user.dir=C:\Users\JenkinsSlave\workspace\Lucene-Solr-5.x-Windows\solr\build\solr-core\test\J0
   [junit4]   2> 870072 INFO  (jetty-launcher-669-thread-1) [n:127.0.0.1:65071_solr    ] o.a.s.s.SolrDispatchFilter SolrDispatchFilter.init() done
   [junit4]   2> 870114 INFO  (jetty-launcher-669-thread-3) [n:127.0.0.1:65076_solr    ] o.a.s.c.OverseerAutoReplicaFailoverThread Starting OverseerAutoReplicaFailoverThread autoReplicaFailoverWorkLoopDelay=10000 autoReplicaFailoverWaitAfterExpiration=30000 autoReplicaFailoverBadNodeExpiration=60000
   [junit4]   2> 870114 INFO  (OverseerCollectionConfigSetProcessor-95158156937068550-127.0.0.1:65076_solr-n_0000000000) [n:127.0.0.1:65076_solr    ] o.a.s.c.OverseerTaskProcessor Process current queue of overseer operations
   [junit4]   2> 870114 INFO  (jetty-launcher-669-thread-3) [n:127.0.0.1:65076_solr    ] o.a.s.c.c.ZkStateReader Updating cluster state from ZooKeeper... 
   [junit4]   2> 870114 INFO  (OverseerStateUpdate-95158156937068550-127.0.0.1:65076_solr-n_0000000000) [n:127.0.0.1:65076_solr    ] o.a.s.c.Overseer Starting to work on the main queue
   [junit4]   2> 870155 INFO  (jetty-launcher-669-thread-3) [n:127.0.0.1:65076_solr    ] o.a.s.c.CoreContainer Security conf doesn't exist. Skipping setup for authorization module.
   [junit4]   2> 870155 INFO  (jetty-launcher-669-thread-3) [n:127.0.0.1:65076_solr    ] o.a.s.c.CoreContainer Authentication plugin class obtained from system property 'authenticationPlugin': org.apache.solr.cloud.TestAuthenticationFramework$MockAuthenticationPlugin
   [junit4]   2> 870155 INFO  (jetty-launcher-669-thread-3) [n:127.0.0.1:65076_solr    ] o.a.s.c.CoreContainer Reconfiguring the shard handler factory and update shard handler.
   [junit4]   2> 870155 INFO  (jetty-launcher-669-thread-3) [n:127.0.0.1:65076_solr    ] o.a.s.h.c.HttpShardHandlerFactory Reconfiguring the default client with: org.apache.solr.cloud.TestAuthenticationFramework$MockAuthenticationPlugin$MockClientConfigurer@ad26fa
   [junit4]   2> 870155 INFO  (jetty-launcher-669-thread-3) [n:127.0.0.1:65076_solr    ] o.a.s.u.UpdateShardHandler Reconfiguring the default client with: org.apache.solr.cloud.TestAuthenticationFramework$MockAuthenticationPlugin$MockClientConfigurer@ad26fa
   [junit4]   2> 870156 INFO  (jetty-launcher-669-thread-3) [n:127.0.0.1:65076_solr    ] o.a.s.c.CorePropertiesLocator Looking for core definitions underneath C:\Users\JenkinsSlave\workspace\Lucene-Solr-5.x-Windows\solr\build\solr-core\test\J0\temp\solr.cloud.TestAuthenticationFramework_AB6E62193E7C069E-001\tempDir-001\node3\.
   [junit4]   2> 870157 INFO  (jetty-launcher-669-thread-3) [n:127.0.0.1:65076_solr    ] o.a.s.c.CorePropertiesLocator Found 0 core definitions
   [junit4]   2> 870158 INFO  (jetty-launcher-669-thread-3) [n:127.0.0.1:65076_solr    ] o.a.s.s.SolrDispatchFilter user.dir=C:\Users\JenkinsSlave\workspace\Lucene-Solr-5.x-Windows\solr\build\solr-core\test\J0
   [junit4]   2> 870158 INFO  (jetty-launcher-669-thread-3) [n:127.0.0.1:65076_solr    ] o.a.s.s.SolrDispatchFilter SolrDispatchFilter.init() done
   [junit4]   2> 870266 INFO  (jetty-launcher-669-thread-1) [    ] o.e.j.s.ServerConnector Stopped ServerConnector@12ba46a{HTTP/1.1}{127.0.0.1:0}
   [junit4]   2> 870272 INFO  (jetty-launcher-669-thread-1) [    ] o.a.s.c.CoreContainer Shutting down CoreContainer instance=9090710
   [junit4]   2> 870276 INFO  (jetty-launcher-669-thread-1) [    ] o.a.s.c.Overseer Overseer (id=95158156937068550-127.0.0.1:65076_solr-n_0000000000) closing
   [junit4]   2> 870276 INFO  (jetty-launcher-669-thread-3) [    ] o.e.j.s.ServerConnector Stopped ServerConnector@1b48d54{HTTP/1.1}{127.0.0.1:0}
   [junit4]   2> 870277 INFO  (jetty-launcher-669-thread-3) [    ] o.a.s.c.CoreContainer Shutting down CoreContainer instance=4541205
   [junit4]   2> 870277 INFO  (OverseerStateUpdate-95158156937068550-127.0.0.1:65076_solr-n_0000000000) [n:127.0.0.1:65076_solr    ] o.a.s.c.Overseer Overseer Loop exiting : 127.0.0.1:65076_solr
   [junit4]   2> 870310 ERROR (jetty-launcher-669-thread-3-EventThread) [n:127.0.0.1:65076_solr    ] o.a.z.ClientCnxn Error while calling watcher 
   [junit4]   2> java.util.concurrent.RejectedExecutionException: Task org.apache.solr.common.util.ExecutorUtil$MDCAwareThreadPoolExecutor$1@147b5be rejected from org.apache.solr.common.util.ExecutorUtil$MDCAwareThreadPoolExecutor@178304e[Shutting down, pool size = 1, active threads = 0, queued tasks = 0, completed tasks = 1]
   [junit4]   2> 	at java.util.concurrent.ThreadPoolExecutor$AbortPolicy.rejectedExecution(ThreadPoolExecutor.java:2047)
   [junit4]   2> 	at java.util.concurrent.ThreadPoolExecutor.reject(ThreadPoolExecutor.java:823)
   [junit4]   2> 	at java.util.concurrent.ThreadPoolExecutor.execute(ThreadPoolExecutor.java:1369)
   [junit4]   2> 	at org.apache.solr.common.util.ExecutorUtil$MDCAwareThreadPoolExecutor.execute(ExecutorUtil.java:215)
   [junit4]   2> 	at java.util.concurrent.AbstractExecutorService.submit(AbstractExecutorService.java:112)
   [junit4]   2> 	at org.apache.solr.common.cloud.SolrZkClient$3.process(SolrZkClient.java:261)
   [junit4]   2> 	at org.apache.zookeeper.ClientCnxn$EventThread.processEvent(ClientCnxn.java:522)
   [junit4]   2> 	at org.apache.zookeeper.ClientCnxn$EventThread.run(ClientCnxn.java:498)
   [junit4]   2> 870312 INFO  (zkCallback-677-thread-2-processing-n:127.0.0.1:65071_solr) [n:127.0.0.1:65071_solr    ] o.a.s.c.c.ZkStateReader A live node change: [WatchedEvent state:SyncConnected type:NodeChildrenChanged path:/live_nodes], has occurred - updating... (live nodes size: [2])
   [junit4]   2> 870312 INFO  (jetty-launcher-669-thread-1) [    ] o.e.j.s.h.ContextHandler Stopped o.e.j.s.ServletContextHandler@17f1621{/solr,null,UNAVAILABLE}
   [junit4]   2> 871780 WARN  (zkCallback-677-thread-1-processing-n:127.0.0.1:65071_solr) [n:127.0.0.1:65071_solr    ] o.a.s.c.LeaderElector 
   [junit4]   2> org.apache.zookeeper.KeeperException$SessionExpiredException: KeeperErrorCode = Session expired for /overseer_elect/election
   [junit4]   2> 	at org.apache.zookeeper.KeeperException.create(KeeperException.java:127)
   [junit4]   2> 	at org.apache.zookeeper.KeeperException.create(KeeperException.java:51)
   [junit4]   2> 	at org.apache.zookeeper.ZooKeeper.getChildren(ZooKeeper.java:1472)
   [junit4]   2> 	at org.apache.solr.common.cloud.SolrZkClient$6.execute(SolrZkClient.java:328)
   [junit4]   2> 	at org.apache.solr.common.cloud.SolrZkClient$6.execute(SolrZkClient.java:325)
   [junit4]   2> 	at org.apache.solr.common.cloud.ZkCmdExecutor.retryOperation(ZkCmdExecutor.java:61)
   [junit4]   2> 	at org.apache.solr.common.cloud.SolrZkClient.getChildren(SolrZkClient.java:325)
   [junit4]   2> 	at org.apache.solr.cloud.LeaderElector.checkIfIamLeader(LeaderElector.java:108)
   [junit4]   2> 	at org.apache.solr.cloud.LeaderElector.access$200(LeaderElector.java:59)
   [junit4]   2> 	at org.apache.solr.cloud.LeaderElector$ElectionWatcher.process(LeaderElector.java:389)
   [junit4]   2> 	at org.apache.solr.common.cloud.SolrZkClient$3$1.run(SolrZkClient.java:264)
   [junit4]   2> 	at java.util.concurrent.Executors$RunnableAdapter.call(Executors.java:511)
   [junit4]   2> 	at java.util.concurrent.FutureTask.run(FutureTask.java:266)
   [junit4]   2> 	at org.apache.solr.common.util.ExecutorUtil$MDCAwareThreadPoolExecutor$1.run(ExecutorUtil.java:232)
   [junit4]   2> 	at java.util.concurrent.ThreadPoolExecutor.runWorker(ThreadPoolExecutor.java:1142)
   [junit4]   2> 	at java.util.concurrent.ThreadPoolExecutor$Worker.run(ThreadPoolExecutor.java:617)
   [junit4]   2> 	at java.lang.Thread.run(Thread.java:745)
   [junit4]   2> 871782 WARN  (zkCallback-677-thread-2-processing-n:127.0.0.1:65071_solr) [n:127.0.0.1:65071_solr    ] o.a.s.c.c.ZkStateReader ZooKeeper watch triggered, but Solr cannot talk to ZK: [KeeperErrorCode = Session expired for /live_nodes]
   [junit4]   2> 871782 INFO  (jetty-launcher-669-thread-3) [    ] o.e.j.s.h.ContextHandler Stopped o.e.j.s.ServletContextHandler@1ed2582{/solr,null,UNAVAILABLE}
   [junit4]   2> 871786 INFO  (TEST-TestAuthenticationFramework.testErrorsInStartup-seed#[AB6E62193E7C069E]) [    ] o.a.s.c.ZkTestServer connecting to 127.0.0.1:65067 65067
   [junit4]   2> 873993 INFO  (Thread-2187) [    ] o.a.s.c.ZkTestServer connecting to 127.0.0.1:65067 65067
   [junit4]   2> 873993 WARN  (Thread-2187) [    ] o.a.s.c.ZkTestServer Watch limit violations: 
   [junit4]   2> Maximum concurrent create/delete watches above limit:
   [junit4]   2> 
   [junit4]   2> 	2	/solr/aliases.json
   [junit4]   2> 	2	/solr/security.json
   [junit4]   2> 
   [junit4]   2> Maximum concurrent data watches above limit:
   [junit4]   2> 
   [junit4]   2> 	2	/solr/clusterstate.json
   [junit4]   2> 
   [junit4]   2> Maximum concurrent children watches above limit:
   [junit4]   2> 
   [junit4]   2> 	2	/solr/live_nodes
   [junit4]   2> 	2	/solr/collections
   [junit4]   2> 
   [junit4]   2> 874000 INFO  (TEST-TestAuthenticationFramework.testStopAllStartAll-seed#[AB6E62193E7C069E]) [    ] o.a.s.c.ZkTestServer STARTING ZK TEST SERVER
   [junit4]   2> 874001 INFO  (Thread-2211) [    ] o.a.s.c.ZkTestServer client port:0.0.0.0/0.0.0.0:0
   [junit4]   2> 874001 INFO  (Thread-2211) [    ] o.a.s.c.ZkTestServer Starting server
   [junit4]   2> 874098 INFO  (TEST-TestAuthenticationFramework.testStopAllStartAll-seed#[AB6E62193E7C069E]) [    ] o.a.s.c.ZkTestServer start zk server on port:65121
   [junit4]   2> 874098 INFO  (TEST-TestAuthenticationFramework.testStopAllStartAll-seed#[AB6E62193E7C069E]) [    ] o.a.s.c.c.SolrZkClient Using default ZkCredentialsProvider
   [junit4]   2> 874099 INFO  (TEST-TestAuthenticationFramework.testStopAllStartAll-seed#[AB6E62193E7C069E]) [    ] o.a.s.c.c.ConnectionManager Waiting for client to connect to ZooKeeper
   [junit4]   2> 874374 INFO  (zkCallback-680-thread-1) [    ] o.a.s.c.c.ConnectionManager Watcher org.apache.solr.common.cloud.ConnectionManager@18b7669 name:ZooKeeperConnection Watcher:127.0.0.1:65121 got event WatchedEvent state:SyncConnected type:None path:null path:null type:None
   [junit4]   2> 874374 INFO  (TEST-TestAuthenticationFramework.testStopAllStartAll-seed#[AB6E62193E7C069E]) [    ] o.a.s.c.c.ConnectionManager Client is connected to ZooKeeper
   [junit4]   2> 874379 INFO  (TEST-TestAuthenticationFramework.testStopAllStartAll-seed#[AB6E62193E7C069E]) [    ] o.a.s.c.c.SolrZkClient Using default ZkACLProvider
   [junit4]   2> 874379 INFO  (TEST-TestAuthenticationFramework.testStopAllStartAll-seed#[AB6E62193E7C069E]) [    ] o.a.s.c.c.SolrZkClient makePath: /solr/solr.xml
   [junit4]   2> 874456 INFO  (jetty-launcher-679-thread-3) [    ] o.e.j.s.Server jetty-9.2.13.v20150730
   [junit4]   2> 874456 INFO  (jetty-launcher-679-thread-1) [    ] o.e.j.s.Server jetty-9.2.13.v20150730
   [junit4]   2> 874456 INFO  (jetty-launcher-679-thread-2) [    ] o.e.j.s.Server jetty-9.2.13.v20150730
   [junit4]   2> 874457 INFO  (jetty-launcher-679-thread-4) [    ] o.e.j.s.Server jetty-9.2.13.v20150730
   [junit4]   2> 874457 INFO  (jetty-launcher-679-thread-5) [    ] o.e.j.s.Server jetty-9.2.13.v20150730
   [junit4]   2> 874461 INFO  (jetty-launcher-679-thread-3) [    ] o.e.j.s.h.ContextHandler Started o.e.j.s.ServletContextHandler@112247c{/solr,null,AVAILABLE}
   [junit4]   2> 874463 INFO  (jetty-launcher-679-thread-4) [    ] o.e.j.s.h.ContextHandler Started o.e.j.s.ServletContextHandler@1e136bb{/solr,null,AVAILABLE}
   [junit4]   2> 874464 INFO  (jetty-launcher-679-thread-3) [    ] o.e.j.s.ServerConnector Started ServerConnector@6ba562{HTTP/1.1}{127.0.0.1:65137}
   [junit4]   2> 874464 INFO  (jetty-launcher-679-thread-2) [    ] o.e.j.s.h.ContextHandler Started o.e.j.s.ServletContextHandler@3a762f{/solr,null,AVAILABLE}
   [junit4]   2> 874464 INFO  (jetty-launcher-679-thread-3) [    ] o.e.j.s.Server Started @879108ms
   [junit4]   2> 874464 INFO  (jetty-launcher-679-thread-3) [    ] o.a.s.c.s.e.JettySolrRunner Jetty properties: {hostContext=/solr, hostPort=65137}
   [junit4]   2> 874464 INFO  (jetty-launcher-679-thread-4) [    ] o.e.j.s.ServerConnector Started ServerConnector@1dfbcae{HTTP/1.1}{127.0.0.1:65140}
   [junit4]   2> 874464 INFO  (jetty-launcher-679-thread-4) [    ] o.e.j.s.Server Started @879109ms
   [junit4]   2> 874464 INFO  (jetty-launcher-679-thread-4) [    ] o.a.s.c.s.e.JettySolrRunner Jetty properties: {hostContext=/solr, hostPort=65140}
   [junit4]   2> 874465 INFO  (jetty-launcher-679-thread-2) [    ] o.e.j.s.ServerConnector Started ServerConnector@19dbbb5{HTTP/1.1}{127.0.0.1:65143}
   [junit4]   2> 874465 INFO  (jetty-launcher-679-thread-2) [    ] o.e.j.s.Server Started @879109ms
   [junit4]   2> 874465 INFO  (jetty-launcher-679-thread-4) [    ] o.a.s.s.SolrDispatchFilter SolrDispatchFilter.init(): sun.misc.Launcher$AppClassLoader@e2f2a
   [junit4]   2> 874465 INFO  (jetty-launcher-679-thread-2) [    ] o.a.s.c.s.e.JettySolrRunner Jetty properties: {hostContext=/solr, hostPort=65143}
   [junit4]   2> 874465 INFO  (jetty-launcher-679-thread-4) [    ] o.a.s.c.SolrResourceLoader new SolrResourceLoader for directory: 'C:\Users\JenkinsSlave\workspace\Lucene-Solr-5.x-Windows\solr\build\solr-core\test\J0\temp\solr.cloud.TestAuthenticationFramework_AB6E62193E7C069E-001\tempDir-002\node5'
   [junit4]   2> 874465 INFO  (jetty-launcher-679-thread-4) [    ] o.a.s.c.SolrResourceLoader JNDI not configured for solr (NoInitialContextEx)
   [junit4]   2> 874465 INFO  (jetty-launcher-679-thread-2) [    ] o.a.s.s.SolrDispatchFilter SolrDispatchFilter.init(): sun.misc.Launcher$AppClassLoader@e2f2a
   [junit4]   2> 874465 INFO  (jetty-launcher-679-thread-4) [    ] o.a.s.c.SolrResourceLoader solr home defaulted to 'solr/' (could not find system property or JNDI)
   [junit4]   2> 874465 INFO  (jetty-launcher-679-thread-2) [    ] o.a.s.c.SolrResourceLoader new SolrResourceLoader for directory: 'C:\Users\JenkinsSlave\workspace\Lucene-Solr-5.x-Windows\solr\build\solr-core\test\J0\temp\solr.cloud.TestAuthenticationFramework_AB6E62193E7C069E-001\tempDir-002\node2'
   [junit4]   2> 874465 INFO  (jetty-launcher-679-thread-2) [    ] o.a.s.c.SolrResourceLoader JNDI not configured for solr (NoInitialContextEx)
   [junit4]   2> 874465 INFO  (jetty-launcher-679-thread-2) [    ] o.a.s.c.SolrResourceLoader solr home defaulted to 'solr/' (could not find system property or JNDI)
   [junit4]   2> 874465 INFO  (jetty-launcher-679-thread-3) [    ] o.a.s.s.SolrDispatchFilter SolrDispatchFilter.init(): sun.misc.Launcher$AppClassLoader@e2f2a
   [junit4]   2> 874465 INFO  (jetty-launcher-679-thread-3) [    ] o.a.s.c.SolrResourceLoader new SolrResourceLoader for directory: 'C:\Users\JenkinsSlave\workspace\Lucene-Solr-5.x-Windows\solr\build\solr-core\test\J0\temp\solr.cloud.TestAuthenticationFramework_AB6E62193E7C069E-001\tempDir-002\node3'
   [junit4]   2> 874465 INFO  (jetty-launcher-679-thread-3) [    ] o.a.s.c.SolrResourceLoader JNDI not configured for solr (NoInitialContextEx)
   [junit4]   2> 874465 INFO  (jetty-launcher-679-thread-3) [    ] o.a.s.c.SolrResourceLoader solr home defaulted to 'solr/' (could not find system property or JNDI)
   [junit4]   2> 874465 INFO  (jetty-launcher-679-thread-4) [    ] o.a.s.c.c.SolrZkClient Using default ZkCredentialsProvider
   [junit4]   2> 874466 INFO  (jetty-launcher-679-thread-2) [    ] o.a.s.c.c.SolrZkClient Using default ZkCredentialsProvider
   [junit4]   2> 874466 INFO  (jetty-launcher-679-thread-4) [    ] o.a.s.c.c.ConnectionManager Waiting for client to connect to ZooKeeper
   [junit4]   2> 874467 INFO  (jetty-launcher-679-thread-3) [    ] o.a.s.c.c.SolrZkClient Using default ZkCredentialsProvider
   [junit4]   2> 874467 INFO  (jetty-launcher-679-thread-1) [    ] o.e.j.s.h.ContextHandler Started o.e.j.s.ServletContextHandler@51f9e8{/solr,null,AVAILABLE}
   [junit4]   2> 874469 INFO  (jetty-launcher-679-thread-2) [    ] o.a.s.c.c.ConnectionManager Waiting for client to connect to ZooKeeper
   [junit4]   2> 874469 INFO  (jetty-launcher-679-thread-3) [    ] o.a.s.c.c.ConnectionManager Waiting for client to connect to ZooKeeper
   [junit4]   2> 874470 INFO  (jetty-launcher-679-thread-1) [    ] o.e.j.s.ServerConnector Started ServerConnector@1c29d8c{HTTP/1.1}{127.0.0.1:65153}
   [junit4]   2> 874470 INFO  (jetty-launcher-679-thread-1) [    ] o.e.j.s.Server Started @879114ms
   [junit4]   2> 874470 INFO  (jetty-launcher-679-thread-1) [    ] o.a.s.c.s.e.JettySolrRunner Jetty properties: {hostContext=/solr, hostPort=65153}
   [junit4]   2> 874470 INFO  (jetty-launcher-679-thread-1) [    ] o.a.s.s.SolrDispatchFilter SolrDispatchFilter.init(): sun.misc.Launcher$AppClassLoader@e2f2a
   [junit4]   2> 874470 INFO  (jetty-launcher-679-thread-1) [    ] o.a.s.c.SolrResourceLoader new SolrResourceLoader for directory: 'C:\Users\JenkinsSlave\workspace\Lucene-Solr-5.x-Windows\solr\build\solr-core\test\J0\temp\solr.cloud.TestAuthenticationFramework_AB6E62193E7C069E-001\tempDir-002\node1'
   [junit4]   2> 874470 INFO  (jetty-launcher-679-thread-1) [    ] o.a.s.c.SolrResourceLoader JNDI not configured for solr (NoInitialContextEx)
   [junit4]   2> 874470 INFO  (jetty-launcher-679-thread-1) [    ] o.a.s.c.SolrResourceLoader solr home defaulted to 'solr/' (could not find system property or JNDI)
   [junit4]   2> 874470 INFO  (jetty-launcher-679-thread-5) [    ] o.e.j.s.h.ContextHandler Started o.e.j.s.ServletContextHandler@1bd02d2{/solr,null,AVAILABLE}
   [junit4]   2> 874470 INFO  (jetty-launcher-679-thread-1) [    ] o.a.s.c.c.SolrZkClient Using default ZkCredentialsProvider
   [junit4]   2> 874470 INFO  (jetty-launcher-679-thread-5) [    ] o.e.j.s.ServerConnector Started ServerConnector@1bdf8cb{HTTP/1.1}{127.0.0.1:65158}
   [junit4]   2> 874470 INFO  (jetty-launcher-679-thread-5) [    ] o.e.j.s.Server Started @879115ms
   [junit4]   2> 874470 INFO  (jetty-launcher-679-thread-5) [    ] o.a.s.c.s.e.JettySolrRunner Jetty properties: {hostContext=/solr, hostPort=65158}
   [junit4]   2> 874470 INFO  (jetty-launcher-679-thread-5) [    ] o.a.s.s.SolrDispatchFilter SolrDispatchFilter.init(): sun.misc.Launcher$AppClassLoader@e2f2a
   [junit4]   2> 874470 INFO  (jetty-launcher-679-thread-5) [    ] o.a.s.c.SolrResourceLoader new SolrResourceLoader for directory: 'C:\Users\JenkinsSlave\workspace\Lucene-Solr-5.x-Windows\solr\build\solr-core\test\J0\temp\solr.cloud.TestAuthenticationFramework_AB6E62193E7C069E-001\tempDir-002\node4'
   [junit4]   2> 874470 INFO  (jetty-launcher-679-thread-5) [    ] o.a.s.c.SolrResourceLoader JNDI not configured for solr (NoInitialContextEx)
   [junit4]   2> 874470 INFO  (jetty-launcher-679-thread-5) [    ] o.a.s.c.SolrResourceLoader solr home defaulted to 'solr/' (could not find system property or JNDI)
   [junit4]   2> 874470 INFO  (jetty-launcher-679-thread-1) [    ] o.a.s.c.c.ConnectionManager Waiting for client to connect to ZooKeeper
   [junit4]   2> 874471 INFO  (jetty-launcher-679-thread-5) [    ] o.a.s.c.c.SolrZkClient Using default ZkCredentialsProvider
   [junit4]   2> 874472 INFO  (jetty-launcher-679-thread-5) [    ] o.a.s.c.c.ConnectionManager Waiting for client to connect to ZooKeeper
   [junit4]   2> 874489 INFO  (zkCallback-681-thread-1) [    ] o.a.s.c.c.ConnectionManager Watcher org.apache.solr.common.cloud.ConnectionManager@19e53f0 name:ZooKeeperConnection Watcher:127.0.0.1:65121/solr got event WatchedEvent state:SyncConnected type:None path:null path:null type:None
   [junit4]   2> 874489 INFO  (jetty-launcher-679-thread-4) [    ] o.a.s.c.c.ConnectionManager Client is connected to ZooKeeper
   [junit4]   2> 874490 INFO  (jetty-launcher-679-thread-4) [    ] o.a.s.c.c.SolrZkClient Using default ZkACLProvider
   [junit4]   2> 874504 INFO  (jetty-launcher-679-thread-4) [    ] o.a.s.s.SolrDispatchFilter solr.xml found in ZooKeeper. Loading...
   [junit4]   2> 874504 INFO  (zkCallback-682-thread-1) [    ] o.a.s.c.c.ConnectionManager Watcher org.apache.solr.common.cloud.ConnectionManager@1ab53cc name:ZooKeeperConnection Watcher:127.0.0.1:65121/solr got event WatchedEvent state:SyncConnected type:None path:null path:null type:None
   [junit4]   2> 874504 INFO  (jetty-launcher-679-thread-2) [    ] o.a.s.c.c.ConnectionManager Client is connected to ZooKeeper
   [junit4]   2> 874504 INFO  (zkCallback-683-thread-1) [    ] o.a.s.c.c.ConnectionManager Watcher org.apache.solr.common.cloud.ConnectionManager@138e2b2 name:ZooKeeperConnection Watcher:127.0.0.1:65121/solr got event WatchedEvent state:SyncConnected type:None path:null path:null type:None
   [junit4]   2> 874504 INFO  (zkCallback-684-thread-1) [    ] o.a.s.c.c.ConnectionManager Watcher org.apache.solr.common.cloud.ConnectionManager@1a82407 name:ZooKeeperConnection Watcher:127.0.0.1:65121/solr got event WatchedEvent state:SyncConnected type:None path:null path:null type:None
   [junit4]   2> 874504 INFO  (jetty-launcher-679-thread-2) [    ] o.a.s.c.c.SolrZkClient Using default ZkACLProvider
   [junit4]   2> 874504 INFO  (jetty-launcher-679-thread-1) [    ] o.a.s.c.c.ConnectionManager Client is connected to ZooKeeper
   [junit4]   2> 874504 INFO  (jetty-launcher-679-thread-3) [    ] o.a.s.c.c.ConnectionManager Client is connected to ZooKeeper
   [junit4]   2> 874504 INFO  (zkCallback-685-thread-1) [    ] o.a.s.c.c.ConnectionManager Watcher org.apache.solr.common.cloud.ConnectionManager@1f4762a name:ZooKeeperConnection Watcher:127.0.0.1:65121/solr got event WatchedEvent state:SyncConnected type:None path:null path:null type:None
   [junit4]   2> 874505 INFO  (jetty-launcher-679-thread-5) [    ] o.a.s.c.c.ConnectionManager Client is connected to ZooKeeper
   [junit4]   2> 874504 INFO  (jetty-launcher-679-thread-3) [    ] o.a.s.c.c.SolrZkClient Using default ZkACLProvider
   [junit4]   2> 874505 INFO  (jetty-launcher-679-thread-5) [    ] o.a.s.c.c.SolrZkClient Using default ZkACLProvider
   [junit4]   2> 874505 INFO  (jetty-launcher-679-thread-5) [    ] o.a.s.s.SolrDispatchFilter solr.xml found in ZooKeeper. Loading...
   [junit4]   2> 874505 INFO  (jetty-launcher-679-thread-3) [    ] o.a.s.s.SolrDispatchFilter solr.xml found in ZooKeeper. Loading...
   [junit4]   2> 874505 INFO  (jetty-launcher-679-thread-2) [    ] o.a.s.s.SolrDispatchFilter solr.xml found in ZooKeeper. Loading...
   [junit4]   2> 874509 INFO  (jetty-launcher-679-thread-1) [    ] o.a.s.c.c.SolrZkClient Using default ZkACLProvider
   [junit4]   2> 874532 INFO  (jetty-launcher-679-thread-5) [    ] o.a.s.c.CorePropertiesLocator Config-defined core root directory: C:\Users\JenkinsSlave\workspace\Lucene-Solr-5.x-Windows\solr\build\solr-core\test\J0\temp\solr.cloud.TestAuthenticationFramework_AB6E62193E7C069E-001\tempDir-002\node4\.
   [junit4]   2> 874532 INFO  (jetty-launcher-679-thread-5) [    ] o.a.s.c.CoreContainer New CoreContainer 4324876
   [junit4]   2> 874532 INFO  (jetty-launcher-679-thread-5) [    ] o.a.s.c.CoreContainer Loading cores into CoreContainer [instanceDir=C:\Users\JenkinsSlave\workspace\Lucene-Solr-5.x-Windows\solr\build\solr-core\test\J0\temp\solr.cloud.TestAuthenticationFramework_AB6E62193E7C069E-001\tempDir-002\node4]
   [junit4]   2> 874533 WARN  (jetty-launcher-679-thread-5) [    ] o.a.s.c.CoreContainer Couldn't add files from C:\Users\JenkinsSlave\workspace\Lucene-Solr-5.x-Windows\solr\build\solr-core\test\J0\temp\solr.cloud.TestAuthenticationFramework_AB6E62193E7C069E-001\tempDir-002\node4\lib to classpath: C:\Users\JenkinsSlave\workspace\Lucene-Solr-5.x-Windows\solr\build\solr-core\test\J0\temp\solr.cloud.TestAuthenticationFramework_AB6E62193E7C069E-001\tempDir-002\node4\lib
   [junit4]   2> 874533 INFO  (jetty-launcher-679-thread-5) [    ] o.a.s.h.c.HttpShardHandlerFactory created with socketTimeout : 90000,urlScheme : ,connTimeout : 15000,maxConnectionsPerHost : 20,maxConnections : 10000,corePoolSize : 0,maximumPoolSize : 2147483647,maxThreadIdleTime : 5,sizeOfQueue : -1,fairnessPolicy : false,useRetries : false,
   [junit4]   2> 874533 INFO  (jetty-launcher-679-thread-4) [    ] o.a.s.c.CorePropertiesLocator Config-defined core root directory: C:\Users\JenkinsSlave\workspace\Lucene-Solr-5.x-Windows\solr\build\solr-core\test\J0\temp\solr.cloud.TestAuthenticationFramework_AB6E62193E7C069E-001\tempDir-002\node5\.
   [junit4]   2> 874533 INFO  (jetty-launcher-679-thread-4) [    ] o.a.s.c.CoreContainer New CoreContainer 11423340
   [junit4]   2> 874533 INFO  (jetty-launcher-679-thread-4) [    ] o.a.s.c.CoreContainer Loading cores into CoreContainer [instanceDir=C:\Users\JenkinsSlave\workspace\Lucene-Solr-5.x-Windows\solr\build\solr-core\test\J0\temp\solr.cloud.TestAuthenticationFramework_AB6E62193E7C069E-001\tempDir-002\node5]
   [junit4]   2> 874533 INFO  (jetty-launcher-679-thread-5) [    ] o.a.s.u.UpdateShardHandler Creating UpdateShardHandler HTTP client with params: socketTimeout=340000&connTimeout=45000&retry=true
   [junit4]   2> 874533 WARN  (jetty-launcher-679-thread-4) [    ] o.a.s.c.CoreContainer Couldn't add files from C:\Users\JenkinsSlave\workspace\Lucene-Solr-5.x-Windows\solr\build\solr-core\test\J0\temp\solr.cloud.TestAuthenticationFramework_AB6E62193E7C069E-001\tempDir-002\node5\lib to classpath: C:\Users\JenkinsSlave\workspace\Lucene-Solr-5.x-Windows\solr\build\solr-core\test\J0\temp\solr.cloud.TestAuthenticationFramework_AB6E62193E7C069E-001\tempDir-002\node5\lib
   [junit4]   2> 874534 INFO  (jetty-launcher-679-thread-4) [    ] o.a.s.h.c.HttpShardHandlerFactory created with socketTimeout : 90000,urlScheme : ,connTimeout : 15000,maxConnectionsPerHost : 20,maxConnections : 10000,corePoolSize : 0,maximumPoolSize : 2147483647,maxThreadIdleTime : 5,sizeOfQueue : -1,fairnessPolicy : false,useRetries : false,
   [junit4]   2> 874534 INFO  (jetty-launcher-679-thread-4) [    ] o.a.s.u.UpdateShardHandler Creating UpdateShardHandler HTTP client with params: socketTimeout=340000&connTimeout=45000&retry=true
   [junit4]   2> 874535 INFO  (jetty-launcher-679-thread-4) [    ] o.a.s.l.LogWatcher SLF4J impl is org.slf4j.impl.Log4jLoggerFactory
   [junit4]   2> 874535 INFO  (jetty-launcher-679-thread-4) [    ] o.a.s.l.LogWatcher Registering Log Listener [Log4j (org.slf4j.impl.Log4jLoggerFactory)]
   [junit4]   2> 874535 INFO  (jetty-launcher-679-thread-4) [    ] o.a.s.c.ZkContainer Zookeeper client=127.0.0.1:65121/solr
   [junit4]   2> 874535 INFO  (jetty-launcher-679-thread-4) [    ] o.a.s.c.ZkController zkHost includes chroot
   [junit4]   2> 874535 INFO  (jetty-launcher-679-thread-4) [    ] o.a.s.c.c.SolrZkClient Using default ZkCredentialsProvider
   [junit4]   2> 874535 INFO  (jetty-launcher-679-thread-5) [    ] o.a.s.l.LogWatcher SLF4J impl is org.slf4j.impl.Log4jLoggerFactory
   [junit4]   2> 874536 INFO  (jetty-launcher-679-thread-5) [    ] o.a.s.l.LogWatcher Registering Log Listener [Log4j (org.slf4j.impl.Log4jLoggerFactory)]
   [junit4]   2> 874536 INFO  (jetty-launcher-679-thread-5) [    ] o.a.s.c.ZkContainer Zookeeper client=127.0.0.1:65121/solr
   [junit4]   2> 874536 INFO  (jetty-launcher-679-thread-5) [    ] o.a.s.c.ZkController zkHost includes chroot
   [junit4]   2> 874536 INFO  (jetty-launcher-679-thread-5) [    ] o.a.s.c.c.SolrZkClient Using default ZkCredentialsProvider
   [junit4]   2> 874537 INFO  (jetty-launcher-679-thread-4) [    ] o.a.s.c.c.ConnectionManager Waiting for client to connect to ZooKeeper
   [junit4]   2> 874537 INFO  (jetty-launcher-679-thread-5) [    ] o.a.s.c.c.ConnectionManager Waiting for client to connect to ZooKeeper
   [junit4]   2> 874547 INFO  (jetty-launcher-679-thread-3) [    ] o.a.s.c.CorePropertiesLocator Config-defined core root directory: C:\Users\JenkinsSlave\workspace\Lucene-Solr-5.x-Windows\solr\build\solr-core\test\J0\temp\solr.cloud.TestAuthenticationFramework_AB6E62193E7C069E-001\tempDir-002\node3\.
   [junit4]   2> 874547 INFO  (jetty-launcher-679-thread-1) [    ] o.a.s.s.SolrDispatchFilter solr.xml found in ZooKeeper. Loading...
   [junit4]   2> 874547 INFO  (jetty-launcher-679-thread-3) [    ] o.a.s.c.CoreContainer New CoreContainer 6761822
   [junit4]   2> 874547 INFO  (jetty-launcher-679-thread-3) [    ] o.a.s.c.CoreContainer Loading cores into CoreContainer [instanceDir=C:\Users\JenkinsSlave\workspace\Lucene-Solr-5.x-Windows\solr\build\solr-core\test\J0\temp\solr.cloud.TestAuthenticationFramework_AB6E62193E7C069E-001\tempDir-002\node3]
   [junit4]   2> 874547 WARN  (jetty-launcher-679-thread-3) [    ] o.a.s.c.CoreContainer Couldn't add files from C:\Users\JenkinsSlave\workspace\Lucene-Solr-5.x-Windows\solr\build\solr-core\test\J0\temp\solr.cloud.TestAuthenticationFramework_AB6E62193E7C069E-001\tempDir-002\node3\lib to classpath: C:\Users\JenkinsSlave\workspace\Lucene-Solr-5.x-Windows\solr\build\solr-core\test\J0\temp\solr.cloud.TestAuthenticationFramework_AB6E62193E7C069E-001\tempDir-002\node3\lib
   [junit4]   2> 874547 INFO  (jetty-launcher-679-thread-3) [    ] o.a.s.h.c.HttpShardHandlerFactory created with socketTimeout 

[...truncated too long message...]

eader(LeaderElector.java:158)
   [junit4]   2> 	at org.apache.solr.cloud.LeaderElector.access$200(LeaderElector.java:59)
   [junit4]   2> 	at org.apache.solr.cloud.LeaderElector$ElectionWatcher.process(LeaderElector.java:389)
   [junit4]   2> 	at org.apache.solr.common.cloud.SolrZkClient$3$1.run(SolrZkClient.java:264)
   [junit4]   2> 	at java.util.concurrent.Executors$RunnableAdapter.call(Executors.java:511)
   [junit4]   2> 	at java.util.concurrent.FutureTask.run(FutureTask.java:266)
   [junit4]   2> 	at org.apache.solr.common.util.ExecutorUtil$MDCAwareThreadPoolExecutor$1.run(ExecutorUtil.java:232)
   [junit4]   2> 	at java.util.concurrent.ThreadPoolExecutor.runWorker(ThreadPoolExecutor.java:1142)
   [junit4]   2> 	at java.util.concurrent.ThreadPoolExecutor$Worker.run(ThreadPoolExecutor.java:617)
   [junit4]   2> 	at java.lang.Thread.run(Thread.java:745)
   [junit4]   2> 2521686 WARN  (zkCallback-1624-thread-3-processing-n:127.0.0.1:55131_) [n:127.0.0.1:55131_    ] o.a.s.c.c.ZkStateReader ZooKeeper watch triggered, but Solr cannot talk to ZK: [KeeperErrorCode = Session expired for /live_nodes]
   [junit4]   2> 2521688 INFO  (TEST-ShardSplitTest.test-seed#[AB6E62193E7C069E]) [    ] o.e.j.s.ServerConnector Stopped ServerConnector@b12867{HTTP/1.1}{127.0.0.1:0}
   [junit4]   2> 2521688 INFO  (TEST-ShardSplitTest.test-seed#[AB6E62193E7C069E]) [    ] o.e.j.s.h.ContextHandler Stopped o.e.j.s.ServletContextHandler@1a675bb{/,null,UNAVAILABLE}
   [junit4]   2> 2521693 INFO  (TEST-ShardSplitTest.test-seed#[AB6E62193E7C069E]) [n:127.0.0.1:55131_ c:collection1 s:shard1 r:core_node4 x:collection1] o.a.s.c.ZkTestServer connecting to 127.0.0.1:55009 55009
   [junit4]   2> 2524119 INFO  (Thread-5185) [    ] o.a.s.c.ZkTestServer connecting to 127.0.0.1:55009 55009
   [junit4]   2> 2524121 WARN  (Thread-5185) [    ] o.a.s.c.ZkTestServer Watch limit violations: 
   [junit4]   2> Maximum concurrent create/delete watches above limit:
   [junit4]   2> 
   [junit4]   2> 	6	/solr/aliases.json
   [junit4]   2> 	5	/solr/security.json
   [junit4]   2> 	5	/solr/configs/conf1
   [junit4]   2> 
   [junit4]   2> Maximum concurrent data watches above limit:
   [junit4]   2> 
   [junit4]   2> 	6	/solr/clusterstate.json
   [junit4]   2> 
   [junit4]   2> Maximum concurrent children watches above limit:
   [junit4]   2> 
   [junit4]   2> 	6	/solr/live_nodes
   [junit4]   2> 	6	/solr/collections
   [junit4]   2> 	2	/solr/overseer/queue
   [junit4]   2> 	2	/solr/overseer/collection-queue-work
   [junit4]   2> 
   [junit4]   2> NOTE: reproduce with: ant test  -Dtestcase=ShardSplitTest -Dtests.method=test -Dtests.seed=AB6E62193E7C069E -Dtests.slow=true -Dtests.locale=is -Dtests.timezone=Africa/Algiers -Dtests.asserts=true -Dtests.file.encoding=Cp1252
   [junit4] FAILURE  383s J0 | ShardSplitTest.test <<<
   [junit4]    > Throwable #1: java.lang.AssertionError: There are still nodes recoverying - waited for 330 seconds
   [junit4]    > 	at __randomizedtesting.SeedInfo.seed([AB6E62193E7C069E:233A5DC390806B66]:0)
   [junit4]    > 	at org.apache.solr.cloud.AbstractDistribZkTestBase.waitForRecoveriesToFinish(AbstractDistribZkTestBase.java:175)
   [junit4]    > 	at org.apache.solr.cloud.AbstractDistribZkTestBase.waitForRecoveriesToFinish(AbstractDistribZkTestBase.java:136)
   [junit4]    > 	at org.apache.solr.cloud.AbstractDistribZkTestBase.waitForRecoveriesToFinish(AbstractDistribZkTestBase.java:131)
   [junit4]    > 	at org.apache.solr.cloud.AbstractFullDistribZkTestBase.waitForRecoveriesToFinish(AbstractFullDistribZkTestBase.java:825)
   [junit4]    > 	at org.apache.solr.cloud.ShardSplitTest.splitByUniqueKeyTest(ShardSplitTest.java:219)
   [junit4]    > 	at org.apache.solr.cloud.ShardSplitTest.test(ShardSplitTest.java:82)
   [junit4]    > 	at org.apache.solr.BaseDistributedSearchTestCase$ShardsRepeatRule$ShardsFixedStatement.callStatement(BaseDistributedSearchTestCase.java:965)
   [junit4]    > 	at org.apache.solr.BaseDistributedSearchTestCase$ShardsRepeatRule$ShardsStatement.evaluate(BaseDistributedSearchTestCase.java:940)
   [junit4]    > 	at java.lang.Thread.run(Thread.java:745)
   [junit4]   2> 2524125 INFO  (SUITE-ShardSplitTest-seed#[AB6E62193E7C069E]-worker) [n:127.0.0.1:55131_ c:collection1 s:shard1 r:core_node4 x:collection1] o.a.s.SolrTestCaseJ4 ###deleteCore
   [junit4]   2> NOTE: leaving temporary files on disk at: C:\Users\JenkinsSlave\workspace\Lucene-Solr-5.x-Windows\solr\build\solr-core\test\J0\temp\solr.cloud.ShardSplitTest_AB6E62193E7C069E-001
   [junit4]   2> NOTE: test params are: codec=Asserting(Lucene54): {_version_=PostingsFormat(name=Asserting), n_ti=PostingsFormat(name=LuceneFixedGap), id=PostingsFormat(name=LuceneVarGapFixedInterval)}, docValues:{}, sim=DefaultSimilarity, locale=is, timezone=Africa/Algiers
   [junit4]   2> NOTE: Windows 7 6.1 x86/Oracle Corporation 1.8.0_66 (32-bit)/cpus=3,threads=1,free=209823136,total=536870912
   [junit4]   2> NOTE: All tests run in this JVM: [BJQParserTest, CoreAdminRequestStatusTest, TestFieldResource, QueryElevationComponentTest, TestRemoveLastDynamicCopyField, DataDrivenBlockJoinTest, DistributedQueueTest, StatelessScriptUpdateProcessorFactoryTest, UUIDFieldTest, TestSolrQueryResponse, DistributedSpellCheckComponentTest, TestXIncludeConfig, SimplePostToolTest, TestRuleBasedAuthorizationPlugin, TestSurroundQueryParser, AnalysisAfterCoreReloadTest, ForceLeaderTest, TestDynamicFieldResource, TestReRankQParserPlugin, SuggesterFSTTest, HdfsBasicDistributedZk2Test, BlockJoinFacetRandomTest, TestCloudSchemaless, HdfsChaosMonkeyNothingIsSafeTest, DocValuesMultiTest, OverseerTest, SimpleFacetsTest, TestSchemaResource, TestManagedSchema, CollectionStateFormat2Test, TestSolr4Spatial2, TestPhraseSuggestions, TestDistribIDF, TestStressVersions, TestInitParams, TestManagedSynonymFilterFactory, DistribDocExpirationUpdateProcessorTest, ZkCLITest, TestFastLRUCache, TestAnalyzedSuggestions, UnloadDistributedZkTest, StandardRequestHandlerTest, TestReplicationHandler, SoftAutoCommitTest, ExitableDirectoryReaderTest, SSLMigrationTest, TestPartialUpdateDeduplication, TestJsonRequest, ChangedSchemaMergeTest, TestManagedSchemaFieldResource, TestUniqueKeyFieldResource, TestNamedUpdateProcessors, TestSolrXml, FastVectorHighlighterTest, InfoHandlerTest, SampleTest, TestClusterStateMutator, TestJmxIntegration, SpatialRPTFieldTypeTest, TestReplicationHandlerBackup, HardAutoCommitTest, TestTestInjection, TermsComponentTest, RequiredFieldsTest, DocValuesTest, LeaderElectionTest, TimeZoneUtilsTest, TestChildDocTransformer, UpdateParamsTest, TestFaceting, HdfsRestartWhileUpdatingTest, VersionInfoTest, SystemInfoHandlerTest, QueryResultKeyTest, TestAuthenticationFramework, TestFieldTypeResource, TestCodecSupport, OverriddenZkACLAndCredentialsProvidersTest, JSONWriterTest, TestConfigSetsAPI, TestElisionMultitermQuery, DistributedFacetPivotLongTailTest, HdfsThreadLeakTest, ConfigSetsAPITest, TestDistributedSearch, TestSimpleQParserPlugin, OverseerRolesTest, CurrencyFieldXmlFileTest, SOLR749Test, TestLMDirichletSimilarityFactory, SyncSliceTest, TestSweetSpotSimilarityFactory, TestCloudManagedSchema, DeleteShardTest, TestArbitraryIndexDir, SliceStateTest, SolrCoreTest, ScriptEngineTest, ClusterStateUpdateTest, TestHashQParserPlugin, AsyncCallRequestStatusResponseTest, RulesTest, TestSolrQueryParserDefaultOperatorResource, TestSchemaVersionResource, TestRawResponseWriter, SpatialFilterTest, DirectUpdateHandlerTest, TestIntervalFaceting, TestRequestForwarding, RemoteQueryErrorTest, TestUseDocValuesAsStored, TestJmxMonitoredMap, MBeansHandlerTest, TestUpdate, TestTrackingShardHandlerFactory, TestCollapseQParserPlugin, TestOrdValues, ClusterStateTest, TestRandomMergePolicy, TestStressReorder, XmlUpdateRequestHandlerTest, ReturnFieldsTest, TestRestoreCore, TestRestManager, TestGroupingSearch, TestCloudPivotFacet, SuggestComponentTest, TestLuceneMatchVersion, AlternateDirectoryTest, CursorPagingTest, TestConfig, DocumentAnalysisRequestHandlerTest, SparseHLLTest, HLLSerializationTest, OverseerTaskQueueTest, TestReloadDeadlock, SolrTestCaseJ4Test, TestCrossCoreJoin, TestCursorMarkWithoutUniqueKey, TestDistributedMissingSort, TestTolerantSearch, TestJettySolrRunner, ActionThrottleTest, AliasIntegrationTest, CloudExitableDirectoryReaderTest, CollectionsAPIAsyncDistributedZkTest, DeleteLastCustomShardedReplicaTest, DistributedVersionInfoTest, HttpPartitionTest, LeaderInitiatedRecoveryOnShardRestartTest, MultiThreadedOCPTest, RestartWhileUpdatingTest, RollingRestartTest, ShardSplitTest]
   [junit4] Completed [448/562 (7!)] on J0 in 383.06s, 1 test, 1 failure <<< FAILURES!

[...truncated 374 lines...]
BUILD FAILED
C:\Users\JenkinsSlave\workspace\Lucene-Solr-5.x-Windows\build.xml:794: The following error occurred while executing this line:
C:\Users\JenkinsSlave\workspace\Lucene-Solr-5.x-Windows\build.xml:738: The following error occurred while executing this line:
C:\Users\JenkinsSlave\workspace\Lucene-Solr-5.x-Windows\build.xml:59: The following error occurred while executing this line:
C:\Users\JenkinsSlave\workspace\Lucene-Solr-5.x-Windows\solr\build.xml:233: The following error occurred while executing this line:
C:\Users\JenkinsSlave\workspace\Lucene-Solr-5.x-Windows\solr\common-build.xml:526: The following error occurred while executing this line:
C:\Users\JenkinsSlave\workspace\Lucene-Solr-5.x-Windows\lucene\common-build.xml:1444: The following error occurred while executing this line:
C:\Users\JenkinsSlave\workspace\Lucene-Solr-5.x-Windows\lucene\common-build.xml:1000: There were test failures: 562 suites (7 ignored), 2231 tests, 1 error, 7 failures, 93 ignored (49 assumptions) [seed: AB6E62193E7C069E]

Total time: 72 minutes 38 seconds
Build step 'Invoke Ant' marked build as failure
Archiving artifacts
[WARNINGS] Skipping publisher since build result is FAILURE
Recording test results
Email was triggered for: Failure - Any
Sending email for trigger: Failure - Any



Mime
View raw message