lucene-dev mailing list archives

Site index · List index
Message view « Date » · « Thread »
Top « Date » · « Thread »
From Apache Jenkins Server <jenk...@builds.apache.org>
Subject [JENKINS] Lucene-Solr-NightlyTests-5.x - Build # 1075 - Still Failing
Date Fri, 15 Jan 2016 10:14:37 GMT
Build: https://builds.apache.org/job/Lucene-Solr-NightlyTests-5.x/1075/

1 tests failed.
FAILED:  org.apache.solr.cloud.BasicDistributedZkTest.test

Error Message:
Error from server at http://127.0.0.1:37382/collection1: Bad Request    request: http://127.0.0.1:41246/collection1/update?update.chain=distrib-dup-test-chain-explicit&update.distrib=TOLEADER&distrib.from=http%3A%2F%2F127.0.0.1%3A37382%2Fcollection1%2F&wt=javabin&version=2

Stack Trace:
org.apache.solr.client.solrj.impl.HttpSolrClient$RemoteSolrException: Error from server at http://127.0.0.1:37382/collection1: Bad Request



request: http://127.0.0.1:41246/collection1/update?update.chain=distrib-dup-test-chain-explicit&update.distrib=TOLEADER&distrib.from=http%3A%2F%2F127.0.0.1%3A37382%2Fcollection1%2F&wt=javabin&version=2
	at __randomizedtesting.SeedInfo.seed([1817E361ACAC99E4:9043DCBB0250F41C]:0)
	at org.apache.solr.client.solrj.impl.HttpSolrClient.executeMethod(HttpSolrClient.java:576)
	at org.apache.solr.client.solrj.impl.HttpSolrClient.request(HttpSolrClient.java:240)
	at org.apache.solr.client.solrj.impl.HttpSolrClient.request(HttpSolrClient.java:229)
	at org.apache.solr.client.solrj.SolrRequest.process(SolrRequest.java:150)
	at org.apache.solr.client.solrj.SolrRequest.process(SolrRequest.java:167)
	at org.apache.solr.BaseDistributedSearchTestCase.add(BaseDistributedSearchTestCase.java:512)
	at org.apache.solr.cloud.BasicDistributedZkTest.testUpdateProcessorsRunOnlyOnce(BasicDistributedZkTest.java:653)
	at org.apache.solr.cloud.BasicDistributedZkTest.test(BasicDistributedZkTest.java:364)
	at sun.reflect.NativeMethodAccessorImpl.invoke0(Native Method)
	at sun.reflect.NativeMethodAccessorImpl.invoke(NativeMethodAccessorImpl.java:57)
	at sun.reflect.DelegatingMethodAccessorImpl.invoke(DelegatingMethodAccessorImpl.java:43)
	at java.lang.reflect.Method.invoke(Method.java:606)
	at com.carrotsearch.randomizedtesting.RandomizedRunner.invoke(RandomizedRunner.java:1764)
	at com.carrotsearch.randomizedtesting.RandomizedRunner$8.evaluate(RandomizedRunner.java:871)
	at com.carrotsearch.randomizedtesting.RandomizedRunner$9.evaluate(RandomizedRunner.java:907)
	at com.carrotsearch.randomizedtesting.RandomizedRunner$10.evaluate(RandomizedRunner.java:921)
	at org.apache.solr.BaseDistributedSearchTestCase$ShardsRepeatRule$ShardsFixedStatement.callStatement(BaseDistributedSearchTestCase.java:965)
	at org.apache.solr.BaseDistributedSearchTestCase$ShardsRepeatRule$ShardsStatement.evaluate(BaseDistributedSearchTestCase.java:940)
	at com.carrotsearch.randomizedtesting.rules.SystemPropertiesRestoreRule$1.evaluate(SystemPropertiesRestoreRule.java:57)
	at org.apache.lucene.util.TestRuleSetupTeardownChained$1.evaluate(TestRuleSetupTeardownChained.java:50)
	at org.apache.lucene.util.AbstractBeforeAfterRule$1.evaluate(AbstractBeforeAfterRule.java:46)
	at org.apache.lucene.util.TestRuleThreadAndTestName$1.evaluate(TestRuleThreadAndTestName.java:49)
	at org.apache.lucene.util.TestRuleIgnoreAfterMaxFailures$1.evaluate(TestRuleIgnoreAfterMaxFailures.java:65)
	at org.apache.lucene.util.TestRuleMarkFailure$1.evaluate(TestRuleMarkFailure.java:48)
	at com.carrotsearch.randomizedtesting.rules.StatementAdapter.evaluate(StatementAdapter.java:36)
	at com.carrotsearch.randomizedtesting.ThreadLeakControl$StatementRunner.run(ThreadLeakControl.java:367)
	at com.carrotsearch.randomizedtesting.ThreadLeakControl.forkTimeoutingTask(ThreadLeakControl.java:809)
	at com.carrotsearch.randomizedtesting.ThreadLeakControl$3.evaluate(ThreadLeakControl.java:460)
	at com.carrotsearch.randomizedtesting.RandomizedRunner.runSingleTest(RandomizedRunner.java:880)
	at com.carrotsearch.randomizedtesting.RandomizedRunner$5.evaluate(RandomizedRunner.java:781)
	at com.carrotsearch.randomizedtesting.RandomizedRunner$6.evaluate(RandomizedRunner.java:816)
	at com.carrotsearch.randomizedtesting.RandomizedRunner$7.evaluate(RandomizedRunner.java:827)
	at com.carrotsearch.randomizedtesting.rules.StatementAdapter.evaluate(StatementAdapter.java:36)
	at com.carrotsearch.randomizedtesting.rules.SystemPropertiesRestoreRule$1.evaluate(SystemPropertiesRestoreRule.java:57)
	at org.apache.lucene.util.AbstractBeforeAfterRule$1.evaluate(AbstractBeforeAfterRule.java:46)
	at com.carrotsearch.randomizedtesting.rules.StatementAdapter.evaluate(StatementAdapter.java:36)
	at org.apache.lucene.util.TestRuleStoreClassName$1.evaluate(TestRuleStoreClassName.java:42)
	at com.carrotsearch.randomizedtesting.rules.NoShadowingOrOverridesOnMethodsRule$1.evaluate(NoShadowingOrOverridesOnMethodsRule.java:40)
	at com.carrotsearch.randomizedtesting.rules.NoShadowingOrOverridesOnMethodsRule$1.evaluate(NoShadowingOrOverridesOnMethodsRule.java:40)
	at com.carrotsearch.randomizedtesting.rules.StatementAdapter.evaluate(StatementAdapter.java:36)
	at com.carrotsearch.randomizedtesting.rules.StatementAdapter.evaluate(StatementAdapter.java:36)
	at com.carrotsearch.randomizedtesting.rules.StatementAdapter.evaluate(StatementAdapter.java:36)
	at org.apache.lucene.util.TestRuleAssertionsRequired$1.evaluate(TestRuleAssertionsRequired.java:54)
	at org.apache.lucene.util.TestRuleMarkFailure$1.evaluate(TestRuleMarkFailure.java:48)
	at org.apache.lucene.util.TestRuleIgnoreAfterMaxFailures$1.evaluate(TestRuleIgnoreAfterMaxFailures.java:65)
	at org.apache.lucene.util.TestRuleIgnoreTestSuites$1.evaluate(TestRuleIgnoreTestSuites.java:55)
	at com.carrotsearch.randomizedtesting.rules.StatementAdapter.evaluate(StatementAdapter.java:36)
	at com.carrotsearch.randomizedtesting.ThreadLeakControl$StatementRunner.run(ThreadLeakControl.java:367)
	at java.lang.Thread.run(Thread.java:745)




Build Log:
[...truncated 11068 lines...]
   [junit4] Suite: org.apache.solr.cloud.BasicDistributedZkTest
   [junit4]   2> Creating dataDir: /x1/jenkins/jenkins-slave/workspace/Lucene-Solr-NightlyTests-5.x/solr/build/solr-core/test/J0/temp/solr.cloud.BasicDistributedZkTest_1817E361ACAC99E4-001/init-core-data-001
   [junit4]   2> 1884484 INFO  (SUITE-BasicDistributedZkTest-seed#[1817E361ACAC99E4]-worker) [    ] o.a.s.BaseDistributedSearchTestCase Setting hostContext system property: /
   [junit4]   2> 1884489 INFO  (TEST-BasicDistributedZkTest.test-seed#[1817E361ACAC99E4]) [    ] o.a.s.c.ZkTestServer STARTING ZK TEST SERVER
   [junit4]   2> 1884489 INFO  (Thread-3374) [    ] o.a.s.c.ZkTestServer client port:0.0.0.0/0.0.0.0:0
   [junit4]   2> 1884489 INFO  (Thread-3374) [    ] o.a.s.c.ZkTestServer Starting server
   [junit4]   2> 1884589 INFO  (TEST-BasicDistributedZkTest.test-seed#[1817E361ACAC99E4]) [    ] o.a.s.c.ZkTestServer start zk server on port:39969
   [junit4]   2> 1884590 INFO  (TEST-BasicDistributedZkTest.test-seed#[1817E361ACAC99E4]) [    ] o.a.s.c.c.SolrZkClient Using default ZkCredentialsProvider
   [junit4]   2> 1884590 INFO  (TEST-BasicDistributedZkTest.test-seed#[1817E361ACAC99E4]) [    ] o.a.s.c.c.ConnectionManager Waiting for client to connect to ZooKeeper
   [junit4]   2> 1884594 INFO  (zkCallback-1754-thread-1) [    ] o.a.s.c.c.ConnectionManager Watcher org.apache.solr.common.cloud.ConnectionManager@55568b2 name:ZooKeeperConnection Watcher:127.0.0.1:39969 got event WatchedEvent state:SyncConnected type:None path:null path:null type:None
   [junit4]   2> 1884594 INFO  (TEST-BasicDistributedZkTest.test-seed#[1817E361ACAC99E4]) [    ] o.a.s.c.c.ConnectionManager Client is connected to ZooKeeper
   [junit4]   2> 1884595 INFO  (TEST-BasicDistributedZkTest.test-seed#[1817E361ACAC99E4]) [    ] o.a.s.c.c.SolrZkClient Using default ZkACLProvider
   [junit4]   2> 1884595 INFO  (TEST-BasicDistributedZkTest.test-seed#[1817E361ACAC99E4]) [    ] o.a.s.c.c.SolrZkClient makePath: /solr
   [junit4]   2> 1884598 INFO  (TEST-BasicDistributedZkTest.test-seed#[1817E361ACAC99E4]) [    ] o.a.s.c.c.SolrZkClient Using default ZkCredentialsProvider
   [junit4]   2> 1884599 INFO  (TEST-BasicDistributedZkTest.test-seed#[1817E361ACAC99E4]) [    ] o.a.s.c.c.ConnectionManager Waiting for client to connect to ZooKeeper
   [junit4]   2> 1884603 INFO  (zkCallback-1755-thread-1) [    ] o.a.s.c.c.ConnectionManager Watcher org.apache.solr.common.cloud.ConnectionManager@438b8942 name:ZooKeeperConnection Watcher:127.0.0.1:39969/solr got event WatchedEvent state:SyncConnected type:None path:null path:null type:None
   [junit4]   2> 1884603 INFO  (TEST-BasicDistributedZkTest.test-seed#[1817E361ACAC99E4]) [    ] o.a.s.c.c.ConnectionManager Client is connected to ZooKeeper
   [junit4]   2> 1884604 INFO  (TEST-BasicDistributedZkTest.test-seed#[1817E361ACAC99E4]) [    ] o.a.s.c.c.SolrZkClient Using default ZkACLProvider
   [junit4]   2> 1884604 INFO  (TEST-BasicDistributedZkTest.test-seed#[1817E361ACAC99E4]) [    ] o.a.s.c.c.SolrZkClient makePath: /collections/collection1
   [junit4]   2> 1884607 INFO  (TEST-BasicDistributedZkTest.test-seed#[1817E361ACAC99E4]) [    ] o.a.s.c.c.SolrZkClient makePath: /collections/collection1/shards
   [junit4]   2> 1884609 INFO  (TEST-BasicDistributedZkTest.test-seed#[1817E361ACAC99E4]) [    ] o.a.s.c.c.SolrZkClient makePath: /collections/control_collection
   [junit4]   2> 1884611 INFO  (TEST-BasicDistributedZkTest.test-seed#[1817E361ACAC99E4]) [    ] o.a.s.c.c.SolrZkClient makePath: /collections/control_collection/shards
   [junit4]   2> 1884612 INFO  (TEST-BasicDistributedZkTest.test-seed#[1817E361ACAC99E4]) [    ] o.a.s.c.AbstractZkTestCase put /x1/jenkins/jenkins-slave/workspace/Lucene-Solr-NightlyTests-5.x/solr/core/src/test-files/solr/collection1/conf/solrconfig-tlog.xml to /configs/conf1/solrconfig.xml
   [junit4]   2> 1884612 INFO  (TEST-BasicDistributedZkTest.test-seed#[1817E361ACAC99E4]) [    ] o.a.s.c.c.SolrZkClient makePath: /configs/conf1/solrconfig.xml
   [junit4]   2> 1884616 INFO  (TEST-BasicDistributedZkTest.test-seed#[1817E361ACAC99E4]) [    ] o.a.s.c.AbstractZkTestCase put /x1/jenkins/jenkins-slave/workspace/Lucene-Solr-NightlyTests-5.x/solr/core/src/test-files/solr/collection1/conf/schema.xml to /configs/conf1/schema.xml
   [junit4]   2> 1884616 INFO  (TEST-BasicDistributedZkTest.test-seed#[1817E361ACAC99E4]) [    ] o.a.s.c.c.SolrZkClient makePath: /configs/conf1/schema.xml
   [junit4]   2> 1884618 INFO  (TEST-BasicDistributedZkTest.test-seed#[1817E361ACAC99E4]) [    ] o.a.s.c.AbstractZkTestCase put /x1/jenkins/jenkins-slave/workspace/Lucene-Solr-NightlyTests-5.x/solr/core/src/test-files/solr/collection1/conf/solrconfig.snippet.randomindexconfig.xml to /configs/conf1/solrconfig.snippet.randomindexconfig.xml
   [junit4]   2> 1884618 INFO  (TEST-BasicDistributedZkTest.test-seed#[1817E361ACAC99E4]) [    ] o.a.s.c.c.SolrZkClient makePath: /configs/conf1/solrconfig.snippet.randomindexconfig.xml
   [junit4]   2> 1884619 INFO  (TEST-BasicDistributedZkTest.test-seed#[1817E361ACAC99E4]) [    ] o.a.s.c.AbstractZkTestCase put /x1/jenkins/jenkins-slave/workspace/Lucene-Solr-NightlyTests-5.x/solr/core/src/test-files/solr/collection1/conf/stopwords.txt to /configs/conf1/stopwords.txt
   [junit4]   2> 1884620 INFO  (TEST-BasicDistributedZkTest.test-seed#[1817E361ACAC99E4]) [    ] o.a.s.c.c.SolrZkClient makePath: /configs/conf1/stopwords.txt
   [junit4]   2> 1884621 INFO  (TEST-BasicDistributedZkTest.test-seed#[1817E361ACAC99E4]) [    ] o.a.s.c.AbstractZkTestCase put /x1/jenkins/jenkins-slave/workspace/Lucene-Solr-NightlyTests-5.x/solr/core/src/test-files/solr/collection1/conf/protwords.txt to /configs/conf1/protwords.txt
   [junit4]   2> 1884621 INFO  (TEST-BasicDistributedZkTest.test-seed#[1817E361ACAC99E4]) [    ] o.a.s.c.c.SolrZkClient makePath: /configs/conf1/protwords.txt
   [junit4]   2> 1884623 INFO  (TEST-BasicDistributedZkTest.test-seed#[1817E361ACAC99E4]) [    ] o.a.s.c.AbstractZkTestCase put /x1/jenkins/jenkins-slave/workspace/Lucene-Solr-NightlyTests-5.x/solr/core/src/test-files/solr/collection1/conf/currency.xml to /configs/conf1/currency.xml
   [junit4]   2> 1884623 INFO  (TEST-BasicDistributedZkTest.test-seed#[1817E361ACAC99E4]) [    ] o.a.s.c.c.SolrZkClient makePath: /configs/conf1/currency.xml
   [junit4]   2> 1884624 INFO  (TEST-BasicDistributedZkTest.test-seed#[1817E361ACAC99E4]) [    ] o.a.s.c.AbstractZkTestCase put /x1/jenkins/jenkins-slave/workspace/Lucene-Solr-NightlyTests-5.x/solr/core/src/test-files/solr/collection1/conf/enumsConfig.xml to /configs/conf1/enumsConfig.xml
   [junit4]   2> 1884624 INFO  (TEST-BasicDistributedZkTest.test-seed#[1817E361ACAC99E4]) [    ] o.a.s.c.c.SolrZkClient makePath: /configs/conf1/enumsConfig.xml
   [junit4]   2> 1884626 INFO  (TEST-BasicDistributedZkTest.test-seed#[1817E361ACAC99E4]) [    ] o.a.s.c.AbstractZkTestCase put /x1/jenkins/jenkins-slave/workspace/Lucene-Solr-NightlyTests-5.x/solr/core/src/test-files/solr/collection1/conf/open-exchange-rates.json to /configs/conf1/open-exchange-rates.json
   [junit4]   2> 1884626 INFO  (TEST-BasicDistributedZkTest.test-seed#[1817E361ACAC99E4]) [    ] o.a.s.c.c.SolrZkClient makePath: /configs/conf1/open-exchange-rates.json
   [junit4]   2> 1884627 INFO  (TEST-BasicDistributedZkTest.test-seed#[1817E361ACAC99E4]) [    ] o.a.s.c.AbstractZkTestCase put /x1/jenkins/jenkins-slave/workspace/Lucene-Solr-NightlyTests-5.x/solr/core/src/test-files/solr/collection1/conf/mapping-ISOLatin1Accent.txt to /configs/conf1/mapping-ISOLatin1Accent.txt
   [junit4]   2> 1884627 INFO  (TEST-BasicDistributedZkTest.test-seed#[1817E361ACAC99E4]) [    ] o.a.s.c.c.SolrZkClient makePath: /configs/conf1/mapping-ISOLatin1Accent.txt
   [junit4]   2> 1884629 INFO  (TEST-BasicDistributedZkTest.test-seed#[1817E361ACAC99E4]) [    ] o.a.s.c.AbstractZkTestCase put /x1/jenkins/jenkins-slave/workspace/Lucene-Solr-NightlyTests-5.x/solr/core/src/test-files/solr/collection1/conf/old_synonyms.txt to /configs/conf1/old_synonyms.txt
   [junit4]   2> 1884629 INFO  (TEST-BasicDistributedZkTest.test-seed#[1817E361ACAC99E4]) [    ] o.a.s.c.c.SolrZkClient makePath: /configs/conf1/old_synonyms.txt
   [junit4]   2> 1884630 INFO  (TEST-BasicDistributedZkTest.test-seed#[1817E361ACAC99E4]) [    ] o.a.s.c.AbstractZkTestCase put /x1/jenkins/jenkins-slave/workspace/Lucene-Solr-NightlyTests-5.x/solr/core/src/test-files/solr/collection1/conf/synonyms.txt to /configs/conf1/synonyms.txt
   [junit4]   2> 1884631 INFO  (TEST-BasicDistributedZkTest.test-seed#[1817E361ACAC99E4]) [    ] o.a.s.c.c.SolrZkClient makePath: /configs/conf1/synonyms.txt
   [junit4]   2> 1885134 INFO  (TEST-BasicDistributedZkTest.test-seed#[1817E361ACAC99E4]) [    ] o.a.s.SolrTestCaseJ4 Writing core.properties file to /x1/jenkins/jenkins-slave/workspace/Lucene-Solr-NightlyTests-5.x/solr/build/solr-core/test/J0/temp/solr.cloud.BasicDistributedZkTest_1817E361ACAC99E4-001/control-001/cores/collection1
   [junit4]   2> 1885136 INFO  (TEST-BasicDistributedZkTest.test-seed#[1817E361ACAC99E4]) [    ] o.e.j.s.Server jetty-9.2.13.v20150730
   [junit4]   2> 1885139 INFO  (TEST-BasicDistributedZkTest.test-seed#[1817E361ACAC99E4]) [    ] o.e.j.s.h.ContextHandler Started o.e.j.s.ServletContextHandler@4636109d{/,null,AVAILABLE}
   [junit4]   2> 1885139 INFO  (TEST-BasicDistributedZkTest.test-seed#[1817E361ACAC99E4]) [    ] o.e.j.s.ServerConnector Started ServerConnector@15237a99{HTTP/1.1}{127.0.0.1:60904}
   [junit4]   2> 1885139 INFO  (TEST-BasicDistributedZkTest.test-seed#[1817E361ACAC99E4]) [    ] o.e.j.s.Server Started @1888870ms
   [junit4]   2> 1885139 INFO  (TEST-BasicDistributedZkTest.test-seed#[1817E361ACAC99E4]) [    ] o.a.s.c.s.e.JettySolrRunner Jetty properties: {hostPort=60904, coreRootDirectory=/x1/jenkins/jenkins-slave/workspace/Lucene-Solr-NightlyTests-5.x/solr/build/solr-core/test/J0/temp/solr.cloud.BasicDistributedZkTest_1817E361ACAC99E4-001/control-001/cores, solr.data.dir=/x1/jenkins/jenkins-slave/workspace/Lucene-Solr-NightlyTests-5.x/solr/build/solr-core/test/J0/temp/solr.cloud.BasicDistributedZkTest_1817E361ACAC99E4-001/tempDir-001/control/data, hostContext=/}
   [junit4]   2> 1885140 INFO  (TEST-BasicDistributedZkTest.test-seed#[1817E361ACAC99E4]) [    ] o.a.s.s.SolrDispatchFilter SolrDispatchFilter.init(): sun.misc.Launcher$AppClassLoader@7b3cb2c6
   [junit4]   2> 1885140 INFO  (TEST-BasicDistributedZkTest.test-seed#[1817E361ACAC99E4]) [    ] o.a.s.c.SolrResourceLoader new SolrResourceLoader for directory: '/x1/jenkins/jenkins-slave/workspace/Lucene-Solr-NightlyTests-5.x/solr/build/solr-core/test/J0/temp/solr.cloud.BasicDistributedZkTest_1817E361ACAC99E4-001/control-001'
   [junit4]   2> 1885140 INFO  (TEST-BasicDistributedZkTest.test-seed#[1817E361ACAC99E4]) [    ] o.a.s.c.SolrResourceLoader JNDI not configured for solr (NoInitialContextEx)
   [junit4]   2> 1885140 INFO  (TEST-BasicDistributedZkTest.test-seed#[1817E361ACAC99E4]) [    ] o.a.s.c.SolrResourceLoader solr home defaulted to 'solr/' (could not find system property or JNDI)
   [junit4]   2> 1885140 INFO  (TEST-BasicDistributedZkTest.test-seed#[1817E361ACAC99E4]) [    ] o.a.s.c.c.SolrZkClient Using default ZkCredentialsProvider
   [junit4]   2> 1885141 INFO  (TEST-BasicDistributedZkTest.test-seed#[1817E361ACAC99E4]) [    ] o.a.s.c.c.ConnectionManager Waiting for client to connect to ZooKeeper
   [junit4]   2> 1885144 INFO  (zkCallback-1756-thread-1) [    ] o.a.s.c.c.ConnectionManager Watcher org.apache.solr.common.cloud.ConnectionManager@207a3426 name:ZooKeeperConnection Watcher:127.0.0.1:39969/solr got event WatchedEvent state:SyncConnected type:None path:null path:null type:None
   [junit4]   2> 1885144 INFO  (TEST-BasicDistributedZkTest.test-seed#[1817E361ACAC99E4]) [    ] o.a.s.c.c.ConnectionManager Client is connected to ZooKeeper
   [junit4]   2> 1885144 INFO  (TEST-BasicDistributedZkTest.test-seed#[1817E361ACAC99E4]) [    ] o.a.s.c.c.SolrZkClient Using default ZkACLProvider
   [junit4]   2> 1885146 INFO  (TEST-BasicDistributedZkTest.test-seed#[1817E361ACAC99E4]) [    ] o.a.s.s.SolrDispatchFilter Loading solr.xml from SolrHome (not found in ZooKeeper)
   [junit4]   2> 1885146 INFO  (TEST-BasicDistributedZkTest.test-seed#[1817E361ACAC99E4]) [    ] o.a.s.c.SolrXmlConfig Loading container configuration from /x1/jenkins/jenkins-slave/workspace/Lucene-Solr-NightlyTests-5.x/solr/build/solr-core/test/J0/temp/solr.cloud.BasicDistributedZkTest_1817E361ACAC99E4-001/control-001/solr.xml
   [junit4]   2> 1885162 INFO  (TEST-BasicDistributedZkTest.test-seed#[1817E361ACAC99E4]) [    ] o.a.s.c.CorePropertiesLocator Config-defined core root directory: /x1/jenkins/jenkins-slave/workspace/Lucene-Solr-NightlyTests-5.x/solr/build/solr-core/test/J0/temp/solr.cloud.BasicDistributedZkTest_1817E361ACAC99E4-001/control-001/cores
   [junit4]   2> 1885162 INFO  (TEST-BasicDistributedZkTest.test-seed#[1817E361ACAC99E4]) [    ] o.a.s.c.CoreContainer New CoreContainer 202555699
   [junit4]   2> 1885162 INFO  (TEST-BasicDistributedZkTest.test-seed#[1817E361ACAC99E4]) [    ] o.a.s.c.CoreContainer Loading cores into CoreContainer [instanceDir=/x1/jenkins/jenkins-slave/workspace/Lucene-Solr-NightlyTests-5.x/solr/build/solr-core/test/J0/temp/solr.cloud.BasicDistributedZkTest_1817E361ACAC99E4-001/control-001]
   [junit4]   2> 1885162 WARN  (TEST-BasicDistributedZkTest.test-seed#[1817E361ACAC99E4]) [    ] o.a.s.c.CoreContainer Couldn't add files from /x1/jenkins/jenkins-slave/workspace/Lucene-Solr-NightlyTests-5.x/solr/build/solr-core/test/J0/temp/solr.cloud.BasicDistributedZkTest_1817E361ACAC99E4-001/control-001/lib to classpath: /x1/jenkins/jenkins-slave/workspace/Lucene-Solr-NightlyTests-5.x/solr/build/solr-core/test/J0/temp/solr.cloud.BasicDistributedZkTest_1817E361ACAC99E4-001/control-001/lib
   [junit4]   2> 1885162 INFO  (TEST-BasicDistributedZkTest.test-seed#[1817E361ACAC99E4]) [    ] o.a.s.h.c.HttpShardHandlerFactory created with socketTimeout : 90000,urlScheme : ,connTimeout : 15000,maxConnectionsPerHost : 20,maxConnections : 10000,corePoolSize : 0,maximumPoolSize : 2147483647,maxThreadIdleTime : 5,sizeOfQueue : -1,fairnessPolicy : false,useRetries : false,
   [junit4]   2> 1885163 INFO  (TEST-BasicDistributedZkTest.test-seed#[1817E361ACAC99E4]) [    ] o.a.s.u.UpdateShardHandler Creating UpdateShardHandler HTTP client with params: socketTimeout=340000&connTimeout=45000&retry=true
   [junit4]   2> 1885164 INFO  (TEST-BasicDistributedZkTest.test-seed#[1817E361ACAC99E4]) [    ] o.a.s.l.LogWatcher SLF4J impl is org.slf4j.impl.Log4jLoggerFactory
   [junit4]   2> 1885164 INFO  (TEST-BasicDistributedZkTest.test-seed#[1817E361ACAC99E4]) [    ] o.a.s.l.LogWatcher Registering Log Listener [Log4j (org.slf4j.impl.Log4jLoggerFactory)]
   [junit4]   2> 1885164 INFO  (TEST-BasicDistributedZkTest.test-seed#[1817E361ACAC99E4]) [    ] o.a.s.c.ZkContainer Zookeeper client=127.0.0.1:39969/solr
   [junit4]   2> 1885164 INFO  (TEST-BasicDistributedZkTest.test-seed#[1817E361ACAC99E4]) [    ] o.a.s.c.ZkController zkHost includes chroot
   [junit4]   2> 1885164 INFO  (TEST-BasicDistributedZkTest.test-seed#[1817E361ACAC99E4]) [    ] o.a.s.c.c.SolrZkClient Using default ZkCredentialsProvider
   [junit4]   2> 1885165 INFO  (TEST-BasicDistributedZkTest.test-seed#[1817E361ACAC99E4]) [    ] o.a.s.c.c.ConnectionManager Waiting for client to connect to ZooKeeper
   [junit4]   2> 1885167 INFO  (zkCallback-1758-thread-1) [    ] o.a.s.c.c.ConnectionManager Watcher org.apache.solr.common.cloud.ConnectionManager@75f1b685 name:ZooKeeperConnection Watcher:127.0.0.1:39969 got event WatchedEvent state:SyncConnected type:None path:null path:null type:None
   [junit4]   2> 1885167 INFO  (TEST-BasicDistributedZkTest.test-seed#[1817E361ACAC99E4]) [    ] o.a.s.c.c.ConnectionManager Client is connected to ZooKeeper
   [junit4]   2> 1885167 INFO  (TEST-BasicDistributedZkTest.test-seed#[1817E361ACAC99E4]) [    ] o.a.s.c.c.SolrZkClient Using default ZkACLProvider
   [junit4]   2> 1885169 INFO  (TEST-BasicDistributedZkTest.test-seed#[1817E361ACAC99E4]) [n:127.0.0.1:60904_    ] o.a.s.c.c.ConnectionManager Waiting for client to connect to ZooKeeper
   [junit4]   2> 1885171 INFO  (zkCallback-1759-thread-1-processing-n:127.0.0.1:60904_) [n:127.0.0.1:60904_    ] o.a.s.c.c.ConnectionManager Watcher org.apache.solr.common.cloud.ConnectionManager@41581898 name:ZooKeeperConnection Watcher:127.0.0.1:39969/solr got event WatchedEvent state:SyncConnected type:None path:null path:null type:None
   [junit4]   2> 1885172 INFO  (TEST-BasicDistributedZkTest.test-seed#[1817E361ACAC99E4]) [n:127.0.0.1:60904_    ] o.a.s.c.c.ConnectionManager Client is connected to ZooKeeper
   [junit4]   2> 1885174 INFO  (TEST-BasicDistributedZkTest.test-seed#[1817E361ACAC99E4]) [n:127.0.0.1:60904_    ] o.a.s.c.c.SolrZkClient makePath: /overseer/queue
   [junit4]   2> 1885177 INFO  (TEST-BasicDistributedZkTest.test-seed#[1817E361ACAC99E4]) [n:127.0.0.1:60904_    ] o.a.s.c.c.SolrZkClient makePath: /overseer/collection-queue-work
   [junit4]   2> 1885180 INFO  (TEST-BasicDistributedZkTest.test-seed#[1817E361ACAC99E4]) [n:127.0.0.1:60904_    ] o.a.s.c.c.SolrZkClient makePath: /overseer/collection-map-running
   [junit4]   2> 1885183 INFO  (TEST-BasicDistributedZkTest.test-seed#[1817E361ACAC99E4]) [n:127.0.0.1:60904_    ] o.a.s.c.c.SolrZkClient makePath: /overseer/collection-map-completed
   [junit4]   2> 1885187 INFO  (TEST-BasicDistributedZkTest.test-seed#[1817E361ACAC99E4]) [n:127.0.0.1:60904_    ] o.a.s.c.c.SolrZkClient makePath: /overseer/collection-map-failure
   [junit4]   2> 1885190 INFO  (TEST-BasicDistributedZkTest.test-seed#[1817E361ACAC99E4]) [n:127.0.0.1:60904_    ] o.a.s.c.c.SolrZkClient makePath: /live_nodes
   [junit4]   2> 1885192 INFO  (TEST-BasicDistributedZkTest.test-seed#[1817E361ACAC99E4]) [n:127.0.0.1:60904_    ] o.a.s.c.c.SolrZkClient makePath: /aliases.json
   [junit4]   2> 1885194 INFO  (TEST-BasicDistributedZkTest.test-seed#[1817E361ACAC99E4]) [n:127.0.0.1:60904_    ] o.a.s.c.c.SolrZkClient makePath: /clusterstate.json
   [junit4]   2> 1885195 INFO  (TEST-BasicDistributedZkTest.test-seed#[1817E361ACAC99E4]) [n:127.0.0.1:60904_    ] o.a.s.c.c.SolrZkClient makePath: /security.json
   [junit4]   2> 1885196 INFO  (TEST-BasicDistributedZkTest.test-seed#[1817E361ACAC99E4]) [n:127.0.0.1:60904_    ] o.a.s.c.ZkController Register node as live in ZooKeeper:/live_nodes/127.0.0.1:60904_
   [junit4]   2> 1885197 INFO  (TEST-BasicDistributedZkTest.test-seed#[1817E361ACAC99E4]) [n:127.0.0.1:60904_    ] o.a.s.c.c.SolrZkClient makePath: /live_nodes/127.0.0.1:60904_
   [junit4]   2> 1885199 INFO  (TEST-BasicDistributedZkTest.test-seed#[1817E361ACAC99E4]) [n:127.0.0.1:60904_    ] o.a.s.c.c.SolrZkClient makePath: /overseer_elect
   [junit4]   2> 1885200 INFO  (TEST-BasicDistributedZkTest.test-seed#[1817E361ACAC99E4]) [n:127.0.0.1:60904_    ] o.a.s.c.c.SolrZkClient makePath: /overseer_elect/election
   [junit4]   2> 1885201 INFO  (TEST-BasicDistributedZkTest.test-seed#[1817E361ACAC99E4]) [n:127.0.0.1:60904_    ] o.a.s.c.Overseer Overseer (id=null) closing
   [junit4]   2> 1885202 INFO  (TEST-BasicDistributedZkTest.test-seed#[1817E361ACAC99E4]) [n:127.0.0.1:60904_    ] o.a.s.c.LeaderElector Joined leadership election with path: /overseer_elect/election/95213991123484676-127.0.0.1:60904_-n_0000000000
   [junit4]   2> 1885202 INFO  (TEST-BasicDistributedZkTest.test-seed#[1817E361ACAC99E4]) [n:127.0.0.1:60904_    ] o.a.s.c.OverseerElectionContext I am going to be the leader 127.0.0.1:60904_
   [junit4]   2> 1885202 INFO  (TEST-BasicDistributedZkTest.test-seed#[1817E361ACAC99E4]) [n:127.0.0.1:60904_    ] o.a.s.c.c.SolrZkClient makePath: /overseer_elect/leader
   [junit4]   2> 1885204 INFO  (TEST-BasicDistributedZkTest.test-seed#[1817E361ACAC99E4]) [n:127.0.0.1:60904_    ] o.a.s.c.Overseer Overseer (id=95213991123484676-127.0.0.1:60904_-n_0000000000) starting
   [junit4]   2> 1885206 INFO  (TEST-BasicDistributedZkTest.test-seed#[1817E361ACAC99E4]) [n:127.0.0.1:60904_    ] o.a.s.c.c.SolrZkClient makePath: /overseer/queue-work
   [junit4]   2> 1885213 INFO  (TEST-BasicDistributedZkTest.test-seed#[1817E361ACAC99E4]) [n:127.0.0.1:60904_    ] o.a.s.c.OverseerAutoReplicaFailoverThread Starting OverseerAutoReplicaFailoverThread autoReplicaFailoverWorkLoopDelay=10000 autoReplicaFailoverWaitAfterExpiration=30000 autoReplicaFailoverBadNodeExpiration=60000
   [junit4]   2> 1885214 INFO  (OverseerCollectionConfigSetProcessor-95213991123484676-127.0.0.1:60904_-n_0000000000) [n:127.0.0.1:60904_    ] o.a.s.c.OverseerTaskProcessor Process current queue of overseer operations
   [junit4]   2> 1885214 INFO  (OverseerStateUpdate-95213991123484676-127.0.0.1:60904_-n_0000000000) [n:127.0.0.1:60904_    ] o.a.s.c.Overseer Starting to work on the main queue
   [junit4]   2> 1885214 INFO  (TEST-BasicDistributedZkTest.test-seed#[1817E361ACAC99E4]) [n:127.0.0.1:60904_    ] o.a.s.c.c.ZkStateReader Updating cluster state from ZooKeeper... 
   [junit4]   2> 1885241 INFO  (TEST-BasicDistributedZkTest.test-seed#[1817E361ACAC99E4]) [n:127.0.0.1:60904_    ] o.a.s.c.CoreContainer Security conf doesn't exist. Skipping setup for authorization module.
   [junit4]   2> 1885241 INFO  (TEST-BasicDistributedZkTest.test-seed#[1817E361ACAC99E4]) [n:127.0.0.1:60904_    ] o.a.s.c.CoreContainer No authentication plugin used.
   [junit4]   2> 1885242 INFO  (TEST-BasicDistributedZkTest.test-seed#[1817E361ACAC99E4]) [n:127.0.0.1:60904_    ] o.a.s.c.CorePropertiesLocator Looking for core definitions underneath /x1/jenkins/jenkins-slave/workspace/Lucene-Solr-NightlyTests-5.x/solr/build/solr-core/test/J0/temp/solr.cloud.BasicDistributedZkTest_1817E361ACAC99E4-001/control-001/cores
   [junit4]   2> 1885243 INFO  (TEST-BasicDistributedZkTest.test-seed#[1817E361ACAC99E4]) [n:127.0.0.1:60904_    ] o.a.s.c.CoreDescriptor Created CoreDescriptor: {coreNodeName=, shard=, collection=control_collection, loadOnStartup=true, dataDir=data/, config=solrconfig.xml, configSetProperties=configsetprops.json, schema=schema.xml, transient=false, name=collection1}
   [junit4]   2> 1885243 INFO  (TEST-BasicDistributedZkTest.test-seed#[1817E361ACAC99E4]) [n:127.0.0.1:60904_    ] o.a.s.c.CorePropertiesLocator Found core collection1 in /x1/jenkins/jenkins-slave/workspace/Lucene-Solr-NightlyTests-5.x/solr/build/solr-core/test/J0/temp/solr.cloud.BasicDistributedZkTest_1817E361ACAC99E4-001/control-001/cores/collection1
   [junit4]   2> 1885243 INFO  (TEST-BasicDistributedZkTest.test-seed#[1817E361ACAC99E4]) [n:127.0.0.1:60904_    ] o.a.s.c.CorePropertiesLocator Found 1 core definitions
   [junit4]   2> 1885245 INFO  (TEST-BasicDistributedZkTest.test-seed#[1817E361ACAC99E4]) [n:127.0.0.1:60904_    ] o.a.s.s.SolrDispatchFilter user.dir=/x1/jenkins/jenkins-slave/workspace/Lucene-Solr-NightlyTests-5.x/solr/build/solr-core/test/J0
   [junit4]   2> 1885245 INFO  (TEST-BasicDistributedZkTest.test-seed#[1817E361ACAC99E4]) [n:127.0.0.1:60904_    ] o.a.s.s.SolrDispatchFilter SolrDispatchFilter.init() done
   [junit4]   2> 1885245 INFO  (coreLoadExecutor-3390-thread-1-processing-n:127.0.0.1:60904_) [n:127.0.0.1:60904_ c:control_collection   x:collection1] o.a.s.c.ZkController publishing state=down
   [junit4]   2> 1885245 INFO  (coreLoadExecutor-3390-thread-1-processing-n:127.0.0.1:60904_) [n:127.0.0.1:60904_ c:control_collection   x:collection1] o.a.s.c.ZkController numShards not found on descriptor - reading it from system property
   [junit4]   2> 1885247 INFO  (OverseerStateUpdate-95213991123484676-127.0.0.1:60904_-n_0000000000) [n:127.0.0.1:60904_    ] o.a.s.c.Overseer processMessage: queueSize: 1, message = {
   [junit4]   2>   "roles":null,
   [junit4]   2>   "state":"down",
   [junit4]   2>   "numShards":"1",
   [junit4]   2>   "shard":null,
   [junit4]   2>   "collection":"control_collection",
   [junit4]   2>   "operation":"state",
   [junit4]   2>   "core":"collection1",
   [junit4]   2>   "node_name":"127.0.0.1:60904_",
   [junit4]   2>   "base_url":"http://127.0.0.1:60904"} current state version: 0
   [junit4]   2> 1885248 INFO  (coreLoadExecutor-3390-thread-1-processing-n:127.0.0.1:60904_) [n:127.0.0.1:60904_ c:control_collection   x:collection1] o.a.s.c.ZkController look for our core node name
   [junit4]   2> 1885248 INFO  (OverseerStateUpdate-95213991123484676-127.0.0.1:60904_-n_0000000000) [n:127.0.0.1:60904_    ] o.a.s.c.o.ReplicaMutator Update state numShards=1 message={
   [junit4]   2>   "roles":null,
   [junit4]   2>   "state":"down",
   [junit4]   2>   "numShards":"1",
   [junit4]   2>   "shard":null,
   [junit4]   2>   "collection":"control_collection",
   [junit4]   2>   "operation":"state",
   [junit4]   2>   "core":"collection1",
   [junit4]   2>   "node_name":"127.0.0.1:60904_",
   [junit4]   2>   "base_url":"http://127.0.0.1:60904"}
   [junit4]   2> 1885249 INFO  (OverseerStateUpdate-95213991123484676-127.0.0.1:60904_-n_0000000000) [n:127.0.0.1:60904_    ] o.a.s.c.o.ClusterStateMutator building a new cName: control_collection
   [junit4]   2> 1885249 INFO  (OverseerStateUpdate-95213991123484676-127.0.0.1:60904_-n_0000000000) [n:127.0.0.1:60904_    ] o.a.s.c.o.ReplicaMutator Assigning new node to shard shard=shard1
   [junit4]   2> 1885251 INFO  (zkCallback-1759-thread-1-processing-n:127.0.0.1:60904_) [n:127.0.0.1:60904_    ] o.a.s.c.c.ZkStateReader A cluster state change: [WatchedEvent state:SyncConnected type:NodeDataChanged path:/clusterstate.json], has occurred - updating... (live nodes size: [1])
   [junit4]   2> 1886249 INFO  (coreLoadExecutor-3390-thread-1-processing-n:127.0.0.1:60904_) [n:127.0.0.1:60904_ c:control_collection   x:collection1] o.a.s.c.ZkController waiting to find shard id in clusterstate for collection1
   [junit4]   2> 1886249 INFO  (coreLoadExecutor-3390-thread-1-processing-n:127.0.0.1:60904_) [n:127.0.0.1:60904_ c:control_collection   x:collection1] o.a.s.c.ZkController Check for collection zkNode:control_collection
   [junit4]   2> 1886249 INFO  (coreLoadExecutor-3390-thread-1-processing-n:127.0.0.1:60904_) [n:127.0.0.1:60904_ c:control_collection   x:collection1] o.a.s.c.ZkController Collection zkNode exists
   [junit4]   2> 1886249 INFO  (coreLoadExecutor-3390-thread-1-processing-n:127.0.0.1:60904_) [n:127.0.0.1:60904_ c:control_collection   x:collection1] o.a.s.c.c.ZkStateReader Load collection config from: [/collections/control_collection]
   [junit4]   2> 1886250 INFO  (coreLoadExecutor-3390-thread-1-processing-n:127.0.0.1:60904_) [n:127.0.0.1:60904_ c:control_collection   x:collection1] o.a.s.c.c.ZkStateReader path=[/collections/control_collection] [configName]=[conf1] specified config exists in ZooKeeper
   [junit4]   2> 1886250 INFO  (coreLoadExecutor-3390-thread-1-processing-n:127.0.0.1:60904_) [n:127.0.0.1:60904_ c:control_collection   x:collection1] o.a.s.c.SolrResourceLoader new SolrResourceLoader for directory: '/x1/jenkins/jenkins-slave/workspace/Lucene-Solr-NightlyTests-5.x/solr/build/solr-core/test/J0/temp/solr.cloud.BasicDistributedZkTest_1817E361ACAC99E4-001/control-001/cores/collection1'
   [junit4]   2> 1886250 INFO  (coreLoadExecutor-3390-thread-1-processing-n:127.0.0.1:60904_) [n:127.0.0.1:60904_ c:control_collection   x:collection1] o.a.s.c.SolrResourceLoader JNDI not configured for solr (NoInitialContextEx)
   [junit4]   2> 1886250 INFO  (coreLoadExecutor-3390-thread-1-processing-n:127.0.0.1:60904_) [n:127.0.0.1:60904_ c:control_collection   x:collection1] o.a.s.c.SolrResourceLoader solr home defaulted to 'solr/' (could not find system property or JNDI)
   [junit4]   2> 1886252 INFO  (coreLoadExecutor-3390-thread-1-processing-n:127.0.0.1:60904_) [n:127.0.0.1:60904_ c:control_collection   x:collection1] o.a.s.c.Config loaded config solrconfig.xml with version 0 
   [junit4]   2> 1886258 INFO  (coreLoadExecutor-3390-thread-1-processing-n:127.0.0.1:60904_) [n:127.0.0.1:60904_ c:control_collection   x:collection1] o.a.s.c.SolrConfig current version of requestparams : -1
   [junit4]   2> 1886272 INFO  (coreLoadExecutor-3390-thread-1-processing-n:127.0.0.1:60904_) [n:127.0.0.1:60904_ c:control_collection   x:collection1] o.a.s.c.SolrConfig Using Lucene MatchVersion: 5.5.0
   [junit4]   2> 1886301 INFO  (coreLoadExecutor-3390-thread-1-processing-n:127.0.0.1:60904_) [n:127.0.0.1:60904_ c:control_collection   x:collection1] o.a.s.c.SolrConfig Loaded SolrConfig: solrconfig.xml
   [junit4]   2> 1886314 INFO  (coreLoadExecutor-3390-thread-1-processing-n:127.0.0.1:60904_) [n:127.0.0.1:60904_ c:control_collection   x:collection1] o.a.s.s.IndexSchema [collection1] Schema name=test
   [junit4]   2> 1886601 INFO  (coreLoadExecutor-3390-thread-1-processing-n:127.0.0.1:60904_) [n:127.0.0.1:60904_ c:control_collection   x:collection1] o.a.s.s.OpenExchangeRatesOrgProvider Initialized with rates=open-exchange-rates.json, refreshInterval=1440.
   [junit4]   2> 1886610 INFO  (coreLoadExecutor-3390-thread-1-processing-n:127.0.0.1:60904_) [n:127.0.0.1:60904_ c:control_collection   x:collection1] o.a.s.s.IndexSchema default search field in schema is text
   [junit4]   2> 1886612 INFO  (coreLoadExecutor-3390-thread-1-processing-n:127.0.0.1:60904_) [n:127.0.0.1:60904_ c:control_collection   x:collection1] o.a.s.s.IndexSchema unique key field: id
   [junit4]   2> 1886628 INFO  (coreLoadExecutor-3390-thread-1-processing-n:127.0.0.1:60904_) [n:127.0.0.1:60904_ c:control_collection   x:collection1] o.a.s.s.FileExchangeRateProvider Reloading exchange rates from file currency.xml
   [junit4]   2> 1886632 INFO  (coreLoadExecutor-3390-thread-1-processing-n:127.0.0.1:60904_) [n:127.0.0.1:60904_ c:control_collection   x:collection1] o.a.s.s.FileExchangeRateProvider Reloading exchange rates from file currency.xml
   [junit4]   2> 1886637 INFO  (coreLoadExecutor-3390-thread-1-processing-n:127.0.0.1:60904_) [n:127.0.0.1:60904_ c:control_collection   x:collection1] o.a.s.s.OpenExchangeRatesOrgProvider Reloading exchange rates from open-exchange-rates.json
   [junit4]   2> 1886638 INFO  (coreLoadExecutor-3390-thread-1-processing-n:127.0.0.1:60904_) [n:127.0.0.1:60904_ c:control_collection   x:collection1] o.a.s.s.OpenExchangeRatesOrgProvider Reloading exchange rates from open-exchange-rates.json
   [junit4]   2> 1886640 INFO  (coreLoadExecutor-3390-thread-1-processing-n:127.0.0.1:60904_) [n:127.0.0.1:60904_ c:control_collection   x:collection1] o.a.s.c.ConfigSetProperties Did not find ConfigSet properties, assuming default properties: Can't find resource 'configsetprops.json' in classpath or '/configs/conf1', cwd=/x1/jenkins/jenkins-slave/workspace/Lucene-Solr-NightlyTests-5.x/solr/build/solr-core/test/J0
   [junit4]   2> 1886640 INFO  (coreLoadExecutor-3390-thread-1-processing-n:127.0.0.1:60904_) [n:127.0.0.1:60904_ c:control_collection   x:collection1] o.a.s.c.CoreContainer Creating SolrCore 'collection1' using configuration from collection control_collection
   [junit4]   2> 1886640 INFO  (coreLoadExecutor-3390-thread-1-processing-n:127.0.0.1:60904_) [n:127.0.0.1:60904_ c:control_collection s:shard1 r:core_node1 x:collection1] o.a.s.c.SolrCore org.apache.solr.core.MockDirectoryFactory
   [junit4]   2> 1886640 INFO  (coreLoadExecutor-3390-thread-1-processing-n:127.0.0.1:60904_) [n:127.0.0.1:60904_ c:control_collection s:shard1 r:core_node1 x:collection1] o.a.s.c.SolrCore [[collection1] ] Opening new SolrCore at [/x1/jenkins/jenkins-slave/workspace/Lucene-Solr-NightlyTests-5.x/solr/build/solr-core/test/J0/temp/solr.cloud.BasicDistributedZkTest_1817E361ACAC99E4-001/control-001/cores/collection1], dataDir=[/x1/jenkins/jenkins-slave/workspace/Lucene-Solr-NightlyTests-5.x/solr/build/solr-core/test/J0/temp/solr.cloud.BasicDistributedZkTest_1817E361ACAC99E4-001/control-001/cores/collection1/data/]
   [junit4]   2> 1886640 INFO  (coreLoadExecutor-3390-thread-1-processing-n:127.0.0.1:60904_) [n:127.0.0.1:60904_ c:control_collection s:shard1 r:core_node1 x:collection1] o.a.s.c.JmxMonitoredMap JMX monitoring is enabled. Adding Solr mbeans to JMX Server: com.sun.jmx.mbeanserver.JmxMBeanServer@3ca63627
   [junit4]   2> 1886641 INFO  (coreLoadExecutor-3390-thread-1-processing-n:127.0.0.1:60904_) [n:127.0.0.1:60904_ c:control_collection s:shard1 r:core_node1 x:collection1] o.a.s.c.CachingDirectoryFactory return new directory for /x1/jenkins/jenkins-slave/workspace/Lucene-Solr-NightlyTests-5.x/solr/build/solr-core/test/J0/temp/solr.cloud.BasicDistributedZkTest_1817E361ACAC99E4-001/control-001/cores/collection1/data
   [junit4]   2> 1886641 INFO  (coreLoadExecutor-3390-thread-1-processing-n:127.0.0.1:60904_) [n:127.0.0.1:60904_ c:control_collection s:shard1 r:core_node1 x:collection1] o.a.s.c.SolrCore New index directory detected: old=null new=/x1/jenkins/jenkins-slave/workspace/Lucene-Solr-NightlyTests-5.x/solr/build/solr-core/test/J0/temp/solr.cloud.BasicDistributedZkTest_1817E361ACAC99E4-001/control-001/cores/collection1/data/index/
   [junit4]   2> 1886641 WARN  (coreLoadExecutor-3390-thread-1-processing-n:127.0.0.1:60904_) [n:127.0.0.1:60904_ c:control_collection s:shard1 r:core_node1 x:collection1] o.a.s.c.SolrCore [collection1] Solr index directory '/x1/jenkins/jenkins-slave/workspace/Lucene-Solr-NightlyTests-5.x/solr/build/solr-core/test/J0/temp/solr.cloud.BasicDistributedZkTest_1817E361ACAC99E4-001/control-001/cores/collection1/data/index' doesn't exist. Creating new index...
   [junit4]   2> 1886642 INFO  (coreLoadExecutor-3390-thread-1-processing-n:127.0.0.1:60904_) [n:127.0.0.1:60904_ c:control_collection s:shard1 r:core_node1 x:collection1] o.a.s.c.CachingDirectoryFactory return new directory for /x1/jenkins/jenkins-slave/workspace/Lucene-Solr-NightlyTests-5.x/solr/build/solr-core/test/J0/temp/solr.cloud.BasicDistributedZkTest_1817E361ACAC99E4-001/control-001/cores/collection1/data/index
   [junit4]   2> 1886642 INFO  (coreLoadExecutor-3390-thread-1-processing-n:127.0.0.1:60904_) [n:127.0.0.1:60904_ c:control_collection s:shard1 r:core_node1 x:collection1] o.a.s.u.RandomMergePolicy RandomMergePolicy wrapping class org.apache.lucene.index.MockRandomMergePolicy: org.apache.lucene.index.MockRandomMergePolicy@2768ffa4
   [junit4]   2> 1886645 INFO  (coreLoadExecutor-3390-thread-1-processing-n:127.0.0.1:60904_) [n:127.0.0.1:60904_ c:control_collection s:shard1 r:core_node1 x:collection1] o.a.s.c.SolrDeletionPolicy SolrDeletionPolicy.onCommit: commits: num=1
   [junit4]   2> 	commit{dir=RawDirectoryWrapper(NIOFSDirectory@/x1/jenkins/jenkins-slave/workspace/Lucene-Solr-NightlyTests-5.x/solr/build/solr-core/test/J0/temp/solr.cloud.BasicDistributedZkTest_1817E361ACAC99E4-001/index-NIOFSDirectory-001 lockFactory=org.apache.lucene.store.NativeFSLockFactory@5cc4aaec),segFN=segments_1,generation=1}
   [junit4]   2> 1886646 INFO  (coreLoadExecutor-3390-thread-1-processing-n:127.0.0.1:60904_) [n:127.0.0.1:60904_ c:control_collection s:shard1 r:core_node1 x:collection1] o.a.s.c.SolrDeletionPolicy newest commit generation = 1
   [junit4]   2> 1886666 INFO  (coreLoadExecutor-3390-thread-1-processing-n:127.0.0.1:60904_) [n:127.0.0.1:60904_ c:control_collection s:shard1 r:core_node1 x:collection1] o.a.s.u.p.UpdateRequestProcessorChain creating updateRequestProcessorChain "nodistrib"
   [junit4]   2> 1886666 INFO  (coreLoadExecutor-3390-thread-1-processing-n:127.0.0.1:60904_) [n:127.0.0.1:60904_ c:control_collection s:shard1 r:core_node1 x:collection1] o.a.s.u.p.UpdateRequestProcessorChain creating updateRequestProcessorChain "dedupe"
   [junit4]   2> 1886667 INFO  (coreLoadExecutor-3390-thread-1-processing-n:127.0.0.1:60904_) [n:127.0.0.1:60904_ c:control_collection s:shard1 r:core_node1 x:collection1] o.a.s.u.p.UpdateRequestProcessorChain inserting DistributedUpdateProcessorFactory into updateRequestProcessorChain "dedupe"
   [junit4]   2> 1886667 INFO  (coreLoadExecutor-3390-thread-1-processing-n:127.0.0.1:60904_) [n:127.0.0.1:60904_ c:control_collection s:shard1 r:core_node1 x:collection1] o.a.s.u.p.UpdateRequestProcessorChain creating updateRequestProcessorChain "stored_sig"
   [junit4]   2> 1886667 INFO  (coreLoadExecutor-3390-thread-1-processing-n:127.0.0.1:60904_) [n:127.0.0.1:60904_ c:control_collection s:shard1 r:core_node1 x:collection1] o.a.s.u.p.UpdateRequestProcessorChain inserting DistributedUpdateProcessorFactory into updateRequestProcessorChain "stored_sig"
   [junit4]   2> 1886667 INFO  (coreLoadExecutor-3390-thread-1-processing-n:127.0.0.1:60904_) [n:127.0.0.1:60904_ c:control_collection s:shard1 r:core_node1 x:collection1] o.a.s.u.p.UpdateRequestProcessorChain creating updateRequestProcessorChain "distrib-dup-test-chain-explicit"
   [junit4]   2> 1886667 INFO  (coreLoadExecutor-3390-thread-1-processing-n:127.0.0.1:60904_) [n:127.0.0.1:60904_ c:control_collection s:shard1 r:core_node1 x:collection1] o.a.s.u.p.UpdateRequestProcessorChain creating updateRequestProcessorChain "distrib-dup-test-chain-implicit"
   [junit4]   2> 1886667 INFO  (coreLoadExecutor-3390-thread-1-processing-n:127.0.0.1:60904_) [n:127.0.0.1:60904_ c:control_collection s:shard1 r:core_node1 x:collection1] o.a.s.u.p.UpdateRequestProcessorChain inserting DistributedUpdateProcessorFactory into updateRequestProcessorChain "distrib-dup-test-chain-implicit"
   [junit4]   2> 1886667 INFO  (coreLoadExecutor-3390-thread-1-processing-n:127.0.0.1:60904_) [n:127.0.0.1:60904_ c:control_collection s:shard1 r:core_node1 x:collection1] o.a.s.c.SolrCore no updateRequestProcessorChain defined as default, creating implicit default
   [junit4]   2> 1886668 WARN  (coreLoadExecutor-3390-thread-1-processing-n:127.0.0.1:60904_) [n:127.0.0.1:60904_ c:control_collection s:shard1 r:core_node1 x:collection1] o.a.s.c.RequestHandlers INVALID paramSet a in requestHandler {type = requestHandler,name = /dump,class = DumpRequestHandler,args = {defaults={a=A,b=B}}}
   [junit4]   2> 1886671 INFO  (coreLoadExecutor-3390-thread-1-processing-n:127.0.0.1:60904_) [n:127.0.0.1:60904_ c:control_collection s:shard1 r:core_node1 x:collection1] o.a.s.h.l.XMLLoader xsltCacheLifetimeSeconds=60
   [junit4]   2> 1886671 INFO  (OldIndexDirectoryCleanupThreadForCore-collection1) [n:127.0.0.1:60904_ c:control_collection s:shard1 r:core_node1 x:collection1] o.a.s.c.SolrCore Looking for old index directories to cleanup for core collection1 in /x1/jenkins/jenkins-slave/workspace/Lucene-Solr-NightlyTests-5.x/solr/build/solr-core/test/J0/temp/solr.cloud.BasicDistributedZkTest_1817E361ACAC99E4-001/control-001/cores/collection1/data/
   [junit4]   2> 1886672 WARN  (OldIndexDirectoryCleanupThreadForCore-collection1) [n:127.0.0.1:60904_ c:control_collection s:shard1 r:core_node1 x:collection1] o.a.s.c.DirectoryFactory /x1/jenkins/jenkins-slave/workspace/Lucene-Solr-NightlyTests-5.x/solr/build/solr-core/test/J0/temp/solr.cloud.BasicDistributedZkTest_1817E361ACAC99E4-001/control-001/cores/collection1/data/ does not point to a valid data directory; skipping clean-up of old index directories.
   [junit4]   2> 1886672 INFO  (coreLoadExecutor-3390-thread-1-processing-n:127.0.0.1:60904_) [n:127.0.0.1:60904_ c:control_collection s:shard1 r:core_node1 x:collection1] o.a.s.h.l.XMLLoader xsltCacheLifetimeSeconds=60
   [junit4]   2> 1886674 INFO  (coreLoadExecutor-3390-thread-1-processing-n:127.0.0.1:60904_) [n:127.0.0.1:60904_ c:control_collection s:shard1 r:core_node1 x:collection1] o.a.s.h.l.XMLLoader xsltCacheLifetimeSeconds=60
   [junit4]   2> 1886677 INFO  (coreLoadExecutor-3390-thread-1-processing-n:127.0.0.1:60904_) [n:127.0.0.1:60904_ c:control_collection s:shard1 r:core_node1 x:collection1] o.a.s.h.l.XMLLoader xsltCacheLifetimeSeconds=60
   [junit4]   2> 1886683 INFO  (coreLoadExecutor-3390-thread-1-processing-n:127.0.0.1:60904_) [n:127.0.0.1:60904_ c:control_collection s:shard1 r:core_node1 x:collection1] o.a.s.c.RequestHandlers Registered paths: /admin/segments,/get,/admin/luke,standard,/admin/ping,/admin/threads,/dump,/update/json,/admin/properties,/admin/mbeans,/admin/logging,/admin/plugins,/config,/update/csv,/schema,/update/json/docs,/update,/replication,/admin/file,/admin/system
   [junit4]   2> 1886686 INFO  (coreLoadExecutor-3390-thread-1-processing-n:127.0.0.1:60904_) [n:127.0.0.1:60904_ c:control_collection s:shard1 r:core_node1 x:collection1] o.a.s.c.SolrCore Using default statsCache cache: org.apache.solr.search.stats.LocalStatsCache
   [junit4]   2> 1886686 INFO  (coreLoadExecutor-3390-thread-1-processing-n:127.0.0.1:60904_) [n:127.0.0.1:60904_ c:control_collection s:shard1 r:core_node1 x:collection1] o.a.s.u.UpdateHandler Using UpdateLog implementation: org.apache.solr.update.UpdateLog
   [junit4]   2> 1886686 INFO  (coreLoadExecutor-3390-thread-1-processing-n:127.0.0.1:60904_) [n:127.0.0.1:60904_ c:control_collection s:shard1 r:core_node1 x:collection1] o.a.s.u.UpdateLog Initializing UpdateLog: dataDir= defaultSyncLevel=FLUSH numRecordsToKeep=100 maxNumLogsToKeep=10 numVersionBuckets=65536
   [junit4]   2> 1886687 INFO  (coreLoadExecutor-3390-thread-1-processing-n:127.0.0.1:60904_) [n:127.0.0.1:60904_ c:control_collection s:shard1 r:core_node1 x:collection1] o.a.s.u.CommitTracker Hard AutoCommit: disabled
   [junit4]   2> 1886688 INFO  (coreLoadExecutor-3390-thread-1-processing-n:127.0.0.1:60904_) [n:127.0.0.1:60904_ c:control_collection s:shard1 r:core_node1 x:collection1] o.a.s.u.CommitTracker Soft AutoCommit: disabled
   [junit4]   2> 1886688 INFO  (coreLoadExecutor-3390-thread-1-processing-n:127.0.0.1:60904_) [n:127.0.0.1:60904_ c:control_collection s:shard1 r:core_node1 x:collection1] o.a.s.u.RandomMergePolicy RandomMergePolicy wrapping class org.apache.lucene.index.TieredMergePolicy: [TieredMergePolicy: maxMergeAtOnce=38, maxMergeAtOnceExplicit=46, maxMergedSegmentMB=84.8212890625, floorSegmentMB=1.1318359375, forceMergeDeletesPctAllowed=27.90915906757699, segmentsPerTier=43.0, maxCFSSegmentSizeMB=8.796093022207999E12, noCFSRatio=0.0
   [junit4]   2> 1886689 INFO  (coreLoadExecutor-3390-thread-1-processing-n:127.0.0.1:60904_) [n:127.0.0.1:60904_ c:control_collection s:shard1 r:core_node1 x:collection1] o.a.s.c.SolrDeletionPolicy SolrDeletionPolicy.onInit: commits: num=1
   [junit4]   2> 	commit{dir=RawDirectoryWrapper(NIOFSDirectory@/x1/jenkins/jenkins-slave/workspace/Lucene-Solr-NightlyTests-5.x/solr/build/solr-core/test/J0/temp/solr.cloud.BasicDistributedZkTest_1817E361ACAC99E4-001/index-NIOFSDirectory-001 lockFactory=org.apache.lucene.store.NativeFSLockFactory@5cc4aaec),segFN=segments_1,generation=1}
   [junit4]   2> 1886689 INFO  (coreLoadExecutor-3390-thread-1-processing-n:127.0.0.1:60904_) [n:127.0.0.1:60904_ c:control_collection s:shard1 r:core_node1 x:collection1] o.a.s.c.SolrDeletionPolicy newest commit generation = 1
   [junit4]   2> 1886690 INFO  (coreLoadExecutor-3390-thread-1-processing-n:127.0.0.1:60904_) [n:127.0.0.1:60904_ c:control_collection s:shard1 r:core_node1 x:collection1] o.a.s.s.SolrIndexSearcher Opening Searcher@343a656c[collection1] main
   [junit4]   2> 1886690 INFO  (coreLoadExecutor-3390-thread-1-processing-n:127.0.0.1:60904_) [n:127.0.0.1:60904_ c:control_collection s:shard1 r:core_node1 x:collection1] o.a.s.c.c.ZkStateReader Load collection config from: [/collections/control_collection]
   [junit4]   2> 1886697 INFO  (coreLoadExecutor-3390-thread-1-processing-n:127.0.0.1:60904_) [n:127.0.0.1:60904_ c:control_collection s:shard1 r:core_node1 x:collection1] o.a.s.c.c.ZkStateReader path=[/collections/control_collection] [configName]=[conf1] specified config exists in ZooKeeper
   [junit4]   2> 1886697 INFO  (coreLoadExecutor-3390-thread-1-processing-n:127.0.0.1:60904_) [n:127.0.0.1:60904_ c:control_collection s:shard1 r:core_node1 x:collection1] o.a.s.r.ManagedResourceStorage Setting up ZooKeeper-based storage for the RestManager with znodeBase: /configs/conf1
   [junit4]   2> 1886698 INFO  (coreLoadExecutor-3390-thread-1-processing-n:127.0.0.1:60904_) [n:127.0.0.1:60904_ c:control_collection s:shard1 r:core_node1 x:collection1] o.a.s.r.ManagedResourceStorage Configured ZooKeeperStorageIO with znodeBase: /configs/conf1
   [junit4]   2> 1886698 INFO  (coreLoadExecutor-3390-thread-1-processing-n:127.0.0.1:60904_) [n:127.0.0.1:60904_ c:control_collection s:shard1 r:core_node1 x:collection1] o.a.s.r.RestManager Initializing RestManager with initArgs: {}
   [junit4]   2> 1886698 INFO  (coreLoadExecutor-3390-thread-1-processing-n:127.0.0.1:60904_) [n:127.0.0.1:60904_ c:control_collection s:shard1 r:core_node1 x:collection1] o.a.s.r.ManagedResourceStorage Reading _rest_managed.json using ZooKeeperStorageIO:path=/configs/conf1
   [junit4]   2> 1886700 INFO  (coreLoadExecutor-3390-thread-1-processing-n:127.0.0.1:60904_) [n:127.0.0.1:60904_ c:control_collection s:shard1 r:core_node1 x:collection1] o.a.s.r.ManagedResourceStorage No data found for znode /configs/conf1/_rest_managed.json
   [junit4]   2> 1886700 INFO  (coreLoadExecutor-3390-thread-1-processing-n:127.0.0.1:60904_) [n:127.0.0.1:60904_ c:control_collection s:shard1 r:core_node1 x:collection1] o.a.s.r.ManagedResourceStorage Loaded null at path _rest_managed.json using ZooKeeperStorageIO:path=/configs/conf1
   [junit4]   2> 1886700 INFO  (coreLoadExecutor-3390-thread-1-processing-n:127.0.0.1:60904_) [n:127.0.0.1:60904_ c:control_collection s:shard1 r:core_node1 x:collection1] o.a.s.r.RestManager Initializing 0 registered ManagedResources
   [junit4]   2> 1886700 INFO  (coreLoadExecutor-3390-thread-1-processing-n:127.0.0.1:60904_) [n:127.0.0.1:60904_ c:control_collection s:shard1 r:core_node1 x:collection1] o.a.s.h.ReplicationHandler Commits will be reserved for  10000
   [junit4]   2> 1886702 INFO  (searcherExecutor-3391-thread-1-processing-r:core_node1 s:shard1 c:control_collection x:collection1 n:127.0.0.1:60904_) [n:127.0.0.1:60904_ c:control_collection s:shard1 r:core_node1 x:collection1] o.a.s.c.SolrCore [collection1] Registered new searcher Searcher@343a656c[collection1] main{ExitableDirectoryReader(UninvertingDirectoryReader())}
   [junit4]   2> 1886702 INFO  (coreLoadExecutor-3390-thread-1-processing-n:127.0.0.1:60904_) [n:127.0.0.1:60904_ c:control_collection s:shard1 r:core_node1 x:collection1] o.a.s.u.UpdateLog Looking up max value of version field to seed version buckets
   [junit4]   2> 1886702 INFO  (coreLoadExecutor-3390-thread-1-processing-n:127.0.0.1:60904_) [n:127.0.0.1:60904_ c:control_collection s:shard1 r:core_node1 x:collection1] o.a.s.u.VersionInfo Refreshing highest value of _version_ for 65536 version buckets from index
   [junit4]   2> 1886702 INFO  (coreLoadExecutor-3390-thread-1-processing-n:127.0.0.1:60904_) [n:127.0.0.1:60904_ c:control_collection s:shard1 r:core_node1 x:collection1] o.a.s.u.VersionInfo No terms found for _version_, cannot seed version bucket highest value from index
   [junit4]   2> 1886702 INFO  (coreLoadExecutor-3390-thread-1-processing-n:127.0.0.1:60904_) [n:127.0.0.1:60904_ c:control_collection s:shard1 r:core_node1 x:collection1] o.a.s.u.UpdateLog Could not find max version in index or recent updates, using new clock 1523423860294156288
   [junit4]   2> 1886705 INFO  (coreLoadExecutor-3390-thread-1-processing-n:127.0.0.1:60904_) [n:127.0.0.1:60904_ c:control_collection s:shard1 r:core_node1 x:collection1] o.a.s.u.UpdateLog Took 3.0ms to seed version buckets with highest version 1523423860294156288
   [junit4]   2> 1886705 INFO  (coreLoadExecutor-3390-thread-1-processing-n:127.0.0.1:60904_) [n:127.0.0.1:60904_ c:control_collection s:shard1 r:core_node1 x:collection1] o.a.s.c.ZkController watch zkdir /configs/conf1
   [junit4]   2> 1886706 INFO  (coreLoadExecutor-3390-thread-1-processing-n:127.0.0.1:60904_) [n:127.0.0.1:60904_ c:control_collection s:shard1 r:core_node1 x:collection1] o.a.s.c.CoreContainer registering core: collection1
   [junit4]   2> 1886707 INFO  (coreZkRegister-3384-thread-1-processing-r:core_node1 s:shard1 c:control_collection x:collection1 n:127.0.0.1:60904_) [n:127.0.0.1:60904_ c:control_collection s:shard1 r:core_node1 x:collection1] o.a.s.c.ZkController Register replica - core:collection1 address:http://127.0.0.1:60904 collection:control_collection shard:shard1
   [junit4]   2> 1886708 INFO  (coreZkRegister-3384-thread-1-processing-r:core_node1 s:shard1 c:control_collection x:collection1 n:127.0.0.1:60904_) [n:127.0.0.1:60904_ c:control_collection s:shard1 r:core_node1 x:collection1] o.a.s.c.c.SolrZkClient makePath: /collections/control_collection/leader_elect/shard1/election
   [junit4]   2> 1886712 INFO  (coreZkRegister-3384-thread-1-processing-r:core_node1 s:shard1 c:control_collection x:collection1 n:127.0.0.1:60904_) [n:127.0.0.1:60904_ c:control_collection s:shard1 r:core_node1 x:collection1] o.a.s.c.LeaderElector Joined leadership election with path: /collections/control_collection/leader_elect/shard1/election/95213991123484676-core_node1-n_0000000000
   [junit4]   2> 1886713 INFO  (coreZkRegister-3384-thread-1-processing-r:core_node1 s:shard1 c:control_collection x:collection1 n:127.0.0.1:60904_) [n:127.0.0.1:60904_ c:control_collection s:shard1 r:core_node1 x:collection1] o.a.s.c.ShardLeaderElectionContext Running the leader process for shard=shard1 and weAreReplacement=false and leaderVoteWait=10000
   [junit4]   2> 1886715 INFO  (coreZkRegister-3384-thread-1-processing-r:core_node1 s:shard1 c:control_collection x:collection1 n:127.0.0.1:60904_) [n:127.0.0.1:60904_ c:control_collection s:shard1 r:core_node1 x:collection1] o.a.s.c.ShardLeaderElectionContext Enough replicas found to continue.
   [junit4]   2> 1886715 INFO  (coreZkRegister-3384-thread-1-processing-r:core_node1 s:shard1 c:control_collection x:collection1 n:127.0.0.1:60904_) [n:127.0.0.1:60904_ c:control_collection s:shard1 r:core_node1 x:collection1] o.a.s.c.ShardLeaderElectionContext I may be the new leader - try and sync
   [junit4]   2> 1886715 INFO  (coreZkRegister-3384-thread-1-processing-r:core_node1 s:shard1 c:control_collection x:collection1 n:127.0.0.1:60904_) [n:127.0.0.1:60904_ c:control_collection s:shard1 r:core_node1 x:collection1] o.a.s.c.SyncStrategy Sync replicas to http://127.0.0.1:60904/collection1/
   [junit4]   2> 1886715 INFO  (OverseerStateUpdate-95213991123484676-127.0.0.1:60904_-n_0000000000) [n:127.0.0.1:60904_    ] o.a.s.c.Overseer processMessage: queueSize: 1, message = {
   [junit4]   2>   "operation":"leader",
   [junit4]   2>   "shard":"shard1",
   [junit4]   2>   "collection":"control_collection"} current state version: 1
   [junit4]   2> 1886715 INFO  (coreZkRegister-3384-thread-1-processing-r:core_node1 s:shard1 c:control_collection x:collection1 n:127.0.0.1:60904_) [n:127.0.0.1:60904_ c:control_collection s:shard1 r:core_node1 x:collection1] o.a.s.c.SyncStrategy Sync Success - now sync replicas to me
   [junit4]   2> 1886716 INFO  (coreZkRegister-3384-thread-1-processing-r:core_node1 s:shard1 c:control_collection x:collection1 n:127.0.0.1:60904_) [n:127.0.0.1:60904_ c:control_collection s:shard1 r:core_node1 x:collection1] o.a.s.c.SyncStrategy http://127.0.0.1:60904/collection1/ has no replicas
   [junit4]   2> 1886717 INFO  (coreZkRegister-3384-thread-1-processing-r:core_node1 s:shard1 c:control_collection x:collection1 n:127.0.0.1:60904_) [n:127.0.0.1:60904_ c:control_collection s:shard1 r:core_node1 x:collection1] o.a.s.c.c.SolrZkClient makePath: /collections/control_collection/leaders/shard1
   [junit4]   2> 1886720 INFO  (coreZkRegister-3384-thread-1-processing-r:core_node1 s:shard1 c:control_collection x:collection1 n:127.0.0.1:60904_) [n:127.0.0.1:60904_ c:control_collection s:shard1 r:core_node1 x:collection1] o.a.s.c.ShardLeaderElectionContextBase Creating leader registration node
   [junit4]   2> 1886722 INFO  (coreZkRegister-3384-thread-1-processing-r:core_node1 s:shard1 c:control_collection x:collection1 n:127.0.0.1:60904_) [n:127.0.0.1:60904_ c:control_collection s:shard1 r:core_node1 x:collection1] o.a.s.c.ShardLeaderElectionContext I am the new leader: http://127.0.0.1:60904/collection1/ shard1
   [junit4]   2> 1886723 INFO  (OverseerStateUpdate-95213991123484676-127.0.0.1:60904_-n_0000000000) [n:127.0.0.1:60904_    ] o.a.s.c.Overseer processMessage: queueSize: 1, message = {
   [junit4]   2>   "operation":"leader",
   [junit4]   2>   "shard":"shard1",
   [junit4]   2>   "collection":"control_collection",
   [junit4]   2>   "base_url":"http://127.0.0.1:60904",
   [junit4]   2>   "core":"collection1",
   [junit4]   2>   "state":"active"} current state version: 1
   [junit4]   2> 1886747 INFO  (TEST-BasicDistributedZkTest.test-seed#[1817E361ACAC99E4]) [    ] o.a.s.c.c.SolrZkClient Using default ZkCredentialsProvider
   [junit4]   2> 1886749 INFO  (TEST-BasicDistributedZkTest.test-seed#[1817E361ACAC99E4]) [    ] o.a.s.c.c.ConnectionManager Waiting for client to connect to ZooKeeper
   [junit4]   2> 1886749 INFO  (zkCallback-1761-thread-1) [    ] o.a.s.c.c.ConnectionManager Watcher org.apache.solr.common.cloud.ConnectionManager@20eded13 name:ZooKeeperConnection Watcher:127.0.0.1:39969/solr got event WatchedEvent state:SyncConnected type:None path:null path:null type:None
   [junit4]   2> 1886749 INFO  (TEST-BasicDistributedZkTest.test-seed#[1817E361ACAC99E4]) [    ] o.a.s.c.c.ConnectionManager Client is connected to ZooKeeper
   [junit4]   2> 1886749 INFO  (TEST-BasicDistributedZkTest.test-seed#[1817E361ACAC99E4]) [    ] o.a.s.c.c.SolrZkClient Using default ZkACLProvider
   [junit4]   2> 1886749 INFO  (TEST-BasicDistributedZkTest.test-seed#[1817E361ACAC99E4]) [    ] o.a.s.c.c.ZkStateReader Updating cluster state from ZooKeeper... 
   [junit4]   2> 1886751 INFO  (TEST-BasicDistributedZkTest.test-seed#[1817E361ACAC99E4]) [    ] o.a.s.c.ChaosMonkey monkey: init - expire sessions:false cause connection loss:false
   [junit4]   2> 1886826 INFO  (zkCallback-1761-thread-1) [    ] o.a.s.c.c.ZkStateReader A cluster state change: [WatchedEvent state:SyncConnected type:NodeDataChanged path:/clusterstate.json], has occurred - updating... (live nodes size: [1])
   [junit4]   2> 1886826 INFO  (zkCallback-1759-thread-1-processing-n:127.0.0.1:60904_) [n:127.0.0.1:60904_    ] o.a.s.c.c.ZkStateReader A cluster state change: [WatchedEvent state:SyncConnected type:NodeDataChanged path:/clusterstate.json], has occurred - updating... (live nodes size: [1])
   [junit4]   2> 1886874 INFO  (coreZkRegister-3384-thread-1-processing-r:core_node1 s:shard1 c:control_collection x:collection1 n:127.0.0.1:60904_) [n:127.0.0.1:60904_ c:control_collection s:shard1 r:core_node1 x:collection1] o.a.s.c.ZkController We are http://127.0.0.1:60904/collection1/ and leader is http://127.0.0.1:60904/collection1/
   [junit4]   2> 1886874 INFO  (coreZkRegister-3384-thread-1-processing-r:core_node1 s:shard1 c:control_collection x:collection1 n:127.0.0.1:60904_) [n:127.0.0.1:60904_ c:control_collection s:shard1 r:core_node1 x:collection1] o.a.s.c.ZkController No LogReplay needed for core=collection1 baseURL=http://127.0.0.1:60904
   [junit4]   2> 1886874 INFO  (coreZkRegister-3384-thread-1-processing-r:core_node1 s:shard1 c:control_collection x:collection1 n:127.0.0.1:60904_) [n:127.0.0.1:60904_ c:control_collection s:shard1 r:core_node1 x:collection1] o.a.s.c.ZkController I am the leader, no recovery necessary
   [junit4]   2> 1886874 INFO  (coreZkRegister-3384-thread-1-processing-r:core_node1 s:shard1 c:control_collection x:collection1 n:127.0.0.1:60904_) [n:127.0.0.1:60904_ c:control_collection s:shard1 r:core_node1 x:collection1] o.a.s.c.ZkController publishing state=active
   [junit4]   2> 1886874 INFO  (coreZkRegister-3384-thread-1-processing-r:core_node1 s:shard1 c:control_collection x:collection1 n:127.0.0.1:60904_) [n:127.0.0.1:60904_ c:control_collection s:shard1 r:core_node1 x:collection1] o.a.s.c.ZkController numShards not found on descriptor - reading it from system property
   [junit4]   2> 1886876 INFO  (OverseerStateUpdate-95213991123484676-127.0.0.1:60904_-n_0000000000) [n:127.0.0.1:60904_    ] o.a.s.c.Overseer processMessage: queueSize: 1, message = {
   [junit4]   2>   "roles":null,
   [junit4]   2>   "state":"active",
   [junit4]   2>   "numShards":"2",
   [junit4]   2>   "shard":"shard1",
   [junit4]   2>   "collection":"control_collection",
   [junit4]   2>   "core_node_name":"core_node1",
   [junit4]   2>   "operation":"state",
   [junit4]   2>   "core":"collection1",
   [junit4]   2>   "node_name":"127.0.0.1:60904_",
   [junit4]   2>   "base_url":"http://127.0.0.1:60904"} current state version: 2
   [junit4]   2> 1886877 INFO  (OverseerStateUpdate-95213991123484676-127.0.0.1:60904_-n_0000000000) [n:127.0.0.1:60904_    ] o.a.s.c.o.ReplicaMutator Update state numShards=2 message={
   [junit4]   2>   "roles":null,
   [junit4]   2>   "state":"active",
   [junit4]   2>   "numShards":"2",
   [junit4]   2>   "shard":"shard1",
   [junit4]   2>   "collection":"control_collection",
   [junit4]   2>   "core_node_name":"core_node1",
   [junit4]   2>   "operation":"state",
   [junit4]   2>   "core":"collection1",
   [junit4]   2>   "node_name":"127.0.0.1:60904_",
   [junit4]   2>   "base_url":"http://127.0.0.1:60904"}
   [junit4]   2> 1886980 INFO  (zkCallback-1759-thread-1-processing-n:127.0.0.1:60904_) [n:127.0.0.1:60904_    ] o.a.s.c.c.ZkStateReader A cluster state change: [WatchedEvent state:SyncConnected type:NodeDataChanged path:/clusterstate.json], has occurred - updating... (live nodes size: [1])
   [junit4]   2> 1886980 INFO  (zkCallback-1761-thread-1) [    ] o.a.s.c.c.ZkStateReader A cluster state change: [WatchedEvent state:SyncConnected type:NodeDataChanged path:/clusterstate.json], has occurred - updating... (live nodes size: [1])
   [junit4]   2> 1887142 INFO  (TEST-BasicDistributedZkTest.test-seed#[1817E361ACAC99E4]) [    ] o.a.s.SolrTestCaseJ4 Writing core.properties file to /x1/jenkins/jenkins-slave/workspace/Lucene-Solr-NightlyTests-5.x/solr/build/solr-core/test/J0/temp/solr.cloud.BasicDistributedZkTest_1817E361ACAC99E4-001/shard-1-001/cores/collection1
   [junit4]   2> 1887144 INFO  (TEST-BasicDistributedZkTest.test-seed#[1817E361ACAC99E4]) [    ] o.a.s.c.AbstractFullDistribZkTestBase create jetty 1 in directory /x1/jenkins/jenkins-slave/workspace/Lucene-Solr-NightlyTests-5.x/solr/build/solr-core/test/J0/temp/solr.cloud.BasicDistributedZkTest_1817E361ACAC99E4-001/shard-1-001
   [junit4]   2> 1887153 INFO  (TEST-BasicDistributedZkTest.test-seed#[1817E361ACAC99E4]) [    ] o.e.j.s.Server jetty-9.2.13.v20150730
   [junit4]   2> 1887177 INFO  (TEST-BasicDistributedZkTest.test-seed#[1817E361ACAC99E4]) [    ] o.e.j.s.h.ContextHandler Started o.e.j.s.ServletContextHandler@47fb729{/,null,AVAILABLE}
   [junit4]   2> 1887177 INFO  (TEST-BasicDistributedZkTest.test-seed#[1817E361ACAC99E4]) [    ] o.e.j.s.ServerConnector Started ServerConnector@5cd1e70d{HTTP/1.1}{127.0.0.1:37382}
   [junit4]   2> 1887178 INFO  (TEST-BasicDistributedZkTest.test-seed#[1817E361ACAC99E4]) [    ] o.e.j.s.Server Started @1890909ms
   [junit4]   2> 1887178 INFO  (TEST-BasicDistributedZkTest.test-seed#[1817E361ACAC99E4]) [    ] o.a.s.c.s.e.JettySolrRunner Jetty properties: {solrconfig=solrconfig.xml, hostPort=37382, coreRootDirectory=/x1/jenkins/jenkins-slave/workspace/Lucene-Solr-NightlyTests-5.x/solr/build/solr-core/test/J0/../../../../../../../../../../x1/jenkins/jenkins-slave/workspace/Lucene-Solr-NightlyTests-5.x/solr/build/solr-core/test/J0/temp/solr.cloud.BasicDistributedZkTest_1817E361ACAC99E4-001/shard-1-001/cores, hostContext=/, solr.data.dir=/x1/jenkins/jenkins-slave/workspace/Lucene-Solr-NightlyTests-5.x/solr/build/solr-core/test/J0/temp/solr.cloud.BasicDistributedZkTest_1817E361ACAC99E4-001/tempDir-001/jetty1}
   [junit4]   2> 1887178 INFO  (TEST-BasicDistributedZkTest.test-seed#[1817E361ACAC99E4]) [    ] o.a.s.s.SolrDispatchFilter SolrDispatchFilter.init(): sun.misc.Launcher$AppClassLoader@7b3cb2c6
   [junit4]   2> 1887178 INFO  (TEST-BasicDistributedZkTest.test-seed#[1817E361ACAC99E4]) [    ] o.a.s.c.SolrResourceLoader new SolrResourceLoader for directory: '/x1/jenkins/jenkins-slave/workspace/Lucene-Solr-NightlyTests-5.x/solr/build/solr-core/test/J0/temp/solr.cloud.BasicDistributedZkTest_1817E361ACAC99E4-001/shard-1-001'
   [junit4]   2> 1887178 INFO  (TEST-BasicDistributedZkTest.test-seed#[1817E361ACAC99E4]) [    ] o.a.s.c.SolrResourceLoader JNDI not configured for solr (NoInitialContextEx)
   [junit4]   2> 1887178 INFO  (TEST-BasicDistributedZkTest.test-seed#[1817E361ACAC99E4]) [    ] o.a.s.c.SolrResourceLoader solr home defaulted to 'solr/' (could not find system property or JNDI)
   [junit4]   2> 1887179 INFO  (TEST-BasicDistributedZkTest.test-seed#[1817E361ACAC99E4]) [    ] o.a.s.c.c.SolrZkClient Using default ZkCredentialsProvider
   [junit4]   2> 1887183 INFO  (TEST-BasicDistributedZkTest.test-seed#[1817E361ACAC99E4]) [    ] o.a.s.c.c.ConnectionManager Waiting for client to connect to ZooKeeper
   [junit4]   2> 1887184 INFO  (zkCallback-1762-thread-1) [    ] o.a.s.c.c.ConnectionManager Watcher org.apache.solr.common.cloud.ConnectionManager@18fcabbb name:ZooKeeperConnection Watcher:127.0.0.1:39969/solr got event WatchedEvent state:SyncConnected type:None path:null path:null type:None
   [junit4]   2> 1887184 INFO  (TEST-BasicDistributedZkTest.test-seed#[1817E361ACAC99E4]) [    ] o.a.s.c.c.ConnectionManager Client is connected to ZooKeeper
   [junit4]   2> 1887184 INFO  (TEST-BasicDistributedZkTest.test-seed#[1817E361ACAC99E4]) [    ] o.a.s.c.c.SolrZkClient Using default ZkACLProvider
   [junit4]   2> 1887185 INFO  (TEST-BasicDistributedZkTest.test-seed#[1817E361ACAC99E4]) [    ] o.a.s.s.SolrDispatchFilter Loading solr.xml from SolrHome (not found in ZooKeeper)
   [junit4]   2> 1887185 INFO  (TEST-BasicDistributedZkTest.test-seed#[1817E361ACAC99E4]) [    ] o.a.s.c.SolrXmlConfig Loading container configuration from /x1/jenkins/jenkins-slave/workspace/Lucene-Solr-NightlyTests-5.x/solr/build/solr-core/test/J0/temp/solr.cloud.BasicDistributedZkTest_1817E361ACAC99E4-001/shard-1-001/solr.xml
   [junit4]   2> 1887209 INFO  (TEST-BasicDistributedZkTest.test-seed#[1817E361ACAC99E4]) [    ] o.a.s.c.CorePropertiesLocator Config-defined core root directory: /x1/jenkins/jenkins-slave/workspace/Lucene-Solr-NightlyTests-5.x/solr/build/solr-core/test/J0/../../../../../../../../../../x1/jenkins/jenkins-slave/workspace/Lucene-Solr-NightlyTests-5.x/solr/build/solr-core/test/J0/temp/solr.cloud.BasicDistributedZkTest_1817E361ACAC99E4-001/shard-1-001/cores
   [junit4]   2> 1887210 INFO  (TEST-BasicDistributedZkTest.test-seed#[1817E361ACAC99E4]) [    ] o.a.s.c.CoreContainer New CoreContainer 1974690352
   [junit4]   2> 1887210 INFO  (TEST-BasicDistributedZkTest.test-seed#[1817E361ACAC99E4]) [    ] o.a.s.c.CoreContainer Loading cores into CoreContainer [instanceDir=/x1/jenkins/jenkins-slave/workspace/Lucene-Solr-NightlyTests-5.x/solr/build/solr-core/test/J0/temp/solr.cloud.BasicDistributedZkTest_1817E361ACAC99E4-001/shard-1-001]
   [junit4]   2> 1887210 WARN  (TEST-BasicDistributedZkTest.test-seed#[1817E361ACAC99E4]) [    ] o.a.s.c.CoreContainer Couldn't add files from /x1/jenkins/jenkins-slave/workspace/Lucene-Solr-NightlyTests-5.x/solr/build/solr-core/test/J0/temp/solr.cloud.BasicDistributedZkTest_1817E361ACAC99E4-001/shard-1-001/lib to classpath: /x1/jenkins/jenkins-slave/workspace/Lucene-Solr-NightlyTests-5.x/solr/build/solr-core/test/J0/temp/solr.cloud.BasicDistributedZkTest_1817E361ACAC99E4-001/shard-1-001/lib
   [junit4]   2> 1887210 INFO  (TEST-BasicDistributedZkTest.test-seed#[1817E361ACAC99E4]) [    ] o.a.s.h.c.HttpShardHandlerFactory created with socketTimeout : 90000,urlScheme : ,connTimeout : 15000,maxConnectionsPerHost : 20,maxConnections : 10000,corePoolSize : 0,maximumPoolSize : 2147483647,maxThreadIdleTime : 5,sizeOfQueue : -1,fairnessPolicy : false,useRetries : false,
   [junit4]   2> 1887212 INFO  (TEST-BasicDistributedZkTest.test-seed#[1817E361ACAC99E4]) [    ] o.a.s.u.UpdateShardHandler Creating UpdateShardHandler HTTP client with params: socketTimeout=340000&connTimeout=45000&retry=true
   [junit4]   2> 1887213 INFO  (TEST-BasicDistributedZkTest.test-seed#[1817E361ACAC99E4]) [    ] o.a.s.l.LogWatcher SLF4J impl is org.slf4j.impl.Log4jLoggerFactory
   [junit4]   2> 1887213 INFO  (TEST-BasicDistributedZkTest.test-seed#[1817E361ACAC99E4]) [    ] o.a.s.l.LogWatcher Registering Log Listener [Log4j (org.slf4j.impl.Log4jLoggerFactory)]
   [junit4]   2> 1887213 INFO  (TEST-BasicDistributedZkTest.test-seed#[1817E361ACAC99E4]) [    ] o.a.s.c.ZkContainer Zookeeper client=127.0.0.1:39969/solr
   [junit4]   2> 1887215 INFO  (TEST-BasicDistributedZkTest.test-seed#[1817E361ACAC99E4]) [    ] o.a.s.c.ZkController zkHost includes chroot
   [junit4]   2> 1887215 INFO  (TEST-BasicDistributedZkTest.test-seed#[1817E361ACAC99E4]) [    ] o.a.s.c.c.SolrZkClient Using default ZkCredentialsProvider
   [junit4]   2> 1887251 INFO  (TEST-BasicDistributedZkTest.test-seed#[1817E361ACAC99E4]) [    ] o.a.s.c.c.ConnectionManager Waiting for client to connect to ZooKeeper
   [junit4]   2> 1887290 INFO  (zkCallback-1764-thread-1) [    ] o.a.s.c.c.ConnectionManager Watcher org.apache.solr.common.cloud.ConnectionManager@1da124d5 name:ZooKeeperConnection Watcher:127.0.0.1:39969 got event WatchedEvent state:SyncConnected type:None path:null path:null type:None
   [junit4]   2> 1887290 INFO  (TEST-BasicDistributedZkTest.test-seed#[1817E361ACAC99E4]) [    ] o.a.s.c.c.ConnectionManager Client is connected to ZooKeeper
   [junit4]   2> 1887291 INFO  (TEST-BasicDistributedZkTest.test-seed#[1817E361ACAC99E4]) [    ] o.a.s.c.c.SolrZkClient Using default ZkACLProvider
   [junit4]   2> 1887293 INFO  (TEST-BasicDistributedZkTest.test-seed#[1817E361ACAC99E4]) [n:127.0.0.1:37382_    ] o.a.s.c.c.ConnectionManager Waiting for client to connect to ZooKeeper
   [junit4]   2> 1887295 INFO  (zkCallback-1765-thread-1-processing-n:127.0.0.1:37382_) [n:127.0.0.1:37382_    ] o.a.s.c.c.ConnectionManager Watcher org.apache.solr.common.cloud.ConnectionManager@34b71c5c name:ZooKeeperConnection Watcher:127.0.0.1:39969/solr got event WatchedEvent state:SyncConnected type:None path:null path:null type:None
   [junit4]   2> 1887295 INFO  (TEST-BasicDistributedZkTest.test-seed#[1817E361ACAC99E4]) [n:127.0.0.1:37382_    ] o.a.s.c.c.ConnectionManager Client is connected to ZooKeeper
   [junit4]   2> 1887301 INFO  (TEST-BasicDistributedZkTest.test-seed#[1817E361ACAC99E4]) [n:127.0.0.1:37382_    ] o.a.s.c.c.ZkStateReader Updating cluster state from ZooKeeper... 
   [junit4]   2> 1888305 INFO  (TEST-BasicDistributedZkTest.test-seed#[1817E361ACAC99E4]) [n:127.0.0.1:37382_    ] o.a.s.c.ZkController Register node as live in ZooKeeper:/live_nodes/127.0.0.1:37382_
   [junit4]   2> 1888306 INFO  (TEST-BasicDistributedZkTest.test-seed#[1817E361ACAC99E4]) [n:127.0.0.1:37382_    ] o.a.s.c.c.SolrZkClient makePath: /live_nodes/127.0.0.1:37382_
   [junit4]   2> 1888307 INFO  (zkCallback-1759-thread-1-processing-n:127.0.0.1:60904_) [n:127.0.0.1:60904_    ] o.a.s.c.c.ZkStateReader A live node change: [WatchedEvent state:SyncConnected type:NodeChildrenChanged path:/live_nodes], has occurred - updating... (live nodes size: [1])
   [junit4]   2> 1888307 INFO  (zkCallback-1761-thread-1) [    ] o.a.s.c.c.ZkStateReader A live node change: [WatchedEvent state:SyncConnected type:NodeChildrenChanged path:/live_nodes], has occurred - updating... (live nodes size: [1])
   [junit4]   2> 1888308 INFO  (zkCallback-1765-thread-1-processing-n:127.0.0.1:37382_) [n:127.0.0.1:37382_    ] o.a.s.c.c.ZkStateReader A live node change: [WatchedEvent state:SyncConnected type:NodeChildrenChanged path:/live_nodes], has occurred - updating... (live nodes size: [1])
   [junit4]   2> 1888308 INFO  (TEST-BasicDistributedZkTest.test-seed#[1817E361ACAC99E4]) [n:127.0.0.1:37382_    ] o.a.s.c.Overseer Overseer (id=null) closing
   [junit4]   2> 1888309 INFO  (TEST-BasicDistributedZkTest.test-seed#[1817E361ACAC99E4]) [n:127.0.0.1:37382_    ] o.a.s.c.LeaderElector Joined leadership election with path: /overseer_elect/election/95213991123484680-127.0.0.1:37382_-n_0000000001
   [junit4]   2> 1888309 INFO  (TEST-BasicDistributedZkTest.test-seed#[1817E361ACAC99E4]) [n:127.0.0.1:37382_    ] o.a.s.c.LeaderElector Watching path /overseer_elect/election/95213991123484676-127.0.0.1:60904_-n_0000000000 to know if I could be the leader
   [junit4]   2> 1888330 INFO  (TEST-BasicDistributedZkTest.test-seed#[1817E361ACAC99E4]) [n:127.0.0.1:37382_    ] o.a.s.c.CoreContainer Security conf doesn't exist. Skipping setup for authorization module.
   [junit4]   2> 1888330 INFO  (TEST-BasicDistributedZkTest.test-seed#[1817E361ACAC99E4]) [n:127.0.0.1:37382_    ] o.a.s.c.CoreContainer No authentication plugin used.
   [junit4]   2> 1888331 INFO  (TEST-BasicDistributedZkTest.test-seed#[1817E361ACAC99E4]) [n:127.0.0.1:37382_    ] o.a.s.c.CorePropertiesLocator Looking for core definitions underneath /x1/jenkins/jenkins-slave/workspace/Lucene-Solr-NightlyTests-5.x/solr/build/solr-core/test/J0/../../../../../../../../../../x1/jenkins/jenkins-slave/workspace/Lucene-Solr-NightlyTests-5.x/solr/build/solr-core/test/J0/temp/solr.cloud.BasicDistributedZkTest_1817E361ACAC99E4-001/shard-1-001/cores
   [junit4]   2> 1888332 INFO  (TEST-BasicDistributedZkTest.test-seed#[1817E361ACAC99E4]) [n:127.0.0.1:37382_    ] o.a.s.c.CoreDescriptor Created CoreDescriptor: {name=collection1, coreNodeName=, dataDir=data/, collection=collection1, configSetProperties=configsetprops.json, shard=, schema=schema.xml, transient=false, config=solrconfig.xml, loadOnStartup=true}
   [junit4]   2> 1888332 INFO  (TEST-BasicDistributedZkTest.test-seed#[1817E361ACAC99E4]) [n:127.0.0.1:37382_    ] o.a.s.c.CorePropertiesLocator Found core collection1 in /x1/jenkins/jenkins-slave/workspace/Lucene-Solr-NightlyTests-5.x/solr/build/solr-core/test/J0/../../../../../../../../../../x1/jenkins/jenkins-slave/workspace/Lucene-Solr-NightlyTests-5.x/solr/build/solr-core/test/J0/temp/solr.cloud.BasicDistributedZkTest_1817E361ACAC99E4-001/shard-1-001/cores/collection1
   [junit4]   2> 1888332 INFO  (TEST-BasicDistributedZkTest.test-seed#[1817E361ACAC99E4]) [n:127.0.0.1:37382_    ] o.a.s.c.CorePropertiesLocator Found 1 core definitions
   [junit4]   2> 1888334 INFO  (coreLoadExecutor-3401-thread-1-processing-n:127.0.0.1:37382_) [n:127.0.0.1:37382_ c:collection1   x:collection1] o.a.s.c.ZkController publishing state=down
   [junit4]   2> 1888334 INFO  (coreLoadExecutor-3401-thread-1-processing-n:127.0.0.1:37382_) [n:127.0.0.1:37382_ c:collection1   x:collection1] o.a.s.c.ZkController numShards not found on descriptor - reading it from system property
   [junit4]   2> 1888336 INFO  (OverseerStateUpdate-95213991123484676-127.0.0.1:60904_-n_0000000000) [n:127.0.0.1:60904_    ] o.a.s.c.Overseer processMessage: queueSize: 1, message = {
   [junit4]   2>   "roles":null,
   [junit4]   2>   "state":"down",
   [junit4]   2>   "numShards":"2",
   [junit4]   2>   "shard":null,
   [junit4]   2>   "collection":"collection1",
   [junit4]   2>   "operation":"state",
   [junit4]   2>   "core":"collection1",
   [junit4]   2>   "node_name":"127.0.0.1:37382_",
   [junit4]   2>   "base_url":"http://127.0.0.1:37382"} current state version: 3
   [junit4]   2> 1888336 INFO  (OverseerStateUpdate-95213991123484676-127.0.0.1:60904_-n_0000000000) [n:127.0.0.1:60904_    ] o.a.s.c.o.ReplicaMutator Update state numShards=2 message={
   [junit4]   2>   "roles":null,
   [junit4]   2>   "state":"down",
   [junit4]   2>   "numShards":"2",
   [junit4]   2>   "shard":null,
   [junit4]   2>   "collection":"collection1",
   [junit4]   2>   "operation":"state",
   [junit4]   2>   "core":"collection1",
   [junit4]   2>   "node_name":"127.0.0.1:37382_",
   [junit4]   2>   "base_url":"http://127.0.0.1:37382"}
   [junit4]   2> 1888336 INFO  (OverseerStateUpdate-95213991123484676-127.0.0.1:60904_-n_0000000000) [n:127.0.0.1:60904_    ] o.a.s.c.o.ClusterStateMutator building a new cName: collection1
   [junit4]   2> 1888336 INFO  (OverseerStateUpdate-95213991123484676-127.0.0.1:60904_-n_0000000000) [n:127.0.0.1:60904_    ] o.a.s.c.o.ReplicaMutator Assigning new node to shard shard=shard2
   [junit4]   2> 1888338 INFO  (coreLoadExecutor-3401-thread-1-processing-n:127.0.0.1:37382_) [n:127.0.0.1:37382_ c:collection1   x:collection1] o.a.s.c.ZkController look for our core node name
   [junit4]   2> 1888339 INFO  (TEST-BasicDistributedZkTest.test-seed#[1817E361ACAC99E4]) [n:127.0.0.1:37382_    ] o.a.s.s.SolrDispatchFilter user.dir=/x1/jenkins/jenkins-slave/workspace/Lucene-Solr-NightlyTests-5.x/solr/build/solr-core/test/J0
   [junit4]   2> 1888339 INFO  (TEST-BasicDistributedZkTest.test-seed#[1817E361ACAC99E4]) [n:127.0.0.1:37382_    ] o.a.s.s.SolrDispatchFilter SolrDispatchFilter.init() done
   [junit4]   2> 1888441 INFO  (zkCallback-1761-thread-1) [    ] o.a.s.c.c.ZkStateReader A cluster state change: [WatchedEvent state:SyncConnected type:NodeDataChanged path:/clusterstate.json], has occurred - updating... (live nodes size: [2])
   [junit4]   2> 1888441 INFO  (zkCallback-1765-thread-1-processing-n:127.0.0.1:37382_) [n:127.0.0.1:37382_    ] o.a.s.c.c.ZkStateReader A cluster state change: [WatchedEvent state:SyncConnected type:NodeDataChanged path:/clusterstate.json], has occurred - updating... (live nodes size: [2])
   [junit4]   2> 1888441 INFO  (zkCallback-1759-thread-1-processing-n:127.0.0.1:60904_) [n:127.0.0.1:60904_    ] o.a.s.c.c.ZkStateReader A cluster state change: [WatchedEvent state:SyncConnected type:NodeDataChanged path:/clusterstate.json], has occurred - updating... (live nodes size: [2])
   [junit4]   2> 1889339 INFO  (coreLoadExecutor-3401-thread-1-processing-n:127.0.0.1:37382_) [n:127.0.0.1:37382_ c:collection1   x:collection1] o.a.s.c.ZkController waiting to find shard id in clusterstate for collection1
   [junit4]   2> 1889339 INFO  (coreLoadExecutor-3401-thread-1-processing-n:127.0.0.1:37382_) [n:127.0.0.1:37382_ c:collection1   x:collection1] o.a.s.c.ZkController Check for collection zkNode:collection1
   [junit4]   2> 1889340 INFO  (coreLoadExecutor-3401-thread-1-processing-n:127.0.0.1:37382_) [n:127.0.0.1:37382_ c:collection1   x:collection1] o.a.s.c.ZkController Collection zkNode exists
   [junit4]   2> 1889340 INFO  (coreLoadExecutor-3401-thread-1-processing-n:127.0.0.1:37382_) [n:127.0.0.1:37382_ c:collection1   x:collection1] o.a.s.c.c.ZkStateReader Load collection config from: [/collections/collection1]
   [junit4]   2> 1889340 INFO  (coreLoadExecutor-3401-thread-1-processing-n:127.0.0.1:37382_) [n:127.0.0.1:37382_ c:collection1   x:collection1] o.a.s.c.c.ZkStateReader path=[/collections/collection1] [configName]=[conf1] specified config exists in ZooKeeper
   [junit4]   2> 1889340 INFO  (coreLoadExecutor-3401-thread-1-processing-n:127.0.0.1:37382_) [n:127.0.0.1:37382_ c:collection1   x:collection1] o.a.s.c.SolrResourceLoader new SolrResourceLoader for directory: '/x1/jenkins/jenkins-slave/workspace/Lucene-Solr-NightlyTests-5.x/solr/build/solr-core/test/J0/temp/solr.cloud.BasicDistributedZkTest_1817E361ACAC99E4-001/shard-1-001/cores/collection1'
   [junit4]   2> 1889340 INFO  (coreLoadExecutor-3401-thread-1-processing-n:127.0.0.1:37382_) [n:127.0.0.1:37382_ c:collection1   x:collection1] o.a.s.c.SolrResourceLoader JNDI not configured for solr (NoInitialContextEx)
   [junit4]   2> 1889341 INFO  (coreLoadExecutor-3401-thread-1-processing-n:127.0.0.1:37382_) [n:127.0.0.1:37382_ c:collection1   x:collection1] o.a.s.c.SolrResourceLoader solr home defaulted to 'solr/' (could not find system property or JNDI)
   [junit4]   2> 1889342 INFO  (coreLoadExecutor-3401-thread-1-processing-n:127.0.0.1:37382_) [n:127.0.0.1:37382_ c:collection1   x:collection1] o.a.s.c.Config loaded config solrconfig.xml with version 0 
   [junit4]   2> 1889348 INFO  (coreLoadExecutor-3401-thread-1-processing-n:127.0.0.1:37382_) [n:127.0.0.1:37382_ c:collection1   x:collection1] o.a.s.c.SolrConfig current version of requestparams : -1
   [junit4]   2> 1889362 INFO  (coreLoadExecutor-3401-thread-1-processing-n:127.0.0.1:37382_) [n:127.0.0.1:37382_ c:collection1   x:collection1] o.a.s.c.SolrConfig Using Lucene MatchVersion: 5.5.0
   [junit4]   2> 1889391 INFO  (coreLoadExecutor-3401-thread-1-processing-n:127.0.0.1:37382_) [n:127.0.0.1:37382_ c:collection1   x:collection1] o.a.s.c.SolrConfig Loaded SolrConfig: solrconfig.xml
   [junit4]   2> 1889399 INFO  (coreLoadExecutor-3401-thread-1-processing-n:127.0.0.1:37382_) [n:127.0.0.1:37382_ c:collection1   x:collection1] o.a.s.s.IndexSchema [collection1] Schema name=test
   [junit4]   2> 1889652 INFO  (coreLoadExecutor-3401-thread-1-processing-n:127.0.0.1:37382_) [n:127.0.0.1:37382_ c:collection1   x:collection1] o.a.s.s.OpenExchangeRatesOrgProvider Initialized with rates=open-exchange-rates.json, refreshInterval=1440.
   [junit4]   2> 1889660 INFO  (coreLoadExecutor-3401-thread-1-processing-n:127.0.0.1:37382_) [n:127.0.0.1:37382_ c:collection1   x:collection1] o.a.s.s.IndexSchema default search field in schema is text
   [junit4]   2> 1889662 INFO  (coreLoadExecutor-3401-thread-1-processing-n:127.0.0.1:37382_) [n:127.0.0.1:37382_ c:collection1   x:collection1] o.a.s.s.IndexSchema unique key field: id
   [junit4]   2> 1889671 INFO  (coreLoadExecutor-3401-thread-1-processing-n:127.0.0.1:37382_) [n:127.0.0.1:37382_ c:collection1   x:collection1] o.a.s.s.FileExchangeRateProvider Reloading exchange rates from file currency.xml
   [junit4]   2> 1889674 INFO  (coreLoadExecutor-3401-thread-1-processing-n:127.0.0.1:37382_) [n:127.0.0.1:37382_ c:collection1   x:collection1] o.a.s.s.FileExchangeRateProvider Reloading exchange rates from file currency.xml
   [junit4]   2> 1889676 INFO  (coreLoadExecutor-3401-thread-1-processing-n:127.0.0.1:37382_) [n:127.0.0.1:37382_ c:collection1   x:collection1] o.a.s.s.OpenExchangeRatesOrgProvider Reloading exchange rates from open-exchange-rates.json
   [junit4]   2> 1889677 INFO  (coreLoadExecutor-3401-thread-1-processing-n:127.0.0.1:37382_) [n:127.0.0.1:37382_ c:collection1   x:collection1] o.a.s.s.OpenExchangeRatesOrgProvider Reloading exchange rates from open-exchange-rates.json
   [junit4]   2> 1889679 INFO  (coreLoadExecutor-3401-thread-1-processing-n:127.0.0.1:37382_) [n:127.0.0.1:37382_ c:collection1   x:collection1] o.a.s.c.ConfigSetProperties Did not find ConfigSet properties, assuming default properties: Can't find resource 'configsetprops.json' in classpath or '/configs/conf1', cwd=/x1/jenkins/jenkins-slave/workspace/Lucene-Solr-NightlyTests-5.x/solr/build/solr-core/test/J0
   [junit4]   2> 1889679 INFO  (coreLoadExecutor-3401-thread-1-processing-n:127.0.0.1:37382_) [n:127.0.0.1:37382_ c:collection1   x:collection1] o.a.s.c.CoreContainer Creating SolrCore 'collection1' using configuration from collection collection1
   [junit4]   2> 1889679 INFO  (coreLoadExecutor-3401-thread-1-processing-n:127.0.0.1:37382_) [n:127.0.0.1:37382_ c:collection1 s:shard2 r:core_node1 x:collection1] o.a.s.c.SolrCore org.apache.solr.core.MockDirectoryFactory
   [junit4]   2> 1889679 INFO  (coreLoadExecutor-3401-thread-1-processing-n:127.0.0.1:37382_) [n:127.0.0.1:37382_ c:collection1 s:shard2 r:core_node1 x:collection1] o.a.s.c.SolrCore [[collection1] ] Opening new SolrCore at [/x1/jenkins/jenkins-slave/workspace/Lucene-Solr-NightlyTests-5.x/solr/build/solr-core/test/J0/temp/solr.cloud.BasicDistributedZkTest_1817E361ACAC99E4-001/shard-1-001/cores/collection1], dataDir=[/x1/jenkins/jenkins-slave/workspace/Lucene-Solr-NightlyTests-5.x/solr/build/solr-core/test/J0/../../../../../../../../../../x1/jenkins/jenkins-slave/workspace/Lucene-Solr-NightlyTests-5.x/solr/build/solr-core/test/J0/temp/solr.cloud.BasicDistributedZkTest_1817E361ACAC99E4-001/shard-1-001/cores/collection1/data/]
   [junit4]   2> 1889679 INFO  (coreLoadExecutor-3401-thread-1-processing-n:127.0.0.1:37382_) [n:127.0.0.1:37382_ c:collection1 s:shard2 r:core_node1 x:collection1] o.a.s.c.JmxMonitoredMap JMX monitoring is enabled. Adding Solr mbeans to JMX Server: com.sun.jmx.mbeanserver.JmxMBeanServer@3ca63627
   [junit4]   2> 1889680 INFO  (coreLoadExecutor-3401-thread-1-processing-n:127.0.0.1:37382_) [n:127.0.0.1:37382_ c:collection1 s:shard2 r:core_node1 x:collection1] o.a.s.c.CachingDirectoryFactory return new directory for /x1/jenkins/jenkins-slave/workspace/Lucene-Solr-NightlyTests-5.x/solr/build/solr-core/test/J0/../../../../../../../../../../x1/jenkins/jenkins-slave/workspace/Lucene-Solr-NightlyTests-5.x/solr/build/solr-core/test/J0/temp/solr.cloud.BasicDistributedZkTest_1817E361ACAC99E4-001/shard-1-001/cores/collection1/data
   [junit4]   2> 1889680 INFO  (coreLoadExecutor-3401-thread-1-processing-n:127.0.0.1:37382_) [n:127.0.0.1:37382_ c:collection1 s:shard2 r:core_node1 x:collection1] o.a.s.c.SolrCore New index directory detected: old=null new=/x1/jenkins/jenkins-slave/workspace/Lucene-Solr-NightlyTests-5.x/solr/build/solr-core/test/J0/../../../../../../../../../../x1/jenkins/jenkins-slave/workspace/Lucene-Solr-NightlyTests-5.x/solr/build/solr-core/test/J0/temp/solr.cloud.BasicDistributedZkTest_1817E361ACAC99E4-001/shard-1-001/cores/collection1/data/index/
   [junit4]   2> 1889680 WARN  (coreLoadExecutor-3401-thread-1-processing-n:127.0.0.1:37382_) [n:127.0.0.1:37382_ c:collection1 s:shard2 r:core_node1 x:collection1] o.a.s.c.SolrCore [collection1] Solr index directory '/x1/jenkins/jenkins-slave/workspace/Lucene-Solr-NightlyTests-5.x/solr/build/solr-core/test/J0/../../../../../../../../../../x1/jenkins/jenkins-slave/workspace/Lucene-Solr-NightlyTests-5.x/solr/build/solr-core/test/J0/temp/solr.cloud.BasicDistributedZkTest_1817E361ACAC99E4-001/shard-1-001/cores/collection1/data/index' doesn't exist. Creating new index...
   [junit4]   2> 1889681 INFO  (coreLoadExecutor-3401-thread-1-processing-n:127.0.0.1:37382_) [n:127.0.0.1:37382_ c:collection1 s:shard2 r:core_node1 x:collection1] o.a.s.c.CachingDirectoryFactory return new directory for /x1/jenkins/jenkins-slave/workspace/Lucene-Solr-NightlyTests-5.x/solr/build/solr-core/test/J0/../../../../../../../../../../x1/jenkins/jenkins-slave/workspace/Lucene-Solr-NightlyTests-5.x/solr/build/solr-core/test/J0/temp/solr.cloud.BasicDistributedZkTest_1817E361ACAC99E4-001/shard-1-001/cores/collection1/data/index
   [junit4]   2> 1889681 INFO  (coreLoadExecutor-3401-thread-1-processing-n:127.0.0.1:37382_) [n:127.0.0.1:37382_ c:collection1 s:shard2 r:core_node1 x:collection1] o.a.s.u.RandomMergePolicy RandomMergePolicy wrapping class org.apache.lucene.index.MockRandomMergePolicy: org.apache.lucene.index.MockRandomMergePolicy@107bc95c
   [junit4]   2> 1889684 INFO  (coreLoadExecutor-3401-thread-1-processing-n:127.0.0.1:37382_) [n:127.0.0.1:37382_ c:collection1 s:shard2 r:core_node1 x:collection1] o.a.s.c.SolrDeletionPolicy SolrDeletionPolicy.onCommit: commits: num=1
   [junit4]   2> 	commit{dir=RawDirectoryWrapper(NIOFSDirectory@/x1/jenkins/jenkins-slave/workspace/Lucene-Solr-NightlyTests-5.x/solr/build/solr-core/test/J0/temp/solr.cloud.BasicDistributedZkTest_1817E361ACAC99E4-001/index-NIOFSDirectory-002 lockFactory=org.apache.lucene.store.NativeFSLockFactory@5cc4aaec),segFN=segments_1,generation=1}
   [junit4]   2> 1889684 INFO  (coreLoadExecutor-3401-thread-1-processing-n:127.0.0.1:37382_) [n:127.0.0.1:37382_ c:collection1 s:shard2 r:core_node1 x:collection1] o.a.s.c.SolrDeletionPolicy newest commit generation = 1
   [junit4]   2> 1889685 INFO  (OldIndexDirectoryCleanupThreadForCore-collection1) [n:127.0.0.1:37382_ c:collection1 s:shard2 r:core_node1 x:collection1] o.a.s.c.SolrCore Looking for old index directories to cleanup for core collection1 in /x1/jenkins/jenkins-slave/workspace/Lucene-Solr-NightlyTests-5.x/solr/build/solr-core/test/J0/../../../../../../../../../../x1/jenkins/jenkins-slave/workspace/Lucene-Solr-NightlyTests-5.x/solr/build/solr-core/test/J0/temp/solr.cloud.BasicDistributedZkTest_1817E361ACAC99E4-001/shard-1-001/cores/collection1/data/
   [junit4]   2> 1889685 WARN  (OldIndexDirectoryCleanupThreadForCore-collection1) [n:127.0.0.1:37382_ c:collection1 s:shard2 r:core_node1 x:collection1] o.a.s.c.DirectoryFactory /x1/jenkins/jenkins-slave/workspace/Lucene-Solr-NightlyTests-5.x/solr/build/solr-core/test/J0/../../../../../../../../../../x1/jenkins/jenkins-slave/workspace/Lucene-Solr-NightlyTests-5.x/solr/build/solr-core/test/J0/temp/solr.cloud.BasicDistributedZkTest_1817E361ACAC99E4-001/shard-1-001/cores/collection1/data/ does not point to a valid data directory; skipping clean-up of old index directories.
   [junit4]   2> 1889690 INFO  (coreLoadExecutor-3401-thread-1-processing-n:127.0.0.1:37382_) [n:127.0.0.1:37382_ c:collec

[...truncated too long message...]

 o.a.s.c.CachingDirectoryFactory Closing directory: /x1/jenkins/jenkins-slave/workspace/Lucene-Solr-NightlyTests-5.x/solr/build/solr-core/test/J0/../../../../../../../../../../x1/jenkins/jenkins-slave/workspace/Lucene-Solr-NightlyTests-5.x/solr/build/solr-core/test/J0/temp/solr.cloud.BasicDistributedZkTest_1817E361ACAC99E4-001/shard-4-001/cores/collection1/data/index
   [junit4]   2> 1963576 INFO  (TEST-BasicDistributedZkTest.test-seed#[1817E361ACAC99E4]) [    ] o.e.j.s.ServerConnector Stopped ServerConnector@6893394c{HTTP/1.1}{127.0.0.1:0}
   [junit4]   2> 1963576 INFO  (TEST-BasicDistributedZkTest.test-seed#[1817E361ACAC99E4]) [    ] o.e.j.s.h.ContextHandler Stopped o.e.j.s.ServletContextHandler@150c8397{/,null,UNAVAILABLE}
   [junit4]   2> 1963578 INFO  (TEST-BasicDistributedZkTest.test-seed#[1817E361ACAC99E4]) [n:127.0.0.1:47355_ c:collection3 s:shard1 r:core_node4 x:collection3] o.a.s.c.ZkTestServer connecting to 127.0.0.1:39969 39969
   [junit4]   2> 1963698 INFO  (Thread-3374) [    ] o.a.s.c.ZkTestServer connecting to 127.0.0.1:39969 39969
   [junit4]   2> 1963699 WARN  (Thread-3374) [    ] o.a.s.c.ZkTestServer Watch limit violations: 
   [junit4]   2> Maximum concurrent create/delete watches above limit:
   [junit4]   2> 
   [junit4]   2> 	7	/solr/aliases.json
   [junit4]   2> 	5	/solr/configs/conf1
   [junit4]   2> 	5	/solr/security.json
   [junit4]   2> 
   [junit4]   2> Maximum concurrent data watches above limit:
   [junit4]   2> 
   [junit4]   2> 	7	/solr/clusterstate.json
   [junit4]   2> 
   [junit4]   2> Maximum concurrent children watches above limit:
   [junit4]   2> 
   [junit4]   2> 	7	/solr/live_nodes
   [junit4]   2> 	7	/solr/collections
   [junit4]   2> 	4	/solr/overseer/collection-queue-work
   [junit4]   2> 	4	/solr/overseer/queue
   [junit4]   2> 	4	/solr/overseer/queue-work
   [junit4]   2> 
   [junit4]   2> NOTE: download the large Jenkins line-docs file by running 'ant get-jenkins-line-docs' in the lucene directory.
   [junit4]   2> NOTE: reproduce with: ant test  -Dtestcase=BasicDistributedZkTest -Dtests.method=test -Dtests.seed=1817E361ACAC99E4 -Dtests.multiplier=2 -Dtests.nightly=true -Dtests.slow=true -Dtests.linedocsfile=/x1/jenkins/lucene-data/enwiki.random.lines.txt -Dtests.locale=fr_CH -Dtests.timezone=Asia/Nicosia -Dtests.asserts=true -Dtests.file.encoding=UTF-8
   [junit4] ERROR   79.2s J0 | BasicDistributedZkTest.test <<<
   [junit4]    > Throwable #1: org.apache.solr.client.solrj.impl.HttpSolrClient$RemoteSolrException: Error from server at http://127.0.0.1:37382/collection1: Bad Request
   [junit4]    > request: http://127.0.0.1:41246/collection1/update?update.chain=distrib-dup-test-chain-explicit&update.distrib=TOLEADER&distrib.from=http%3A%2F%2F127.0.0.1%3A37382%2Fcollection1%2F&wt=javabin&version=2
   [junit4]    > 	at __randomizedtesting.SeedInfo.seed([1817E361ACAC99E4:9043DCBB0250F41C]:0)
   [junit4]    > 	at org.apache.solr.client.solrj.impl.HttpSolrClient.executeMethod(HttpSolrClient.java:576)
   [junit4]    > 	at org.apache.solr.client.solrj.impl.HttpSolrClient.request(HttpSolrClient.java:240)
   [junit4]    > 	at org.apache.solr.client.solrj.impl.HttpSolrClient.request(HttpSolrClient.java:229)
   [junit4]    > 	at org.apache.solr.client.solrj.SolrRequest.process(SolrRequest.java:150)
   [junit4]    > 	at org.apache.solr.client.solrj.SolrRequest.process(SolrRequest.java:167)
   [junit4]    > 	at org.apache.solr.BaseDistributedSearchTestCase.add(BaseDistributedSearchTestCase.java:512)
   [junit4]    > 	at org.apache.solr.cloud.BasicDistributedZkTest.testUpdateProcessorsRunOnlyOnce(BasicDistributedZkTest.java:653)
   [junit4]    > 	at org.apache.solr.cloud.BasicDistributedZkTest.test(BasicDistributedZkTest.java:364)
   [junit4]    > 	at org.apache.solr.BaseDistributedSearchTestCase$ShardsRepeatRule$ShardsFixedStatement.callStatement(BaseDistributedSearchTestCase.java:965)
   [junit4]    > 	at org.apache.solr.BaseDistributedSearchTestCase$ShardsRepeatRule$ShardsStatement.evaluate(BaseDistributedSearchTestCase.java:940)
   [junit4]    > 	at java.lang.Thread.run(Thread.java:745)
   [junit4]   2> 1963704 INFO  (SUITE-BasicDistributedZkTest-seed#[1817E361ACAC99E4]-worker) [n:127.0.0.1:47355_ c:collection3 s:shard1 r:core_node4 x:collection3] o.a.s.SolrTestCaseJ4 ###deleteCore
   [junit4]   2> NOTE: leaving temporary files on disk at: /x1/jenkins/jenkins-slave/workspace/Lucene-Solr-NightlyTests-5.x/solr/build/solr-core/test/J0/temp/solr.cloud.BasicDistributedZkTest_1817E361ACAC99E4-001
   [junit4]   2> Jan 15, 2016 9:31:25 AM com.carrotsearch.randomizedtesting.ThreadLeakControl checkThreadLeaks
   [junit4]   2> WARNING: Will linger awaiting termination of 1 leaked thread(s).
   [junit4]   2> NOTE: test params are: codec=Asserting(Lucene54): {n_d1=PostingsFormat(name=LuceneFixedGap), intDefault=Lucene50(blocksize=128), foo_b=TestBloomFilteredLucenePostings(BloomFilteringPostingsFormat(Lucene50(blocksize=128))), regex_dup_B_s=PostingsFormat(name=LuceneFixedGap), n_l1=PostingsFormat(name=LuceneFixedGap), author_t=Lucene50(blocksize=128), text=TestBloomFilteredLucenePostings(BloomFilteringPostingsFormat(Lucene50(blocksize=128))), genre_s=BlockTreeOrds(blocksize=128), price=TestBloomFilteredLucenePostings(BloomFilteringPostingsFormat(Lucene50(blocksize=128))), regex_dup_A_s=TestBloomFilteredLucenePostings(BloomFilteringPostingsFormat(Lucene50(blocksize=128))), foo_i=Lucene50(blocksize=128), a_t=PostingsFormat(name=LuceneFixedGap), SubjectTerms_mfacet=Lucene50(blocksize=128), foo_f=TestBloomFilteredLucenePostings(BloomFilteringPostingsFormat(Lucene50(blocksize=128))), n_td1=Lucene50(blocksize=128), id=BlockTreeOrds(blocksize=128), n_f1=Lucene50(blocksize=128), sequence_i=BlockTreeOrds(blocksize=128), oddField_s=BlockTreeOrds(blocksize=128), range_facet_i_dv=PostingsFormat(name=LuceneFixedGap), n_tf1=PostingsFormat(name=LuceneFixedGap), inStock=TestBloomFilteredLucenePostings(BloomFilteringPostingsFormat(Lucene50(blocksize=128))), val_i=BlockTreeOrds(blocksize=128), name=BlockTreeOrds(blocksize=128), rnd_b=BlockTreeOrds(blocksize=128), other_tl1=Lucene50(blocksize=128), n_tdt1=Lucene50(blocksize=128), range_facet_l_dv=BlockTreeOrds(blocksize=128), timestamp=PostingsFormat(name=LuceneFixedGap), cat=PostingsFormat(name=LuceneFixedGap), a_i1=PostingsFormat(name=LuceneFixedGap), foo_d=BlockTreeOrds(blocksize=128), n_dt1=Lucene50(blocksize=128), series_t=Lucene50(blocksize=128), range_facet_l=PostingsFormat(name=LuceneFixedGap), n_tl1=Lucene50(blocksize=128), multiDefault=PostingsFormat(name=LuceneFixedGap), _version_=Lucene50(blocksize=128), n_ti1=BlockTreeOrds(blocksize=128)}, docValues:{timestamp=DocValuesFormat(name=Direct), range_facet_i_dv=DocValuesFormat(name=Direct), range_facet_l_dv=DocValuesFormat(name=Lucene54)}, sim=DefaultSimilarity, locale=fr_CH, timezone=Asia/Nicosia
   [junit4]   2> NOTE: Linux 3.13.0-52-generic amd64/Oracle Corporation 1.7.0_80 (64-bit)/cpus=4,threads=1,free=291418576,total=501743616
   [junit4]   2> NOTE: All tests run in this JVM: [TestFunctionQuery, SortSpecParsingTest, TestRandomFaceting, PolyFieldTest, TestManagedSynonymFilterFactory, BlockJoinFacetSimpleTest, TestSolr4Spatial2, ParsingFieldUpdateProcessorsTest, TestSchemaNameResource, TestLuceneMatchVersion, TestLazyCores, DistributedVersionInfoTest, TestFieldTypeCollectionResource, TestMaxScoreQueryParser, TestConfigSetsAPIZkFailure, SyncSliceTest, TestRebalanceLeaders, TestRTGBase, TestRandomDVFaceting, SpatialRPTFieldTypeTest, JavabinLoaderTest, TestRTimerTree, DistributedDebugComponentTest, CleanupOldIndexTest, ResourceLoaderTest, SOLR749Test, AlternateDirectoryTest, TestAtomicUpdateErrorCases, TestFaceting, ReturnFieldsTest, TestJsonRequest, ActionThrottleTest, TestManagedSchema, TestShardHandlerFactory, BufferStoreTest, SignatureUpdateProcessorFactoryTest, ShardSplitTest, TriLevelCompositeIdRoutingTest, TestJoin, TestIBSimilarityFactory, PreAnalyzedFieldTest, EchoParamsTest, DistributedQueryElevationComponentTest, TestInitParams, LeaderFailoverAfterPartitionTest, TestSolrCLIRunExample, HdfsDirectoryFactoryTest, CurrencyFieldOpenExchangeTest, BasicAuthIntegrationTest, DistributedFacetPivotWhiteBoxTest, TestLRUCache, TestCloudManagedSchemaConcurrent, TestRemoteStreaming, TestRawResponseWriter, DocumentAnalysisRequestHandlerTest, TestMacros, TestFoldingMultitermQuery, TestTrieFacet, TestStressLucene, JsonLoaderTest, TestAuthenticationFramework, LeaderElectionIntegrationTest, TestDynamicLoading, TestHighFrequencyDictionaryFactory, TestSolrXml, TestMinMaxOnMultiValuedField, QueryEqualityTest, BasicDistributedZkTest]
   [junit4] Completed [256/565 (1!)] on J0 in 79.76s, 1 test, 1 error <<< FAILURES!

[...truncated 998 lines...]
BUILD FAILED
/x1/jenkins/jenkins-slave/workspace/Lucene-Solr-NightlyTests-5.x/build.xml:801: The following error occurred while executing this line:
/x1/jenkins/jenkins-slave/workspace/Lucene-Solr-NightlyTests-5.x/build.xml:738: The following error occurred while executing this line:
/x1/jenkins/jenkins-slave/workspace/Lucene-Solr-NightlyTests-5.x/build.xml:59: The following error occurred while executing this line:
/x1/jenkins/jenkins-slave/workspace/Lucene-Solr-NightlyTests-5.x/solr/build.xml:233: The following error occurred while executing this line:
/x1/jenkins/jenkins-slave/workspace/Lucene-Solr-NightlyTests-5.x/solr/common-build.xml:534: The following error occurred while executing this line:
/x1/jenkins/jenkins-slave/workspace/Lucene-Solr-NightlyTests-5.x/lucene/common-build.xml:1444: The following error occurred while executing this line:
/x1/jenkins/jenkins-slave/workspace/Lucene-Solr-NightlyTests-5.x/lucene/common-build.xml:1000: There were test failures: 565 suites (7 ignored), 2258 tests, 1 error, 33 ignored (18 assumptions) [seed: 1817E361ACAC99E4]

Total time: 221 minutes 58 seconds
Build step 'Invoke Ant' marked build as failure
Archiving artifacts
Recording test results
Email was triggered for: Failure - Any
Sending email for trigger: Failure - Any



Mime
View raw message