lucene-dev mailing list archives

Site index · List index
Message view « Date » · « Thread »
Top « Date » · « Thread »
From Policeman Jenkins Server <jenk...@thetaphi.de>
Subject [JENKINS-EA] Lucene-Solr-trunk-Linux (64bit/jdk-9-ea+95) - Build # 15542 - Failure!
Date Wed, 13 Jan 2016 15:25:31 GMT
Build: http://jenkins.thetaphi.de/job/Lucene-Solr-trunk-Linux/15542/
Java: 64bit/jdk-9-ea+95 -XX:-UseCompressedOops -XX:+UseParallelGC -XX:-CompactStrings

1 tests failed.
FAILED:  org.apache.solr.cloud.HttpPartitionTest.test

Error Message:
Didn't see all replicas for shard shard1 in c8n_1x2 come up within 30000 ms! ClusterState: {   "collection1":{     "replicationFactor":"1",     "shards":{       "shard1":{         "range":"80000000-ffffffff",         "state":"active",         "replicas":{"core_node2":{             "core":"collection1",             "base_url":"http://127.0.0.1:53899",             "node_name":"127.0.0.1:53899_",             "state":"active",             "leader":"true"}}},       "shard2":{         "range":"0-7fffffff",         "state":"active",         "replicas":{           "core_node1":{             "core":"collection1",             "base_url":"http://127.0.0.1:50067",             "node_name":"127.0.0.1:50067_",             "state":"active",             "leader":"true"},           "core_node3":{             "core":"collection1",             "base_url":"http://127.0.0.1:52314",             "node_name":"127.0.0.1:52314_",             "state":"active"}}}},     "router":{"name":"compositeId"},     "maxShardsPerNode":"1",     "autoAddReplicas":"false",     "autoCreated":"true"},   "control_collection":{     "replicationFactor":"1",     "shards":{"shard1":{         "range":"80000000-7fffffff",         "state":"active",         "replicas":{"core_node1":{             "core":"collection1",             "base_url":"http://127.0.0.1:55433",             "node_name":"127.0.0.1:55433_",             "state":"active",             "leader":"true"}}}},     "router":{"name":"compositeId"},     "maxShardsPerNode":"1",     "autoAddReplicas":"false",     "autoCreated":"true"},   "c8n_1x2":{     "replicationFactor":"2",     "shards":{"shard1":{         "range":"80000000-7fffffff",         "state":"active",         "replicas":{           "core_node1":{             "core":"c8n_1x2_shard1_replica2",             "base_url":"http://127.0.0.1:53899",             "node_name":"127.0.0.1:53899_",             "state":"recovering"},           "core_node2":{             "core":"c8n_1x2_shard1_replica1",             "base_url":"http://127.0.0.1:55433",             "node_name":"127.0.0.1:55433_",             "state":"active",             "leader":"true"}}}},     "router":{"name":"compositeId"},     "maxShardsPerNode":"1",     "autoAddReplicas":"false"},   "collMinRf_1x3":{     "replicationFactor":"3",     "shards":{"shard1":{         "range":"80000000-7fffffff",         "state":"active",         "replicas":{           "core_node1":{             "core":"collMinRf_1x3_shard1_replica3",             "base_url":"http://127.0.0.1:52314",             "node_name":"127.0.0.1:52314_",             "state":"active"},           "core_node2":{             "core":"collMinRf_1x3_shard1_replica2",             "base_url":"http://127.0.0.1:53899",             "node_name":"127.0.0.1:53899_",             "state":"active"},           "core_node3":{             "core":"collMinRf_1x3_shard1_replica1",             "base_url":"http://127.0.0.1:55433",             "node_name":"127.0.0.1:55433_",             "state":"active",             "leader":"true"}}}},     "router":{"name":"compositeId"},     "maxShardsPerNode":"1",     "autoAddReplicas":"false"}}

Stack Trace:
java.lang.AssertionError: Didn't see all replicas for shard shard1 in c8n_1x2 come up within 30000 ms! ClusterState: {
  "collection1":{
    "replicationFactor":"1",
    "shards":{
      "shard1":{
        "range":"80000000-ffffffff",
        "state":"active",
        "replicas":{"core_node2":{
            "core":"collection1",
            "base_url":"http://127.0.0.1:53899",
            "node_name":"127.0.0.1:53899_",
            "state":"active",
            "leader":"true"}}},
      "shard2":{
        "range":"0-7fffffff",
        "state":"active",
        "replicas":{
          "core_node1":{
            "core":"collection1",
            "base_url":"http://127.0.0.1:50067",
            "node_name":"127.0.0.1:50067_",
            "state":"active",
            "leader":"true"},
          "core_node3":{
            "core":"collection1",
            "base_url":"http://127.0.0.1:52314",
            "node_name":"127.0.0.1:52314_",
            "state":"active"}}}},
    "router":{"name":"compositeId"},
    "maxShardsPerNode":"1",
    "autoAddReplicas":"false",
    "autoCreated":"true"},
  "control_collection":{
    "replicationFactor":"1",
    "shards":{"shard1":{
        "range":"80000000-7fffffff",
        "state":"active",
        "replicas":{"core_node1":{
            "core":"collection1",
            "base_url":"http://127.0.0.1:55433",
            "node_name":"127.0.0.1:55433_",
            "state":"active",
            "leader":"true"}}}},
    "router":{"name":"compositeId"},
    "maxShardsPerNode":"1",
    "autoAddReplicas":"false",
    "autoCreated":"true"},
  "c8n_1x2":{
    "replicationFactor":"2",
    "shards":{"shard1":{
        "range":"80000000-7fffffff",
        "state":"active",
        "replicas":{
          "core_node1":{
            "core":"c8n_1x2_shard1_replica2",
            "base_url":"http://127.0.0.1:53899",
            "node_name":"127.0.0.1:53899_",
            "state":"recovering"},
          "core_node2":{
            "core":"c8n_1x2_shard1_replica1",
            "base_url":"http://127.0.0.1:55433",
            "node_name":"127.0.0.1:55433_",
            "state":"active",
            "leader":"true"}}}},
    "router":{"name":"compositeId"},
    "maxShardsPerNode":"1",
    "autoAddReplicas":"false"},
  "collMinRf_1x3":{
    "replicationFactor":"3",
    "shards":{"shard1":{
        "range":"80000000-7fffffff",
        "state":"active",
        "replicas":{
          "core_node1":{
            "core":"collMinRf_1x3_shard1_replica3",
            "base_url":"http://127.0.0.1:52314",
            "node_name":"127.0.0.1:52314_",
            "state":"active"},
          "core_node2":{
            "core":"collMinRf_1x3_shard1_replica2",
            "base_url":"http://127.0.0.1:53899",
            "node_name":"127.0.0.1:53899_",
            "state":"active"},
          "core_node3":{
            "core":"collMinRf_1x3_shard1_replica1",
            "base_url":"http://127.0.0.1:55433",
            "node_name":"127.0.0.1:55433_",
            "state":"active",
            "leader":"true"}}}},
    "router":{"name":"compositeId"},
    "maxShardsPerNode":"1",
    "autoAddReplicas":"false"}}
	at __randomizedtesting.SeedInfo.seed([A6CA607D3ABA454D:2E9E5FA7944628B5]:0)
	at org.junit.Assert.fail(Assert.java:93)
	at org.apache.solr.cloud.AbstractFullDistribZkTestBase.ensureAllReplicasAreActive(AbstractFullDistribZkTestBase.java:1864)
	at org.apache.solr.cloud.HttpPartitionTest.testRf2(HttpPartitionTest.java:349)
	at org.apache.solr.cloud.HttpPartitionTest.test(HttpPartitionTest.java:109)
	at sun.reflect.NativeMethodAccessorImpl.invoke0(Native Method)
	at sun.reflect.NativeMethodAccessorImpl.invoke(NativeMethodAccessorImpl.java:62)
	at sun.reflect.DelegatingMethodAccessorImpl.invoke(DelegatingMethodAccessorImpl.java:43)
	at java.lang.reflect.Method.invoke(Method.java:520)
	at com.carrotsearch.randomizedtesting.RandomizedRunner.invoke(RandomizedRunner.java:1764)
	at com.carrotsearch.randomizedtesting.RandomizedRunner$8.evaluate(RandomizedRunner.java:871)
	at com.carrotsearch.randomizedtesting.RandomizedRunner$9.evaluate(RandomizedRunner.java:907)
	at com.carrotsearch.randomizedtesting.RandomizedRunner$10.evaluate(RandomizedRunner.java:921)
	at org.apache.solr.BaseDistributedSearchTestCase$ShardsRepeatRule$ShardsFixedStatement.callStatement(BaseDistributedSearchTestCase.java:965)
	at org.apache.solr.BaseDistributedSearchTestCase$ShardsRepeatRule$ShardsStatement.evaluate(BaseDistributedSearchTestCase.java:940)
	at com.carrotsearch.randomizedtesting.rules.SystemPropertiesRestoreRule$1.evaluate(SystemPropertiesRestoreRule.java:57)
	at org.apache.lucene.util.TestRuleSetupTeardownChained$1.evaluate(TestRuleSetupTeardownChained.java:50)
	at org.apache.lucene.util.AbstractBeforeAfterRule$1.evaluate(AbstractBeforeAfterRule.java:46)
	at org.apache.lucene.util.TestRuleThreadAndTestName$1.evaluate(TestRuleThreadAndTestName.java:49)
	at org.apache.lucene.util.TestRuleIgnoreAfterMaxFailures$1.evaluate(TestRuleIgnoreAfterMaxFailures.java:65)
	at org.apache.lucene.util.TestRuleMarkFailure$1.evaluate(TestRuleMarkFailure.java:48)
	at com.carrotsearch.randomizedtesting.rules.StatementAdapter.evaluate(StatementAdapter.java:36)
	at com.carrotsearch.randomizedtesting.ThreadLeakControl$StatementRunner.run(ThreadLeakControl.java:367)
	at com.carrotsearch.randomizedtesting.ThreadLeakControl.forkTimeoutingTask(ThreadLeakControl.java:809)
	at com.carrotsearch.randomizedtesting.ThreadLeakControl$3.evaluate(ThreadLeakControl.java:460)
	at com.carrotsearch.randomizedtesting.RandomizedRunner.runSingleTest(RandomizedRunner.java:880)
	at com.carrotsearch.randomizedtesting.RandomizedRunner$5.evaluate(RandomizedRunner.java:781)
	at com.carrotsearch.randomizedtesting.RandomizedRunner$6.evaluate(RandomizedRunner.java:816)
	at com.carrotsearch.randomizedtesting.RandomizedRunner$7.evaluate(RandomizedRunner.java:827)
	at com.carrotsearch.randomizedtesting.rules.StatementAdapter.evaluate(StatementAdapter.java:36)
	at com.carrotsearch.randomizedtesting.rules.SystemPropertiesRestoreRule$1.evaluate(SystemPropertiesRestoreRule.java:57)
	at org.apache.lucene.util.AbstractBeforeAfterRule$1.evaluate(AbstractBeforeAfterRule.java:46)
	at com.carrotsearch.randomizedtesting.rules.StatementAdapter.evaluate(StatementAdapter.java:36)
	at org.apache.lucene.util.TestRuleStoreClassName$1.evaluate(TestRuleStoreClassName.java:42)
	at com.carrotsearch.randomizedtesting.rules.NoShadowingOrOverridesOnMethodsRule$1.evaluate(NoShadowingOrOverridesOnMethodsRule.java:40)
	at com.carrotsearch.randomizedtesting.rules.NoShadowingOrOverridesOnMethodsRule$1.evaluate(NoShadowingOrOverridesOnMethodsRule.java:40)
	at com.carrotsearch.randomizedtesting.rules.StatementAdapter.evaluate(StatementAdapter.java:36)
	at com.carrotsearch.randomizedtesting.rules.StatementAdapter.evaluate(StatementAdapter.java:36)
	at com.carrotsearch.randomizedtesting.rules.StatementAdapter.evaluate(StatementAdapter.java:36)
	at org.apache.lucene.util.TestRuleAssertionsRequired$1.evaluate(TestRuleAssertionsRequired.java:54)
	at org.apache.lucene.util.TestRuleMarkFailure$1.evaluate(TestRuleMarkFailure.java:48)
	at org.apache.lucene.util.TestRuleIgnoreAfterMaxFailures$1.evaluate(TestRuleIgnoreAfterMaxFailures.java:65)
	at org.apache.lucene.util.TestRuleIgnoreTestSuites$1.evaluate(TestRuleIgnoreTestSuites.java:55)
	at com.carrotsearch.randomizedtesting.rules.StatementAdapter.evaluate(StatementAdapter.java:36)
	at com.carrotsearch.randomizedtesting.ThreadLeakControl$StatementRunner.run(ThreadLeakControl.java:367)
	at java.lang.Thread.run(Thread.java:747)




Build Log:
[...truncated 10968 lines...]
   [junit4] Suite: org.apache.solr.cloud.HttpPartitionTest
   [junit4]   2> Creating dataDir: /home/jenkins/workspace/Lucene-Solr-trunk-Linux/solr/build/solr-core/test/J1/temp/solr.cloud.HttpPartitionTest_A6CA607D3ABA454D-001/init-core-data-001
   [junit4]   2> 1228601 INFO  (SUITE-HttpPartitionTest-seed#[A6CA607D3ABA454D]-worker) [    ] o.a.s.BaseDistributedSearchTestCase Setting hostContext system property: /
   [junit4]   2> 1228602 INFO  (TEST-HttpPartitionTest.test-seed#[A6CA607D3ABA454D]) [    ] o.a.s.c.ZkTestServer STARTING ZK TEST SERVER
   [junit4]   2> 1228602 INFO  (Thread-3541) [    ] o.a.s.c.ZkTestServer client port:0.0.0.0/0.0.0.0:0
   [junit4]   2> 1228602 INFO  (Thread-3541) [    ] o.a.s.c.ZkTestServer Starting server
   [junit4]   2> 1228702 INFO  (TEST-HttpPartitionTest.test-seed#[A6CA607D3ABA454D]) [    ] o.a.s.c.ZkTestServer start zk server on port:40511
   [junit4]   2> 1228703 INFO  (TEST-HttpPartitionTest.test-seed#[A6CA607D3ABA454D]) [    ] o.a.s.c.c.SolrZkClient Using default ZkCredentialsProvider
   [junit4]   2> 1228703 INFO  (TEST-HttpPartitionTest.test-seed#[A6CA607D3ABA454D]) [    ] o.a.s.c.c.ConnectionManager Waiting for client to connect to ZooKeeper
   [junit4]   2> 1228704 INFO  (zkCallback-1326-thread-1) [    ] o.a.s.c.c.ConnectionManager Watcher org.apache.solr.common.cloud.ConnectionManager@791a627e name:ZooKeeperConnection Watcher:127.0.0.1:40511 got event WatchedEvent state:SyncConnected type:None path:null path:null type:None
   [junit4]   2> 1228704 INFO  (TEST-HttpPartitionTest.test-seed#[A6CA607D3ABA454D]) [    ] o.a.s.c.c.ConnectionManager Client is connected to ZooKeeper
   [junit4]   2> 1228705 INFO  (TEST-HttpPartitionTest.test-seed#[A6CA607D3ABA454D]) [    ] o.a.s.c.c.SolrZkClient Using default ZkACLProvider
   [junit4]   2> 1228705 INFO  (TEST-HttpPartitionTest.test-seed#[A6CA607D3ABA454D]) [    ] o.a.s.c.c.SolrZkClient makePath: /solr
   [junit4]   2> 1228706 INFO  (TEST-HttpPartitionTest.test-seed#[A6CA607D3ABA454D]) [    ] o.a.s.c.c.SolrZkClient Using default ZkCredentialsProvider
   [junit4]   2> 1228706 INFO  (TEST-HttpPartitionTest.test-seed#[A6CA607D3ABA454D]) [    ] o.a.s.c.c.ConnectionManager Waiting for client to connect to ZooKeeper
   [junit4]   2> 1228706 INFO  (zkCallback-1327-thread-1) [    ] o.a.s.c.c.ConnectionManager Watcher org.apache.solr.common.cloud.ConnectionManager@58fd2453 name:ZooKeeperConnection Watcher:127.0.0.1:40511/solr got event WatchedEvent state:SyncConnected type:None path:null path:null type:None
   [junit4]   2> 1228706 INFO  (TEST-HttpPartitionTest.test-seed#[A6CA607D3ABA454D]) [    ] o.a.s.c.c.ConnectionManager Client is connected to ZooKeeper
   [junit4]   2> 1228707 INFO  (TEST-HttpPartitionTest.test-seed#[A6CA607D3ABA454D]) [    ] o.a.s.c.c.SolrZkClient Using default ZkACLProvider
   [junit4]   2> 1228707 INFO  (TEST-HttpPartitionTest.test-seed#[A6CA607D3ABA454D]) [    ] o.a.s.c.c.SolrZkClient makePath: /collections/collection1
   [junit4]   2> 1228707 INFO  (TEST-HttpPartitionTest.test-seed#[A6CA607D3ABA454D]) [    ] o.a.s.c.c.SolrZkClient makePath: /collections/collection1/shards
   [junit4]   2> 1228707 INFO  (TEST-HttpPartitionTest.test-seed#[A6CA607D3ABA454D]) [    ] o.a.s.c.c.SolrZkClient makePath: /collections/control_collection
   [junit4]   2> 1228708 INFO  (TEST-HttpPartitionTest.test-seed#[A6CA607D3ABA454D]) [    ] o.a.s.c.c.SolrZkClient makePath: /collections/control_collection/shards
   [junit4]   2> 1228708 INFO  (TEST-HttpPartitionTest.test-seed#[A6CA607D3ABA454D]) [    ] o.a.s.c.AbstractZkTestCase put /home/jenkins/workspace/Lucene-Solr-trunk-Linux/solr/core/src/test-files/solr/collection1/conf/solrconfig-tlog.xml to /configs/conf1/solrconfig.xml
   [junit4]   2> 1228708 INFO  (TEST-HttpPartitionTest.test-seed#[A6CA607D3ABA454D]) [    ] o.a.s.c.c.SolrZkClient makePath: /configs/conf1/solrconfig.xml
   [junit4]   2> 1228709 INFO  (TEST-HttpPartitionTest.test-seed#[A6CA607D3ABA454D]) [    ] o.a.s.c.AbstractZkTestCase put /home/jenkins/workspace/Lucene-Solr-trunk-Linux/solr/core/src/test-files/solr/collection1/conf/schema.xml to /configs/conf1/schema.xml
   [junit4]   2> 1228709 INFO  (TEST-HttpPartitionTest.test-seed#[A6CA607D3ABA454D]) [    ] o.a.s.c.c.SolrZkClient makePath: /configs/conf1/schema.xml
   [junit4]   2> 1228710 INFO  (TEST-HttpPartitionTest.test-seed#[A6CA607D3ABA454D]) [    ] o.a.s.c.AbstractZkTestCase put /home/jenkins/workspace/Lucene-Solr-trunk-Linux/solr/core/src/test-files/solr/collection1/conf/solrconfig.snippet.randomindexconfig.xml to /configs/conf1/solrconfig.snippet.randomindexconfig.xml
   [junit4]   2> 1228710 INFO  (TEST-HttpPartitionTest.test-seed#[A6CA607D3ABA454D]) [    ] o.a.s.c.c.SolrZkClient makePath: /configs/conf1/solrconfig.snippet.randomindexconfig.xml
   [junit4]   2> 1228710 INFO  (TEST-HttpPartitionTest.test-seed#[A6CA607D3ABA454D]) [    ] o.a.s.c.AbstractZkTestCase put /home/jenkins/workspace/Lucene-Solr-trunk-Linux/solr/core/src/test-files/solr/collection1/conf/stopwords.txt to /configs/conf1/stopwords.txt
   [junit4]   2> 1228711 INFO  (TEST-HttpPartitionTest.test-seed#[A6CA607D3ABA454D]) [    ] o.a.s.c.c.SolrZkClient makePath: /configs/conf1/stopwords.txt
   [junit4]   2> 1228711 INFO  (TEST-HttpPartitionTest.test-seed#[A6CA607D3ABA454D]) [    ] o.a.s.c.AbstractZkTestCase put /home/jenkins/workspace/Lucene-Solr-trunk-Linux/solr/core/src/test-files/solr/collection1/conf/protwords.txt to /configs/conf1/protwords.txt
   [junit4]   2> 1228711 INFO  (TEST-HttpPartitionTest.test-seed#[A6CA607D3ABA454D]) [    ] o.a.s.c.c.SolrZkClient makePath: /configs/conf1/protwords.txt
   [junit4]   2> 1228711 INFO  (TEST-HttpPartitionTest.test-seed#[A6CA607D3ABA454D]) [    ] o.a.s.c.AbstractZkTestCase put /home/jenkins/workspace/Lucene-Solr-trunk-Linux/solr/core/src/test-files/solr/collection1/conf/currency.xml to /configs/conf1/currency.xml
   [junit4]   2> 1228711 INFO  (TEST-HttpPartitionTest.test-seed#[A6CA607D3ABA454D]) [    ] o.a.s.c.c.SolrZkClient makePath: /configs/conf1/currency.xml
   [junit4]   2> 1228712 INFO  (TEST-HttpPartitionTest.test-seed#[A6CA607D3ABA454D]) [    ] o.a.s.c.AbstractZkTestCase put /home/jenkins/workspace/Lucene-Solr-trunk-Linux/solr/core/src/test-files/solr/collection1/conf/enumsConfig.xml to /configs/conf1/enumsConfig.xml
   [junit4]   2> 1228712 INFO  (TEST-HttpPartitionTest.test-seed#[A6CA607D3ABA454D]) [    ] o.a.s.c.c.SolrZkClient makePath: /configs/conf1/enumsConfig.xml
   [junit4]   2> 1228713 INFO  (TEST-HttpPartitionTest.test-seed#[A6CA607D3ABA454D]) [    ] o.a.s.c.AbstractZkTestCase put /home/jenkins/workspace/Lucene-Solr-trunk-Linux/solr/core/src/test-files/solr/collection1/conf/open-exchange-rates.json to /configs/conf1/open-exchange-rates.json
   [junit4]   2> 1228713 INFO  (TEST-HttpPartitionTest.test-seed#[A6CA607D3ABA454D]) [    ] o.a.s.c.c.SolrZkClient makePath: /configs/conf1/open-exchange-rates.json
   [junit4]   2> 1228713 INFO  (TEST-HttpPartitionTest.test-seed#[A6CA607D3ABA454D]) [    ] o.a.s.c.AbstractZkTestCase put /home/jenkins/workspace/Lucene-Solr-trunk-Linux/solr/core/src/test-files/solr/collection1/conf/mapping-ISOLatin1Accent.txt to /configs/conf1/mapping-ISOLatin1Accent.txt
   [junit4]   2> 1228713 INFO  (TEST-HttpPartitionTest.test-seed#[A6CA607D3ABA454D]) [    ] o.a.s.c.c.SolrZkClient makePath: /configs/conf1/mapping-ISOLatin1Accent.txt
   [junit4]   2> 1228714 INFO  (TEST-HttpPartitionTest.test-seed#[A6CA607D3ABA454D]) [    ] o.a.s.c.AbstractZkTestCase put /home/jenkins/workspace/Lucene-Solr-trunk-Linux/solr/core/src/test-files/solr/collection1/conf/old_synonyms.txt to /configs/conf1/old_synonyms.txt
   [junit4]   2> 1228714 INFO  (TEST-HttpPartitionTest.test-seed#[A6CA607D3ABA454D]) [    ] o.a.s.c.c.SolrZkClient makePath: /configs/conf1/old_synonyms.txt
   [junit4]   2> 1228714 INFO  (TEST-HttpPartitionTest.test-seed#[A6CA607D3ABA454D]) [    ] o.a.s.c.AbstractZkTestCase put /home/jenkins/workspace/Lucene-Solr-trunk-Linux/solr/core/src/test-files/solr/collection1/conf/synonyms.txt to /configs/conf1/synonyms.txt
   [junit4]   2> 1228714 INFO  (TEST-HttpPartitionTest.test-seed#[A6CA607D3ABA454D]) [    ] o.a.s.c.c.SolrZkClient makePath: /configs/conf1/synonyms.txt
   [junit4]   2> 1228764 INFO  (TEST-HttpPartitionTest.test-seed#[A6CA607D3ABA454D]) [    ] o.a.s.SolrTestCaseJ4 Writing core.properties file to /home/jenkins/workspace/Lucene-Solr-trunk-Linux/solr/build/solr-core/test/J1/temp/solr.cloud.HttpPartitionTest_A6CA607D3ABA454D-001/control-001/cores/collection1
   [junit4]   2> 1228765 INFO  (TEST-HttpPartitionTest.test-seed#[A6CA607D3ABA454D]) [    ] o.e.j.s.Server jetty-9.2.13.v20150730
   [junit4]   2> 1228766 INFO  (TEST-HttpPartitionTest.test-seed#[A6CA607D3ABA454D]) [    ] o.e.j.s.h.ContextHandler Started o.e.j.s.ServletContextHandler@2104acb9{/,null,AVAILABLE}
   [junit4]   2> 1228769 INFO  (TEST-HttpPartitionTest.test-seed#[A6CA607D3ABA454D]) [    ] o.e.j.s.ServerConnector Started ServerConnector@10fa2f65{HTTP/1.1}{127.0.0.1:54825}
   [junit4]   2> 1228769 INFO  (TEST-HttpPartitionTest.test-seed#[A6CA607D3ABA454D]) [    ] o.e.j.s.Server Started @1230474ms
   [junit4]   2> 1228769 INFO  (TEST-HttpPartitionTest.test-seed#[A6CA607D3ABA454D]) [    ] o.a.s.c.s.e.JettySolrRunner Jetty properties: {solr.data.dir=/home/jenkins/workspace/Lucene-Solr-trunk-Linux/solr/build/solr-core/test/J1/temp/solr.cloud.HttpPartitionTest_A6CA607D3ABA454D-001/tempDir-001/control/data, hostContext=/, hostPort=55433, coreRootDirectory=/home/jenkins/workspace/Lucene-Solr-trunk-Linux/solr/build/solr-core/test/J1/temp/solr.cloud.HttpPartitionTest_A6CA607D3ABA454D-001/control-001/cores}
   [junit4]   2> 1228769 INFO  (TEST-HttpPartitionTest.test-seed#[A6CA607D3ABA454D]) [    ] o.a.s.s.SolrDispatchFilter SolrDispatchFilter.init(): sun.misc.Launcher$AppClassLoader@deb6432
   [junit4]   2> 1228769 INFO  (TEST-HttpPartitionTest.test-seed#[A6CA607D3ABA454D]) [    ] o.a.s.c.SolrResourceLoader new SolrResourceLoader for directory: '/home/jenkins/workspace/Lucene-Solr-trunk-Linux/solr/build/solr-core/test/J1/temp/solr.cloud.HttpPartitionTest_A6CA607D3ABA454D-001/control-001'
   [junit4]   2> 1228769 INFO  (TEST-HttpPartitionTest.test-seed#[A6CA607D3ABA454D]) [    ] o.a.s.c.SolrResourceLoader JNDI not configured for solr (NoInitialContextEx)
   [junit4]   2> 1228770 INFO  (TEST-HttpPartitionTest.test-seed#[A6CA607D3ABA454D]) [    ] o.a.s.c.SolrResourceLoader solr home defaulted to 'solr/' (could not find system property or JNDI)
   [junit4]   2> 1228770 INFO  (TEST-HttpPartitionTest.test-seed#[A6CA607D3ABA454D]) [    ] o.a.s.c.c.SolrZkClient Using default ZkCredentialsProvider
   [junit4]   2> 1228770 INFO  (TEST-HttpPartitionTest.test-seed#[A6CA607D3ABA454D]) [    ] o.a.s.c.c.ConnectionManager Waiting for client to connect to ZooKeeper
   [junit4]   2> 1228770 INFO  (zkCallback-1328-thread-1) [    ] o.a.s.c.c.ConnectionManager Watcher org.apache.solr.common.cloud.ConnectionManager@15561f91 name:ZooKeeperConnection Watcher:127.0.0.1:40511/solr got event WatchedEvent state:SyncConnected type:None path:null path:null type:None
   [junit4]   2> 1228771 INFO  (TEST-HttpPartitionTest.test-seed#[A6CA607D3ABA454D]) [    ] o.a.s.c.c.ConnectionManager Client is connected to ZooKeeper
   [junit4]   2> 1228771 INFO  (TEST-HttpPartitionTest.test-seed#[A6CA607D3ABA454D]) [    ] o.a.s.c.c.SolrZkClient Using default ZkACLProvider
   [junit4]   2> 1228771 INFO  (TEST-HttpPartitionTest.test-seed#[A6CA607D3ABA454D]) [    ] o.a.s.s.SolrDispatchFilter Loading solr.xml from SolrHome (not found in ZooKeeper)
   [junit4]   2> 1228771 INFO  (TEST-HttpPartitionTest.test-seed#[A6CA607D3ABA454D]) [    ] o.a.s.c.SolrXmlConfig Loading container configuration from /home/jenkins/workspace/Lucene-Solr-trunk-Linux/solr/build/solr-core/test/J1/temp/solr.cloud.HttpPartitionTest_A6CA607D3ABA454D-001/control-001/solr.xml
   [junit4]   2> 1228774 INFO  (TEST-HttpPartitionTest.test-seed#[A6CA607D3ABA454D]) [    ] o.a.s.c.CorePropertiesLocator Config-defined core root directory: /home/jenkins/workspace/Lucene-Solr-trunk-Linux/solr/build/solr-core/test/J1/temp/solr.cloud.HttpPartitionTest_A6CA607D3ABA454D-001/control-001/cores
   [junit4]   2> 1228774 INFO  (TEST-HttpPartitionTest.test-seed#[A6CA607D3ABA454D]) [    ] o.a.s.c.CoreContainer New CoreContainer 1928598206
   [junit4]   2> 1228774 INFO  (TEST-HttpPartitionTest.test-seed#[A6CA607D3ABA454D]) [    ] o.a.s.c.CoreContainer Loading cores into CoreContainer [instanceDir=/home/jenkins/workspace/Lucene-Solr-trunk-Linux/solr/build/solr-core/test/J1/temp/solr.cloud.HttpPartitionTest_A6CA607D3ABA454D-001/control-001]
   [junit4]   2> 1228774 WARN  (TEST-HttpPartitionTest.test-seed#[A6CA607D3ABA454D]) [    ] o.a.s.c.CoreContainer Couldn't add files from /home/jenkins/workspace/Lucene-Solr-trunk-Linux/solr/build/solr-core/test/J1/temp/solr.cloud.HttpPartitionTest_A6CA607D3ABA454D-001/control-001/lib to classpath: /home/jenkins/workspace/Lucene-Solr-trunk-Linux/solr/build/solr-core/test/J1/temp/solr.cloud.HttpPartitionTest_A6CA607D3ABA454D-001/control-001/lib
   [junit4]   2> 1228775 INFO  (TEST-HttpPartitionTest.test-seed#[A6CA607D3ABA454D]) [    ] o.a.s.h.c.HttpShardHandlerFactory created with socketTimeout : 90000,urlScheme : ,connTimeout : 15000,maxConnectionsPerHost : 20,maxConnections : 10000,corePoolSize : 0,maximumPoolSize : 2147483647,maxThreadIdleTime : 5,sizeOfQueue : -1,fairnessPolicy : false,useRetries : false,
   [junit4]   2> 1228775 INFO  (TEST-HttpPartitionTest.test-seed#[A6CA607D3ABA454D]) [    ] o.a.s.u.UpdateShardHandler Creating UpdateShardHandler HTTP client with params: socketTimeout=340000&connTimeout=45000&retry=true
   [junit4]   2> 1228775 INFO  (TEST-HttpPartitionTest.test-seed#[A6CA607D3ABA454D]) [    ] o.a.s.l.LogWatcher SLF4J impl is org.slf4j.impl.Log4jLoggerFactory
   [junit4]   2> 1228776 INFO  (TEST-HttpPartitionTest.test-seed#[A6CA607D3ABA454D]) [    ] o.a.s.l.LogWatcher Registering Log Listener [Log4j (org.slf4j.impl.Log4jLoggerFactory)]
   [junit4]   2> 1228776 INFO  (TEST-HttpPartitionTest.test-seed#[A6CA607D3ABA454D]) [    ] o.a.s.c.ZkContainer Zookeeper client=127.0.0.1:40511/solr
   [junit4]   2> 1228776 INFO  (TEST-HttpPartitionTest.test-seed#[A6CA607D3ABA454D]) [    ] o.a.s.c.ZkController zkHost includes chroot
   [junit4]   2> 1228776 INFO  (TEST-HttpPartitionTest.test-seed#[A6CA607D3ABA454D]) [    ] o.a.s.c.c.SolrZkClient Using default ZkCredentialsProvider
   [junit4]   2> 1228776 INFO  (TEST-HttpPartitionTest.test-seed#[A6CA607D3ABA454D]) [    ] o.a.s.c.c.ConnectionManager Waiting for client to connect to ZooKeeper
   [junit4]   2> 1228777 INFO  (zkCallback-1331-thread-1) [    ] o.a.s.c.c.ConnectionManager Watcher org.apache.solr.common.cloud.ConnectionManager@45e2264f name:ZooKeeperConnection Watcher:127.0.0.1:40511 got event WatchedEvent state:SyncConnected type:None path:null path:null type:None
   [junit4]   2> 1228777 INFO  (TEST-HttpPartitionTest.test-seed#[A6CA607D3ABA454D]) [    ] o.a.s.c.c.ConnectionManager Client is connected to ZooKeeper
   [junit4]   2> 1228777 INFO  (TEST-HttpPartitionTest.test-seed#[A6CA607D3ABA454D]) [    ] o.a.s.c.c.SolrZkClient Using default ZkACLProvider
   [junit4]   2> 1228777 INFO  (TEST-HttpPartitionTest.test-seed#[A6CA607D3ABA454D]) [    ] o.a.s.c.c.ConnectionManager Waiting for client to connect to ZooKeeper
   [junit4]   2> 1228778 INFO  (zkCallback-1332-thread-1) [    ] o.a.s.c.c.ConnectionManager Watcher org.apache.solr.common.cloud.ConnectionManager@5e25bdd0 name:ZooKeeperConnection Watcher:127.0.0.1:40511/solr got event WatchedEvent state:SyncConnected type:None path:null path:null type:None
   [junit4]   2> 1228778 INFO  (TEST-HttpPartitionTest.test-seed#[A6CA607D3ABA454D]) [    ] o.a.s.c.c.ConnectionManager Client is connected to ZooKeeper
   [junit4]   2> 1228778 INFO  (TEST-HttpPartitionTest.test-seed#[A6CA607D3ABA454D]) [    ] o.a.s.c.c.SolrZkClient makePath: /overseer/queue
   [junit4]   2> 1228779 INFO  (TEST-HttpPartitionTest.test-seed#[A6CA607D3ABA454D]) [    ] o.a.s.c.c.SolrZkClient makePath: /overseer/collection-queue-work
   [junit4]   2> 1228780 INFO  (TEST-HttpPartitionTest.test-seed#[A6CA607D3ABA454D]) [    ] o.a.s.c.c.SolrZkClient makePath: /overseer/collection-map-running
   [junit4]   2> 1228781 INFO  (TEST-HttpPartitionTest.test-seed#[A6CA607D3ABA454D]) [    ] o.a.s.c.c.SolrZkClient makePath: /overseer/collection-map-completed
   [junit4]   2> 1228781 INFO  (TEST-HttpPartitionTest.test-seed#[A6CA607D3ABA454D]) [    ] o.a.s.c.c.SolrZkClient makePath: /overseer/collection-map-failure
   [junit4]   2> 1228782 INFO  (TEST-HttpPartitionTest.test-seed#[A6CA607D3ABA454D]) [    ] o.a.s.c.c.SolrZkClient makePath: /live_nodes
   [junit4]   2> 1228782 INFO  (TEST-HttpPartitionTest.test-seed#[A6CA607D3ABA454D]) [    ] o.a.s.c.c.SolrZkClient makePath: /aliases.json
   [junit4]   2> 1228783 INFO  (TEST-HttpPartitionTest.test-seed#[A6CA607D3ABA454D]) [    ] o.a.s.c.c.SolrZkClient makePath: /clusterstate.json
   [junit4]   2> 1228783 INFO  (TEST-HttpPartitionTest.test-seed#[A6CA607D3ABA454D]) [    ] o.a.s.c.c.SolrZkClient makePath: /security.json
   [junit4]   2> 1228783 INFO  (TEST-HttpPartitionTest.test-seed#[A6CA607D3ABA454D]) [    ] o.a.s.c.ZkController Register node as live in ZooKeeper:/live_nodes/127.0.0.1:55433_
   [junit4]   2> 1228783 INFO  (TEST-HttpPartitionTest.test-seed#[A6CA607D3ABA454D]) [    ] o.a.s.c.c.SolrZkClient makePath: /live_nodes/127.0.0.1:55433_
   [junit4]   2> 1228784 INFO  (TEST-HttpPartitionTest.test-seed#[A6CA607D3ABA454D]) [    ] o.a.s.c.c.SolrZkClient makePath: /overseer_elect
   [junit4]   2> 1228784 INFO  (TEST-HttpPartitionTest.test-seed#[A6CA607D3ABA454D]) [    ] o.a.s.c.c.SolrZkClient makePath: /overseer_elect/election
   [junit4]   2> 1228785 INFO  (TEST-HttpPartitionTest.test-seed#[A6CA607D3ABA454D]) [    ] o.a.s.c.Overseer Overseer (id=null) closing
   [junit4]   2> 1228785 INFO  (TEST-HttpPartitionTest.test-seed#[A6CA607D3ABA454D]) [    ] o.a.s.c.LeaderElector Joined leadership election with path: /overseer_elect/election/95204031483478020-127.0.0.1:55433_-n_0000000000
   [junit4]   2> 1228785 INFO  (TEST-HttpPartitionTest.test-seed#[A6CA607D3ABA454D]) [    ] o.a.s.c.OverseerElectionContext I am going to be the leader 127.0.0.1:55433_
   [junit4]   2> 1228785 INFO  (TEST-HttpPartitionTest.test-seed#[A6CA607D3ABA454D]) [    ] o.a.s.c.c.SolrZkClient makePath: /overseer_elect/leader
   [junit4]   2> 1228785 INFO  (TEST-HttpPartitionTest.test-seed#[A6CA607D3ABA454D]) [    ] o.a.s.c.Overseer Overseer (id=95204031483478020-127.0.0.1:55433_-n_0000000000) starting
   [junit4]   2> 1228786 INFO  (TEST-HttpPartitionTest.test-seed#[A6CA607D3ABA454D]) [    ] o.a.s.c.c.SolrZkClient makePath: /overseer/queue-work
   [junit4]   2> 1228787 INFO  (TEST-HttpPartitionTest.test-seed#[A6CA607D3ABA454D]) [    ] o.a.s.c.OverseerAutoReplicaFailoverThread Starting OverseerAutoReplicaFailoverThread autoReplicaFailoverWorkLoopDelay=10000 autoReplicaFailoverWaitAfterExpiration=30000 autoReplicaFailoverBadNodeExpiration=60000
   [junit4]   2> 1228787 INFO  (TEST-HttpPartitionTest.test-seed#[A6CA607D3ABA454D]) [    ] o.a.s.c.c.ZkStateReader Updating cluster state from ZooKeeper... 
   [junit4]   2> 1228788 INFO  (OverseerCollectionConfigSetProcessor-95204031483478020-127.0.0.1:55433_-n_0000000000) [    ] o.a.s.c.OverseerTaskProcessor Process current queue of overseer operations
   [junit4]   2> 1228788 INFO  (OverseerStateUpdate-95204031483478020-127.0.0.1:55433_-n_0000000000) [    ] o.a.s.c.Overseer Starting to work on the main queue
   [junit4]   2> 1228795 INFO  (TEST-HttpPartitionTest.test-seed#[A6CA607D3ABA454D]) [    ] o.a.s.c.CoreContainer Security conf doesn't exist. Skipping setup for authorization module.
   [junit4]   2> 1228795 INFO  (TEST-HttpPartitionTest.test-seed#[A6CA607D3ABA454D]) [    ] o.a.s.c.CoreContainer No authentication plugin used.
   [junit4]   2> 1228795 INFO  (TEST-HttpPartitionTest.test-seed#[A6CA607D3ABA454D]) [    ] o.a.s.c.CorePropertiesLocator Looking for core definitions underneath /home/jenkins/workspace/Lucene-Solr-trunk-Linux/solr/build/solr-core/test/J1/temp/solr.cloud.HttpPartitionTest_A6CA607D3ABA454D-001/control-001/cores
   [junit4]   2> 1228796 INFO  (TEST-HttpPartitionTest.test-seed#[A6CA607D3ABA454D]) [    ] o.a.s.c.CoreDescriptor Created CoreDescriptor: {name=collection1, config=solrconfig.xml, transient=false, schema=schema.xml, loadOnStartup=true, configSetProperties=configsetprops.json, collection=control_collection, coreNodeName=, dataDir=data/, shard=}
   [junit4]   2> 1228796 INFO  (TEST-HttpPartitionTest.test-seed#[A6CA607D3ABA454D]) [    ] o.a.s.c.CorePropertiesLocator Found core collection1 in /home/jenkins/workspace/Lucene-Solr-trunk-Linux/solr/build/solr-core/test/J1/temp/solr.cloud.HttpPartitionTest_A6CA607D3ABA454D-001/control-001/cores/collection1
   [junit4]   2> 1228796 INFO  (TEST-HttpPartitionTest.test-seed#[A6CA607D3ABA454D]) [    ] o.a.s.c.CorePropertiesLocator Found 1 core definitions
   [junit4]   2> 1228797 INFO  (TEST-HttpPartitionTest.test-seed#[A6CA607D3ABA454D]) [    ] o.a.s.s.SolrDispatchFilter user.dir=/home/jenkins/workspace/Lucene-Solr-trunk-Linux/solr/build/solr-core/test/J1
   [junit4]   2> 1228797 INFO  (TEST-HttpPartitionTest.test-seed#[A6CA607D3ABA454D]) [    ] o.a.s.s.SolrDispatchFilter SolrDispatchFilter.init() done
   [junit4]   2> 1228797 INFO  (coreLoadExecutor-4197-thread-1) [    ] o.a.s.c.ZkController publishing state=down
   [junit4]   2> 1228797 INFO  (coreLoadExecutor-4197-thread-1) [    ] o.a.s.c.ZkController numShards not found on descriptor - reading it from system property
   [junit4]   2> 1228797 INFO  (OverseerStateUpdate-95204031483478020-127.0.0.1:55433_-n_0000000000) [    ] o.a.s.c.Overseer processMessage: queueSize: 1, message = {
   [junit4]   2>   "core":"collection1",
   [junit4]   2>   "roles":null,
   [junit4]   2>   "base_url":"http://127.0.0.1:55433",
   [junit4]   2>   "node_name":"127.0.0.1:55433_",
   [junit4]   2>   "numShards":"1",
   [junit4]   2>   "state":"down",
   [junit4]   2>   "shard":null,
   [junit4]   2>   "collection":"control_collection",
   [junit4]   2>   "operation":"state"} current state version: 0
   [junit4]   2> 1228797 INFO  (coreLoadExecutor-4197-thread-1) [    ] o.a.s.c.ZkController look for our core node name
   [junit4]   2> 1228797 INFO  (OverseerStateUpdate-95204031483478020-127.0.0.1:55433_-n_0000000000) [    ] o.a.s.c.o.ReplicaMutator Update state numShards=1 message={
   [junit4]   2>   "core":"collection1",
   [junit4]   2>   "roles":null,
   [junit4]   2>   "base_url":"http://127.0.0.1:55433",
   [junit4]   2>   "node_name":"127.0.0.1:55433_",
   [junit4]   2>   "numShards":"1",
   [junit4]   2>   "state":"down",
   [junit4]   2>   "shard":null,
   [junit4]   2>   "collection":"control_collection",
   [junit4]   2>   "operation":"state"}
   [junit4]   2> 1228798 INFO  (OverseerStateUpdate-95204031483478020-127.0.0.1:55433_-n_0000000000) [    ] o.a.s.c.o.ClusterStateMutator building a new cName: control_collection
   [junit4]   2> 1228798 INFO  (OverseerStateUpdate-95204031483478020-127.0.0.1:55433_-n_0000000000) [    ] o.a.s.c.o.ReplicaMutator Assigning new node to shard shard=shard1
   [junit4]   2> 1228798 INFO  (zkCallback-1332-thread-1) [    ] o.a.s.c.c.ZkStateReader A cluster state change: [WatchedEvent state:SyncConnected type:NodeDataChanged path:/clusterstate.json], has occurred - updating... (live nodes size: [1])
   [junit4]   2> 1229798 INFO  (coreLoadExecutor-4197-thread-1) [    ] o.a.s.c.ZkController waiting to find shard id in clusterstate for collection1
   [junit4]   2> 1229798 INFO  (coreLoadExecutor-4197-thread-1) [    ] o.a.s.c.ZkController Check for collection zkNode:control_collection
   [junit4]   2> 1229798 INFO  (coreLoadExecutor-4197-thread-1) [    ] o.a.s.c.ZkController Collection zkNode exists
   [junit4]   2> 1229798 INFO  (coreLoadExecutor-4197-thread-1) [    ] o.a.s.c.c.ZkStateReader Load collection config from: [/collections/control_collection]
   [junit4]   2> 1229798 INFO  (coreLoadExecutor-4197-thread-1) [    ] o.a.s.c.c.ZkStateReader path=[/collections/control_collection] [configName]=[conf1] specified config exists in ZooKeeper
   [junit4]   2> 1229798 INFO  (coreLoadExecutor-4197-thread-1) [    ] o.a.s.c.SolrResourceLoader new SolrResourceLoader for directory: '/home/jenkins/workspace/Lucene-Solr-trunk-Linux/solr/build/solr-core/test/J1/temp/solr.cloud.HttpPartitionTest_A6CA607D3ABA454D-001/control-001/cores/collection1'
   [junit4]   2> 1229798 INFO  (coreLoadExecutor-4197-thread-1) [    ] o.a.s.c.SolrResourceLoader JNDI not configured for solr (NoInitialContextEx)
   [junit4]   2> 1229798 INFO  (coreLoadExecutor-4197-thread-1) [    ] o.a.s.c.SolrResourceLoader solr home defaulted to 'solr/' (could not find system property or JNDI)
   [junit4]   2> 1229799 INFO  (coreLoadExecutor-4197-thread-1) [    ] o.a.s.c.Config loaded config solrconfig.xml with version 0 
   [junit4]   2> 1229802 INFO  (coreLoadExecutor-4197-thread-1) [    ] o.a.s.c.SolrConfig current version of requestparams : -1
   [junit4]   2> 1229813 INFO  (coreLoadExecutor-4197-thread-1) [    ] o.a.s.c.SolrConfig Using Lucene MatchVersion: 6.0.0
   [junit4]   2> 1229819 INFO  (coreLoadExecutor-4197-thread-1) [    ] o.a.s.c.SolrConfig Loaded SolrConfig: solrconfig.xml
   [junit4]   2> 1229823 INFO  (coreLoadExecutor-4197-thread-1) [    ] o.a.s.s.IndexSchema [collection1] Schema name=test
   [junit4]   2> 1229887 INFO  (coreLoadExecutor-4197-thread-1) [    ] o.a.s.s.OpenExchangeRatesOrgProvider Initialized with rates=open-exchange-rates.json, refreshInterval=1440.
   [junit4]   2> 1229890 INFO  (coreLoadExecutor-4197-thread-1) [    ] o.a.s.s.IndexSchema default search field in schema is text
   [junit4]   2> 1229891 INFO  (coreLoadExecutor-4197-thread-1) [    ] o.a.s.s.IndexSchema unique key field: id
   [junit4]   2> 1229894 INFO  (coreLoadExecutor-4197-thread-1) [    ] o.a.s.s.FileExchangeRateProvider Reloading exchange rates from file currency.xml
   [junit4]   2> 1229895 INFO  (coreLoadExecutor-4197-thread-1) [    ] o.a.s.s.FileExchangeRateProvider Reloading exchange rates from file currency.xml
   [junit4]   2> 1229896 INFO  (coreLoadExecutor-4197-thread-1) [    ] o.a.s.s.OpenExchangeRatesOrgProvider Reloading exchange rates from open-exchange-rates.json
   [junit4]   2> 1229897 INFO  (coreLoadExecutor-4197-thread-1) [    ] o.a.s.s.OpenExchangeRatesOrgProvider Reloading exchange rates from open-exchange-rates.json
   [junit4]   2> 1229897 INFO  (coreLoadExecutor-4197-thread-1) [    ] o.a.s.c.ConfigSetProperties Did not find ConfigSet properties, assuming default properties: Can't find resource 'configsetprops.json' in classpath or '/configs/conf1', cwd=/home/jenkins/workspace/Lucene-Solr-trunk-Linux/solr/build/solr-core/test/J1
   [junit4]   2> 1229897 INFO  (coreLoadExecutor-4197-thread-1) [    ] o.a.s.c.CoreContainer Creating SolrCore 'collection1' using configuration from collection control_collection
   [junit4]   2> 1229897 INFO  (coreLoadExecutor-4197-thread-1) [    ] o.a.s.c.SolrCore org.apache.solr.core.MockDirectoryFactory
   [junit4]   2> 1229898 INFO  (coreLoadExecutor-4197-thread-1) [    ] o.a.s.c.SolrCore [[collection1] ] Opening new SolrCore at [/home/jenkins/workspace/Lucene-Solr-trunk-Linux/solr/build/solr-core/test/J1/temp/solr.cloud.HttpPartitionTest_A6CA607D3ABA454D-001/control-001/cores/collection1], dataDir=[/home/jenkins/workspace/Lucene-Solr-trunk-Linux/solr/build/solr-core/test/J1/temp/solr.cloud.HttpPartitionTest_A6CA607D3ABA454D-001/control-001/cores/collection1/data/]
   [junit4]   2> 1229898 INFO  (coreLoadExecutor-4197-thread-1) [    ] o.a.s.c.JmxMonitoredMap JMX monitoring is enabled. Adding Solr mbeans to JMX Server: com.sun.jmx.mbeanserver.JmxMBeanServer@4102580c
   [junit4]   2> 1229898 INFO  (coreLoadExecutor-4197-thread-1) [    ] o.a.s.c.CachingDirectoryFactory return new directory for /home/jenkins/workspace/Lucene-Solr-trunk-Linux/solr/build/solr-core/test/J1/temp/solr.cloud.HttpPartitionTest_A6CA607D3ABA454D-001/control-001/cores/collection1/data
   [junit4]   2> 1229898 INFO  (coreLoadExecutor-4197-thread-1) [    ] o.a.s.c.SolrCore New index directory detected: old=null new=/home/jenkins/workspace/Lucene-Solr-trunk-Linux/solr/build/solr-core/test/J1/temp/solr.cloud.HttpPartitionTest_A6CA607D3ABA454D-001/control-001/cores/collection1/data/index/
   [junit4]   2> 1229898 WARN  (coreLoadExecutor-4197-thread-1) [    ] o.a.s.c.SolrCore [collection1] Solr index directory '/home/jenkins/workspace/Lucene-Solr-trunk-Linux/solr/build/solr-core/test/J1/temp/solr.cloud.HttpPartitionTest_A6CA607D3ABA454D-001/control-001/cores/collection1/data/index' doesn't exist. Creating new index...
   [junit4]   2> 1229898 INFO  (coreLoadExecutor-4197-thread-1) [    ] o.a.s.c.CachingDirectoryFactory return new directory for /home/jenkins/workspace/Lucene-Solr-trunk-Linux/solr/build/solr-core/test/J1/temp/solr.cloud.HttpPartitionTest_A6CA607D3ABA454D-001/control-001/cores/collection1/data/index
   [junit4]   2> 1229898 INFO  (coreLoadExecutor-4197-thread-1) [    ] o.a.s.u.RandomMergePolicy RandomMergePolicy wrapping class org.apache.lucene.index.TieredMergePolicy: [TieredMergePolicy: maxMergeAtOnce=27, maxMergeAtOnceExplicit=23, maxMergedSegmentMB=52.296875, floorSegmentMB=1.1484375, forceMergeDeletesPctAllowed=29.853381930844943, segmentsPerTier=25.0, maxCFSSegmentSizeMB=8.796093022207999E12, noCFSRatio=0.0
   [junit4]   2> 1229899 INFO  (coreLoadExecutor-4197-thread-1) [    ] o.a.s.c.SolrDeletionPolicy SolrDeletionPolicy.onCommit: commits: num=1
   [junit4]   2> 	commit{dir=MockDirectoryWrapper(RAMDirectory@155e1914 lockFactory=org.apache.lucene.store.SingleInstanceLockFactory@6bc22d),segFN=segments_1,generation=1}
   [junit4]   2> 1229899 INFO  (coreLoadExecutor-4197-thread-1) [    ] o.a.s.c.SolrDeletionPolicy newest commit generation = 1
   [junit4]   2> 1229899 INFO  (OldIndexDirectoryCleanupThreadForCore-collection1) [    ] o.a.s.c.SolrCore Looking for old index directories to cleanup for core collection1 in /home/jenkins/workspace/Lucene-Solr-trunk-Linux/solr/build/solr-core/test/J1/temp/solr.cloud.HttpPartitionTest_A6CA607D3ABA454D-001/control-001/cores/collection1/data/
   [junit4]   2> 1229899 WARN  (OldIndexDirectoryCleanupThreadForCore-collection1) [    ] o.a.s.c.DirectoryFactory /home/jenkins/workspace/Lucene-Solr-trunk-Linux/solr/build/solr-core/test/J1/temp/solr.cloud.HttpPartitionTest_A6CA607D3ABA454D-001/control-001/cores/collection1/data/ does not point to a valid data directory; skipping clean-up of old index directories.
   [junit4]   2> 1229901 INFO  (coreLoadExecutor-4197-thread-1) [    ] o.a.s.u.p.UpdateRequestProcessorChain creating updateRequestProcessorChain "nodistrib"
   [junit4]   2> 1229901 INFO  (coreLoadExecutor-4197-thread-1) [    ] o.a.s.u.p.UpdateRequestProcessorChain creating updateRequestProcessorChain "dedupe"
   [junit4]   2> 1229901 INFO  (coreLoadExecutor-4197-thread-1) [    ] o.a.s.u.p.UpdateRequestProcessorChain inserting DistributedUpdateProcessorFactory into updateRequestProcessorChain "dedupe"
   [junit4]   2> 1229901 INFO  (coreLoadExecutor-4197-thread-1) [    ] o.a.s.u.p.UpdateRequestProcessorChain creating updateRequestProcessorChain "stored_sig"
   [junit4]   2> 1229901 INFO  (coreLoadExecutor-4197-thread-1) [    ] o.a.s.u.p.UpdateRequestProcessorChain inserting DistributedUpdateProcessorFactory into updateRequestProcessorChain "stored_sig"
   [junit4]   2> 1229901 INFO  (coreLoadExecutor-4197-thread-1) [    ] o.a.s.u.p.UpdateRequestProcessorChain creating updateRequestProcessorChain "distrib-dup-test-chain-explicit"
   [junit4]   2> 1229901 INFO  (coreLoadExecutor-4197-thread-1) [    ] o.a.s.u.p.UpdateRequestProcessorChain creating updateRequestProcessorChain "distrib-dup-test-chain-implicit"
   [junit4]   2> 1229901 INFO  (coreLoadExecutor-4197-thread-1) [    ] o.a.s.u.p.UpdateRequestProcessorChain inserting DistributedUpdateProcessorFactory into updateRequestProcessorChain "distrib-dup-test-chain-implicit"
   [junit4]   2> 1229901 INFO  (coreLoadExecutor-4197-thread-1) [    ] o.a.s.c.SolrCore no updateRequestProcessorChain defined as default, creating implicit default
   [junit4]   2> 1229901 WARN  (coreLoadExecutor-4197-thread-1) [    ] o.a.s.c.RequestHandlers INVALID paramSet a in requestHandler {type = requestHandler,name = /dump,class = DumpRequestHandler,args = {defaults={a=A,b=B}}}
   [junit4]   2> 1229903 INFO  (coreLoadExecutor-4197-thread-1) [    ] o.a.s.h.l.XMLLoader xsltCacheLifetimeSeconds=60
   [junit4]   2> 1229903 INFO  (coreLoadExecutor-4197-thread-1) [    ] o.a.s.h.l.XMLLoader xsltCacheLifetimeSeconds=60
   [junit4]   2> 1229904 INFO  (coreLoadExecutor-4197-thread-1) [    ] o.a.s.h.l.XMLLoader xsltCacheLifetimeSeconds=60
   [junit4]   2> 1229904 INFO  (coreLoadExecutor-4197-thread-1) [    ] o.a.s.h.l.XMLLoader xsltCacheLifetimeSeconds=60
   [junit4]   2> 1229906 INFO  (coreLoadExecutor-4197-thread-1) [    ] o.a.s.c.RequestHandlers Registered paths: /admin/mbeans,standard,/dump,/update/csv,/sql,/update/json/docs,/admin/luke,/export,/admin/segments,/get,/admin/system,/replication,/admin/properties,/config,/stream,/schema,/admin/plugins,/admin/logging,/update/json,/admin/threads,/admin/ping,/update,/admin/file
   [junit4]   2> 1229906 INFO  (coreLoadExecutor-4197-thread-1) [    ] o.a.s.c.SolrCore Using default statsCache cache: org.apache.solr.search.stats.LocalStatsCache
   [junit4]   2> 1229906 INFO  (coreLoadExecutor-4197-thread-1) [    ] o.a.s.u.UpdateHandler Using UpdateLog implementation: org.apache.solr.update.UpdateLog
   [junit4]   2> 1229906 INFO  (coreLoadExecutor-4197-thread-1) [    ] o.a.s.u.UpdateLog Initializing UpdateLog: dataDir= defaultSyncLevel=FLUSH numRecordsToKeep=100 maxNumLogsToKeep=10 numVersionBuckets=65536
   [junit4]   2> 1229907 INFO  (coreLoadExecutor-4197-thread-1) [    ] o.a.s.u.CommitTracker Hard AutoCommit: disabled
   [junit4]   2> 1229907 INFO  (coreLoadExecutor-4197-thread-1) [    ] o.a.s.u.CommitTracker Soft AutoCommit: disabled
   [junit4]   2> 1229907 INFO  (coreLoadExecutor-4197-thread-1) [    ] o.a.s.u.RandomMergePolicy RandomMergePolicy wrapping class org.apache.lucene.index.TieredMergePolicy: [TieredMergePolicy: maxMergeAtOnce=23, maxMergeAtOnceExplicit=16, maxMergedSegmentMB=33.048828125, floorSegmentMB=0.82421875, forceMergeDeletesPctAllowed=29.165186422531843, segmentsPerTier=45.0, maxCFSSegmentSizeMB=8.796093022207999E12, noCFSRatio=0.0
   [junit4]   2> 1229907 INFO  (coreLoadExecutor-4197-thread-1) [    ] o.a.s.c.SolrDeletionPolicy SolrDeletionPolicy.onInit: commits: num=1
   [junit4]   2> 	commit{dir=MockDirectoryWrapper(RAMDirectory@155e1914 lockFactory=org.apache.lucene.store.SingleInstanceLockFactory@6bc22d),segFN=segments_1,generation=1}
   [junit4]   2> 1229907 INFO  (coreLoadExecutor-4197-thread-1) [    ] o.a.s.c.SolrDeletionPolicy newest commit generation = 1
   [junit4]   2> 1229907 INFO  (coreLoadExecutor-4197-thread-1) [    ] o.a.s.s.SolrIndexSearcher Opening [Searcher@4cabe9c4[collection1] main]
   [junit4]   2> 1229907 INFO  (coreLoadExecutor-4197-thread-1) [    ] o.a.s.c.c.ZkStateReader Load collection config from: [/collections/control_collection]
   [junit4]   2> 1229908 INFO  (coreLoadExecutor-4197-thread-1) [    ] o.a.s.c.c.ZkStateReader path=[/collections/control_collection] [configName]=[conf1] specified config exists in ZooKeeper
   [junit4]   2> 1229908 INFO  (coreLoadExecutor-4197-thread-1) [    ] o.a.s.r.ManagedResourceStorage Setting up ZooKeeper-based storage for the RestManager with znodeBase: /configs/conf1
   [junit4]   2> 1229908 INFO  (coreLoadExecutor-4197-thread-1) [    ] o.a.s.r.ManagedResourceStorage Configured ZooKeeperStorageIO with znodeBase: /configs/conf1
   [junit4]   2> 1229908 INFO  (coreLoadExecutor-4197-thread-1) [    ] o.a.s.r.RestManager Initializing RestManager with initArgs: {}
   [junit4]   2> 1229908 INFO  (coreLoadExecutor-4197-thread-1) [    ] o.a.s.r.ManagedResourceStorage Reading _rest_managed.json using ZooKeeperStorageIO:path=/configs/conf1
   [junit4]   2> 1229908 INFO  (coreLoadExecutor-4197-thread-1) [    ] o.a.s.r.ManagedResourceStorage No data found for znode /configs/conf1/_rest_managed.json
   [junit4]   2> 1229908 INFO  (coreLoadExecutor-4197-thread-1) [    ] o.a.s.r.ManagedResourceStorage Loaded null at path _rest_managed.json using ZooKeeperStorageIO:path=/configs/conf1
   [junit4]   2> 1229908 INFO  (coreLoadExecutor-4197-thread-1) [    ] o.a.s.r.RestManager Initializing 0 registered ManagedResources
   [junit4]   2> 1229909 INFO  (coreLoadExecutor-4197-thread-1) [    ] o.a.s.h.ReplicationHandler Commits will be reserved for  10000
   [junit4]   2> 1229909 INFO  (searcherExecutor-4198-thread-1) [    ] o.a.s.c.SolrCore [collection1] Registered new searcher Searcher@4cabe9c4[collection1] main{ExitableDirectoryReader(UninvertingDirectoryReader())}
   [junit4]   2> 1229909 INFO  (coreLoadExecutor-4197-thread-1) [    ] o.a.s.u.UpdateLog Looking up max value of version field to seed version buckets
   [junit4]   2> 1229909 INFO  (coreLoadExecutor-4197-thread-1) [    ] o.a.s.u.VersionInfo Refreshing highest value of _version_ for 65536 version buckets from index
   [junit4]   2> 1229909 INFO  (coreLoadExecutor-4197-thread-1) [    ] o.a.s.u.VersionInfo No terms found for _version_, cannot seed version bucket highest value from index
   [junit4]   2> 1229909 INFO  (coreLoadExecutor-4197-thread-1) [    ] o.a.s.u.UpdateLog Could not find max version in index or recent updates, using new clock 1523264505105088512
   [junit4]   2> 1229911 INFO  (coreLoadExecutor-4197-thread-1) [    ] o.a.s.u.UpdateLog Took 1.0ms to seed version buckets with highest version 1523264505105088512
   [junit4]   2> 1229911 INFO  (coreLoadExecutor-4197-thread-1) [    ] o.a.s.c.ZkController watch zkdir /configs/conf1
   [junit4]   2> 1229911 INFO  (coreLoadExecutor-4197-thread-1) [    ] o.a.s.c.CoreContainer registering core: collection1
   [junit4]   2> 1229911 INFO  (coreZkRegister-4191-thread-1) [    ] o.a.s.c.ZkController Register replica - core:collection1 address:http://127.0.0.1:55433 collection:control_collection shard:shard1
   [junit4]   2> 1229912 INFO  (coreZkRegister-4191-thread-1) [    ] o.a.s.c.c.SolrZkClient makePath: /collections/control_collection/leader_elect/shard1/election
   [junit4]   2> 1229913 INFO  (coreZkRegister-4191-thread-1) [    ] o.a.s.c.LeaderElector Joined leadership election with path: /collections/control_collection/leader_elect/shard1/election/95204031483478020-core_node1-n_0000000000
   [junit4]   2> 1229913 INFO  (coreZkRegister-4191-thread-1) [    ] o.a.s.c.ShardLeaderElectionContext Running the leader process for shard=shard1 and weAreReplacement=false and leaderVoteWait=10000
   [junit4]   2> 1229914 INFO  (coreZkRegister-4191-thread-1) [    ] o.a.s.c.ShardLeaderElectionContext Enough replicas found to continue.
   [junit4]   2> 1229914 INFO  (coreZkRegister-4191-thread-1) [    ] o.a.s.c.ShardLeaderElectionContext I may be the new leader - try and sync
   [junit4]   2> 1229914 INFO  (coreZkRegister-4191-thread-1) [    ] o.a.s.c.SyncStrategy Sync replicas to http://127.0.0.1:55433/collection1/
   [junit4]   2> 1229914 INFO  (coreZkRegister-4191-thread-1) [    ] o.a.s.c.SyncStrategy Sync Success - now sync replicas to me
   [junit4]   2> 1229914 INFO  (OverseerStateUpdate-95204031483478020-127.0.0.1:55433_-n_0000000000) [    ] o.a.s.c.Overseer processMessage: queueSize: 1, message = {
   [junit4]   2>   "operation":"leader",
   [junit4]   2>   "shard":"shard1",
   [junit4]   2>   "collection":"control_collection"} current state version: 1
   [junit4]   2> 1229914 INFO  (coreZkRegister-4191-thread-1) [    ] o.a.s.c.SyncStrategy http://127.0.0.1:55433/collection1/ has no replicas
   [junit4]   2> 1229914 INFO  (coreZkRegister-4191-thread-1) [    ] o.a.s.c.c.SolrZkClient makePath: /collections/control_collection/leaders/shard1
   [junit4]   2> 1229915 INFO  (coreZkRegister-4191-thread-1) [    ] o.a.s.c.ShardLeaderElectionContextBase Creating leader registration node
   [junit4]   2> 1229915 INFO  (coreZkRegister-4191-thread-1) [    ] o.a.s.c.ShardLeaderElectionContext I am the new leader: http://127.0.0.1:55433/collection1/ shard1
   [junit4]   2> 1229916 INFO  (OverseerStateUpdate-95204031483478020-127.0.0.1:55433_-n_0000000000) [    ] o.a.s.c.Overseer processMessage: queueSize: 1, message = {
   [junit4]   2>   "operation":"leader",
   [junit4]   2>   "shard":"shard1",
   [junit4]   2>   "collection":"control_collection",
   [junit4]   2>   "base_url":"http://127.0.0.1:55433",
   [junit4]   2>   "core":"collection1",
   [junit4]   2>   "state":"active"} current state version: 1
   [junit4]   2> 1230017 INFO  (zkCallback-1332-thread-1) [    ] o.a.s.c.c.ZkStateReader A cluster state change: [WatchedEvent state:SyncConnected type:NodeDataChanged path:/clusterstate.json], has occurred - updating... (live nodes size: [1])
   [junit4]   2> 1230066 INFO  (coreZkRegister-4191-thread-1) [    ] o.a.s.c.ZkController We are http://127.0.0.1:55433/collection1/ and leader is http://127.0.0.1:55433/collection1/
   [junit4]   2> 1230066 INFO  (coreZkRegister-4191-thread-1) [    ] o.a.s.c.ZkController No LogReplay needed for core=collection1 baseURL=http://127.0.0.1:55433
   [junit4]   2> 1230066 INFO  (coreZkRegister-4191-thread-1) [    ] o.a.s.c.ZkController I am the leader, no recovery necessary
   [junit4]   2> 1230066 INFO  (coreZkRegister-4191-thread-1) [    ] o.a.s.c.ZkController publishing state=active
   [junit4]   2> 1230066 INFO  (coreZkRegister-4191-thread-1) [    ] o.a.s.c.ZkController numShards not found on descriptor - reading it from system property
   [junit4]   2> 1230069 INFO  (OverseerStateUpdate-95204031483478020-127.0.0.1:55433_-n_0000000000) [    ] o.a.s.c.Overseer processMessage: queueSize: 1, message = {
   [junit4]   2>   "core":"collection1",
   [junit4]   2>   "core_node_name":"core_node1",
   [junit4]   2>   "roles":null,
   [junit4]   2>   "base_url":"http://127.0.0.1:55433",
   [junit4]   2>   "node_name":"127.0.0.1:55433_",
   [junit4]   2>   "numShards":"1",
   [junit4]   2>   "state":"active",
   [junit4]   2>   "shard":"shard1",
   [junit4]   2>   "collection":"control_collection",
   [junit4]   2>   "operation":"state"} current state version: 2
   [junit4]   2> 1230069 INFO  (OverseerStateUpdate-95204031483478020-127.0.0.1:55433_-n_0000000000) [    ] o.a.s.c.o.ReplicaMutator Update state numShards=1 message={
   [junit4]   2>   "core":"collection1",
   [junit4]   2>   "core_node_name":"core_node1",
   [junit4]   2>   "roles":null,
   [junit4]   2>   "base_url":"http://127.0.0.1:55433",
   [junit4]   2>   "node_name":"127.0.0.1:55433_",
   [junit4]   2>   "numShards":"1",
   [junit4]   2>   "state":"active",
   [junit4]   2>   "shard":"shard1",
   [junit4]   2>   "collection":"control_collection",
   [junit4]   2>   "operation":"state"}
   [junit4]   2> 1230170 INFO  (zkCallback-1332-thread-1) [    ] o.a.s.c.c.ZkStateReader A cluster state change: [WatchedEvent state:SyncConnected type:NodeDataChanged path:/clusterstate.json], has occurred - updating... (live nodes size: [1])
   [junit4]   2> 1230298 INFO  (TEST-HttpPartitionTest.test-seed#[A6CA607D3ABA454D]) [    ] o.a.s.c.c.SolrZkClient Using default ZkCredentialsProvider
   [junit4]   2> 1230298 INFO  (TEST-HttpPartitionTest.test-seed#[A6CA607D3ABA454D]) [    ] o.a.s.c.c.ConnectionManager Waiting for client to connect to ZooKeeper
   [junit4]   2> 1230299 INFO  (zkCallback-1334-thread-1) [    ] o.a.s.c.c.ConnectionManager Watcher org.apache.solr.common.cloud.ConnectionManager@3f56510e name:ZooKeeperConnection Watcher:127.0.0.1:40511/solr got event WatchedEvent state:SyncConnected type:None path:null path:null type:None
   [junit4]   2> 1230299 INFO  (TEST-HttpPartitionTest.test-seed#[A6CA607D3ABA454D]) [    ] o.a.s.c.c.ConnectionManager Client is connected to ZooKeeper
   [junit4]   2> 1230299 INFO  (TEST-HttpPartitionTest.test-seed#[A6CA607D3ABA454D]) [    ] o.a.s.c.c.SolrZkClient Using default ZkACLProvider
   [junit4]   2> 1230299 INFO  (TEST-HttpPartitionTest.test-seed#[A6CA607D3ABA454D]) [    ] o.a.s.c.c.ZkStateReader Updating cluster state from ZooKeeper... 
   [junit4]   2> 1230301 INFO  (TEST-HttpPartitionTest.test-seed#[A6CA607D3ABA454D]) [    ] o.a.s.c.ChaosMonkey monkey: init - expire sessions:false cause connection loss:false
   [junit4]   2> 1230301 INFO  (TEST-HttpPartitionTest.test-seed#[A6CA607D3ABA454D]) [    ] o.a.s.c.AbstractFullDistribZkTestBase Creating collection1 with stateFormat=2
   [junit4]   2> 1230301 INFO  (TEST-HttpPartitionTest.test-seed#[A6CA607D3ABA454D]) [    ] o.a.s.c.c.SolrZkClient Using default ZkCredentialsProvider
   [junit4]   2> 1230301 INFO  (TEST-HttpPartitionTest.test-seed#[A6CA607D3ABA454D]) [    ] o.a.s.c.c.ConnectionManager Waiting for client to connect to ZooKeeper
   [junit4]   2> 1230301 INFO  (zkCallback-1335-thread-1) [    ] o.a.s.c.c.ConnectionManager Watcher org.apache.solr.common.cloud.ConnectionManager@b05390c name:ZooKeeperConnection Watcher:127.0.0.1:40511/solr got event WatchedEvent state:SyncConnected type:None path:null path:null type:None
   [junit4]   2> 1230301 INFO  (TEST-HttpPartitionTest.test-seed#[A6CA607D3ABA454D]) [    ] o.a.s.c.c.ConnectionManager Client is connected to ZooKeeper
   [junit4]   2> 1230301 INFO  (TEST-HttpPartitionTest.test-seed#[A6CA607D3ABA454D]) [    ] o.a.s.c.c.SolrZkClient Using default ZkACLProvider
   [junit4]   2> 1230302 INFO  (OverseerStateUpdate-95204031483478020-127.0.0.1:55433_-n_0000000000) [    ] o.a.s.c.Overseer processMessage: queueSize: 1, message = {
   [junit4]   2>   "operation":"create",
   [junit4]   2>   "name":"collection1",
   [junit4]   2>   "numShards":"2",
   [junit4]   2>   "stateFormat":"2"} current state version: 3
   [junit4]   2> 1230302 INFO  (OverseerStateUpdate-95204031483478020-127.0.0.1:55433_-n_0000000000) [    ] o.a.s.c.o.ClusterStateMutator building a new cName: collection1
   [junit4]   2> 1230352 INFO  (TEST-HttpPartitionTest.test-seed#[A6CA607D3ABA454D]) [    ] o.a.s.SolrTestCaseJ4 Writing core.properties file to /home/jenkins/workspace/Lucene-Solr-trunk-Linux/solr/build/solr-core/test/J1/temp/solr.cloud.HttpPartitionTest_A6CA607D3ABA454D-001/shard-1-001/cores/collection1
   [junit4]   2> 1230352 INFO  (TEST-HttpPartitionTest.test-seed#[A6CA607D3ABA454D]) [    ] o.a.s.c.AbstractFullDistribZkTestBase create jetty 1 in directory /home/jenkins/workspace/Lucene-Solr-trunk-Linux/solr/build/solr-core/test/J1/temp/solr.cloud.HttpPartitionTest_A6CA607D3ABA454D-001/shard-1-001
   [junit4]   2> 1230353 INFO  (TEST-HttpPartitionTest.test-seed#[A6CA607D3ABA454D]) [    ] o.e.j.s.Server jetty-9.2.13.v20150730
   [junit4]   2> 1230354 INFO  (TEST-HttpPartitionTest.test-seed#[A6CA607D3ABA454D]) [    ] o.e.j.s.h.ContextHandler Started o.e.j.s.ServletContextHandler@509bdaa1{/,null,AVAILABLE}
   [junit4]   2> 1230354 INFO  (TEST-HttpPartitionTest.test-seed#[A6CA607D3ABA454D]) [    ] o.e.j.s.ServerConnector Started ServerConnector@571abce8{HTTP/1.1}{127.0.0.1:42458}
   [junit4]   2> 1230354 INFO  (TEST-HttpPartitionTest.test-seed#[A6CA607D3ABA454D]) [    ] o.e.j.s.Server Started @1232059ms
   [junit4]   2> 1230354 INFO  (TEST-HttpPartitionTest.test-seed#[A6CA607D3ABA454D]) [    ] o.a.s.c.s.e.JettySolrRunner Jetty properties: {solr.data.dir=/home/jenkins/workspace/Lucene-Solr-trunk-Linux/solr/build/solr-core/test/J1/temp/solr.cloud.HttpPartitionTest_A6CA607D3ABA454D-001/tempDir-001/jetty1, solrconfig=solrconfig.xml, hostContext=/, hostPort=50067, coreRootDirectory=/home/jenkins/workspace/Lucene-Solr-trunk-Linux/solr/build/solr-core/test/J1/temp/solr.cloud.HttpPartitionTest_A6CA607D3ABA454D-001/shard-1-001/cores}
   [junit4]   2> 1230355 INFO  (TEST-HttpPartitionTest.test-seed#[A6CA607D3ABA454D]) [    ] o.a.s.s.SolrDispatchFilter SolrDispatchFilter.init(): sun.misc.Launcher$AppClassLoader@deb6432
   [junit4]   2> 1230355 INFO  (TEST-HttpPartitionTest.test-seed#[A6CA607D3ABA454D]) [    ] o.a.s.c.SolrResourceLoader new SolrResourceLoader for directory: '/home/jenkins/workspace/Lucene-Solr-trunk-Linux/solr/build/solr-core/test/J1/temp/solr.cloud.HttpPartitionTest_A6CA607D3ABA454D-001/shard-1-001'
   [junit4]   2> 1230355 INFO  (TEST-HttpPartitionTest.test-seed#[A6CA607D3ABA454D]) [    ] o.a.s.c.SolrResourceLoader JNDI not configured for solr (NoInitialContextEx)
   [junit4]   2> 1230355 INFO  (TEST-HttpPartitionTest.test-seed#[A6CA607D3ABA454D]) [    ] o.a.s.c.SolrResourceLoader solr home defaulted to 'solr/' (could not find system property or JNDI)
   [junit4]   2> 1230355 INFO  (TEST-HttpPartitionTest.test-seed#[A6CA607D3ABA454D]) [    ] o.a.s.c.c.SolrZkClient Using default ZkCredentialsProvider
   [junit4]   2> 1230355 INFO  (TEST-HttpPartitionTest.test-seed#[A6CA607D3ABA454D]) [    ] o.a.s.c.c.ConnectionManager Waiting for client to connect to ZooKeeper
   [junit4]   2> 1230356 INFO  (zkCallback-1336-thread-1) [    ] o.a.s.c.c.ConnectionManager Watcher org.apache.solr.common.cloud.ConnectionManager@dce56fd name:ZooKeeperConnection Watcher:127.0.0.1:40511/solr got event WatchedEvent state:SyncConnected type:None path:null path:null type:None
   [junit4]   2> 1230356 INFO  (TEST-HttpPartitionTest.test-seed#[A6CA607D3ABA454D]) [    ] o.a.s.c.c.ConnectionManager Client is connected to ZooKeeper
   [junit4]   2> 1230357 INFO  (TEST-HttpPartitionTest.test-seed#[A6CA607D3ABA454D]) [    ] o.a.s.c.c.SolrZkClient Using default ZkACLProvider
   [junit4]   2> 1230357 INFO  (TEST-HttpPartitionTest.test-seed#[A6CA607D3ABA454D]) [    ] o.a.s.s.SolrDispatchFilter Loading solr.xml from SolrHome (not found in ZooKeeper)
   [junit4]   2> 1230357 INFO  (TEST-HttpPartitionTest.test-seed#[A6CA607D3ABA454D]) [    ] o.a.s.c.SolrXmlConfig Loading container configuration from /home/jenkins/workspace/Lucene-Solr-trunk-Linux/solr/build/solr-core/test/J1/temp/solr.cloud.HttpPartitionTest_A6CA607D3ABA454D-001/shard-1-001/solr.xml
   [junit4]   2> 1230360 INFO  (TEST-HttpPartitionTest.test-seed#[A6CA607D3ABA454D]) [    ] o.a.s.c.CorePropertiesLocator Config-defined core root directory: /home/jenkins/workspace/Lucene-Solr-trunk-Linux/solr/build/solr-core/test/J1/temp/solr.cloud.HttpPartitionTest_A6CA607D3ABA454D-001/shard-1-001/cores
   [junit4]   2> 1230360 INFO  (TEST-HttpPartitionTest.test-seed#[A6CA607D3ABA454D]) [    ] o.a.s.c.CoreContainer New CoreContainer 2059419764
   [junit4]   2> 1230360 INFO  (TEST-HttpPartitionTest.test-seed#[A6CA607D3ABA454D]) [    ] o.a.s.c.CoreContainer Loading cores into CoreContainer [instanceDir=/home/jenkins/workspace/Lucene-Solr-trunk-Linux/solr/build/solr-core/test/J1/temp/solr.cloud.HttpPartitionTest_A6CA607D3ABA454D-001/shard-1-001]
   [junit4]   2> 1230360 WARN  (TEST-HttpPartitionTest.test-seed#[A6CA607D3ABA454D]) [    ] o.a.s.c.CoreContainer Couldn't add files from /home/jenkins/workspace/Lucene-Solr-trunk-Linux/solr/build/solr-core/test/J1/temp/solr.cloud.HttpPartitionTest_A6CA607D3ABA454D-001/shard-1-001/lib to classpath: /home/jenkins/workspace/Lucene-Solr-trunk-Linux/solr/build/solr-core/test/J1/temp/solr.cloud.HttpPartitionTest_A6CA607D3ABA454D-001/shard-1-001/lib
   [junit4]   2> 1230361 INFO  (TEST-HttpPartitionTest.test-seed#[A6CA607D3ABA454D]) [    ] o.a.s.h.c.HttpShardHandlerFactory created with socketTimeout : 90000,urlScheme : ,connTimeout : 15000,maxConnectionsPerHost : 20,maxConnections : 10000,corePoolSize : 0,maximumPoolSize : 2147483647,maxThreadIdleTime : 5,sizeOfQueue : -1,fairnessPolicy : false,useRetries : false,
   [junit4]   2> 1230361 INFO  (TEST-HttpPartitionTest.test-seed#[A6CA607D3ABA454D]) [    ] o.a.s.u.UpdateShardHandler Creating UpdateShardHandler HTTP client with params: socketTimeout=340000&connTimeout=45000&retry=true
   [junit4]   2> 1230362 INFO  (TEST-HttpPartitionTest.test-seed#[A6CA607D3ABA454D]) [    ] o.a.s.l.LogWatcher SLF4J impl is org.slf4j.impl.Log4jLoggerFactory
   [junit4]   2> 1230362 INFO  (TEST-HttpPartitionTest.test-seed#[A6CA607D3ABA454D]) [    ] o.a.s.l.LogWatcher Registering Log Listener [Log4j (org.slf4j.impl.Log4jLoggerFactory)]
   [junit4]   2> 1230362 INFO  (TEST-HttpPartitionTest.test-seed#[A6CA607D3ABA454D]) [    ] o.a.s.c.ZkContainer Zookeeper client=127.0.0.1:40511/solr
   [junit4]   2> 1230362 INFO  (TEST-HttpPartitionTest.test-seed#[A6CA607D3ABA454D]) [    ] o.a.s.c.ZkController zkHost includes chroot
   [junit4]   2> 1230362 INFO  (TEST-HttpPartitionTest.test-seed#[A6CA607D3ABA454D]) [    ] o.a.s.c.c.SolrZkClient Using default ZkCredentialsProvider
   [junit4]   2> 1230362 INFO  (TEST-HttpPartitionTest.test-seed#[A6CA607D3ABA454D]) [    ] o.a.s.c.c.ConnectionManager Waiting for client to connect to ZooKeeper
   [junit4]   2> 1230363 INFO  (zkCallback-1339-thread-1) [    ] o.a.s.c.c.ConnectionManager Watcher org.apache.solr.common.cloud.ConnectionManager@108b4274 name:ZooKeeperConnection Watcher:127.0.0.1:40511 got event WatchedEvent state:SyncConnected type:None path:null path:null type:None
   [junit4]   2> 1230363 INFO  (TEST-HttpPartitionTest.test-seed#[A6CA607D3ABA454D]) [    ] o.a.s.c.c.ConnectionManager Client is connected to ZooKeeper
   [junit4]   2> 1230363 INFO  (TEST-HttpPartitionTest.test-seed#[A6CA607D3ABA454D]) [    ] o.a.s.c.c.SolrZkClient Using default ZkACLProvider
   [junit4]   2> 1230364 INFO  (TEST-HttpPartitionTest.test-seed#[A6CA607D3ABA454D]) [    ] o.a.s.c.c.ConnectionManager Waiting for client to connect to ZooKeeper
   [junit4]   2> 1230364 INFO  (zkCallback-1340-thread-1) [    ] o.a.s.c.c.ConnectionManager Watcher org.apache.solr.common.cloud.ConnectionManager@233d4936 name:ZooKeeperConnection Watcher:127.0.0.1:40511/solr got event WatchedEvent state:SyncConnected type:None path:null path:null type:None
   [junit4]   2> 1230364 INFO  (TEST-HttpPartitionTest.test-seed#[A6CA607D3ABA454D]) [    ] o.a.s.c.c.ConnectionManager Client is connected to ZooKeeper
   [junit4]   2> 1230366 INFO  (TEST-HttpPartitionTest.test-seed#[A6CA607D3ABA454D]) [    ] o.a.s.c.c.ZkStateReader Updating cluster state from ZooKeeper... 
   [junit4]   2> 1230403 INFO  (OverseerStateUpdate-95204031483478020-127.0.0.1:55433_-n_0000000000) [    ] o.a.s.c.o.ZkStateWriter going to create_collection /collections/collection1/state.json
   [junit4]   2> 1231368 INFO  (TEST-HttpPartitionTest.test-seed#[A6CA607D3ABA454D]) [    ] o.a.s.c.ZkController Register node as live in ZooKeeper:/live_nodes/127.0.0.1:50067_
   [junit4]   2> 1231368 INFO  (TEST-HttpPartitionTest.test-seed#[A6CA607D3ABA454D]) [    ] o.a.s.c.c.SolrZkClient makePath: /live_nodes/127.0.0.1:50067_
   [junit4]   2> 1231368 INFO  (zkCallback-1334-thread-1) [    ] o.a.s.c.c.ZkStateReader A live node change: [WatchedEvent state:SyncConnected type:NodeChildrenChanged path:/live_nodes], has occurred - updating... (live nodes size: [1])
   [junit4]   2> 1231368 INFO  (zkCallback-1340-thread-1) [    ] o.a.s.c.c.ZkStateReader A live node change: [WatchedEvent state:SyncConnected type:NodeChildrenChanged path:/live_nodes], has occurred - updating... (live nodes size: [1])
   [junit4]   2> 1231369 INFO  (TEST-HttpPartitionTest.test-seed#[A6CA607D3ABA454D]) [    ] o.a.s.c.Overseer Overseer (id=null) closing
   [junit4]   2> 1231369 INFO  (TEST-HttpPartitionTest.test-seed#[A6CA607D3ABA454D]) [    ] o.a.s.c.LeaderElector Joined leadership election with path: /overseer_elect/election/95204031483478025-127.0.0.1:50067_-n_0000000001
   [junit4]   2> 1231369 INFO  (TEST-HttpPartitionTest.test-seed#[A6CA607D3ABA454D]) [    ] o.a.s.c.LeaderElector Watching path /overseer_elect/election/95204031483478020-127.0.0.1:55433_-n_0000000000 to know if I could be the leader
   [junit4]   2> 1231369 INFO  (zkCallback-1332-thread-2) [    ] o.a.s.c.c.ZkStateReader A live node change: [WatchedEvent state:SyncConnected type:NodeChildrenChanged path:/live_nodes], has occurred - updating... (live nodes size: [1])
   [junit4]   2> 1231381 INFO  (TEST-HttpPartitionTest.test-seed#[A6CA607D3ABA454D]) [    ] o.a.s.c.CoreContainer Security conf doesn't exist. Skipping setup for authorization module.
   [junit4]   2> 1231381 INFO  (TEST-HttpPartitionTest.test-seed#[A6CA607D3ABA454D]) [    ] o.a.s.c.CoreContainer No authentication plugin used.
   [junit4]   2> 1231381 INFO  (TEST-HttpPartitionTest.test-seed#[A6CA607D3ABA454D]) [    ] o.a.s.c.CorePropertiesLocator Looking for core definitions underneath /home/jenkins/workspace/Lucene-Solr-trunk-Linux/solr/build/solr-core/test/J1/temp/solr.cloud.HttpPartitionTest_A6CA607D3ABA454D-001/shard-1-001/cores
   [junit4]   2> 1231381 INFO  (TEST-HttpPartitionTest.test-seed#[A6CA607D3ABA454D]) [    ] o.a.s.c.CoreDescriptor Created CoreDescriptor: {name=collection1, config=solrconfig.xml, transient=false, schema=schema.xml, loadOnStartup=true, configSetProperties=configsetprops.json, collection=collection1, coreNodeName=, dataDir=data/, shard=}
   [junit4]   2> 1231381 INFO  (TEST-HttpPartitionTest.test-seed#[A6CA607D3ABA454D]) [    ] o.a.s.c.CorePropertiesLocator Found core collection1 in /home/jenkins/workspace/Lucene-Solr-trunk-Linux/solr/build/solr-core/test/J1/temp/solr.cloud.HttpPartitionTest_A6CA607D3ABA454D-001/shard-1-001/cores/collection1
   [junit4]   2> 1231381 INFO  (TEST-HttpPartitionTest.test-seed#[A6CA607D3ABA454D]) [    ] o.a.s.c.CorePropertiesLocator Found 1 core definitions
   [junit4]   2> 1231382 INFO  (TEST-HttpPartitionTest.test-seed#[A6CA607D3ABA454D]) [    ] o.a.s.s.SolrDispatchFilter user.dir=/home/jenkins/workspace/Lucene-Solr-trunk-Linux/solr/build/solr-core/test/J1
   [junit4]   2> 1231382 INFO  (TEST-HttpPartitionTest.test-seed#[A6CA607D3ABA454D]) [    ] o.a.s.s.SolrDispatchFilter SolrDispatchFilter.init() done
   [junit4]   2> 1231382 INFO  (coreLoadExecutor-4208-thread-1) [    ] o.a.s.c.ZkController publishing state=down
   [junit4]   2> 1231382 INFO  (coreLoadExecutor-4208-thread-1) [    ] o.a.s.c.ZkController numShards not found on descriptor - reading it from system property
   [junit4]   2> 1231383 INFO  (coreLoadExecutor-4208-thread-1) [    ] o.a.s.c.ZkController Registering watch for collection collection1
   [junit4]   2> 1231383 INFO  (coreLoadExecutor-4208-thread-1) [    ] o.a.s.c.c.ZkStateReader addZkWatch [collection1]
   [junit4]   2> 1231383 INFO  (OverseerStateUpdate-95204031483478020-127.0.0.1:55433_-n_0000000000) [    ] o.a.s.c.Overseer processMessage: queueSize: 1, message = {
   [junit4]   2>   "core":"collection1",
   [junit4]   2>   "roles":null,
   [junit4]   2>   "base_url":"http://127.0.0.1:50067",
   [junit4]   2>   "node_name":"127.0.0.1:50067_",
   [junit4]   2>   "numShards":"2",
   [junit4]   2>   "state":"down",
   [junit4]   2>   "shard":null,
   [junit4]   2>   "collection":"collection1",
   [junit4]   2>   "operation":"state"} current state version: 3
   [junit4]   2> 1231383 INFO  (coreLoadExecutor-4208-thread-1) [    ] o.a.s.c.c.ZkStateReader Add data for [collection1] ver [0]
   [junit4]   2> 1231383 INFO  (coreLoadExecutor-4208-thread-1) [    ] o.a.s.c.ZkController look for our core node name
   [junit4]   2> 1231383 INFO  (OverseerStateUpdate-95204031483478020-127.0.0.1:55433_-n_0000000000) [    ] o.a.s.c.o.ReplicaMutator Update state numShards=2 message={
   [junit4]   2>   "core":"collection1",
   [junit4]   2>   "roles":null,
   [junit4]   2>   "base_url":"http://127.0.0.1:50067",
   [junit4]   2>   "node_name":"127.0.0.1:50067_",
   [junit4]   2>   "numShards":"2",
   [junit4]   2>   "state":"down",
   [junit4]   2>   "shard":null,
   [junit4]   2>   "collection":"collection1",
   [junit4]   2>   "operation":"state"}
   [junit4]   2> 1231383 INFO  (OverseerStateUpdate-95204031483478020-127.0.0.1:55433_-n_0000000000) [    ] o.a.s.c.o.ReplicaMutator Collection already exists with numShards=2
   [junit4]   2> 1231383 INFO  (OverseerStateUpdate-95204031483478020-127.0.0.1:55433_-n_0000000000) [    ] o.a.s.c.o.ReplicaMutator Assigning new node to shard shard=shard2
   [junit4]   2> 1231484 INFO  (OverseerStateUpdate-95204031483478020-127.0.0.1:55433_-n_0000000000) [    ] o.a.s.c.o.ZkStateWriter going to update_collection /collections/collection1/state.json version: 0
   [junit4]   2> 1231484 INFO  (zkCallback-1340-thread-1) [    ] o.a.s.c.c.ZkStateReader A cluster state change: [WatchedEvent state:SyncConnected type:NodeDataChanged path:/collections/collection1/state.json] for collection [collection1] has occurred - updating... (live nodes size: [2])
   [junit4]   2> 1231485 INFO  (zkCallback-1340-thread-1) [    ] o.a.s.c.c.ZkStateReader Updating data for [collection1] from [0] to [1]
   [junit4]   2> 1232383 INFO  (coreLoadExecutor-4208-thread-1) [    ] o.a.s.c.ZkController waiting to find shard id in clusterstate for collection1
   [junit4]   2> 1232383 INFO  (coreLoadExecutor-4208-thread-1) [    ] o.a.s.c.ZkController Check for collection zkNode:collection1
   [junit4]   2> 1232383 INFO  (coreLoadExecutor-4208-thread-1) [    ] o.a.s.c.ZkController Collection zkNode exists
   [junit4]   2> 1232383 INFO  (coreLoadExecutor-4208-thread-1) [    ] o.a.s.c.c.ZkStateReader Load collection config from: [/collections/collection1]
   [junit4]   2> 1232384 INFO  (coreLoadExecutor-4208-thread-1) [    ] o.a.s.c.c.ZkStateReader path=[/collections/collection1] [configName]=[conf1] specified config exists in ZooKeeper
   [junit4]   2> 1232384 INFO  (coreLoadExecutor-4208-thread-1) [    ] o.a.s.c.SolrResourceLoader new SolrResourceLoader for directory: '/home/jenkins/workspace/Lucene-Solr-trunk-Linux/solr/build/solr-core/test/J1/temp/solr.cloud.HttpPartitionTest_A6CA607D3ABA454D-001/shard-1-001/cores/collection1'
   [junit4]   2> 1232384 INFO  (coreLoadExecutor-4208-thread-1) [    ] o.a.s.c.SolrResourceLoader JNDI not configured for solr (NoInitialContextEx)
   [junit4]   2> 1232384 INFO  (coreLoadExecutor-4208-thread-1) [    ] o.a.s.c.SolrResourceLoader solr home defaulted to 'solr/' (could not find system property or JNDI)
   [junit4]   2> 1232385 INFO  (coreLoadExecutor-4208-thread-1) [    ] o.a.s.c.Config loaded config solrconfig.xml with version 0 
   [junit4]   2> 1232387 INFO  (coreLoadExecutor-4208-thread-1) [    ] o.a.s.c.SolrConfig current version of requestparams : -1
   [junit4]   2> 1232390 INFO  (coreLoadExecutor-4208-thread-1) [    ] o.a.s.c.SolrConfig Using Lucene MatchVersion: 6.0.0
   [junit4]   2> 1232411 INFO  (coreLoadExecutor-4208-thread-1) [    ] o.a.s.c.SolrConfig Loaded SolrConfig: solrconfig.xml
   [junit4]   2> 1232414 INFO  (coreLoadExecutor-4208-thread-1) [    ] o.a.s.s.IndexSchema [collection1] Schema name=test
   [junit4]   2> 1232474 INFO  (coreLoadExecutor-4208-thread-1) [    ] o.a.s.s.OpenExchangeRatesOrgProvider Initialized with rates=open-exchange-rates.json, refreshInterval=1440.
   [junit4]   2> 1232477 INFO  (coreLoadExecutor-4208-thread-1) [    ] o.a.s.s.IndexSchema default search field in schema is text
   [junit4]   2> 1232478 INFO  (coreLoadExecutor-4208-thread-1) [    ] o.a.s.s.IndexSchema unique key field: id
   [junit4]   2> 1232482 INFO  (coreLoadExecutor-4208-thread-1) [    ] o.a.s.s.FileExchangeRateProvider Reloading exchange rates from file currency.xml
   [junit4]   2> 1232483 INFO  (coreLoadExecutor-4208-thread-1) [    ] o.a.s.s.FileExchangeRateProvider Reloading exchange rates from file currency.xml
   [junit4]   2> 1232484 INFO  (coreLoadExecutor-4208-thread-1) [    ] o.a.s.s.OpenExchangeRatesOrgProvider Reloading exchange rates from open-exchange-rates.json
   [junit4]   2> 1232484 INFO  (coreLoadExecutor-4208-thread-1) [    ] o.a.s.s.OpenExchangeRatesOrgProvider Reloading exchange rates from open-exchange-rates.json
   [junit4]   2> 1232485 INFO  (coreLoadExecutor-4208-thread-1) [    ] o.a.s.c.ConfigSetProperties Did not find ConfigSet properties, assuming default properties: Can't find resource 'configsetprops.json' in classpath or '/configs/conf1', cwd=/home/jenkins/workspace/Lucene-Solr-trunk-Linux/solr/build/solr-core/test/J1
   [junit4]   2> 1232485 INFO  (coreLoadExecutor-4208-thread-1) [    ] o.a.s.c.CoreContainer Creating SolrCore 'collection1' using configuration from collection collection1
   [junit4]   2> 1232485 INFO  (coreLoadExecutor-4208-thread-1) [    ] o.a.s.c.SolrCore org.apache.solr.core.MockDirectoryFactory
   [junit4]   2> 1232486 INFO  (coreLoadExecutor-4208-thread-1) [    ] o.a.s.c.SolrCore [[collection1] ] Opening new SolrCore at [/home/jenkins/workspace/Lucene-Solr-trunk-Linux/solr/build/solr-core/test/J1/temp/solr.cloud.HttpPartitionTest_A6CA607D3ABA454D-001/shard-1-001/cores/collection1], dataDir=[/home/jenkins/workspace/Lucene-Solr-trunk-Linux/solr/build/solr-core/test/J1/temp/solr.cloud.HttpPartitionTest_A6CA607D3ABA454D-001/shard-1-001/cores/collection1/data/]
   [junit4]   2> 1232486 INFO  (coreLoadExecutor-4208-thread-1) [    ] o.a.s.c.JmxMonitoredMap JMX monitoring is enabled. Adding Solr mbeans to JMX Server: com.sun.jmx.mbeanserver.JmxMBeanServer@4102580c
   [junit4]   2> 1232486 INFO  (coreLoadExecutor-4208-thread-1) [    ] o.a.s.c.CachingDirectoryFactory return new directory for /home/jenkins/workspace/Lucene-Solr-trunk-Linux/solr/build/solr-core/test/J1/temp/solr.cloud.HttpPartitionTest_A6CA607D3ABA454D-001/shard-1-001/cores/collection1/data
   [junit4]   2> 1232486 INFO  (coreLoadExecutor-4208-thread-1) [    ] o.a.s.c.SolrCore New index directory detected: old=null new=/home/jenkins/workspace/Lucene-Solr-trunk-Linux/solr/build/solr-core/test/J1/temp/solr.cloud.HttpPartitionTest_A6CA607D3ABA454D-001/shard-1-001/cores/collection1/data/index/
   [junit4]   2> 1232486 WARN  (coreLoadExecutor-4208-thread-1) [    ] o.a.s.c.SolrCore [collection1] Solr index directory '/home/jenkins/workspace/Lucene-Solr-trunk-Linux/solr/build/solr-core/test/J1/temp/solr.cloud.HttpPartitionTest_A6CA607D3ABA454D-001/shard-1-001/cores/collection1/data/index' doesn't exist. Creating new index...
   [junit4]   2> 1232486 INFO  (coreLoadExecutor-4208-thread-1) [    ] o.a.s.c.CachingDirectoryFactory return new directory for /home/jenkins/workspace/Lucene-Solr-trunk-Linux/solr/build/solr-core/test/J1/temp/solr.cloud.HttpPartitionTest_A6CA607D3ABA454D-001/shard-1-001/cores/collection1/data/index
   [junit4]   2> 1232486 INFO  (coreLoadExecutor-4208-thread-1) [    ] o.a.s.u.RandomMergePolicy RandomMergePolicy wrapping class org.apache.lucene.index.TieredMergePolicy: [TieredMergePolicy: maxMergeAtOnce=27, maxMergeAtOnceExplicit=23, maxMergedSegmentMB=52.296875, floorSegmentMB=1.1484375, forceMergeDeletesPctAllowed=29.853381930844943, segmentsPerTier=25.0, maxCFSSegmentSizeMB=8.796093022207999E12, noCFSRatio=0.0
   [junit4]   2> 1232487 INFO  (coreLoadExecutor-4208-thread-1) [    ] o.a.s.c.SolrDeletionPolicy SolrDeletionPolicy.onCommit: commits: num=1
   [junit4]   2> 	commit{dir=MockDirectoryWrapper(RAMDirectory@7822cc4 lockFactory=org.apache.lucene.store.SingleInstanceLockFactory@52ac0685),segFN=segments_1,generation=1}
   [junit4]   2> 1232487 INFO  (coreLoadExecutor-4208-thread-1) [    ] o.a.s.c.SolrDeletionPolicy newest commit generation = 1
   [junit4]   2> 1232487 INFO  (OldIndexDirectoryCleanupThreadForCore-collection1) [    ] o.a.s.c.SolrCore Looking for old index directories to cleanup for core collection1 in /home/jenkins/workspace/Lucene-Solr-trunk-Linux/solr/build/solr-core/test/J1/temp/solr.cloud.HttpPartitionTest_A6CA607D3ABA454D-001/shard-1-001/cores/collection1/data/
   [junit4]   2> 1232487 WARN  (OldIndexDirectoryCleanupThreadForCore-collection1) [    ] o.a.s.c.DirectoryFactory /home/jenkins/workspace/Lucene-Solr-trunk-Linux/solr/build/solr-core/test/J1/temp/solr.cloud.HttpPartitionTest_A6CA607D3ABA454D-001/shard-1-001/cores/collection1/data/ does not point to a valid data directory; skipping clean-up of old index directories.
   [junit4]   2> 1232489 INFO  (coreLoadExecutor-4208-thread-1) [    ] o.a.s.u.p.UpdateRequestProcessorChain creating updateRequestProcessorChain "nodistrib"
   [junit4]   2> 1232489 INFO  (coreLoadExecutor-4208-thread-1) [    ] o.a.s.u.p.UpdateRequestProcessorChain creating updateRequestProcessorChain "dedupe"
   [junit4]   2> 1232489 INFO  (coreLoadExecutor-4208-thread-1) [    ] o.a.s.u.p.UpdateRequestProcessorChain inserting DistributedUpdateProcessorFactory into updateRequestProcessorChain "dedupe"
   [junit4]   2> 1232489 INFO  (coreLoadExecutor-4208-thread-1) [    ] o.a.s.u.p.UpdateRequestProcessorChain creating updateRequestProcessorChain "stored_sig"
   [junit4]   2> 1232489 INFO  (coreLoadExecutor-4208-thread-1) [    ] o.a.s.u.p.UpdateRequestProcessorChain inserting DistributedUpdateProcessorFactory into updateRequestProcessorChain "stored_sig"
   [junit4]   2> 1232489 INFO  (coreLoadExecutor-4208-thread-1) [    ] o.a.s.u.p.UpdateRequestProcessorChain creating updateRequestProcessorChain "distrib-dup-test-chain-explicit"
   [junit4]   2> 1232489 INFO  (coreLoadExecutor-4208-thread-1) [    ] o.a.s.u.p.UpdateRequestProcessorChain creating updateRequestProcessorChain "distrib-dup-test-chain-implicit"
   [junit4]   2> 1232490 INFO  (coreLoadExecutor-4208-thread-1) [    ] o.a.s.u.p.UpdateRequestProcessorChain inserting DistributedUpdateProcessorFactory into updateRequestProcessorChain "distrib-dup-test-chain-implicit"
   [junit4]   2> 1232490 INFO  (coreLoadExecutor-4208-thread-1) [    ] o.a.s.c.SolrCore no updateRequestProcessorChain defined as default, creating implicit default
   [junit4]   2> 1232490 WARN  (coreLoadExecutor-4208-thread-1) [    ] o.a.s.c.RequestHandlers INVALID paramSet a in requestHandler {type = requestHandler,name = /dump,class = DumpRequestHandler,args = {defaults={a=A,b=B}}}
   [junit4]   2> 1232491 INFO  (coreLoadExecutor-4208-thread-1) [    ] o.a.s.h.l.XMLLoader xsltCacheLifetimeSeconds=60
   [junit4]   2> 1232491 INFO  (coreLoadExecutor-4208-thread-1) [    ] o.a.s.h.l.XMLLoader xsltCacheLifetimeSeconds=60
   [junit4]   2> 1232492 INFO  (coreLoadExecutor-4208-thread-1) [    ] o.a.s.h.l.XMLLoader xsltCacheLifetimeSeconds=60
   [junit4]   2> 1232492 INFO  (coreLoadExecutor-4208-thread-1) [    ] o.a.s.h.l.XMLLoader xsltCacheLifetimeSeconds=60
   [junit4]   2> 1232494 INFO  (coreLoadExecutor-4208-thread-1) [    ] o.a.s.c.RequestHandlers Registered paths: /admin/mbeans,standard,/dump,/update/csv,/sql,/update/json/docs,/admin/luke,/export,/admin/segments,/get,/admin/system,/replication,/admin/properties,/config,/stream,/schema,/admin/plugins,/admin/logging,/update/json,/admin/threads,/admin/ping,/update,/admin/file
   [junit4]   2> 1232494 INFO  (coreLoadExecutor-4208-thread-1) [    ] o.a.s.c.SolrCore Using default statsCache cache: org.apache.solr.search.stats.LocalStatsCache
   [junit4]   2> 1232495 INFO  (coreLoadExecutor-4208-thread-1) [    ] o.a.s.u.UpdateHandler Using UpdateLog implementation: org.apache.solr.update.UpdateLog
   [junit4]   2> 1232495 INFO  (coreLoadExecutor-4208-thread-1) [    ] o.a.s.u.UpdateLog Initializing UpdateLog: dataDir= defaultSyncLevel=FLUSH numRecordsToKeep=100 maxNumLogsToKeep=10 numVersionBuckets=65536
   [junit4]   2> 1232495 INFO  (coreLoadExecutor-4208-thread-1) [    ] o.a.s.u.CommitTracker Hard AutoCommit: disabled
   [junit4]   2> 1232495 INFO  (coreLoadExecutor-4208-thread-1) [    ] o.a.s.u.CommitTracker Soft AutoCommit: disabled
   [junit4]   2> 1232496 INFO  (coreLoadExecutor-4208-thread-1) [    ] o.a.s.u.RandomMergePolicy RandomMergePolicy wrapping class org.apache.lucene.index.TieredMergePolicy: [TieredMergePolicy: maxMergeAtOnce=23, maxMergeAtOnceExplicit=16, maxMergedSegmentMB=33.048828125, floorSegmentMB=0.82421875, forceMergeDeletesPctAllowed=29.165186422531843, segmentsPerTier=45.0, maxCFSSegmentSizeMB=8.796093022207999E12, noCFSRatio=0.0
   [junit4]   2> 1232496 INFO  (coreLoadExecutor-4208-thread-1) [    ] o.a.s.c.SolrDeletionPolicy SolrDeletionPolicy.onInit: commits: num=1
   [junit4]   2> 	commit{dir=MockDirectoryWrapper(RAMDirectory@7822cc4 lockFactory=org.apache.lucene.store.SingleInstanceLockFactory@52ac0685),segFN=segments_1,generation=1}
   [junit4]   2> 1232496 INFO  (coreLoadExecutor-4208-thread-1) [    ] o.a.s.c.SolrDeletionPolicy newest commit generation = 1
   [junit4]   2> 1232497 INFO  (coreLoadExecutor-4208-thread-1) [    ] o.a.s.s.SolrIndexSearcher Opening [Searcher@19e7493b[collection1] main]
   [junit4]   2> 1232497 INFO  (coreLoadExecutor-4208-thread-1) [    ] o.a.s.c.c.ZkStateReader Load collection config from: [/collections/collection1]
   [junit4]   2> 1232497 INFO  (coreLoadExecutor-4208-thread-1) [    ] o.a.s.c.c.ZkStateReader path=[/collections/collection1] [configName]=[conf1] specified config exists in ZooKeeper
   [junit4]   2> 1232497 INFO  (coreLoadExecutor-4208-thread-1) [    ] o.a.s.r.ManagedResourceStorage Setting up ZooKeeper-based storage for the RestManager with znodeBase: /configs/conf1
   [junit4]   2> 1232497 INFO  (coreLoadExecutor-4208-thread-1) [    ] o.a.s.r.ManagedResourceStorage Configured ZooKeeperStorageIO with znodeBase: /configs/conf1
   [junit4]   2> 1232497 INFO  (coreLoadExecutor-4208-thread-1) [    ] o.a.s.r.RestManager Initializing RestManager with initArgs: {}
   [junit4]   2> 1232497 INFO  (coreLoadExecutor-4208-thread-1) [    ] o.a.s.r.ManagedResourceStorage Reading _rest_managed.json using ZooKeeperStorageIO:path=/configs/conf1
   [junit4]   2> 1232497 INFO  (coreLoadExecutor-4208-thread-1) [    ] o.a.s.r.ManagedResourceStorage No data found for znode /configs/conf1/_rest_managed.json
   [junit4]   2> 1232497 INFO  (coreLoadExecutor-4208-thread-1) [    ] o.a.s.r.ManagedResourceStorage Loaded null at path _rest_managed.json using ZooKeeperStorageIO:path=/configs/conf1
   [junit4]   2> 1232497 INFO  (coreLoadExecutor-4208-thread-1) [    ] o.a.s.r.RestManager Initializing 0 registered ManagedResources
   [junit4]   2> 1232497 INFO  (coreLoadExecutor-4208-thread-1) [    ] o.a.s.h.ReplicationHandler Commits will be reserved for  10000
   [junit4]   2> 1232498 INFO  (searcherExecutor-4209-thread-1) [    ] o.a.s.c.SolrCore [collection1] Registered new searcher Searcher@19e7493b[collection1] main{ExitableDirectoryReader(UninvertingDirectoryReader())}
   [junit4]   2> 1232498 INFO  (coreLoadExecutor-4208-thread-1) [    ] o.a.s.u.UpdateLog Looking up max value of version field to seed version buckets
   [junit4]   2> 1232498 INFO  (coreLoadExecutor-4208-thread-1) [    ] o.a.s.u.VersionInfo Refreshing highest value of _version_ for 65536 version buckets from index
   [junit4]   2> 1232498 INFO  (coreLoadExecutor-4208-thread-1) [    ] o.a.s.u.VersionInfo No terms found for _version_, cannot seed version bucket highest value from index
   [junit4]   2> 1232498 INFO  (coreLoadExecutor-4208-thread-1) [    ] o.a.s.u.UpdateLog Could not find max version in index or recent updates, using new clock 1523264507819851776
   [junit4]   2> 1232500 INFO  (coreLoadExecutor-4208-thread-1) [    ] o.a.s.u.UpdateLog Took 1.0ms to seed version buckets with highest version 1523264507819851776
   [junit4]   2> 1232500 INFO  (coreLoadExecutor-4208-thread-1) [    ] o.a.s.c.ZkController watch zkdir /configs/conf1
   [junit4]   2> 1232500 INFO  (coreLoadExecutor-4208-thread-1) [    ] o.a.s.c.CoreContainer registering core: collection1
   [junit4]   2> 1232501 INFO  (coreZkRegister-4203-thread-1) [    ] o.a.s.c.ZkController Register replica - core:collection1 address:http://127.0.0.1:50067 collection:collection1 shard:shard2
   [junit4]   2> 1232501 INFO  (coreZkRegister-4203-thread-1) [    ] o.a.s.c.c.SolrZkClient makePath: /collections/collection1/leader_elect/shard2/election
   [junit4]   2> 1232502 INFO  (coreZkRegister-4203-thread-1) [    ] o.a.s.c.LeaderElector Joined leadership election with path: /collections/collection1/leader_elect/shard2/election/95204031483478025-core_node1-n_0000000000
   [junit4]   2> 1232502 INFO  (coreZkRegister-4203-thread-1) [    ] o.a.s.c.ShardLeaderElectionContext Running the leader process for shard=shard2 and weAreReplacement=false and leaderVoteWait=10000
   [junit4]   2> 1232503 INFO  (coreZkRegister-4203-thread-1) [    ] o.a.s.c.ShardLeaderElectionContext Enough replicas found to continue.
   [junit4]   2> 1232503 INFO  (coreZkRegister-4203-thread-1) [    ] o.a.s.c.ShardLeaderElectionContext I may be the new leader - try and sync
   [junit4]   2> 1232503 INFO  (coreZkRegister-4203-thread-1) [    ] o.a.s.c.SyncStrategy Sync replicas to http://127.0.0.1:50067/collection1/
   [junit4]   2> 1232503 INFO  (coreZkRegister-4203-thread-1) [    ] o.a.s.c.SyncStrategy Sync Success - now sync replicas to me
   [junit4]   2> 1232503 INFO  (coreZkRegister-4203-thread-1) [    ] o.a.s.c.SyncStrategy http://127.0.0.1:50067/collection1/ has no replicas
   [junit4]   2> 1232503 INFO  (coreZkRegister-4203-thread-1) [    ] o.a.s.c.c.SolrZkClient makePath: /collections/collection1/leaders/shard2
   [junit4]   2> 1232504 INFO  (coreZkRegister-4203-thread-1) [    ] o.a.s.c.ShardLeaderElectionContextBase Creating leader registration node
   [junit4]   2> 1232505 INFO  (OverseerStateUpdate-95204031483478020-127.0.0.1:55433_-n_0000000000) [    ] o.a.s.c.Overseer processMessage: queueSize: 1, message = {
   [junit4]   2>   "operation":"leader",
   [junit4]   2>   "shard":"shard2",
   [junit4]   2>   "collection":"collection1"} current state version: 3
   [junit4]   2> 1232505 INFO  (coreZkRegister-4203-thread-1) [    ] o.a.s.c.ShardLeaderElectionContext I am the new leader: http://127.0.0.1:50067/collection1/ shard2
   [junit4]   2> 1232506 INFO  (OverseerStateUpdate-95204031483478020-127.0.0.1:55433_-n_0000000000) [    ] o.a.s.c.Overseer processMessage: queueSize: 1, message = {
   [junit4]   2>   "operation":"leader",
   [junit4]   2>   "shard":"shard2",
   [junit4]   2>   "collection":"collection1",
   [junit4]   2>   "base_url":"http://127.0.0.1:50067",
   [junit4]   2>   "core":"collection1",
   [junit4]   2>   "state":"active"} current state version: 3
   [junit4]   2> 1232607 INFO  (OverseerStateUpdate-95204031483478020-127.0.0.1:55433_-n_0000000000) [    ] o.a.s.c.o.ZkStateWriter going to update_collection /collections/collection1/state.json version: 1
   [junit4]   2> 1232607 INFO  (zkCallback-1340-thread-1) [    ] o.a.s.c.c.ZkStateReader A cluster state change: [WatchedEvent state:SyncConnected type:NodeDataChanged path:/collections/collection1/state.json] for collection [collection1] has occurred - updating... (live nodes size: [2])
   [junit4]   2> 1232607 INFO  (zkCallback-1340-thread-1) [    ] o.a.s.c.c.ZkStateReader Updating data for [collection1] from [1] to [2]
   [junit4]   2> 1232656 INFO  (coreZkRegister-4203-thread-1) [    ] o.a.s.c.ZkController We are http://127.0.0.1:50067/collection1/ and leader is http://127.0.0.1:50067/collection1/
   [junit4]   2> 1232656 INFO  (coreZkRegister-4203-thread-1) [    ] o.a.s.c.ZkController No LogReplay needed for core=collection1 baseURL=http://127.0.0.1:50067
   [junit4]   2> 1232656 INFO  (coreZkRegister-4203-thread-1) [    ] o.a.s.c.ZkController I am the leader, no recovery necessary
   [j

[...truncated too long message...]

url":"http://127.0.0.1:55433",
   [junit4]    >             "node_name":"127.0.0.1:55433_",
   [junit4]    >             "state":"active",
   [junit4]    >             "leader":"true"}}}},
   [junit4]    >     "router":{"name":"compositeId"},
   [junit4]    >     "maxShardsPerNode":"1",
   [junit4]    >     "autoAddReplicas":"false",
   [junit4]    >     "autoCreated":"true"},
   [junit4]    >   "c8n_1x2":{
   [junit4]    >     "replicationFactor":"2",
   [junit4]    >     "shards":{"shard1":{
   [junit4]    >         "range":"80000000-7fffffff",
   [junit4]    >         "state":"active",
   [junit4]    >         "replicas":{
   [junit4]    >           "core_node1":{
   [junit4]    >             "core":"c8n_1x2_shard1_replica2",
   [junit4]    >             "base_url":"http://127.0.0.1:53899",
   [junit4]    >             "node_name":"127.0.0.1:53899_",
   [junit4]    >             "state":"recovering"},
   [junit4]    >           "core_node2":{
   [junit4]    >             "core":"c8n_1x2_shard1_replica1",
   [junit4]    >             "base_url":"http://127.0.0.1:55433",
   [junit4]    >             "node_name":"127.0.0.1:55433_",
   [junit4]    >             "state":"active",
   [junit4]    >             "leader":"true"}}}},
   [junit4]    >     "router":{"name":"compositeId"},
   [junit4]    >     "maxShardsPerNode":"1",
   [junit4]    >     "autoAddReplicas":"false"},
   [junit4]    >   "collMinRf_1x3":{
   [junit4]    >     "replicationFactor":"3",
   [junit4]    >     "shards":{"shard1":{
   [junit4]    >         "range":"80000000-7fffffff",
   [junit4]    >         "state":"active",
   [junit4]    >         "replicas":{
   [junit4]    >           "core_node1":{
   [junit4]    >             "core":"collMinRf_1x3_shard1_replica3",
   [junit4]    >             "base_url":"http://127.0.0.1:52314",
   [junit4]    >             "node_name":"127.0.0.1:52314_",
   [junit4]    >             "state":"active"},
   [junit4]    >           "core_node2":{
   [junit4]    >             "core":"collMinRf_1x3_shard1_replica2",
   [junit4]    >             "base_url":"http://127.0.0.1:53899",
   [junit4]    >             "node_name":"127.0.0.1:53899_",
   [junit4]    >             "state":"active"},
   [junit4]    >           "core_node3":{
   [junit4]    >             "core":"collMinRf_1x3_shard1_replica1",
   [junit4]    >             "base_url":"http://127.0.0.1:55433",
   [junit4]    >             "node_name":"127.0.0.1:55433_",
   [junit4]    >             "state":"active",
   [junit4]    >             "leader":"true"}}}},
   [junit4]    >     "router":{"name":"compositeId"},
   [junit4]    >     "maxShardsPerNode":"1",
   [junit4]    >     "autoAddReplicas":"false"}}
   [junit4]    > 	at __randomizedtesting.SeedInfo.seed([A6CA607D3ABA454D:2E9E5FA7944628B5]:0)
   [junit4]    > 	at org.apache.solr.cloud.AbstractFullDistribZkTestBase.ensureAllReplicasAreActive(AbstractFullDistribZkTestBase.java:1864)
   [junit4]    > 	at org.apache.solr.cloud.HttpPartitionTest.testRf2(HttpPartitionTest.java:349)
   [junit4]    > 	at org.apache.solr.cloud.HttpPartitionTest.test(HttpPartitionTest.java:109)
   [junit4]    > 	at org.apache.solr.BaseDistributedSearchTestCase$ShardsRepeatRule$ShardsFixedStatement.callStatement(BaseDistributedSearchTestCase.java:965)
   [junit4]    > 	at org.apache.solr.BaseDistributedSearchTestCase$ShardsRepeatRule$ShardsStatement.evaluate(BaseDistributedSearchTestCase.java:940)
   [junit4]    > 	at java.lang.Thread.run(Thread.java:747)
   [junit4]   2> 1366065 INFO  (SUITE-HttpPartitionTest-seed#[A6CA607D3ABA454D]-worker) [    ] o.a.s.SolrTestCaseJ4 ###deleteCore
   [junit4]   2> NOTE: leaving temporary files on disk at: /home/jenkins/workspace/Lucene-Solr-trunk-Linux/solr/build/solr-core/test/J1/temp/solr.cloud.HttpPartitionTest_A6CA607D3ABA454D-001
   [junit4]   2> Jan 13, 2016 3:19:31 PM com.carrotsearch.randomizedtesting.ThreadLeakControl checkThreadLeaks
   [junit4]   2> WARNING: Will linger awaiting termination of 1 leaked thread(s).
   [junit4]   2> NOTE: test params are: codec=Asserting(Lucene60): {range_facet_l_dv=PostingsFormat(name=LuceneVarGapDocFreqInterval), _version_=Lucene50(blocksize=128), multiDefault=PostingsFormat(name=Direct), a_t=Lucene50(blocksize=128), intDefault=Lucene50(blocksize=128), id=PostingsFormat(name=LuceneVarGapDocFreqInterval), range_facet_i_dv=Lucene50(blocksize=128), text=PostingsFormat(name=Memory doPackFST= true), range_facet_l=Lucene50(blocksize=128), timestamp=Lucene50(blocksize=128)}, docValues:{range_facet_l_dv=DocValuesFormat(name=Asserting), range_facet_i_dv=DocValuesFormat(name=Direct), timestamp=DocValuesFormat(name=Direct)}, sim=RandomSimilarityProvider(queryNorm=true,coord=crazy): {}, locale=tr_TR, timezone=Africa/Lome
   [junit4]   2> NOTE: Linux 3.19.0-42-generic amd64/Oracle Corporation 9-ea (64-bit)/cpus=12,threads=1,free=259227312,total=530579456
   [junit4]   2> NOTE: All tests run in this JVM: [TestBlendedInfixSuggestions, ChaosMonkeyNothingIsSafeTest, TestWordDelimiterFilterFactory, SpellPossibilityIteratorTest, TestEmbeddedSolrServerConstructors, DistribCursorPagingTest, DistanceFunctionTest, DistributedTermsComponentTest, LoggingHandlerTest, TestFastLRUCache, WordBreakSolrSpellCheckerTest, HdfsBasicDistributedZk2Test, AddBlockUpdateTest, RecoveryAfterSoftCommitTest, SaslZkACLProviderTest, DistributedExpandComponentTest, TestChildDocTransformer, TestPivotHelperCode, ExplicitHLLTest, MBeansHandlerTest, TestCursorMarkWithoutUniqueKey, SmileWriterTest, TestBulkSchemaAPI, TestLeaderElectionZkExpiry, TestInfoStreamLogging, TestRandomMergePolicy, TermsComponentTest, TestAddFieldRealTimeGet, SolrCmdDistributorTest, OutOfBoxZkACLAndCredentialsProvidersTest, TestSerializedLuceneMatchVersion, TestMaxScoreQueryParser, SolrIndexSplitterTest, TestBulkSchemaConcurrent, UniqFieldsUpdateProcessorFactoryTest, TermVectorComponentTest, ZkControllerTest, BadCopyFieldTest, NumericFieldsTest, TestCloudSchemaless, ConnectionManagerTest, TestCoreContainer, OpenExchangeRatesOrgProviderTest, HighlighterMaxOffsetTest, MoreLikeThisHandlerTest, TestSolrDynamicMBean, SpatialFilterTest, DOMUtilTest, TestSolrCloudWithKerberosAlt, DocumentBuilderTest, TestBM25SimilarityFactory, CSVRequestHandlerTest, CloudMLTQParserTest, RestartWhileUpdatingTest, SolrPluginUtilsTest, TestManagedSchemaFieldTypeResource, TestCloudPivotFacet, TestConfigOverlay, AtomicUpdatesTest, TestHdfsUpdateLog, TestConfigSets, TestComplexPhraseQParserPlugin, TestSmileRequest, FileUtilsTest, ZkSolrClientTest, ResponseHeaderTest, TestConfigSetsAPIExclusivity, SimplePostToolTest, RulesTest, TestReloadDeadlock, SecurityConfHandlerTest, ZkCLITest, DistributedIntervalFacetingTest, TestFiltering, NotRequiredUniqueKeyTest, TestSimpleTrackingShardHandler, TestRandomRequestDistribution, TestMiniSolrCloudClusterBase, SolrInfoMBeanTest, BasicFunctionalityTest, TestReqParamsAPI, AliasIntegrationTest, TestReloadAndDeleteDocs, TestFilteredDocIdSet, TestLMJelinekMercerSimilarityFactory, MinimalSchemaTest, BufferStoreTest, HdfsRecoverLeaseTest, ConvertedLegacyTest, TestQuerySenderListener, ChaosMonkeySafeLeaderTest, BasicDistributedZk2Test, CollectionsAPIDistributedZkTest, BasicZkTest, RecoveryZkTest, TestRandomFaceting, TestHashPartitioner, TestRealTimeGet, TestReload, HardAutoCommitTest, SolrCoreTest, SpellCheckComponentTest, TestFunctionQuery, TestLazyCores, HighlighterTest, SoftAutoCommitTest, SolrRequestParserTest, DocValuesTest, TestStressLucene, TestTrie, TestCSVLoader, NoCacheHeaderTest, SolrCoreCheckLockOnStartupTest, TestPseudoReturnFields, TestAtomicUpdateErrorCases, DefaultValueUpdateProcessorTest, TestRemoteStreaming, TestSurroundQueryParser, LukeRequestHandlerTest, DirectSolrSpellCheckerTest, TestQueryTypes, RequestHandlersTest, RequiredFieldsTest, TestSolrQueryParser, IndexSchemaTest, ReturnFieldsTest, TestPartialUpdateDeduplication, PingRequestHandlerTest, TestSolrDeletionPolicy2, MultiTermTest, TestFuzzyAnalyzedSuggestions, TestSolrCoreProperties, TestPostingsSolrHighlighter, DirectSolrConnectionTest, TestCodecSupport, SynonymTokenizerTest, TestXIncludeConfig, TestSweetSpotSimilarityFactory, TestDFRSimilarityFactory, TestLMDirichletSimilarityFactory, TestFastWriter, TimeZoneUtilsTest, ResourceLoaderTest, TestFastOutputStream, ScriptEngineTest, TestSystemIdResolver, DateFieldTest, SpellingQueryConverterTest, TestSolrJ, TestLRUCache, TestDocumentBuilder, DistributedMLTComponentTest, AsyncCallRequestStatusResponseTest, BaseCdcrDistributedZkTest, CdcrReplicationHandlerTest, CdcrVersionReplicationTest, CollectionReloadTest, CollectionsAPIAsyncDistributedZkTest, DeleteReplicaTest, HttpPartitionTest]
   [junit4] Completed [435/576 (1!)] on J1 in 137.73s, 1 test, 1 failure <<< FAILURES!

[...truncated 465 lines...]
BUILD FAILED
/home/jenkins/workspace/Lucene-Solr-trunk-Linux/build.xml:784: The following error occurred while executing this line:
/home/jenkins/workspace/Lucene-Solr-trunk-Linux/build.xml:728: The following error occurred while executing this line:
/home/jenkins/workspace/Lucene-Solr-trunk-Linux/build.xml:59: The following error occurred while executing this line:
/home/jenkins/workspace/Lucene-Solr-trunk-Linux/solr/build.xml:233: The following error occurred while executing this line:
/home/jenkins/workspace/Lucene-Solr-trunk-Linux/solr/common-build.xml:522: The following error occurred while executing this line:
/home/jenkins/workspace/Lucene-Solr-trunk-Linux/lucene/common-build.xml:1424: The following error occurred while executing this line:
/home/jenkins/workspace/Lucene-Solr-trunk-Linux/lucene/common-build.xml:981: There were test failures: 576 suites (8 ignored), 2305 tests, 1 failure, 115 ignored (70 assumptions) [seed: A6CA607D3ABA454D]

Total time: 48 minutes 17 seconds
Build step 'Invoke Ant' marked build as failure
Archiving artifacts
[WARNINGS] Skipping publisher since build result is FAILURE
Recording test results
Email was triggered for: Failure - Any
Sending email for trigger: Failure - Any



Mime
View raw message