lucene-dev mailing list archives

Site index · List index
Message view « Date » · « Thread »
Top « Date » · « Thread »
From Policeman Jenkins Server <jenk...@thetaphi.de>
Subject [JENKINS-EA] Lucene-Solr-5.x-Linux (64bit/jdk-9-ea+95) - Build # 15200 - Still Failing!
Date Sat, 09 Jan 2016 20:06:43 GMT
Build: http://jenkins.thetaphi.de/job/Lucene-Solr-5.x-Linux/15200/
Java: 64bit/jdk-9-ea+95 -XX:-UseCompressedOops -XX:+UseParallelGC -XX:-CompactStrings

2 tests failed.
FAILED:  org.apache.solr.cloud.LeaderFailoverAfterPartitionTest.test

Error Message:
Doc with id=4 not found in http://127.0.0.1:43857/_nmy/c8n_1x3_lf due to: Path not found: /id; rsp={doc=null}

Stack Trace:
java.lang.AssertionError: Doc with id=4 not found in http://127.0.0.1:43857/_nmy/c8n_1x3_lf due to: Path not found: /id; rsp={doc=null}
	at __randomizedtesting.SeedInfo.seed([E95D58C1DD15BB74:6109671B73E9D68C]:0)
	at org.junit.Assert.fail(Assert.java:93)
	at org.junit.Assert.assertTrue(Assert.java:43)
	at org.apache.solr.cloud.HttpPartitionTest.assertDocExists(HttpPartitionTest.java:620)
	at org.apache.solr.cloud.HttpPartitionTest.assertDocsExistInAllReplicas(HttpPartitionTest.java:575)
	at org.apache.solr.cloud.LeaderFailoverAfterPartitionTest.testRf3WithLeaderFailover(LeaderFailoverAfterPartitionTest.java:103)
	at org.apache.solr.cloud.LeaderFailoverAfterPartitionTest.test(LeaderFailoverAfterPartitionTest.java:56)
	at sun.reflect.NativeMethodAccessorImpl.invoke0(Native Method)
	at sun.reflect.NativeMethodAccessorImpl.invoke(NativeMethodAccessorImpl.java:62)
	at sun.reflect.DelegatingMethodAccessorImpl.invoke(DelegatingMethodAccessorImpl.java:43)
	at java.lang.reflect.Method.invoke(Method.java:520)
	at com.carrotsearch.randomizedtesting.RandomizedRunner.invoke(RandomizedRunner.java:1764)
	at com.carrotsearch.randomizedtesting.RandomizedRunner$8.evaluate(RandomizedRunner.java:871)
	at com.carrotsearch.randomizedtesting.RandomizedRunner$9.evaluate(RandomizedRunner.java:907)
	at com.carrotsearch.randomizedtesting.RandomizedRunner$10.evaluate(RandomizedRunner.java:921)
	at org.apache.solr.BaseDistributedSearchTestCase$ShardsRepeatRule$ShardsFixedStatement.callStatement(BaseDistributedSearchTestCase.java:965)
	at org.apache.solr.BaseDistributedSearchTestCase$ShardsRepeatRule$ShardsStatement.evaluate(BaseDistributedSearchTestCase.java:940)
	at com.carrotsearch.randomizedtesting.rules.SystemPropertiesRestoreRule$1.evaluate(SystemPropertiesRestoreRule.java:57)
	at org.apache.lucene.util.TestRuleSetupTeardownChained$1.evaluate(TestRuleSetupTeardownChained.java:50)
	at org.apache.lucene.util.AbstractBeforeAfterRule$1.evaluate(AbstractBeforeAfterRule.java:46)
	at org.apache.lucene.util.TestRuleThreadAndTestName$1.evaluate(TestRuleThreadAndTestName.java:49)
	at org.apache.lucene.util.TestRuleIgnoreAfterMaxFailures$1.evaluate(TestRuleIgnoreAfterMaxFailures.java:65)
	at org.apache.lucene.util.TestRuleMarkFailure$1.evaluate(TestRuleMarkFailure.java:48)
	at com.carrotsearch.randomizedtesting.rules.StatementAdapter.evaluate(StatementAdapter.java:36)
	at com.carrotsearch.randomizedtesting.ThreadLeakControl$StatementRunner.run(ThreadLeakControl.java:367)
	at com.carrotsearch.randomizedtesting.ThreadLeakControl.forkTimeoutingTask(ThreadLeakControl.java:809)
	at com.carrotsearch.randomizedtesting.ThreadLeakControl$3.evaluate(ThreadLeakControl.java:460)
	at com.carrotsearch.randomizedtesting.RandomizedRunner.runSingleTest(RandomizedRunner.java:880)
	at com.carrotsearch.randomizedtesting.RandomizedRunner$5.evaluate(RandomizedRunner.java:781)
	at com.carrotsearch.randomizedtesting.RandomizedRunner$6.evaluate(RandomizedRunner.java:816)
	at com.carrotsearch.randomizedtesting.RandomizedRunner$7.evaluate(RandomizedRunner.java:827)
	at com.carrotsearch.randomizedtesting.rules.StatementAdapter.evaluate(StatementAdapter.java:36)
	at com.carrotsearch.randomizedtesting.rules.SystemPropertiesRestoreRule$1.evaluate(SystemPropertiesRestoreRule.java:57)
	at org.apache.lucene.util.AbstractBeforeAfterRule$1.evaluate(AbstractBeforeAfterRule.java:46)
	at com.carrotsearch.randomizedtesting.rules.StatementAdapter.evaluate(StatementAdapter.java:36)
	at org.apache.lucene.util.TestRuleStoreClassName$1.evaluate(TestRuleStoreClassName.java:42)
	at com.carrotsearch.randomizedtesting.rules.NoShadowingOrOverridesOnMethodsRule$1.evaluate(NoShadowingOrOverridesOnMethodsRule.java:40)
	at com.carrotsearch.randomizedtesting.rules.NoShadowingOrOverridesOnMethodsRule$1.evaluate(NoShadowingOrOverridesOnMethodsRule.java:40)
	at com.carrotsearch.randomizedtesting.rules.StatementAdapter.evaluate(StatementAdapter.java:36)
	at com.carrotsearch.randomizedtesting.rules.StatementAdapter.evaluate(StatementAdapter.java:36)
	at com.carrotsearch.randomizedtesting.rules.StatementAdapter.evaluate(StatementAdapter.java:36)
	at org.apache.lucene.util.TestRuleAssertionsRequired$1.evaluate(TestRuleAssertionsRequired.java:54)
	at org.apache.lucene.util.TestRuleMarkFailure$1.evaluate(TestRuleMarkFailure.java:48)
	at org.apache.lucene.util.TestRuleIgnoreAfterMaxFailures$1.evaluate(TestRuleIgnoreAfterMaxFailures.java:65)
	at org.apache.lucene.util.TestRuleIgnoreTestSuites$1.evaluate(TestRuleIgnoreTestSuites.java:55)
	at com.carrotsearch.randomizedtesting.rules.StatementAdapter.evaluate(StatementAdapter.java:36)
	at com.carrotsearch.randomizedtesting.ThreadLeakControl$StatementRunner.run(ThreadLeakControl.java:367)
	at java.lang.Thread.run(Thread.java:747)


FAILED:  org.apache.solr.cloud.TestMiniSolrCloudClusterBase.testBasics

Error Message:
expected:<1> but was:<0>

Stack Trace:
java.lang.AssertionError: expected:<1> but was:<0>
	at __randomizedtesting.SeedInfo.seed([E95D58C1DD15BB74:D485F6EDE5FBE504]:0)
	at org.junit.Assert.fail(Assert.java:93)
	at org.junit.Assert.failNotEquals(Assert.java:647)
	at org.junit.Assert.assertEquals(Assert.java:128)
	at org.junit.Assert.assertEquals(Assert.java:472)
	at org.junit.Assert.assertEquals(Assert.java:456)
	at org.apache.solr.cloud.TestMiniSolrCloudClusterBase.testCollectionCreateSearchDelete(TestMiniSolrCloudClusterBase.java:149)
	at org.apache.solr.cloud.TestMiniSolrCloudClusterBase.testBasics(TestMiniSolrCloudClusterBase.java:78)
	at sun.reflect.NativeMethodAccessorImpl.invoke0(Native Method)
	at sun.reflect.NativeMethodAccessorImpl.invoke(NativeMethodAccessorImpl.java:62)
	at sun.reflect.DelegatingMethodAccessorImpl.invoke(DelegatingMethodAccessorImpl.java:43)
	at java.lang.reflect.Method.invoke(Method.java:520)
	at com.carrotsearch.randomizedtesting.RandomizedRunner.invoke(RandomizedRunner.java:1764)
	at com.carrotsearch.randomizedtesting.RandomizedRunner$8.evaluate(RandomizedRunner.java:871)
	at com.carrotsearch.randomizedtesting.RandomizedRunner$9.evaluate(RandomizedRunner.java:907)
	at com.carrotsearch.randomizedtesting.RandomizedRunner$10.evaluate(RandomizedRunner.java:921)
	at com.carrotsearch.randomizedtesting.rules.SystemPropertiesRestoreRule$1.evaluate(SystemPropertiesRestoreRule.java:57)
	at org.apache.lucene.util.TestRuleSetupTeardownChained$1.evaluate(TestRuleSetupTeardownChained.java:50)
	at org.apache.lucene.util.AbstractBeforeAfterRule$1.evaluate(AbstractBeforeAfterRule.java:46)
	at org.apache.lucene.util.TestRuleThreadAndTestName$1.evaluate(TestRuleThreadAndTestName.java:49)
	at org.apache.lucene.util.TestRuleIgnoreAfterMaxFailures$1.evaluate(TestRuleIgnoreAfterMaxFailures.java:65)
	at org.apache.lucene.util.TestRuleMarkFailure$1.evaluate(TestRuleMarkFailure.java:48)
	at com.carrotsearch.randomizedtesting.rules.StatementAdapter.evaluate(StatementAdapter.java:36)
	at com.carrotsearch.randomizedtesting.ThreadLeakControl$StatementRunner.run(ThreadLeakControl.java:367)
	at com.carrotsearch.randomizedtesting.ThreadLeakControl.forkTimeoutingTask(ThreadLeakControl.java:809)
	at com.carrotsearch.randomizedtesting.ThreadLeakControl$3.evaluate(ThreadLeakControl.java:460)
	at com.carrotsearch.randomizedtesting.RandomizedRunner.runSingleTest(RandomizedRunner.java:880)
	at com.carrotsearch.randomizedtesting.RandomizedRunner$5.evaluate(RandomizedRunner.java:781)
	at com.carrotsearch.randomizedtesting.RandomizedRunner$6.evaluate(RandomizedRunner.java:816)
	at com.carrotsearch.randomizedtesting.RandomizedRunner$7.evaluate(RandomizedRunner.java:827)
	at com.carrotsearch.randomizedtesting.rules.StatementAdapter.evaluate(StatementAdapter.java:36)
	at com.carrotsearch.randomizedtesting.rules.SystemPropertiesRestoreRule$1.evaluate(SystemPropertiesRestoreRule.java:57)
	at org.apache.lucene.util.AbstractBeforeAfterRule$1.evaluate(AbstractBeforeAfterRule.java:46)
	at com.carrotsearch.randomizedtesting.rules.StatementAdapter.evaluate(StatementAdapter.java:36)
	at org.apache.lucene.util.TestRuleStoreClassName$1.evaluate(TestRuleStoreClassName.java:42)
	at com.carrotsearch.randomizedtesting.rules.NoShadowingOrOverridesOnMethodsRule$1.evaluate(NoShadowingOrOverridesOnMethodsRule.java:40)
	at com.carrotsearch.randomizedtesting.rules.NoShadowingOrOverridesOnMethodsRule$1.evaluate(NoShadowingOrOverridesOnMethodsRule.java:40)
	at com.carrotsearch.randomizedtesting.rules.StatementAdapter.evaluate(StatementAdapter.java:36)
	at com.carrotsearch.randomizedtesting.rules.StatementAdapter.evaluate(StatementAdapter.java:36)
	at com.carrotsearch.randomizedtesting.rules.StatementAdapter.evaluate(StatementAdapter.java:36)
	at org.apache.lucene.util.TestRuleAssertionsRequired$1.evaluate(TestRuleAssertionsRequired.java:54)
	at org.apache.lucene.util.TestRuleMarkFailure$1.evaluate(TestRuleMarkFailure.java:48)
	at org.apache.lucene.util.TestRuleIgnoreAfterMaxFailures$1.evaluate(TestRuleIgnoreAfterMaxFailures.java:65)
	at org.apache.lucene.util.TestRuleIgnoreTestSuites$1.evaluate(TestRuleIgnoreTestSuites.java:55)
	at com.carrotsearch.randomizedtesting.rules.StatementAdapter.evaluate(StatementAdapter.java:36)
	at com.carrotsearch.randomizedtesting.ThreadLeakControl$StatementRunner.run(ThreadLeakControl.java:367)
	at java.lang.Thread.run(Thread.java:747)




Build Log:
[...truncated 11062 lines...]
   [junit4] Suite: org.apache.solr.cloud.LeaderFailoverAfterPartitionTest
   [junit4]   2> Creating dataDir: /home/jenkins/workspace/Lucene-Solr-5.x-Linux/solr/build/solr-core/test/J2/temp/solr.cloud.LeaderFailoverAfterPartitionTest_E95D58C1DD15BB74-001/init-core-data-001
   [junit4]   2> 1226485 INFO  (SUITE-LeaderFailoverAfterPartitionTest-seed#[E95D58C1DD15BB74]-worker) [    ] o.a.s.BaseDistributedSearchTestCase Setting hostContext system property: /_nmy/
   [junit4]   2> 1226487 INFO  (TEST-LeaderFailoverAfterPartitionTest.test-seed#[E95D58C1DD15BB74]) [    ] o.a.s.c.ZkTestServer STARTING ZK TEST SERVER
   [junit4]   2> 1226487 INFO  (Thread-3395) [    ] o.a.s.c.ZkTestServer client port:0.0.0.0/0.0.0.0:0
   [junit4]   2> 1226487 INFO  (Thread-3395) [    ] o.a.s.c.ZkTestServer Starting server
   [junit4]   2> 1226587 INFO  (TEST-LeaderFailoverAfterPartitionTest.test-seed#[E95D58C1DD15BB74]) [    ] o.a.s.c.ZkTestServer start zk server on port:49662
   [junit4]   2> 1226587 INFO  (TEST-LeaderFailoverAfterPartitionTest.test-seed#[E95D58C1DD15BB74]) [    ] o.a.s.c.c.SolrZkClient Using default ZkCredentialsProvider
   [junit4]   2> 1226588 INFO  (TEST-LeaderFailoverAfterPartitionTest.test-seed#[E95D58C1DD15BB74]) [    ] o.a.s.c.c.ConnectionManager Waiting for client to connect to ZooKeeper
   [junit4]   2> 1226589 INFO  (zkCallback-1123-thread-1) [    ] o.a.s.c.c.ConnectionManager Watcher org.apache.solr.common.cloud.ConnectionManager@4e6c9e04 name:ZooKeeperConnection Watcher:127.0.0.1:49662 got event WatchedEvent state:SyncConnected type:None path:null path:null type:None
   [junit4]   2> 1226589 INFO  (TEST-LeaderFailoverAfterPartitionTest.test-seed#[E95D58C1DD15BB74]) [    ] o.a.s.c.c.ConnectionManager Client is connected to ZooKeeper
   [junit4]   2> 1226590 INFO  (TEST-LeaderFailoverAfterPartitionTest.test-seed#[E95D58C1DD15BB74]) [    ] o.a.s.c.c.SolrZkClient Using default ZkACLProvider
   [junit4]   2> 1226590 INFO  (TEST-LeaderFailoverAfterPartitionTest.test-seed#[E95D58C1DD15BB74]) [    ] o.a.s.c.c.SolrZkClient makePath: /solr
   [junit4]   2> 1226591 INFO  (TEST-LeaderFailoverAfterPartitionTest.test-seed#[E95D58C1DD15BB74]) [    ] o.a.s.c.c.SolrZkClient Using default ZkCredentialsProvider
   [junit4]   2> 1226591 INFO  (TEST-LeaderFailoverAfterPartitionTest.test-seed#[E95D58C1DD15BB74]) [    ] o.a.s.c.c.ConnectionManager Waiting for client to connect to ZooKeeper
   [junit4]   2> 1226592 INFO  (zkCallback-1124-thread-1) [    ] o.a.s.c.c.ConnectionManager Watcher org.apache.solr.common.cloud.ConnectionManager@5443e1f0 name:ZooKeeperConnection Watcher:127.0.0.1:49662/solr got event WatchedEvent state:SyncConnected type:None path:null path:null type:None
   [junit4]   2> 1226592 INFO  (TEST-LeaderFailoverAfterPartitionTest.test-seed#[E95D58C1DD15BB74]) [    ] o.a.s.c.c.ConnectionManager Client is connected to ZooKeeper
   [junit4]   2> 1226592 INFO  (TEST-LeaderFailoverAfterPartitionTest.test-seed#[E95D58C1DD15BB74]) [    ] o.a.s.c.c.SolrZkClient Using default ZkACLProvider
   [junit4]   2> 1226592 INFO  (TEST-LeaderFailoverAfterPartitionTest.test-seed#[E95D58C1DD15BB74]) [    ] o.a.s.c.c.SolrZkClient makePath: /collections/collection1
   [junit4]   2> 1226592 INFO  (TEST-LeaderFailoverAfterPartitionTest.test-seed#[E95D58C1DD15BB74]) [    ] o.a.s.c.c.SolrZkClient makePath: /collections/collection1/shards
   [junit4]   2> 1226593 INFO  (TEST-LeaderFailoverAfterPartitionTest.test-seed#[E95D58C1DD15BB74]) [    ] o.a.s.c.c.SolrZkClient makePath: /collections/control_collection
   [junit4]   2> 1226593 INFO  (TEST-LeaderFailoverAfterPartitionTest.test-seed#[E95D58C1DD15BB74]) [    ] o.a.s.c.c.SolrZkClient makePath: /collections/control_collection/shards
   [junit4]   2> 1226594 INFO  (TEST-LeaderFailoverAfterPartitionTest.test-seed#[E95D58C1DD15BB74]) [    ] o.a.s.c.AbstractZkTestCase put /home/jenkins/workspace/Lucene-Solr-5.x-Linux/solr/core/src/test-files/solr/collection1/conf/solrconfig-tlog.xml to /configs/conf1/solrconfig.xml
   [junit4]   2> 1226594 INFO  (TEST-LeaderFailoverAfterPartitionTest.test-seed#[E95D58C1DD15BB74]) [    ] o.a.s.c.c.SolrZkClient makePath: /configs/conf1/solrconfig.xml
   [junit4]   2> 1226595 INFO  (TEST-LeaderFailoverAfterPartitionTest.test-seed#[E95D58C1DD15BB74]) [    ] o.a.s.c.AbstractZkTestCase put /home/jenkins/workspace/Lucene-Solr-5.x-Linux/solr/core/src/test-files/solr/collection1/conf/schema.xml to /configs/conf1/schema.xml
   [junit4]   2> 1226595 INFO  (TEST-LeaderFailoverAfterPartitionTest.test-seed#[E95D58C1DD15BB74]) [    ] o.a.s.c.c.SolrZkClient makePath: /configs/conf1/schema.xml
   [junit4]   2> 1226596 INFO  (TEST-LeaderFailoverAfterPartitionTest.test-seed#[E95D58C1DD15BB74]) [    ] o.a.s.c.AbstractZkTestCase put /home/jenkins/workspace/Lucene-Solr-5.x-Linux/solr/core/src/test-files/solr/collection1/conf/solrconfig.snippet.randomindexconfig.xml to /configs/conf1/solrconfig.snippet.randomindexconfig.xml
   [junit4]   2> 1226596 INFO  (TEST-LeaderFailoverAfterPartitionTest.test-seed#[E95D58C1DD15BB74]) [    ] o.a.s.c.c.SolrZkClient makePath: /configs/conf1/solrconfig.snippet.randomindexconfig.xml
   [junit4]   2> 1226596 INFO  (TEST-LeaderFailoverAfterPartitionTest.test-seed#[E95D58C1DD15BB74]) [    ] o.a.s.c.AbstractZkTestCase put /home/jenkins/workspace/Lucene-Solr-5.x-Linux/solr/core/src/test-files/solr/collection1/conf/stopwords.txt to /configs/conf1/stopwords.txt
   [junit4]   2> 1226596 INFO  (TEST-LeaderFailoverAfterPartitionTest.test-seed#[E95D58C1DD15BB74]) [    ] o.a.s.c.c.SolrZkClient makePath: /configs/conf1/stopwords.txt
   [junit4]   2> 1226597 INFO  (TEST-LeaderFailoverAfterPartitionTest.test-seed#[E95D58C1DD15BB74]) [    ] o.a.s.c.AbstractZkTestCase put /home/jenkins/workspace/Lucene-Solr-5.x-Linux/solr/core/src/test-files/solr/collection1/conf/protwords.txt to /configs/conf1/protwords.txt
   [junit4]   2> 1226597 INFO  (TEST-LeaderFailoverAfterPartitionTest.test-seed#[E95D58C1DD15BB74]) [    ] o.a.s.c.c.SolrZkClient makePath: /configs/conf1/protwords.txt
   [junit4]   2> 1226598 INFO  (TEST-LeaderFailoverAfterPartitionTest.test-seed#[E95D58C1DD15BB74]) [    ] o.a.s.c.AbstractZkTestCase put /home/jenkins/workspace/Lucene-Solr-5.x-Linux/solr/core/src/test-files/solr/collection1/conf/currency.xml to /configs/conf1/currency.xml
   [junit4]   2> 1226598 INFO  (TEST-LeaderFailoverAfterPartitionTest.test-seed#[E95D58C1DD15BB74]) [    ] o.a.s.c.c.SolrZkClient makePath: /configs/conf1/currency.xml
   [junit4]   2> 1226598 INFO  (TEST-LeaderFailoverAfterPartitionTest.test-seed#[E95D58C1DD15BB74]) [    ] o.a.s.c.AbstractZkTestCase put /home/jenkins/workspace/Lucene-Solr-5.x-Linux/solr/core/src/test-files/solr/collection1/conf/enumsConfig.xml to /configs/conf1/enumsConfig.xml
   [junit4]   2> 1226598 INFO  (TEST-LeaderFailoverAfterPartitionTest.test-seed#[E95D58C1DD15BB74]) [    ] o.a.s.c.c.SolrZkClient makePath: /configs/conf1/enumsConfig.xml
   [junit4]   2> 1226599 INFO  (TEST-LeaderFailoverAfterPartitionTest.test-seed#[E95D58C1DD15BB74]) [    ] o.a.s.c.AbstractZkTestCase put /home/jenkins/workspace/Lucene-Solr-5.x-Linux/solr/core/src/test-files/solr/collection1/conf/open-exchange-rates.json to /configs/conf1/open-exchange-rates.json
   [junit4]   2> 1226599 INFO  (TEST-LeaderFailoverAfterPartitionTest.test-seed#[E95D58C1DD15BB74]) [    ] o.a.s.c.c.SolrZkClient makePath: /configs/conf1/open-exchange-rates.json
   [junit4]   2> 1226600 INFO  (TEST-LeaderFailoverAfterPartitionTest.test-seed#[E95D58C1DD15BB74]) [    ] o.a.s.c.AbstractZkTestCase put /home/jenkins/workspace/Lucene-Solr-5.x-Linux/solr/core/src/test-files/solr/collection1/conf/mapping-ISOLatin1Accent.txt to /configs/conf1/mapping-ISOLatin1Accent.txt
   [junit4]   2> 1226600 INFO  (TEST-LeaderFailoverAfterPartitionTest.test-seed#[E95D58C1DD15BB74]) [    ] o.a.s.c.c.SolrZkClient makePath: /configs/conf1/mapping-ISOLatin1Accent.txt
   [junit4]   2> 1226600 INFO  (TEST-LeaderFailoverAfterPartitionTest.test-seed#[E95D58C1DD15BB74]) [    ] o.a.s.c.AbstractZkTestCase put /home/jenkins/workspace/Lucene-Solr-5.x-Linux/solr/core/src/test-files/solr/collection1/conf/old_synonyms.txt to /configs/conf1/old_synonyms.txt
   [junit4]   2> 1226600 INFO  (TEST-LeaderFailoverAfterPartitionTest.test-seed#[E95D58C1DD15BB74]) [    ] o.a.s.c.c.SolrZkClient makePath: /configs/conf1/old_synonyms.txt
   [junit4]   2> 1226601 INFO  (TEST-LeaderFailoverAfterPartitionTest.test-seed#[E95D58C1DD15BB74]) [    ] o.a.s.c.AbstractZkTestCase put /home/jenkins/workspace/Lucene-Solr-5.x-Linux/solr/core/src/test-files/solr/collection1/conf/synonyms.txt to /configs/conf1/synonyms.txt
   [junit4]   2> 1226601 INFO  (TEST-LeaderFailoverAfterPartitionTest.test-seed#[E95D58C1DD15BB74]) [    ] o.a.s.c.c.SolrZkClient makePath: /configs/conf1/synonyms.txt
   [junit4]   2> 1226655 INFO  (TEST-LeaderFailoverAfterPartitionTest.test-seed#[E95D58C1DD15BB74]) [    ] o.a.s.SolrTestCaseJ4 Writing core.properties file to /home/jenkins/workspace/Lucene-Solr-5.x-Linux/solr/build/solr-core/test/J2/temp/solr.cloud.LeaderFailoverAfterPartitionTest_E95D58C1DD15BB74-001/control-001/cores/collection1
   [junit4]   2> 1226656 INFO  (TEST-LeaderFailoverAfterPartitionTest.test-seed#[E95D58C1DD15BB74]) [    ] o.e.j.s.Server jetty-9.2.13.v20150730
   [junit4]   2> 1226657 INFO  (TEST-LeaderFailoverAfterPartitionTest.test-seed#[E95D58C1DD15BB74]) [    ] o.e.j.s.h.ContextHandler Started o.e.j.s.ServletContextHandler@15ce58c6{/_nmy,null,AVAILABLE}
   [junit4]   2> 1226657 INFO  (TEST-LeaderFailoverAfterPartitionTest.test-seed#[E95D58C1DD15BB74]) [    ] o.e.j.s.ServerConnector Started ServerConnector@21a2fa8{HTTP/1.1}{127.0.0.1:٣٣١٦٧}
   [junit4]   2> 1226657 INFO  (TEST-LeaderFailoverAfterPartitionTest.test-seed#[E95D58C1DD15BB74]) [    ] o.e.j.s.Server Started @١٢٢٨٥٤٤ms
   [junit4]   2> 1226657 INFO  (TEST-LeaderFailoverAfterPartitionTest.test-seed#[E95D58C1DD15BB74]) [    ] o.a.s.c.s.e.JettySolrRunner Jetty properties: {solr.data.dir=/home/jenkins/workspace/Lucene-Solr-5.x-Linux/solr/build/solr-core/test/J2/temp/solr.cloud.LeaderFailoverAfterPartitionTest_E95D58C1DD15BB74-001/tempDir-001/control/data, hostContext=/_nmy, hostPort=45251, coreRootDirectory=/home/jenkins/workspace/Lucene-Solr-5.x-Linux/solr/build/solr-core/test/J2/temp/solr.cloud.LeaderFailoverAfterPartitionTest_E95D58C1DD15BB74-001/control-001/cores}
   [junit4]   2> 1226657 INFO  (TEST-LeaderFailoverAfterPartitionTest.test-seed#[E95D58C1DD15BB74]) [    ] o.a.s.s.SolrDispatchFilter SolrDispatchFilter.init(): sun.misc.Launcher$AppClassLoader@deb6432
   [junit4]   2> 1226658 INFO  (TEST-LeaderFailoverAfterPartitionTest.test-seed#[E95D58C1DD15BB74]) [    ] o.a.s.c.SolrResourceLoader new SolrResourceLoader for directory: '/home/jenkins/workspace/Lucene-Solr-5.x-Linux/solr/build/solr-core/test/J2/temp/solr.cloud.LeaderFailoverAfterPartitionTest_E95D58C1DD15BB74-001/control-001'
   [junit4]   2> 1226658 INFO  (TEST-LeaderFailoverAfterPartitionTest.test-seed#[E95D58C1DD15BB74]) [    ] o.a.s.c.SolrResourceLoader JNDI not configured for solr (NoInitialContextEx)
   [junit4]   2> 1226658 INFO  (TEST-LeaderFailoverAfterPartitionTest.test-seed#[E95D58C1DD15BB74]) [    ] o.a.s.c.SolrResourceLoader solr home defaulted to 'solr/' (could not find system property or JNDI)
   [junit4]   2> 1226658 INFO  (TEST-LeaderFailoverAfterPartitionTest.test-seed#[E95D58C1DD15BB74]) [    ] o.a.s.c.c.SolrZkClient Using default ZkCredentialsProvider
   [junit4]   2> 1226658 INFO  (TEST-LeaderFailoverAfterPartitionTest.test-seed#[E95D58C1DD15BB74]) [    ] o.a.s.c.c.ConnectionManager Waiting for client to connect to ZooKeeper
   [junit4]   2> 1226659 INFO  (zkCallback-1125-thread-1) [    ] o.a.s.c.c.ConnectionManager Watcher org.apache.solr.common.cloud.ConnectionManager@34f5bed name:ZooKeeperConnection Watcher:127.0.0.1:49662/solr got event WatchedEvent state:SyncConnected type:None path:null path:null type:None
   [junit4]   2> 1226659 INFO  (TEST-LeaderFailoverAfterPartitionTest.test-seed#[E95D58C1DD15BB74]) [    ] o.a.s.c.c.ConnectionManager Client is connected to ZooKeeper
   [junit4]   2> 1226659 INFO  (TEST-LeaderFailoverAfterPartitionTest.test-seed#[E95D58C1DD15BB74]) [    ] o.a.s.c.c.SolrZkClient Using default ZkACLProvider
   [junit4]   2> 1226659 INFO  (TEST-LeaderFailoverAfterPartitionTest.test-seed#[E95D58C1DD15BB74]) [    ] o.a.s.s.SolrDispatchFilter Loading solr.xml from SolrHome (not found in ZooKeeper)
   [junit4]   2> 1226659 INFO  (TEST-LeaderFailoverAfterPartitionTest.test-seed#[E95D58C1DD15BB74]) [    ] o.a.s.c.SolrXmlConfig Loading container configuration from /home/jenkins/workspace/Lucene-Solr-5.x-Linux/solr/build/solr-core/test/J2/temp/solr.cloud.LeaderFailoverAfterPartitionTest_E95D58C1DD15BB74-001/control-001/solr.xml
   [junit4]   2> 1226662 INFO  (TEST-LeaderFailoverAfterPartitionTest.test-seed#[E95D58C1DD15BB74]) [    ] o.a.s.c.CorePropertiesLocator Config-defined core root directory: /home/jenkins/workspace/Lucene-Solr-5.x-Linux/solr/build/solr-core/test/J2/temp/solr.cloud.LeaderFailoverAfterPartitionTest_E95D58C1DD15BB74-001/control-001/cores
   [junit4]   2> 1226662 INFO  (TEST-LeaderFailoverAfterPartitionTest.test-seed#[E95D58C1DD15BB74]) [    ] o.a.s.c.CoreContainer New CoreContainer 1944599125
   [junit4]   2> 1226662 INFO  (TEST-LeaderFailoverAfterPartitionTest.test-seed#[E95D58C1DD15BB74]) [    ] o.a.s.c.CoreContainer Loading cores into CoreContainer [instanceDir=/home/jenkins/workspace/Lucene-Solr-5.x-Linux/solr/build/solr-core/test/J2/temp/solr.cloud.LeaderFailoverAfterPartitionTest_E95D58C1DD15BB74-001/control-001]
   [junit4]   2> 1226663 WARN  (TEST-LeaderFailoverAfterPartitionTest.test-seed#[E95D58C1DD15BB74]) [    ] o.a.s.c.CoreContainer Couldn't add files from /home/jenkins/workspace/Lucene-Solr-5.x-Linux/solr/build/solr-core/test/J2/temp/solr.cloud.LeaderFailoverAfterPartitionTest_E95D58C1DD15BB74-001/control-001/lib to classpath: /home/jenkins/workspace/Lucene-Solr-5.x-Linux/solr/build/solr-core/test/J2/temp/solr.cloud.LeaderFailoverAfterPartitionTest_E95D58C1DD15BB74-001/control-001/lib
   [junit4]   2> 1226663 INFO  (TEST-LeaderFailoverAfterPartitionTest.test-seed#[E95D58C1DD15BB74]) [    ] o.a.s.h.c.HttpShardHandlerFactory created with socketTimeout : 90000,urlScheme : ,connTimeout : 15000,maxConnectionsPerHost : 20,maxConnections : 10000,corePoolSize : 0,maximumPoolSize : 2147483647,maxThreadIdleTime : 5,sizeOfQueue : -1,fairnessPolicy : false,useRetries : false,
   [junit4]   2> 1226663 INFO  (TEST-LeaderFailoverAfterPartitionTest.test-seed#[E95D58C1DD15BB74]) [    ] o.a.s.u.UpdateShardHandler Creating UpdateShardHandler HTTP client with params: socketTimeout=340000&connTimeout=45000&retry=true
   [junit4]   2> 1226664 INFO  (TEST-LeaderFailoverAfterPartitionTest.test-seed#[E95D58C1DD15BB74]) [    ] o.a.s.l.LogWatcher SLF4J impl is org.slf4j.impl.Log4jLoggerFactory
   [junit4]   2> 1226664 INFO  (TEST-LeaderFailoverAfterPartitionTest.test-seed#[E95D58C1DD15BB74]) [    ] o.a.s.l.LogWatcher Registering Log Listener [Log4j (org.slf4j.impl.Log4jLoggerFactory)]
   [junit4]   2> 1226664 INFO  (TEST-LeaderFailoverAfterPartitionTest.test-seed#[E95D58C1DD15BB74]) [    ] o.a.s.c.ZkContainer Zookeeper client=127.0.0.1:49662/solr
   [junit4]   2> 1226664 INFO  (TEST-LeaderFailoverAfterPartitionTest.test-seed#[E95D58C1DD15BB74]) [    ] o.a.s.c.ZkController zkHost includes chroot
   [junit4]   2> 1226664 INFO  (TEST-LeaderFailoverAfterPartitionTest.test-seed#[E95D58C1DD15BB74]) [    ] o.a.s.c.c.SolrZkClient Using default ZkCredentialsProvider
   [junit4]   2> 1226664 INFO  (TEST-LeaderFailoverAfterPartitionTest.test-seed#[E95D58C1DD15BB74]) [    ] o.a.s.c.c.ConnectionManager Waiting for client to connect to ZooKeeper
   [junit4]   2> 1226665 INFO  (zkCallback-1127-thread-1) [    ] o.a.s.c.c.ConnectionManager Watcher org.apache.solr.common.cloud.ConnectionManager@6b2089ab name:ZooKeeperConnection Watcher:127.0.0.1:49662 got event WatchedEvent state:SyncConnected type:None path:null path:null type:None
   [junit4]   2> 1226665 INFO  (TEST-LeaderFailoverAfterPartitionTest.test-seed#[E95D58C1DD15BB74]) [    ] o.a.s.c.c.ConnectionManager Client is connected to ZooKeeper
   [junit4]   2> 1226666 INFO  (TEST-LeaderFailoverAfterPartitionTest.test-seed#[E95D58C1DD15BB74]) [    ] o.a.s.c.c.SolrZkClient Using default ZkACLProvider
   [junit4]   2> 1226666 INFO  (TEST-LeaderFailoverAfterPartitionTest.test-seed#[E95D58C1DD15BB74]) [    ] o.a.s.c.c.ConnectionManager Waiting for client to connect to ZooKeeper
   [junit4]   2> 1226667 INFO  (zkCallback-1128-thread-1) [    ] o.a.s.c.c.ConnectionManager Watcher org.apache.solr.common.cloud.ConnectionManager@68d1eae4 name:ZooKeeperConnection Watcher:127.0.0.1:49662/solr got event WatchedEvent state:SyncConnected type:None path:null path:null type:None
   [junit4]   2> 1226667 INFO  (TEST-LeaderFailoverAfterPartitionTest.test-seed#[E95D58C1DD15BB74]) [    ] o.a.s.c.c.ConnectionManager Client is connected to ZooKeeper
   [junit4]   2> 1226667 INFO  (TEST-LeaderFailoverAfterPartitionTest.test-seed#[E95D58C1DD15BB74]) [    ] o.a.s.c.c.SolrZkClient makePath: /overseer/queue
   [junit4]   2> 1226668 INFO  (TEST-LeaderFailoverAfterPartitionTest.test-seed#[E95D58C1DD15BB74]) [    ] o.a.s.c.c.SolrZkClient makePath: /overseer/collection-queue-work
   [junit4]   2> 1226669 INFO  (TEST-LeaderFailoverAfterPartitionTest.test-seed#[E95D58C1DD15BB74]) [    ] o.a.s.c.c.SolrZkClient makePath: /overseer/collection-map-running
   [junit4]   2> 1226669 INFO  (TEST-LeaderFailoverAfterPartitionTest.test-seed#[E95D58C1DD15BB74]) [    ] o.a.s.c.c.SolrZkClient makePath: /overseer/collection-map-completed
   [junit4]   2> 1226670 INFO  (TEST-LeaderFailoverAfterPartitionTest.test-seed#[E95D58C1DD15BB74]) [    ] o.a.s.c.c.SolrZkClient makePath: /overseer/collection-map-failure
   [junit4]   2> 1226671 INFO  (TEST-LeaderFailoverAfterPartitionTest.test-seed#[E95D58C1DD15BB74]) [    ] o.a.s.c.c.SolrZkClient makePath: /live_nodes
   [junit4]   2> 1226671 INFO  (TEST-LeaderFailoverAfterPartitionTest.test-seed#[E95D58C1DD15BB74]) [    ] o.a.s.c.c.SolrZkClient makePath: /aliases.json
   [junit4]   2> 1226671 INFO  (TEST-LeaderFailoverAfterPartitionTest.test-seed#[E95D58C1DD15BB74]) [    ] o.a.s.c.c.SolrZkClient makePath: /clusterstate.json
   [junit4]   2> 1226672 INFO  (TEST-LeaderFailoverAfterPartitionTest.test-seed#[E95D58C1DD15BB74]) [    ] o.a.s.c.c.SolrZkClient makePath: /security.json
   [junit4]   2> 1226672 INFO  (TEST-LeaderFailoverAfterPartitionTest.test-seed#[E95D58C1DD15BB74]) [    ] o.a.s.c.ZkController Register node as live in ZooKeeper:/live_nodes/127.0.0.1:45251__nmy
   [junit4]   2> 1226672 INFO  (TEST-LeaderFailoverAfterPartitionTest.test-seed#[E95D58C1DD15BB74]) [    ] o.a.s.c.c.SolrZkClient makePath: /live_nodes/127.0.0.1:45251__nmy
   [junit4]   2> 1226673 INFO  (TEST-LeaderFailoverAfterPartitionTest.test-seed#[E95D58C1DD15BB74]) [    ] o.a.s.c.c.SolrZkClient makePath: /overseer_elect
   [junit4]   2> 1226673 INFO  (TEST-LeaderFailoverAfterPartitionTest.test-seed#[E95D58C1DD15BB74]) [    ] o.a.s.c.c.SolrZkClient makePath: /overseer_elect/election
   [junit4]   2> 1226673 INFO  (TEST-LeaderFailoverAfterPartitionTest.test-seed#[E95D58C1DD15BB74]) [    ] o.a.s.c.Overseer Overseer (id=null) closing
   [junit4]   2> 1226673 INFO  (TEST-LeaderFailoverAfterPartitionTest.test-seed#[E95D58C1DD15BB74]) [    ] o.a.s.c.LeaderElector Joined leadership election with path: /overseer_elect/election/95182494384128004-127.0.0.1:45251__nmy-n_0000000000
   [junit4]   2> 1226674 INFO  (TEST-LeaderFailoverAfterPartitionTest.test-seed#[E95D58C1DD15BB74]) [    ] o.a.s.c.OverseerElectionContext I am going to be the leader 127.0.0.1:45251__nmy
   [junit4]   2> 1226674 INFO  (TEST-LeaderFailoverAfterPartitionTest.test-seed#[E95D58C1DD15BB74]) [    ] o.a.s.c.c.SolrZkClient makePath: /overseer_elect/leader
   [junit4]   2> 1226674 INFO  (TEST-LeaderFailoverAfterPartitionTest.test-seed#[E95D58C1DD15BB74]) [    ] o.a.s.c.Overseer Overseer (id=95182494384128004-127.0.0.1:45251__nmy-n_0000000000) starting
   [junit4]   2> 1226674 INFO  (TEST-LeaderFailoverAfterPartitionTest.test-seed#[E95D58C1DD15BB74]) [    ] o.a.s.c.c.SolrZkClient makePath: /overseer/queue-work
   [junit4]   2> 1226676 INFO  (TEST-LeaderFailoverAfterPartitionTest.test-seed#[E95D58C1DD15BB74]) [    ] o.a.s.c.OverseerAutoReplicaFailoverThread Starting OverseerAutoReplicaFailoverThread autoReplicaFailoverWorkLoopDelay=10000 autoReplicaFailoverWaitAfterExpiration=30000 autoReplicaFailoverBadNodeExpiration=60000
   [junit4]   2> 1226676 INFO  (TEST-LeaderFailoverAfterPartitionTest.test-seed#[E95D58C1DD15BB74]) [    ] o.a.s.c.c.ZkStateReader Updating cluster state from ZooKeeper... 
   [junit4]   2> 1226676 INFO  (OverseerCollectionConfigSetProcessor-95182494384128004-127.0.0.1:45251__nmy-n_0000000000) [    ] o.a.s.c.OverseerTaskProcessor Process current queue of overseer operations
   [junit4]   2> 1226676 INFO  (OverseerStateUpdate-95182494384128004-127.0.0.1:45251__nmy-n_0000000000) [    ] o.a.s.c.Overseer Starting to work on the main queue
   [junit4]   2> 1226683 INFO  (TEST-LeaderFailoverAfterPartitionTest.test-seed#[E95D58C1DD15BB74]) [    ] o.a.s.c.CoreContainer Security conf doesn't exist. Skipping setup for authorization module.
   [junit4]   2> 1226683 INFO  (TEST-LeaderFailoverAfterPartitionTest.test-seed#[E95D58C1DD15BB74]) [    ] o.a.s.c.CoreContainer No authentication plugin used.
   [junit4]   2> 1226683 INFO  (TEST-LeaderFailoverAfterPartitionTest.test-seed#[E95D58C1DD15BB74]) [    ] o.a.s.c.CorePropertiesLocator Looking for core definitions underneath /home/jenkins/workspace/Lucene-Solr-5.x-Linux/solr/build/solr-core/test/J2/temp/solr.cloud.LeaderFailoverAfterPartitionTest_E95D58C1DD15BB74-001/control-001/cores
   [junit4]   2> 1226684 INFO  (TEST-LeaderFailoverAfterPartitionTest.test-seed#[E95D58C1DD15BB74]) [    ] o.a.s.c.CoreDescriptor Created CoreDescriptor: {name=collection1, config=solrconfig.xml, transient=false, schema=schema.xml, loadOnStartup=true, configSetProperties=configsetprops.json, collection=control_collection, coreNodeName=, dataDir=data/, shard=}
   [junit4]   2> 1226684 INFO  (TEST-LeaderFailoverAfterPartitionTest.test-seed#[E95D58C1DD15BB74]) [    ] o.a.s.c.CorePropertiesLocator Found core collection1 in /home/jenkins/workspace/Lucene-Solr-5.x-Linux/solr/build/solr-core/test/J2/temp/solr.cloud.LeaderFailoverAfterPartitionTest_E95D58C1DD15BB74-001/control-001/cores/collection1
   [junit4]   2> 1226684 INFO  (TEST-LeaderFailoverAfterPartitionTest.test-seed#[E95D58C1DD15BB74]) [    ] o.a.s.c.CorePropertiesLocator Found 1 core definitions
   [junit4]   2> 1226684 INFO  (TEST-LeaderFailoverAfterPartitionTest.test-seed#[E95D58C1DD15BB74]) [    ] o.a.s.s.SolrDispatchFilter user.dir=/home/jenkins/workspace/Lucene-Solr-5.x-Linux/solr/build/solr-core/test/J2
   [junit4]   2> 1226684 INFO  (TEST-LeaderFailoverAfterPartitionTest.test-seed#[E95D58C1DD15BB74]) [    ] o.a.s.s.SolrDispatchFilter SolrDispatchFilter.init() done
   [junit4]   2> 1226684 INFO  (coreLoadExecutor-4032-thread-1) [    ] o.a.s.c.ZkController publishing state=down
   [junit4]   2> 1226684 INFO  (coreLoadExecutor-4032-thread-1) [    ] o.a.s.c.ZkController numShards not found on descriptor - reading it from system property
   [junit4]   2> 1226685 INFO  (OverseerStateUpdate-95182494384128004-127.0.0.1:45251__nmy-n_0000000000) [    ] o.a.s.c.Overseer processMessage: queueSize: 1, message = {
   [junit4]   2>   "core":"collection1",
   [junit4]   2>   "roles":null,
   [junit4]   2>   "base_url":"http://127.0.0.1:45251/_nmy",
   [junit4]   2>   "node_name":"127.0.0.1:45251__nmy",
   [junit4]   2>   "numShards":"1",
   [junit4]   2>   "state":"down",
   [junit4]   2>   "shard":null,
   [junit4]   2>   "collection":"control_collection",
   [junit4]   2>   "operation":"state"} current state version: 0
   [junit4]   2> 1226685 INFO  (coreLoadExecutor-4032-thread-1) [    ] o.a.s.c.ZkController look for our core node name
   [junit4]   2> 1226685 INFO  (OverseerStateUpdate-95182494384128004-127.0.0.1:45251__nmy-n_0000000000) [    ] o.a.s.c.o.ReplicaMutator Update state numShards=1 message={
   [junit4]   2>   "core":"collection1",
   [junit4]   2>   "roles":null,
   [junit4]   2>   "base_url":"http://127.0.0.1:45251/_nmy",
   [junit4]   2>   "node_name":"127.0.0.1:45251__nmy",
   [junit4]   2>   "numShards":"1",
   [junit4]   2>   "state":"down",
   [junit4]   2>   "shard":null,
   [junit4]   2>   "collection":"control_collection",
   [junit4]   2>   "operation":"state"}
   [junit4]   2> 1226685 INFO  (OverseerStateUpdate-95182494384128004-127.0.0.1:45251__nmy-n_0000000000) [    ] o.a.s.c.o.ClusterStateMutator building a new cName: control_collection
   [junit4]   2> 1226686 INFO  (OverseerStateUpdate-95182494384128004-127.0.0.1:45251__nmy-n_0000000000) [    ] o.a.s.c.o.ReplicaMutator Assigning new node to shard shard=shard1
   [junit4]   2> 1226686 INFO  (zkCallback-1128-thread-1) [    ] o.a.s.c.c.ZkStateReader A cluster state change: [WatchedEvent state:SyncConnected type:NodeDataChanged path:/clusterstate.json], has occurred - updating... (live nodes size: [1])
   [junit4]   2> 1227685 INFO  (coreLoadExecutor-4032-thread-1) [    ] o.a.s.c.ZkController waiting to find shard id in clusterstate for collection1
   [junit4]   2> 1227685 INFO  (coreLoadExecutor-4032-thread-1) [    ] o.a.s.c.ZkController Check for collection zkNode:control_collection
   [junit4]   2> 1227686 INFO  (coreLoadExecutor-4032-thread-1) [    ] o.a.s.c.ZkController Collection zkNode exists
   [junit4]   2> 1227686 INFO  (coreLoadExecutor-4032-thread-1) [    ] o.a.s.c.c.ZkStateReader Load collection config from: [/collections/control_collection]
   [junit4]   2> 1227686 INFO  (coreLoadExecutor-4032-thread-1) [    ] o.a.s.c.c.ZkStateReader path=[/collections/control_collection] [configName]=[conf1] specified config exists in ZooKeeper
   [junit4]   2> 1227686 INFO  (coreLoadExecutor-4032-thread-1) [    ] o.a.s.c.SolrResourceLoader new SolrResourceLoader for directory: '/home/jenkins/workspace/Lucene-Solr-5.x-Linux/solr/build/solr-core/test/J2/temp/solr.cloud.LeaderFailoverAfterPartitionTest_E95D58C1DD15BB74-001/control-001/cores/collection1'
   [junit4]   2> 1227686 INFO  (coreLoadExecutor-4032-thread-1) [    ] o.a.s.c.SolrResourceLoader JNDI not configured for solr (NoInitialContextEx)
   [junit4]   2> 1227686 INFO  (coreLoadExecutor-4032-thread-1) [    ] o.a.s.c.SolrResourceLoader solr home defaulted to 'solr/' (could not find system property or JNDI)
   [junit4]   2> 1227687 INFO  (coreLoadExecutor-4032-thread-1) [    ] o.a.s.c.Config loaded config solrconfig.xml with version 0 
   [junit4]   2> 1227689 INFO  (coreLoadExecutor-4032-thread-1) [    ] o.a.s.c.SolrConfig current version of requestparams : -1
   [junit4]   2> 1227692 INFO  (coreLoadExecutor-4032-thread-1) [    ] o.a.s.c.SolrConfig Using Lucene MatchVersion: 5.5.0
   [junit4]   2> 1227698 INFO  (coreLoadExecutor-4032-thread-1) [    ] o.a.s.c.SolrConfig Loaded SolrConfig: solrconfig.xml
   [junit4]   2> 1227707 INFO  (coreLoadExecutor-4032-thread-1) [    ] o.a.s.s.IndexSchema [collection1] Schema name=test
   [junit4]   2> 1227775 INFO  (coreLoadExecutor-4032-thread-1) [    ] o.a.s.s.OpenExchangeRatesOrgProvider Initialized with rates=open-exchange-rates.json, refreshInterval=1440.
   [junit4]   2> 1227778 INFO  (coreLoadExecutor-4032-thread-1) [    ] o.a.s.s.IndexSchema default search field in schema is text
   [junit4]   2> 1227779 INFO  (coreLoadExecutor-4032-thread-1) [    ] o.a.s.s.IndexSchema unique key field: id
   [junit4]   2> 1227782 INFO  (coreLoadExecutor-4032-thread-1) [    ] o.a.s.s.FileExchangeRateProvider Reloading exchange rates from file currency.xml
   [junit4]   2> 1227783 INFO  (coreLoadExecutor-4032-thread-1) [    ] o.a.s.s.FileExchangeRateProvider Reloading exchange rates from file currency.xml
   [junit4]   2> 1227784 INFO  (coreLoadExecutor-4032-thread-1) [    ] o.a.s.s.OpenExchangeRatesOrgProvider Reloading exchange rates from open-exchange-rates.json
   [junit4]   2> 1227784 INFO  (coreLoadExecutor-4032-thread-1) [    ] o.a.s.s.OpenExchangeRatesOrgProvider Reloading exchange rates from open-exchange-rates.json
   [junit4]   2> 1227785 INFO  (coreLoadExecutor-4032-thread-1) [    ] o.a.s.c.ConfigSetProperties Did not find ConfigSet properties, assuming default properties: Can't find resource 'configsetprops.json' in classpath or '/configs/conf1', cwd=/home/jenkins/workspace/Lucene-Solr-5.x-Linux/solr/build/solr-core/test/J2
   [junit4]   2> 1227785 INFO  (coreLoadExecutor-4032-thread-1) [    ] o.a.s.c.CoreContainer Creating SolrCore 'collection1' using configuration from collection control_collection
   [junit4]   2> 1227785 INFO  (coreLoadExecutor-4032-thread-1) [    ] o.a.s.c.SolrCore org.apache.solr.core.MockDirectoryFactory
   [junit4]   2> 1227786 INFO  (coreLoadExecutor-4032-thread-1) [    ] o.a.s.c.SolrCore [[collection1] ] Opening new SolrCore at [/home/jenkins/workspace/Lucene-Solr-5.x-Linux/solr/build/solr-core/test/J2/temp/solr.cloud.LeaderFailoverAfterPartitionTest_E95D58C1DD15BB74-001/control-001/cores/collection1], dataDir=[/home/jenkins/workspace/Lucene-Solr-5.x-Linux/solr/build/solr-core/test/J2/temp/solr.cloud.LeaderFailoverAfterPartitionTest_E95D58C1DD15BB74-001/control-001/cores/collection1/data/]
   [junit4]   2> 1227786 INFO  (coreLoadExecutor-4032-thread-1) [    ] o.a.s.c.JmxMonitoredMap JMX monitoring is enabled. Adding Solr mbeans to JMX Server: com.sun.jmx.mbeanserver.JmxMBeanServer@5bc5654a
   [junit4]   2> 1227786 INFO  (coreLoadExecutor-4032-thread-1) [    ] o.a.s.c.CachingDirectoryFactory return new directory for /home/jenkins/workspace/Lucene-Solr-5.x-Linux/solr/build/solr-core/test/J2/temp/solr.cloud.LeaderFailoverAfterPartitionTest_E95D58C1DD15BB74-001/control-001/cores/collection1/data
   [junit4]   2> 1227786 INFO  (coreLoadExecutor-4032-thread-1) [    ] o.a.s.c.SolrCore New index directory detected: old=null new=/home/jenkins/workspace/Lucene-Solr-5.x-Linux/solr/build/solr-core/test/J2/temp/solr.cloud.LeaderFailoverAfterPartitionTest_E95D58C1DD15BB74-001/control-001/cores/collection1/data/index/
   [junit4]   2> 1227786 WARN  (coreLoadExecutor-4032-thread-1) [    ] o.a.s.c.SolrCore [collection1] Solr index directory '/home/jenkins/workspace/Lucene-Solr-5.x-Linux/solr/build/solr-core/test/J2/temp/solr.cloud.LeaderFailoverAfterPartitionTest_E95D58C1DD15BB74-001/control-001/cores/collection1/data/index' doesn't exist. Creating new index...
   [junit4]   2> 1227786 INFO  (coreLoadExecutor-4032-thread-1) [    ] o.a.s.c.CachingDirectoryFactory return new directory for /home/jenkins/workspace/Lucene-Solr-5.x-Linux/solr/build/solr-core/test/J2/temp/solr.cloud.LeaderFailoverAfterPartitionTest_E95D58C1DD15BB74-001/control-001/cores/collection1/data/index
   [junit4]   2> 1227786 INFO  (coreLoadExecutor-4032-thread-1) [    ] o.a.s.u.RandomMergePolicy RandomMergePolicy wrapping class org.apache.lucene.index.LogByteSizeMergePolicy: [LogByteSizeMergePolicy: minMergeSize=1677721, mergeFactor=30, maxMergeSize=2147483648, maxMergeSizeForForcedMerge=9223372036854775807, calibrateSizeByDeletes=true, maxMergeDocs=2147483647, maxCFSSegmentSizeMB=8.796093022207999E12, noCFSRatio=1.0]
   [junit4]   2> 1227787 INFO  (coreLoadExecutor-4032-thread-1) [    ] o.a.s.c.SolrDeletionPolicy SolrDeletionPolicy.onCommit: commits: num=1
   [junit4]   2> 	commit{dir=MockDirectoryWrapper(RAMDirectory@38ab77b9 lockFactory=org.apache.lucene.store.SingleInstanceLockFactory@2bdb71af),segFN=segments_1,generation=1}
   [junit4]   2> 1227787 INFO  (coreLoadExecutor-4032-thread-1) [    ] o.a.s.c.SolrDeletionPolicy newest commit generation = 1
   [junit4]   2> 1227787 INFO  (OldIndexDirectoryCleanupThreadForCore-collection1) [    ] o.a.s.c.SolrCore Looking for old index directories to cleanup for core collection1 in /home/jenkins/workspace/Lucene-Solr-5.x-Linux/solr/build/solr-core/test/J2/temp/solr.cloud.LeaderFailoverAfterPartitionTest_E95D58C1DD15BB74-001/control-001/cores/collection1/data/
   [junit4]   2> 1227787 WARN  (OldIndexDirectoryCleanupThreadForCore-collection1) [    ] o.a.s.c.DirectoryFactory /home/jenkins/workspace/Lucene-Solr-5.x-Linux/solr/build/solr-core/test/J2/temp/solr.cloud.LeaderFailoverAfterPartitionTest_E95D58C1DD15BB74-001/control-001/cores/collection1/data/ does not point to a valid data directory; skipping clean-up of old index directories.
   [junit4]   2> 1227788 INFO  (coreLoadExecutor-4032-thread-1) [    ] o.a.s.u.p.UpdateRequestProcessorChain creating updateRequestProcessorChain "nodistrib"
   [junit4]   2> 1227788 INFO  (coreLoadExecutor-4032-thread-1) [    ] o.a.s.u.p.UpdateRequestProcessorChain creating updateRequestProcessorChain "dedupe"
   [junit4]   2> 1227788 INFO  (coreLoadExecutor-4032-thread-1) [    ] o.a.s.u.p.UpdateRequestProcessorChain inserting DistributedUpdateProcessorFactory into updateRequestProcessorChain "dedupe"
   [junit4]   2> 1227788 INFO  (coreLoadExecutor-4032-thread-1) [    ] o.a.s.u.p.UpdateRequestProcessorChain creating updateRequestProcessorChain "stored_sig"
   [junit4]   2> 1227788 INFO  (coreLoadExecutor-4032-thread-1) [    ] o.a.s.u.p.UpdateRequestProcessorChain inserting DistributedUpdateProcessorFactory into updateRequestProcessorChain "stored_sig"
   [junit4]   2> 1227788 INFO  (coreLoadExecutor-4032-thread-1) [    ] o.a.s.u.p.UpdateRequestProcessorChain creating updateRequestProcessorChain "distrib-dup-test-chain-explicit"
   [junit4]   2> 1227789 INFO  (coreLoadExecutor-4032-thread-1) [    ] o.a.s.u.p.UpdateRequestProcessorChain creating updateRequestProcessorChain "distrib-dup-test-chain-implicit"
   [junit4]   2> 1227789 INFO  (coreLoadExecutor-4032-thread-1) [    ] o.a.s.u.p.UpdateRequestProcessorChain inserting DistributedUpdateProcessorFactory into updateRequestProcessorChain "distrib-dup-test-chain-implicit"
   [junit4]   2> 1227789 INFO  (coreLoadExecutor-4032-thread-1) [    ] o.a.s.c.SolrCore no updateRequestProcessorChain defined as default, creating implicit default
   [junit4]   2> 1227789 WARN  (coreLoadExecutor-4032-thread-1) [    ] o.a.s.c.RequestHandlers INVALID paramSet a in requestHandler {type = requestHandler,name = /dump,class = DumpRequestHandler,args = {defaults={a=A,b=B}}}
   [junit4]   2> 1227790 INFO  (coreLoadExecutor-4032-thread-1) [    ] o.a.s.h.l.XMLLoader xsltCacheLifetimeSeconds=60
   [junit4]   2> 1227790 INFO  (coreLoadExecutor-4032-thread-1) [    ] o.a.s.h.l.XMLLoader xsltCacheLifetimeSeconds=60
   [junit4]   2> 1227790 INFO  (coreLoadExecutor-4032-thread-1) [    ] o.a.s.h.l.XMLLoader xsltCacheLifetimeSeconds=60
   [junit4]   2> 1227791 INFO  (coreLoadExecutor-4032-thread-1) [    ] o.a.s.h.l.XMLLoader xsltCacheLifetimeSeconds=60
   [junit4]   2> 1227792 INFO  (coreLoadExecutor-4032-thread-1) [    ] o.a.s.c.RequestHandlers Registered paths: /admin/mbeans,standard,/dump,/update/csv,/update/json/docs,/admin/luke,/admin/segments,/get,/admin/system,/replication,/admin/properties,/config,/schema,/admin/plugins,/admin/logging,/update/json,/admin/threads,/admin/ping,/update,/admin/file
   [junit4]   2> 1227792 INFO  (coreLoadExecutor-4032-thread-1) [    ] o.a.s.c.SolrCore Using default statsCache cache: org.apache.solr.search.stats.LocalStatsCache
   [junit4]   2> 1227792 INFO  (coreLoadExecutor-4032-thread-1) [    ] o.a.s.u.UpdateHandler Using UpdateLog implementation: org.apache.solr.update.UpdateLog
   [junit4]   2> 1227792 INFO  (coreLoadExecutor-4032-thread-1) [    ] o.a.s.u.UpdateLog Initializing UpdateLog: dataDir= defaultSyncLevel=FLUSH numRecordsToKeep=100 maxNumLogsToKeep=10 numVersionBuckets=65536
   [junit4]   2> 1227793 INFO  (coreLoadExecutor-4032-thread-1) [    ] o.a.s.u.CommitTracker Hard AutoCommit: disabled
   [junit4]   2> 1227793 INFO  (coreLoadExecutor-4032-thread-1) [    ] o.a.s.u.CommitTracker Soft AutoCommit: disabled
   [junit4]   2> 1227793 INFO  (coreLoadExecutor-4032-thread-1) [    ] o.a.s.u.RandomMergePolicy RandomMergePolicy wrapping class org.apache.lucene.index.LogByteSizeMergePolicy: [LogByteSizeMergePolicy: minMergeSize=1677721, mergeFactor=20, maxMergeSize=2147483648, maxMergeSizeForForcedMerge=9223372036854775807, calibrateSizeByDeletes=true, maxMergeDocs=2147483647, maxCFSSegmentSizeMB=1.0283203125, noCFSRatio=1.0]
   [junit4]   2> 1227793 INFO  (coreLoadExecutor-4032-thread-1) [    ] o.a.s.c.SolrDeletionPolicy SolrDeletionPolicy.onInit: commits: num=1
   [junit4]   2> 	commit{dir=MockDirectoryWrapper(RAMDirectory@38ab77b9 lockFactory=org.apache.lucene.store.SingleInstanceLockFactory@2bdb71af),segFN=segments_1,generation=1}
   [junit4]   2> 1227794 INFO  (coreLoadExecutor-4032-thread-1) [    ] o.a.s.c.SolrDeletionPolicy newest commit generation = 1
   [junit4]   2> 1227794 INFO  (coreLoadExecutor-4032-thread-1) [    ] o.a.s.s.SolrIndexSearcher Opening Searcher@4fa459f3[collection1] main
   [junit4]   2> 1227794 INFO  (coreLoadExecutor-4032-thread-1) [    ] o.a.s.c.c.ZkStateReader Load collection config from: [/collections/control_collection]
   [junit4]   2> 1227794 INFO  (coreLoadExecutor-4032-thread-1) [    ] o.a.s.c.c.ZkStateReader path=[/collections/control_collection] [configName]=[conf1] specified config exists in ZooKeeper
   [junit4]   2> 1227794 INFO  (coreLoadExecutor-4032-thread-1) [    ] o.a.s.r.ManagedResourceStorage Setting up ZooKeeper-based storage for the RestManager with znodeBase: /configs/conf1
   [junit4]   2> 1227794 INFO  (coreLoadExecutor-4032-thread-1) [    ] o.a.s.r.ManagedResourceStorage Configured ZooKeeperStorageIO with znodeBase: /configs/conf1
   [junit4]   2> 1227794 INFO  (coreLoadExecutor-4032-thread-1) [    ] o.a.s.r.RestManager Initializing RestManager with initArgs: {}
   [junit4]   2> 1227794 INFO  (coreLoadExecutor-4032-thread-1) [    ] o.a.s.r.ManagedResourceStorage Reading _rest_managed.json using ZooKeeperStorageIO:path=/configs/conf1
   [junit4]   2> 1227794 INFO  (coreLoadExecutor-4032-thread-1) [    ] o.a.s.r.ManagedResourceStorage No data found for znode /configs/conf1/_rest_managed.json
   [junit4]   2> 1227794 INFO  (coreLoadExecutor-4032-thread-1) [    ] o.a.s.r.ManagedResourceStorage Loaded null at path _rest_managed.json using ZooKeeperStorageIO:path=/configs/conf1
   [junit4]   2> 1227794 INFO  (coreLoadExecutor-4032-thread-1) [    ] o.a.s.r.RestManager Initializing 0 registered ManagedResources
   [junit4]   2> 1227795 INFO  (coreLoadExecutor-4032-thread-1) [    ] o.a.s.h.ReplicationHandler Commits will be reserved for  10000
   [junit4]   2> 1227795 INFO  (searcherExecutor-4033-thread-1) [    ] o.a.s.c.SolrCore [collection1] Registered new searcher Searcher@4fa459f3[collection1] main{ExitableDirectoryReader(UninvertingDirectoryReader())}
   [junit4]   2> 1227795 INFO  (coreLoadExecutor-4032-thread-1) [    ] o.a.s.u.UpdateLog Looking up max value of version field to seed version buckets
   [junit4]   2> 1227795 INFO  (coreLoadExecutor-4032-thread-1) [    ] o.a.s.u.VersionInfo Refreshing highest value of _version_ for 65536 version buckets from index
   [junit4]   2> 1227795 INFO  (coreLoadExecutor-4032-thread-1) [    ] o.a.s.u.VersionInfo No terms found for _version_, cannot seed version bucket highest value from index
   [junit4]   2> 1227795 INFO  (coreLoadExecutor-4032-thread-1) [    ] o.a.s.u.UpdateLog Could not find max version in index or recent updates, using new clock 1522919911516536832
   [junit4]   2> 1227797 INFO  (coreLoadExecutor-4032-thread-1) [    ] o.a.s.u.UpdateLog Took 1.0ms to seed version buckets with highest version 1522919911516536832
   [junit4]   2> 1227797 INFO  (coreLoadExecutor-4032-thread-1) [    ] o.a.s.c.ZkController watch zkdir /configs/conf1
   [junit4]   2> 1227797 INFO  (coreLoadExecutor-4032-thread-1) [    ] o.a.s.c.CoreContainer registering core: collection1
   [junit4]   2> 1227797 INFO  (coreZkRegister-4026-thread-1) [    ] o.a.s.c.ZkController Register replica - core:collection1 address:http://127.0.0.1:45251/_nmy collection:control_collection shard:shard1
   [junit4]   2> 1227797 INFO  (coreZkRegister-4026-thread-1) [    ] o.a.s.c.c.SolrZkClient makePath: /collections/control_collection/leader_elect/shard1/election
   [junit4]   2> 1227798 INFO  (coreZkRegister-4026-thread-1) [    ] o.a.s.c.LeaderElector Joined leadership election with path: /collections/control_collection/leader_elect/shard1/election/95182494384128004-core_node1-n_0000000000
   [junit4]   2> 1227799 INFO  (coreZkRegister-4026-thread-1) [    ] o.a.s.c.ShardLeaderElectionContext Running the leader process for shard=shard1 and weAreReplacement=false and leaderVoteWait=10000
   [junit4]   2> 1227799 INFO  (coreZkRegister-4026-thread-1) [    ] o.a.s.c.ShardLeaderElectionContext Enough replicas found to continue.
   [junit4]   2> 1227799 INFO  (coreZkRegister-4026-thread-1) [    ] o.a.s.c.ShardLeaderElectionContext I may be the new leader - try and sync
   [junit4]   2> 1227799 INFO  (coreZkRegister-4026-thread-1) [    ] o.a.s.c.SyncStrategy Sync replicas to http://127.0.0.1:45251/_nmy/collection1/
   [junit4]   2> 1227799 INFO  (coreZkRegister-4026-thread-1) [    ] o.a.s.c.SyncStrategy Sync Success - now sync replicas to me
   [junit4]   2> 1227799 INFO  (OverseerStateUpdate-95182494384128004-127.0.0.1:45251__nmy-n_0000000000) [    ] o.a.s.c.Overseer processMessage: queueSize: 1, message = {
   [junit4]   2>   "operation":"leader",
   [junit4]   2>   "shard":"shard1",
   [junit4]   2>   "collection":"control_collection"} current state version: 1
   [junit4]   2> 1227799 INFO  (coreZkRegister-4026-thread-1) [    ] o.a.s.c.SyncStrategy http://127.0.0.1:45251/_nmy/collection1/ has no replicas
   [junit4]   2> 1227800 INFO  (coreZkRegister-4026-thread-1) [    ] o.a.s.c.c.SolrZkClient makePath: /collections/control_collection/leaders/shard1
   [junit4]   2> 1227800 INFO  (coreZkRegister-4026-thread-1) [    ] o.a.s.c.ShardLeaderElectionContextBase Creating leader registration node
   [junit4]   2> 1227801 INFO  (coreZkRegister-4026-thread-1) [    ] o.a.s.c.ShardLeaderElectionContext I am the new leader: http://127.0.0.1:45251/_nmy/collection1/ shard1
   [junit4]   2> 1227801 INFO  (OverseerStateUpdate-95182494384128004-127.0.0.1:45251__nmy-n_0000000000) [    ] o.a.s.c.Overseer processMessage: queueSize: 1, message = {
   [junit4]   2>   "operation":"leader",
   [junit4]   2>   "shard":"shard1",
   [junit4]   2>   "collection":"control_collection",
   [junit4]   2>   "base_url":"http://127.0.0.1:45251/_nmy",
   [junit4]   2>   "core":"collection1",
   [junit4]   2>   "state":"active"} current state version: 1
   [junit4]   2> 1227902 INFO  (zkCallback-1128-thread-1) [    ] o.a.s.c.c.ZkStateReader A cluster state change: [WatchedEvent state:SyncConnected type:NodeDataChanged path:/clusterstate.json], has occurred - updating... (live nodes size: [1])
   [junit4]   2> 1227952 INFO  (coreZkRegister-4026-thread-1) [    ] o.a.s.c.ZkController We are http://127.0.0.1:45251/_nmy/collection1/ and leader is http://127.0.0.1:45251/_nmy/collection1/
   [junit4]   2> 1227952 INFO  (coreZkRegister-4026-thread-1) [    ] o.a.s.c.ZkController No LogReplay needed for core=collection1 baseURL=http://127.0.0.1:45251/_nmy
   [junit4]   2> 1227952 INFO  (coreZkRegister-4026-thread-1) [    ] o.a.s.c.ZkController I am the leader, no recovery necessary
   [junit4]   2> 1227952 INFO  (coreZkRegister-4026-thread-1) [    ] o.a.s.c.ZkController publishing state=active
   [junit4]   2> 1227952 INFO  (coreZkRegister-4026-thread-1) [    ] o.a.s.c.ZkController numShards not found on descriptor - reading it from system property
   [junit4]   2> 1227953 INFO  (OverseerStateUpdate-95182494384128004-127.0.0.1:45251__nmy-n_0000000000) [    ] o.a.s.c.Overseer processMessage: queueSize: 1, message = {
   [junit4]   2>   "core":"collection1",
   [junit4]   2>   "core_node_name":"core_node1",
   [junit4]   2>   "roles":null,
   [junit4]   2>   "base_url":"http://127.0.0.1:45251/_nmy",
   [junit4]   2>   "node_name":"127.0.0.1:45251__nmy",
   [junit4]   2>   "numShards":"1",
   [junit4]   2>   "state":"active",
   [junit4]   2>   "shard":"shard1",
   [junit4]   2>   "collection":"control_collection",
   [junit4]   2>   "operation":"state"} current state version: 2
   [junit4]   2> 1227953 INFO  (OverseerStateUpdate-95182494384128004-127.0.0.1:45251__nmy-n_0000000000) [    ] o.a.s.c.o.ReplicaMutator Update state numShards=1 message={
   [junit4]   2>   "core":"collection1",
   [junit4]   2>   "core_node_name":"core_node1",
   [junit4]   2>   "roles":null,
   [junit4]   2>   "base_url":"http://127.0.0.1:45251/_nmy",
   [junit4]   2>   "node_name":"127.0.0.1:45251__nmy",
   [junit4]   2>   "numShards":"1",
   [junit4]   2>   "state":"active",
   [junit4]   2>   "shard":"shard1",
   [junit4]   2>   "collection":"control_collection",
   [junit4]   2>   "operation":"state"}
   [junit4]   2> 1228054 INFO  (zkCallback-1128-thread-2) [    ] o.a.s.c.c.ZkStateReader A cluster state change: [WatchedEvent state:SyncConnected type:NodeDataChanged path:/clusterstate.json], has occurred - updating... (live nodes size: [1])
   [junit4]   2> 1228186 INFO  (TEST-LeaderFailoverAfterPartitionTest.test-seed#[E95D58C1DD15BB74]) [    ] o.a.s.c.c.SolrZkClient Using default ZkCredentialsProvider
   [junit4]   2> 1228186 INFO  (TEST-LeaderFailoverAfterPartitionTest.test-seed#[E95D58C1DD15BB74]) [    ] o.a.s.c.c.ConnectionManager Waiting for client to connect to ZooKeeper
   [junit4]   2> 1228187 INFO  (zkCallback-1130-thread-1) [    ] o.a.s.c.c.ConnectionManager Watcher org.apache.solr.common.cloud.ConnectionManager@62f08480 name:ZooKeeperConnection Watcher:127.0.0.1:49662/solr got event WatchedEvent state:SyncConnected type:None path:null path:null type:None
   [junit4]   2> 1228187 INFO  (TEST-LeaderFailoverAfterPartitionTest.test-seed#[E95D58C1DD15BB74]) [    ] o.a.s.c.c.ConnectionManager Client is connected to ZooKeeper
   [junit4]   2> 1228187 INFO  (TEST-LeaderFailoverAfterPartitionTest.test-seed#[E95D58C1DD15BB74]) [    ] o.a.s.c.c.SolrZkClient Using default ZkACLProvider
   [junit4]   2> 1228187 INFO  (TEST-LeaderFailoverAfterPartitionTest.test-seed#[E95D58C1DD15BB74]) [    ] o.a.s.c.c.ZkStateReader Updating cluster state from ZooKeeper... 
   [junit4]   2> 1228188 INFO  (TEST-LeaderFailoverAfterPartitionTest.test-seed#[E95D58C1DD15BB74]) [    ] o.a.s.c.ChaosMonkey monkey: init - expire sessions:false cause connection loss:false
   [junit4]   2> 1228234 INFO  (TEST-LeaderFailoverAfterPartitionTest.test-seed#[E95D58C1DD15BB74]) [    ] o.a.s.SolrTestCaseJ4 Writing core.properties file to /home/jenkins/workspace/Lucene-Solr-5.x-Linux/solr/build/solr-core/test/J2/temp/solr.cloud.LeaderFailoverAfterPartitionTest_E95D58C1DD15BB74-001/shard-1-001/cores/collection1
   [junit4]   2> 1228234 INFO  (TEST-LeaderFailoverAfterPartitionTest.test-seed#[E95D58C1DD15BB74]) [    ] o.a.s.c.AbstractFullDistribZkTestBase create jetty 1 in directory /home/jenkins/workspace/Lucene-Solr-5.x-Linux/solr/build/solr-core/test/J2/temp/solr.cloud.LeaderFailoverAfterPartitionTest_E95D58C1DD15BB74-001/shard-1-001
   [junit4]   2> 1228235 INFO  (TEST-LeaderFailoverAfterPartitionTest.test-seed#[E95D58C1DD15BB74]) [    ] o.e.j.s.Server jetty-9.2.13.v20150730
   [junit4]   2> 1228238 INFO  (TEST-LeaderFailoverAfterPartitionTest.test-seed#[E95D58C1DD15BB74]) [    ] o.e.j.s.h.ContextHandler Started o.e.j.s.ServletContextHandler@106d8387{/_nmy,null,AVAILABLE}
   [junit4]   2> 1228238 INFO  (TEST-LeaderFailoverAfterPartitionTest.test-seed#[E95D58C1DD15BB74]) [    ] o.e.j.s.ServerConnector Started ServerConnector@5a412ad5{HTTP/1.1}{127.0.0.1:٥٠٠٣٥}
   [junit4]   2> 1228238 INFO  (TEST-LeaderFailoverAfterPartitionTest.test-seed#[E95D58C1DD15BB74]) [    ] o.e.j.s.Server Started @١٢٣٠١٢٥ms
   [junit4]   2> 1228238 INFO  (TEST-LeaderFailoverAfterPartitionTest.test-seed#[E95D58C1DD15BB74]) [    ] o.a.s.c.s.e.JettySolrRunner Jetty properties: {solr.data.dir=/home/jenkins/workspace/Lucene-Solr-5.x-Linux/solr/build/solr-core/test/J2/temp/solr.cloud.LeaderFailoverAfterPartitionTest_E95D58C1DD15BB74-001/tempDir-001/jetty1, solrconfig=solrconfig.xml, hostContext=/_nmy, hostPort=43857, coreRootDirectory=/home/jenkins/workspace/Lucene-Solr-5.x-Linux/solr/build/solr-core/test/J2/temp/solr.cloud.LeaderFailoverAfterPartitionTest_E95D58C1DD15BB74-001/shard-1-001/cores}
   [junit4]   2> 1228238 INFO  (TEST-LeaderFailoverAfterPartitionTest.test-seed#[E95D58C1DD15BB74]) [    ] o.a.s.s.SolrDispatchFilter SolrDispatchFilter.init(): sun.misc.Launcher$AppClassLoader@deb6432
   [junit4]   2> 1228238 INFO  (TEST-LeaderFailoverAfterPartitionTest.test-seed#[E95D58C1DD15BB74]) [    ] o.a.s.c.SolrResourceLoader new SolrResourceLoader for directory: '/home/jenkins/workspace/Lucene-Solr-5.x-Linux/solr/build/solr-core/test/J2/temp/solr.cloud.LeaderFailoverAfterPartitionTest_E95D58C1DD15BB74-001/shard-1-001'
   [junit4]   2> 1228238 INFO  (TEST-LeaderFailoverAfterPartitionTest.test-seed#[E95D58C1DD15BB74]) [    ] o.a.s.c.SolrResourceLoader JNDI not configured for solr (NoInitialContextEx)
   [junit4]   2> 1228238 INFO  (TEST-LeaderFailoverAfterPartitionTest.test-seed#[E95D58C1DD15BB74]) [    ] o.a.s.c.SolrResourceLoader solr home defaulted to 'solr/' (could not find system property or JNDI)
   [junit4]   2> 1228238 INFO  (TEST-LeaderFailoverAfterPartitionTest.test-seed#[E95D58C1DD15BB74]) [    ] o.a.s.c.c.SolrZkClient Using default ZkCredentialsProvider
   [junit4]   2> 1228239 INFO  (TEST-LeaderFailoverAfterPartitionTest.test-seed#[E95D58C1DD15BB74]) [    ] o.a.s.c.c.ConnectionManager Waiting for client to connect to ZooKeeper
   [junit4]   2> 1228239 INFO  (zkCallback-1131-thread-1) [    ] o.a.s.c.c.ConnectionManager Watcher org.apache.solr.common.cloud.ConnectionManager@3087bc29 name:ZooKeeperConnection Watcher:127.0.0.1:49662/solr got event WatchedEvent state:SyncConnected type:None path:null path:null type:None
   [junit4]   2> 1228239 INFO  (TEST-LeaderFailoverAfterPartitionTest.test-seed#[E95D58C1DD15BB74]) [    ] o.a.s.c.c.ConnectionManager Client is connected to ZooKeeper
   [junit4]   2> 1228240 INFO  (TEST-LeaderFailoverAfterPartitionTest.test-seed#[E95D58C1DD15BB74]) [    ] o.a.s.c.c.SolrZkClient Using default ZkACLProvider
   [junit4]   2> 1228240 INFO  (TEST-LeaderFailoverAfterPartitionTest.test-seed#[E95D58C1DD15BB74]) [    ] o.a.s.s.SolrDispatchFilter Loading solr.xml from SolrHome (not found in ZooKeeper)
   [junit4]   2> 1228240 INFO  (TEST-LeaderFailoverAfterPartitionTest.test-seed#[E95D58C1DD15BB74]) [    ] o.a.s.c.SolrXmlConfig Loading container configuration from /home/jenkins/workspace/Lucene-Solr-5.x-Linux/solr/build/solr-core/test/J2/temp/solr.cloud.LeaderFailoverAfterPartitionTest_E95D58C1DD15BB74-001/shard-1-001/solr.xml
   [junit4]   2> 1228243 INFO  (TEST-LeaderFailoverAfterPartitionTest.test-seed#[E95D58C1DD15BB74]) [    ] o.a.s.c.CorePropertiesLocator Config-defined core root directory: /home/jenkins/workspace/Lucene-Solr-5.x-Linux/solr/build/solr-core/test/J2/temp/solr.cloud.LeaderFailoverAfterPartitionTest_E95D58C1DD15BB74-001/shard-1-001/cores
   [junit4]   2> 1228243 INFO  (TEST-LeaderFailoverAfterPartitionTest.test-seed#[E95D58C1DD15BB74]) [    ] o.a.s.c.CoreContainer New CoreContainer 1591546859
   [junit4]   2> 1228243 INFO  (TEST-LeaderFailoverAfterPartitionTest.test-seed#[E95D58C1DD15BB74]) [    ] o.a.s.c.CoreContainer Loading cores into CoreContainer [instanceDir=/home/jenkins/workspace/Lucene-Solr-5.x-Linux/solr/build/solr-core/test/J2/temp/solr.cloud.LeaderFailoverAfterPartitionTest_E95D58C1DD15BB74-001/shard-1-001]
   [junit4]   2> 1228243 WARN  (TEST-LeaderFailoverAfterPartitionTest.test-seed#[E95D58C1DD15BB74]) [    ] o.a.s.c.CoreContainer Couldn't add files from /home/jenkins/workspace/Lucene-Solr-5.x-Linux/solr/build/solr-core/test/J2/temp/solr.cloud.LeaderFailoverAfterPartitionTest_E95D58C1DD15BB74-001/shard-1-001/lib to classpath: /home/jenkins/workspace/Lucene-Solr-5.x-Linux/solr/build/solr-core/test/J2/temp/solr.cloud.LeaderFailoverAfterPartitionTest_E95D58C1DD15BB74-001/shard-1-001/lib
   [junit4]   2> 1228244 INFO  (TEST-LeaderFailoverAfterPartitionTest.test-seed#[E95D58C1DD15BB74]) [    ] o.a.s.h.c.HttpShardHandlerFactory created with socketTimeout : 90000,urlScheme : ,connTimeout : 15000,maxConnectionsPerHost : 20,maxConnections : 10000,corePoolSize : 0,maximumPoolSize : 2147483647,maxThreadIdleTime : 5,sizeOfQueue : -1,fairnessPolicy : false,useRetries : false,
   [junit4]   2> 1228244 INFO  (TEST-LeaderFailoverAfterPartitionTest.test-seed#[E95D58C1DD15BB74]) [    ] o.a.s.u.UpdateShardHandler Creating UpdateShardHandler HTTP client with params: socketTimeout=340000&connTimeout=45000&retry=true
   [junit4]   2> 1228245 INFO  (TEST-LeaderFailoverAfterPartitionTest.test-seed#[E95D58C1DD15BB74]) [    ] o.a.s.l.LogWatcher SLF4J impl is org.slf4j.impl.Log4jLoggerFactory
   [junit4]   2> 1228245 INFO  (TEST-LeaderFailoverAfterPartitionTest.test-seed#[E95D58C1DD15BB74]) [    ] o.a.s.l.LogWatcher Registering Log Listener [Log4j (org.slf4j.impl.Log4jLoggerFactory)]
   [junit4]   2> 1228245 INFO  (TEST-LeaderFailoverAfterPartitionTest.test-seed#[E95D58C1DD15BB74]) [    ] o.a.s.c.ZkContainer Zookeeper client=127.0.0.1:49662/solr
   [junit4]   2> 1228245 INFO  (TEST-LeaderFailoverAfterPartitionTest.test-seed#[E95D58C1DD15BB74]) [    ] o.a.s.c.ZkController zkHost includes chroot
   [junit4]   2> 1228245 INFO  (TEST-LeaderFailoverAfterPartitionTest.test-seed#[E95D58C1DD15BB74]) [    ] o.a.s.c.c.SolrZkClient Using default ZkCredentialsProvider
   [junit4]   2> 1228245 INFO  (TEST-LeaderFailoverAfterPartitionTest.test-seed#[E95D58C1DD15BB74]) [    ] o.a.s.c.c.ConnectionManager Waiting for client to connect to ZooKeeper
   [junit4]   2> 1228246 INFO  (zkCallback-1133-thread-1) [    ] o.a.s.c.c.ConnectionManager Watcher org.apache.solr.common.cloud.ConnectionManager@4935ba16 name:ZooKeeperConnection Watcher:127.0.0.1:49662 got event WatchedEvent state:SyncConnected type:None path:null path:null type:None
   [junit4]   2> 1228246 INFO  (TEST-LeaderFailoverAfterPartitionTest.test-seed#[E95D58C1DD15BB74]) [    ] o.a.s.c.c.ConnectionManager Client is connected to ZooKeeper
   [junit4]   2> 1228246 INFO  (TEST-LeaderFailoverAfterPartitionTest.test-seed#[E95D58C1DD15BB74]) [    ] o.a.s.c.c.SolrZkClient Using default ZkACLProvider
   [junit4]   2> 1228246 INFO  (TEST-LeaderFailoverAfterPartitionTest.test-seed#[E95D58C1DD15BB74]) [    ] o.a.s.c.c.ConnectionManager Waiting for client to connect to ZooKeeper
   [junit4]   2> 1228247 INFO  (zkCallback-1134-thread-1) [    ] o.a.s.c.c.ConnectionManager Watcher org.apache.solr.common.cloud.ConnectionManager@41b5f05e name:ZooKeeperConnection Watcher:127.0.0.1:49662/solr got event WatchedEvent state:SyncConnected type:None path:null path:null type:None
   [junit4]   2> 1228247 INFO  (TEST-LeaderFailoverAfterPartitionTest.test-seed#[E95D58C1DD15BB74]) [    ] o.a.s.c.c.ConnectionManager Client is connected to ZooKeeper
   [junit4]   2> 1228249 INFO  (TEST-LeaderFailoverAfterPartitionTest.test-seed#[E95D58C1DD15BB74]) [    ] o.a.s.c.c.ZkStateReader Updating cluster state from ZooKeeper... 
   [junit4]   2> 1229251 INFO  (TEST-LeaderFailoverAfterPartitionTest.test-seed#[E95D58C1DD15BB74]) [    ] o.a.s.c.ZkController Register node as live in ZooKeeper:/live_nodes/127.0.0.1:43857__nmy
   [junit4]   2> 1229251 INFO  (TEST-LeaderFailoverAfterPartitionTest.test-seed#[E95D58C1DD15BB74]) [    ] o.a.s.c.c.SolrZkClient makePath: /live_nodes/127.0.0.1:43857__nmy
   [junit4]   2> 1229252 INFO  (zkCallback-1128-thread-2) [    ] o.a.s.c.c.ZkStateReader A live node change: [WatchedEvent state:SyncConnected type:NodeChildrenChanged path:/live_nodes], has occurred - updating... (live nodes size: [1])
   [junit4]   2> 1229252 INFO  (zkCallback-1130-thread-1) [    ] o.a.s.c.c.ZkStateReader A live node change: [WatchedEvent state:SyncConnected type:NodeChildrenChanged path:/live_nodes], has occurred - updating... (live nodes size: [1])
   [junit4]   2> 1229252 INFO  (zkCallback-1134-thread-1) [    ] o.a.s.c.c.ZkStateReader A live node change: [WatchedEvent state:SyncConnected type:NodeChildrenChanged path:/live_nodes], has occurred - updating... (live nodes size: [1])
   [junit4]   2> 1229252 INFO  (TEST-LeaderFailoverAfterPartitionTest.test-seed#[E95D58C1DD15BB74]) [    ] o.a.s.c.Overseer Overseer (id=null) closing
   [junit4]   2> 1229252 INFO  (TEST-LeaderFailoverAfterPartitionTest.test-seed#[E95D58C1DD15BB74]) [    ] o.a.s.c.LeaderElector Joined leadership election with path: /overseer_elect/election/95182494384128008-127.0.0.1:43857__nmy-n_0000000001
   [junit4]   2> 1229252 INFO  (TEST-LeaderFailoverAfterPartitionTest.test-seed#[E95D58C1DD15BB74]) [    ] o.a.s.c.LeaderElector Watching path /overseer_elect/election/95182494384128004-127.0.0.1:45251__nmy-n_0000000000 to know if I could be the leader
   [junit4]   2> 1229256 INFO  (TEST-LeaderFailoverAfterPartitionTest.test-seed#[E95D58C1DD15BB74]) [    ] o.a.s.c.CoreContainer Security conf doesn't exist. Skipping setup for authorization module.
   [junit4]   2> 1229256 INFO  (TEST-LeaderFailoverAfterPartitionTest.test-seed#[E95D58C1DD15BB74]) [    ] o.a.s.c.CoreContainer No authentication plugin used.
   [junit4]   2> 1229256 INFO  (TEST-LeaderFailoverAfterPartitionTest.test-seed#[E95D58C1DD15BB74]) [    ] o.a.s.c.CorePropertiesLocator Looking for core definitions underneath /home/jenkins/workspace/Lucene-Solr-5.x-Linux/solr/build/solr-core/test/J2/temp/solr.cloud.LeaderFailoverAfterPartitionTest_E95D58C1DD15BB74-001/shard-1-001/cores
   [junit4]   2> 1229256 INFO  (TEST-LeaderFailoverAfterPartitionTest.test-seed#[E95D58C1DD15BB74]) [    ] o.a.s.c.CoreDescriptor Created CoreDescriptor: {name=collection1, config=solrconfig.xml, transient=false, schema=schema.xml, loadOnStartup=true, configSetProperties=configsetprops.json, collection=collection1, coreNodeName=, dataDir=data/, shard=}
   [junit4]   2> 1229256 INFO  (TEST-LeaderFailoverAfterPartitionTest.test-seed#[E95D58C1DD15BB74]) [    ] o.a.s.c.CorePropertiesLocator Found core collection1 in /home/jenkins/workspace/Lucene-Solr-5.x-Linux/solr/build/solr-core/test/J2/temp/solr.cloud.LeaderFailoverAfterPartitionTest_E95D58C1DD15BB74-001/shard-1-001/cores/collection1
   [junit4]   2> 1229256 INFO  (TEST-LeaderFailoverAfterPartitionTest.test-seed#[E95D58C1DD15BB74]) [    ] o.a.s.c.CorePropertiesLocator Found 1 core definitions
   [junit4]   2> 1229257 INFO  (TEST-LeaderFailoverAfterPartitionTest.test-seed#[E95D58C1DD15BB74]) [    ] o.a.s.s.SolrDispatchFilter user.dir=/home/jenkins/workspace/Lucene-Solr-5.x-Linux/solr/build/solr-core/test/J2
   [junit4]   2> 1229257 INFO  (TEST-LeaderFailoverAfterPartitionTest.test-seed#[E95D58C1DD15BB74]) [    ] o.a.s.s.SolrDispatchFilter SolrDispatchFilter.init() done
   [junit4]   2> 1229257 INFO  (coreLoadExecutor-4043-thread-1) [    ] o.a.s.c.ZkController publishing state=down
   [junit4]   2> 1229257 INFO  (coreLoadExecutor-4043-thread-1) [    ] o.a.s.c.ZkController numShards not found on descriptor - reading it from system property
   [junit4]   2> 1229258 INFO  (OverseerStateUpdate-95182494384128004-127.0.0.1:45251__nmy-n_0000000000) [    ] o.a.s.c.Overseer processMessage: queueSize: 1, message = {
   [junit4]   2>   "core":"collection1",
   [junit4]   2>   "roles":null,
   [junit4]   2>   "base_url":"http://127.0.0.1:43857/_nmy",
   [junit4]   2>   "node_name":"127.0.0.1:43857__nmy",
   [junit4]   2>   "numShards":"2",
   [junit4]   2>   "state":"down",
   [junit4]   2>   "shard":null,
   [junit4]   2>   "collection":"collection1",
   [junit4]   2>   "operation":"state"} current state version: 3
   [junit4]   2> 1229258 INFO  (coreLoadExecutor-4043-thread-1) [    ] o.a.s.c.ZkController look for our core node name
   [junit4]   2> 1229258 INFO  (OverseerStateUpdate-95182494384128004-127.0.0.1:45251__nmy-n_0000000000) [    ] o.a.s.c.o.ReplicaMutator Update state numShards=2 message={
   [junit4]   2>   "core":"collection1",
   [junit4]   2>   "roles":null,
   [junit4]   2>   "base_url":"http://127.0.0.1:43857/_nmy",
   [junit4]   2>   "node_name":"127.0.0.1:43857__nmy",
   [junit4]   2>   "numShards":"2",
   [junit4]   2>   "state":"down",
   [junit4]   2>   "shard":null,
   [junit4]   2>   "collection":"collection1",
   [junit4]   2>   "operation":"state"}
   [junit4]   2> 1229258 INFO  (OverseerStateUpdate-95182494384128004-127.0.0.1:45251__nmy-n_0000000000) [    ] o.a.s.c.o.ClusterStateMutator building a new cName: collection1
   [junit4]   2> 1229258 INFO  (OverseerStateUpdate-95182494384128004-127.0.0.1:45251__nmy-n_0000000000) [    ] o.a.s.c.o.ReplicaMutator Assigning new node to shard shard=shard2
   [junit4]   2> 1229359 INFO  (zkCallback-1128-thread-2) [    ] o.a.s.c.c.ZkStateReader A cluster state change: [WatchedEvent state:SyncConnected type:NodeDataChanged path:/clusterstate.json], has occurred - updating... (live nodes size: [2])
   [junit4]   2> 1229359 INFO  (zkCallback-1130-thread-1) [    ] o.a.s.c.c.ZkStateReader A cluster state change: [WatchedEvent state:SyncConnected type:NodeDataChanged path:/clusterstate.json], has occurred - updating... (live nodes size: [2])
   [junit4]   2> 1229359 INFO  (zkCallback-1134-thread-1) [    ] o.a.s.c.c.ZkStateReader A cluster state change: [WatchedEvent state:SyncConnected type:NodeDataChanged path:/clusterstate.json], has occurred - updating... (live nodes size: [2])
   [junit4]   2> 1230258 INFO  (coreLoadExecutor-4043-thread-1) [    ] o.a.s.c.ZkController waiting to find shard id in clusterstate for collection1
   [junit4]   2> 1230258 INFO  (coreLoadExecutor-4043-thread-1) [    ] o.a.s.c.ZkController Check for collection zkNode:collection1
   [junit4]   2> 1230258 INFO  (coreLoadExecutor-4043-thread-1) [    ] o.a.s.c.ZkController Collection zkNode exists
   [junit4]   2> 1230259 INFO  (coreLoadExecutor-4043-thread-1) [    ] o.a.s.c.c.ZkStateReader Load collection config from: [/collections/collection1]
   [junit4]   2> 1230259 INFO  (coreLoadExecutor-4043-thread-1) [    ] o.a.s.c.c.ZkStateReader path=[/collections/collection1] [configName]=[conf1] specified config exists in ZooKeeper
   [junit4]   2> 1230259 INFO  (coreLoadExecutor-4043-thread-1) [    ] o.a.s.c.SolrResourceLoader new SolrResourceLoader for directory: '/home/jenkins/workspace/Lucene-Solr-5.x-Linux/solr/build/solr-core/test/J2/temp/solr.cloud.LeaderFailoverAfterPartitionTest_E95D58C1DD15BB74-001/shard-1-001/cores/collection1'
   [junit4]   2> 1230259 INFO  (coreLoadExecutor-4043-thread-1) [    ] o.a.s.c.SolrResourceLoader JNDI not configured for solr (NoInitialContextEx)
   [junit4]   2> 1230259 INFO  (coreLoadExecutor-4043-thread-1) [    ] o.a.s.c.SolrResourceLoader solr home defaulted to 'solr/' (could not find system property or JNDI)
   [junit4]   2> 1230260 INFO  (coreLoadExecutor-4043-thread-1) [    ] o.a.s.c.Config loaded config solrconfig.xml with version 0 
   [junit4]   2> 1230262 INFO  (coreLoadExecutor-4043-thread-1) [    ] o.a.s.c.SolrConfig current version of requestparams : -1
   [junit4]   2> 1230265 INFO  (coreLoadExecutor-4043-thread-1) [    ] o.a.s.c.SolrConfig Using Lucene MatchVersion: 5.5.0
   [junit4]   2> 1230271 INFO  (coreLoadExecutor-4043-thread-1) [    ] o.a.s.c.SolrConfig Loaded SolrConfig: solrconfig.xml
   [junit4]   2> 1230274 INFO  (coreLoadExecutor-4043-thread-1) [    ] o.a.s.s.IndexSchema [collection1] Schema name=test
   [junit4]   2> 1230350 INFO  (coreLoadExecutor-4043-thread-1) [    ] o.a.s.s.OpenExchangeRatesOrgProvider Initialized with rates=open-exchange-rates.json, refreshInterval=1440.
   [junit4]   2> 1230354 INFO  (coreLoadExecutor-4043-thread-1) [    ] o.a.s.s.IndexSchema default search field in schema is text
   [junit4]   2> 1230354 INFO  (coreLoadExecutor-4043-thread-1) [    ] o.a.s.s.IndexSchema unique key field: id
   [junit4]   2> 1230357 INFO  (coreLoadExecutor-4043-thread-1) [    ] o.a.s.s.FileExchangeRateProvider Reloading exchange rates from file currency.xml
   [junit4]   2> 1230358 INFO  (coreLoadExecutor-4043-thread-1) [    ] o.a.s.s.FileExchangeRateProvider Reloading exchange rates from file currency.xml
   [junit4]   2> 1230359 INFO  (coreLoadExecutor-4043-thread-1) [    ] o.a.s.s.OpenExchangeRatesOrgProvider Reloading exchange rates from open-exchange-rates.json
   [junit4]   2> 1230359 INFO  (coreLoadExecutor-4043-thread-1) [    ] o.a.s.s.OpenExchangeRatesOrgProvider Reloading exchange rates from open-exchange-rates.json
   [junit4]   2> 1230360 INFO  (coreLoadExecutor-4043-thread-1) [    ] o.a.s.c.ConfigSetProperties Did not find ConfigSet properties, assuming default properties: Can't find resource 'configsetprops.json' in classpath or '/configs/conf1', cwd=/home/jenkins/workspace/Lucene-Solr-5.x-Linux/solr/build/solr-core/test/J2
   [junit4]   2> 1230360 INFO  (coreLoadExecutor-4043-thread-1) [    ] o.a.s.c.CoreContainer Creating SolrCore 'collection1' using configuration from collection collection1
   [junit4]   2> 1230360 INFO  (coreLoadExecutor-4043-thread-1) [    ] o.a.s.c.SolrCore org.apache.solr.core.MockDirectoryFactory
   [junit4]   2> 1230360 INFO  (coreLoadExecutor-4043-thread-1) [    ] o.a.s.c.SolrCore [[collection1] ] Opening new SolrCore at [/home/jenkins/workspace/Lucene-Solr-5.x-Linux/solr/build/solr-core/test/J2/temp/solr.cloud.LeaderFailoverAfterPartitionTest_E95D58C1DD15BB74-001/shard-1-001/cores/collection1], dataDir=[/home/jenkins/workspace/Lucene-Solr-5.x-Linux/solr/build/solr-core/test/J2/temp/solr.cloud.LeaderFailoverAfterPartitionTest_E95D58C1DD15BB74-001/shard-1-001/cores/collection1/data/]
   [junit4]   2> 1230360 INFO  (coreLoadExecutor-4043-thread-1) [    ] o.a.s.c.JmxMonitoredMap JMX monitoring is enabled. Adding Solr mbeans to JMX Server: com.sun.jmx.mbeanserver.JmxMBeanServer@5bc5654a
   [junit4]   2> 1230361 INFO  (coreLoadExecutor-4043-thread-1) [    ] o.a.s.c.CachingDirectoryFactory return new directory for /home/jenkins/workspace/Lucene-Solr-5.x-Linux/solr/build/solr-core/test/J2/temp/solr.cloud.LeaderFailoverAfterPartitionTest_E95D58C1DD15BB74-001/shard-1-001/cores/collection1/data
   [junit4]   2> 1230361 INFO  (coreLoadExecutor-4043-thread-1) [    ] o.a.s.c.SolrCore New index directory detected: old=null new=/home/jenkins/workspace/Lucene-Solr-5.x-Linux/solr/build/solr-core/test/J2/temp/solr.cloud.LeaderFailoverAfterPartitionTest_E95D58C1DD15BB74-001/shard-1-001/cores/collection1/data/index/
   [junit4]   2> 1230361 WARN  (coreLoadExecutor-4043-thread-1) [    ] o.a.s.c.SolrCore [collection1] Solr index directory '/home/jenkins/workspace/Lucene-Solr-5.x-Linux/solr/build/solr-core/test/J2/temp/solr.cloud.LeaderFailoverAfterPartitionTest_E95D58C1DD15BB74-001/shard-1-001/cores/collection1/data/index' doesn't exist. Creating new index...
   [junit4]   2> 1230361 INFO  (coreLoadExecutor-4043-thread-1) [    ] o.a.s.c.CachingDirectoryFactory return new directory for /home/jenkins/workspace/Lucene-Solr-5.x-Linux/solr/build/solr-core/test/J2/temp/solr.cloud.LeaderFailoverAfterPartitionTest_E95D58C1DD15BB74-001/shard-1-001/cores/collection1/data/index
   [junit4]   2> 1230361 INFO  (coreLoadExecutor-4043-thread-1) [    ] o.a.s.u.RandomMergePolicy RandomMergePolicy wrapping class org.apache.lucene.index.LogByteSizeMergePolicy: [LogByteSizeMergePolicy: minMergeSize=1677721, mergeFactor=30, maxMergeSize=2147483648, maxMergeSizeForForcedMerge=9223372036854775807, calibrateSizeByDeletes=true, maxMergeDocs=2147483647, maxCFSSegmentSizeMB=8.796093022207999E12, noCFSRatio=1.0]
   [junit4]   2> 1230362 INFO  (coreLoadExecutor-4043-thread-1) [    ] o.a.s.c.SolrDeletionPolicy SolrDeletionPolicy.onCommit: commits: num=1
   [junit4]   2> 	commit{dir=MockDirectoryWrapper(RAMDirectory@640f2b64 lockFactory=org.apache.lucene.store.SingleInstanceLockFactory@1e7a9b3f),segFN=segments_1,generation=1}
   [junit4]   2> 1230362 INFO  (coreLoadExecutor-4043-thread-1) [    ] o.a.s.c.SolrDeletionPolicy newest commit generation = 1
   [junit4]   2> 1230362 INFO  (OldIndexDirectoryCleanupThreadForCore-collection1) [    ] o.a.s.c.SolrCore Looking for old index directories to cleanup for core collection1 in /home/jenkins/workspace/Lucene-Solr-5.x-Linux/solr/build/solr-core/test/J2/temp/solr.cloud.LeaderFailoverAfterPartitionTest_E95D58C1DD15BB74-001/shard-1-001/cores/collection1/data/
   [junit4]   2> 1230362 WARN  (OldIndexDirectoryCleanupThreadForCore-collection1) [    ] o.a.s.c.DirectoryFactory /home/jenkins/workspace/Lucene-Solr-5.x-Linux/solr/build/solr-core/test/J2/temp/solr.cloud.LeaderFailoverAfterPartitionTest_E95D58C1DD15BB74-001/shard-1-001/cores/collection1/data/ does not point to a valid data directory; skipping clean-up of old index directories.
   [junit4]   2> 1230363 INFO  (coreLoadExecutor-4043-thread-1) [    ] o.a.s.u.p.UpdateRequestProcessorChain creating updateRequestProcessorChain "nodistrib"
   [junit4]   2> 1230363 INFO  (coreLoadExecutor-4043-thread-1) [    ] o.a.s.u.p.UpdateRequestProcessorChain creating updateRequestProcessorChain "dedupe"
   [junit4]   2> 1230364 INFO  (coreLoadExecutor-4043-thread-1) [    ] o.a.s.u.p.UpdateRequestProcessorChain inserting DistributedUpdateProcessorFactory into updateRequestProcessorChain "dedupe"
   [junit4]   2> 1230364 INFO  (coreLoadExecutor-4043-thread-1) [    ] o.a.s.u.p.UpdateRequestProcessorChain creating updateRequestProcessorChain "stored_sig"
   [junit4]   2> 1230364 INFO  (coreLoadExecutor-4043-thread-1) [    ] o.a.s.u.p.UpdateRequestProcessorChain inserting DistributedUpdateProcessorFactory into updateRequestProcessorChain "stored_sig"
   [junit4]   2> 1230364 INFO  (coreLoadExecutor-4043-thread-1) [    ] o.a.s.u.p.UpdateRequestProcessorChain creating updateRequestProcessorChain "distrib-dup-test-chain-explicit"
   [junit4]   2> 1230364 INFO  (coreLoadExecutor-4043-thread-1) [    ] o.a.s.u.p.UpdateRequestProcessorChain creating updateRequestProcessorChain "distrib-dup-test-chain-implicit"
   [junit4]   2> 1230364 INFO  (coreLoadExecutor-4043-thread-1) [    ] o.a.s.u.p.UpdateRequestProcessorChain inserting DistributedUpdateProcessorFactory into updateRequestProcessorChain "distrib-dup-test-chain-implicit"
   [junit4]   2> 1230364 INFO  (coreLoadExecutor-4043-thread-1) [    ] o.a.s.c.SolrCore no updateRequestProcessorChain defined as default, creating implicit default
   [junit4]   2> 1230364 WARN  (coreLoadExecutor-4043-thread-1) [    ] o.a.s.c.RequestHandlers INVALID paramSet a in requestHandler {type = requestHandler,name = /dump,class = DumpRequestHandler,args = {defaults={a=A,b=B}}}
   [junit4]   2> 1230365 INFO  (coreLoadExecutor-4043-thread-1) [    ] o.a.s.h.l.XMLLoader xsltCacheLifetimeSeconds=60
   [junit4]   2> 1230365 INFO  (coreLoadExecutor-4043-thread-1) [    ] o.a.s.h.l.XMLLoader xsltCacheLifetimeSeconds=60
   [junit4]   2> 1230366 INFO  (coreLoadExecutor-4043-thread-1) [    ] o.a.s.h.l.XMLLoader xsltCacheLifetimeSeconds=60
   [junit4]   2> 1230366 INFO  (coreLoadExecutor-4043-thread-1) [    ] o.a.s.h.l.XMLLoader xsltCacheLifetimeSeconds=60
   [junit4]   2> 1230367 INFO  (coreLoadExecutor-4043-thread-1) [    ] o.a.s.c.RequestHandlers Registered paths: /admin/mbeans,standard,/dump,/update/csv,/update/json/docs,/admin/luke,/admin/segments,/get,/admin/system,/replication,/admin/properties,/config,/schema,/admin/plugins,/admin/logging,/update/json,/admin/threads,/admin/ping,/update,/admin/file
   [junit4]   2> 1230368 INFO  (coreLoadExecutor-4043-thread-1) [    ] o.a.s.c.SolrCore Using default statsCache cache: org.apache.solr.search.stats.LocalStatsCache
   [junit4]   2> 1230368 INFO  (coreLoadExecutor-4043-thread-1) [    ] o.a.s.u.UpdateHandler Using UpdateLog implementation: org.apache.solr.update.UpdateLog
   [junit4]   2> 1230368 INFO  (coreLoadExecutor-4043-thread-1) [    ] o.a.s.u.UpdateLog Initializing UpdateLog: dataDir= defaultSyncLevel=FLUSH numRecordsToKeep=100 maxNumLogsToKeep=10 numVersionBuckets=65536
   [junit4]   2> 1230426 INFO  (coreLoadExecutor-4043-thread-1) [    ] o.a.s.u.CommitTracker Hard AutoCommit: disabled
   [junit4]   2> 1230426 INFO  (coreLoadExecutor-4043-thread-1) [    ] o.a.s.u.CommitTracker Soft AutoCommit: disabled
   [junit4]   2> 1230426 INFO  (coreLoadExecutor-4043-thread-1) [    ] o.a.s.u.RandomMergePolicy RandomMergePolicy wrapping class org.apache.lucene.index.LogByteSizeMergePolicy: [LogByteSizeMergePolicy: minMergeSize=1677721, mergeFactor=20, maxMergeSize=2147483648, maxMergeSizeForForcedMerge=9223372036854775807, calibrateSizeByDeletes=true, maxMergeDocs=2147483647, maxCFSSegmentSizeMB=1.0283203125, noCFSRatio=1.0]
   [junit4]   2> 1230426 INFO  (coreLoadExecutor-4043-thread-1) [    ] o.a.s.c.SolrDeletionPolicy SolrDeletionPolicy.onInit: commits: num=1
   [junit4]   2> 	commit{dir=MockDirectoryWrapper(RAMDirectory@640f2b64 lockFactory=org.apache.lucene.store.SingleInstanceLockFactory@1e7a9b3f),segFN=segments_1,generation=1}
   [junit4]   2> 1230427 INFO  (coreLoadExecutor-4043-thread-1) [    ] o.a.s.c.SolrDeletionPolicy newest commit generation = 1
   [junit4]   2> 1230427 INFO  (coreLoadExecutor-4043-thread-1) [    ] o.a.s.s.SolrIndexSearcher Opening Searcher@4cee2e44[collection1] main
   [junit4]   2> 1230427 INFO  (coreLoadExecutor-4043-thread-1) [    ] o.a.s.c.c.ZkStateReader Load collection config from: [/collections/collection1]
   [junit4]   2> 1230427 INFO  (coreLoadExecutor-4043-thread-1) [    ] o.a.s.c.c.ZkStateReader path=[/collections/collection1] [configName]=[conf1] specified config exists in ZooKeeper
   [junit4]   2> 1230427 INFO  (coreLoadExecutor-4043-thread-1) [    ] o.a.s.r.ManagedResourceStorage Setting up ZooKeeper-based storage for the RestManager with znodeBase: /configs/conf1
   [junit4]   2> 1230427 INFO  (coreLoadExecutor-4043-thread-1) [    ] o.a.s.r.ManagedResourceStorage Configured ZooKeeperStorageIO with znodeBase: /configs/conf1
   [junit4]   2> 1230427 INFO  (coreLoadExecutor-4043-thread-1) [    ] o.a.s.r.RestManager Initializing RestManager with initArgs: {}
   [junit4]   2> 1230427 INFO  (coreLoadExecutor-4043-thread-1) [    ] o.a.s.r.ManagedResourceStorage Reading _rest_managed.json using ZooKeeperStorageIO:path=/configs/conf1
   [junit4]   2> 1230427 INFO  (coreLoadExecutor-4043-thread-1) [    ] o.a.s.r.ManagedResourceStorage No data found for znode /configs/conf1/_rest_managed.json
   [junit4]   2> 1230427 INFO  (coreLoadExecutor-4043-thread-1) [    ] o.a.s.r.ManagedResourceStorage Loaded null at path _rest_managed.json using ZooKeeperStorageIO:path=/configs/conf1
   [junit4]   2> 1230427 INFO  (coreLoadExecutor-4043-thread-1) [    ] o.a.s.r.RestManager Initializing 0 registered ManagedResources
   [junit4]   2> 1230427 INFO  (coreLoadExecutor-4043-thread-1) [    ] o.a.s.h.ReplicationHandler Commits will be reserved for  10000
   [junit4]   2> 1230428 INFO  (searcherExecutor-4044-thread-1) [    ] o.a.s.c.SolrCore [collection1] Registered new searcher Searcher@4cee2e44[collection1] main{ExitableDirectoryReader(UninvertingDirectoryReader())}
   [junit4]   2> 1230428 INFO  (coreLoadExecutor-4043-thread-1) [    ] o.a.s.u.UpdateLog Looking up max value of version field to seed version buckets
   [junit4]   2> 1230428 INFO  (coreLoadExecutor-4043-thread-1) [    ] o.a.s.u.VersionInfo Refreshing highest value of _version_ for 65536 version buckets from index
   [junit4]   2> 1230428 INFO  (coreLoadExecutor-4043-thread-1) [    ] o.a.s.u.VersionInfo No terms found for _version_, cannot seed version bucket highest value from index
   [junit4]   2> 1230428 INFO  (coreLoadExecutor-4043-thread-1) [    ] o.a.s.u.UpdateLog Could not find max version in index or recent updates, using new clock 1522919914277437440
   [junit4]   2> 1230430 INFO  (coreLoadExecutor-4043-thread-1) [    ] o.a.s.u.UpdateLog Took 1.0ms to seed version buckets with highest version 1522919914277437440
   [junit4]   2> 1230430 INFO  (coreLoadExecutor-4043-thread-1) [    ] o.a.s.c.ZkController watch zkdir /configs/conf1
   [junit4]   2> 1230430 INFO  (coreLoadExecutor-4043-thread-1) [    ] o.a.s.c.CoreContainer registering core: collection1
   [junit4]   2> 1230430 INFO  (coreZkRegister-4038-thread-1) [    ] o.a.s.c.ZkController Register replica - core:collection1 address:http://127.0.0.1:43857/_nmy collection:collection1 shard:shard2
   [junit4]   2> 1230431 INFO  (coreZkRegister-4038-thread-1) [    ] o.a.s.c.c.SolrZkClient makePath: /collections/collection1/leader_elect/shard2/election
   [junit4]   2> 1230431 INFO  (coreZkRegister-4038-thread-1) [    ] o.a.s.c.LeaderElector Joined leadership election with path: /collections/collection1/leader_elect/shard2/election/95182494384128008-core_node1-n_0000000000
   [junit4]   2> 1230431 INFO  (coreZkRegister-4038-thread-1) [    ] o.a.s.c.ShardLeaderElectionContext Running the leader process for shard=shard2 and weAreReplacement=false and leaderVoteWait=10000
   [junit4]   2> 1230432 INFO  (coreZkRegister-4038-thread-1) [    ] o.a.s.c.ShardLeaderElectionContext Enough replicas found to continue.
   [junit4]   2> 1230432 INFO  (coreZkRegister-4038-thread-1) [    ] o.a.s.c.ShardLeaderElectionContext I may be the new leader - try and sync
   [junit4]   2> 1230432 INFO  (coreZkRegister-4038-thread-1) [    ] o.a.s.c.SyncStrategy Sync replicas to http://127.0.0.1:43857/_nmy/collection1/
   [junit4]   2> 1230432 INFO  (coreZkRegister-4038-thread-1) [    ] o.a.s.c.SyncStrategy Sync Success - now sync replicas to me
   [junit4]   2> 1230432 INFO  (coreZkRegister-4038-thread-1) [    ] o.a.s.c.SyncStrategy http://127.0.0.1:43857/_nmy/collection1/ has no replicas
   [junit4]   2> 1230432 INFO  (OverseerStateUpdate-95182494384128004-127.0.0.1:45251__nmy-n_0000000000) [    ] o.a.s.c.Overseer processMessage: queueSize: 1, message = {
   [junit4]   2>   "operation":"leader",
   [junit4]   2>   "shard":"shard2",
   [junit4]   2>   "collection":"collection1"} current state version: 4
   [junit4]   2> 1230432 INFO  (coreZkRegister-4038-thread-1) [    ] o.a.s.c.c.SolrZkClient makePath: /collections/collection1/leaders/shard2
   [junit4]   2> 1230433 INFO  (coreZkRegister-4038-thread-1) [    ] o.a.s.c.ShardLeaderElectionContextBase Creating leader registration node
   [junit4]   2> 1230434 INFO  (coreZkRegister-4038-thread-1) [    ] o.a.s.c.ShardLeaderElectionContext I am the new leader: http://127.0.0.1:43857/_nmy/collection1/ shard2
   [junit4]   2> 1230434 INFO  (OverseerStateUpdate-95182494384128004-127.0.0.1:45251__nmy-n_0000000000) [    ] o.a.s.c.Overseer processMessage: queueSize: 1, message = {
   [junit4]   2>   "operation":"leader",
   [junit4]   2>   "shard":"shard2",
   [junit4]   2>   "collection":"collection1",
   [junit4]   2>   "base_url":"http://127.0.0.1:43857/_nmy",
   [junit4]   2>   "core":"collection1",
   [junit4]   2>   "state":"active"} current state version: 4
   [junit4]   2> 1230535 INFO  (zkCallback-1130-thread-1) [    ] o.a.s.c.c.ZkStateReader A cluster state change: [WatchedEvent state:SyncConnected type:NodeDataChanged path:/clusterstate.json], has occurred - updating... (live nodes size: [2])
   [junit4]   2> 1230535 INFO  (zkCallback-1134-thread-1) [    ] o.a.s.c.c.ZkStateReader A cluster state change: [WatchedEvent state:SyncConnected type:NodeDataChanged path:/clusterstate.json], has occurred - updating... (live nodes size: [2])
   [junit4]   2> 1230535 INFO  (zkCallback-1128-thread-2) [    ] o.a.s.c.c.ZkStateReader A cluster state change: [WatchedEvent state:SyncConnected type:NodeDataChanged path:/clusterstate.json], has occurred - updating... (live nodes size: [2])
   [junit4]   2> 1230585 INFO  (coreZkRegister-4038-thread-1) [    ] o.a.s.c.ZkController We are http://127.0.0.1:43857/_nmy/collection1/ and leader is http://127.0.0.1:43857/_nmy/collection1/
   [junit4]   2> 1230585 INFO  (coreZkRegister-4038-thread-1) [    ] o.a.s.c.ZkController No LogReplay needed for core=collection1 baseURL=http://127.0.0.1:43857/_nmy
   [junit4]   2> 1230585 INFO  (coreZkRegister-4038-thread-1) [    ] o.a.s.c.ZkController I am the leader, no recovery necessary
   [junit4]   2> 1230585 INFO  (coreZkRegister-4038-thread-1) [    ] o.a.s.c.ZkController publishing state=active
   [junit4]   2> 1230585 INFO  (coreZkRegister-4038-thread-1) [    ] o.a.s.c.ZkController numShards not found on descriptor - reading it from system property
   [junit4]   2> 1230586 INFO 

[...truncated too long message...]

SolrCloudCollection/leader_elect/shard1/election/95182500800167947-core_node4-n_0000000001
   [junit4]   2> 1344270 WARN  (zkCallback-1205-thread-3) [    ] o.a.s.c.LeaderElector 
   [junit4]   2> org.apache.zookeeper.KeeperException$SessionExpiredException: KeeperErrorCode = Session expired for /collections/testSolrCloudCollection/leader_elect/shard1/election/95182500800167947-core_node4-n_0000000001
   [junit4]   2> 	at org.apache.zookeeper.KeeperException.create(KeeperException.java:127)
   [junit4]   2> 	at org.apache.zookeeper.KeeperException.create(KeeperException.java:51)
   [junit4]   2> 	at org.apache.zookeeper.ZooKeeper.delete(ZooKeeper.java:873)
   [junit4]   2> 	at org.apache.solr.common.cloud.SolrZkClient$2.execute(SolrZkClient.java:244)
   [junit4]   2> 	at org.apache.solr.common.cloud.SolrZkClient$2.execute(SolrZkClient.java:241)
   [junit4]   2> 	at org.apache.solr.common.cloud.ZkCmdExecutor.retryOperation(ZkCmdExecutor.java:61)
   [junit4]   2> 	at org.apache.solr.common.cloud.SolrZkClient.delete(SolrZkClient.java:241)
   [junit4]   2> 	at org.apache.solr.cloud.ElectionContext.cancelElection(ElectionContext.java:87)
   [junit4]   2> 	at org.apache.solr.cloud.ShardLeaderElectionContextBase.cancelElection(ElectionContext.java:167)
   [junit4]   2> 	at org.apache.solr.cloud.ShardLeaderElectionContext.cancelElection(ElectionContext.java:269)
   [junit4]   2> 	at org.apache.solr.cloud.ShardLeaderElectionContext.runLeaderProcess(ElectionContext.java:445)
   [junit4]   2> 	at org.apache.solr.cloud.LeaderElector.runIamLeaderProcess(LeaderElector.java:198)
   [junit4]   2> 	at org.apache.solr.cloud.LeaderElector.checkIfIamLeader(LeaderElector.java:158)
   [junit4]   2> 	at org.apache.solr.cloud.LeaderElector.access$200(LeaderElector.java:59)
   [junit4]   2> 	at org.apache.solr.cloud.LeaderElector$ElectionWatcher.process(LeaderElector.java:389)
   [junit4]   2> 	at org.apache.solr.common.cloud.SolrZkClient$3$1.run(SolrZkClient.java:264)
   [junit4]   2> 	at java.util.concurrent.Executors$RunnableAdapter.call(Executors.java:514)
   [junit4]   2> 	at java.util.concurrent.FutureTask.run(FutureTask.java:266)
   [junit4]   2> 	at org.apache.solr.common.util.ExecutorUtil$MDCAwareThreadPoolExecutor$1.run(ExecutorUtil.java:232)
   [junit4]   2> 	at java.util.concurrent.ThreadPoolExecutor.runWorker(ThreadPoolExecutor.java:1158)
   [junit4]   2> 	at java.util.concurrent.ThreadPoolExecutor$Worker.run(ThreadPoolExecutor.java:632)
   [junit4]   2> 	at java.lang.Thread.run(Thread.java:747)
   [junit4]   2> 1344271 INFO  (jetty-launcher-1187-thread-4) [    ] o.e.j.s.h.ContextHandler Stopped o.e.j.s.ServletContextHandler@4a396d56{/solr,null,UNAVAILABLE}
   [junit4]   2> 1344272 INFO  (TEST-TestMiniSolrCloudClusterBase.testBasics-seed#[E95D58C1DD15BB74]) [    ] o.a.s.c.ZkTestServer connecting to 127.0.0.1:40756 40756
   [junit4]   2> 1344414 INFO  (Thread-3559) [    ] o.a.s.c.ZkTestServer connecting to 127.0.0.1:40756 40756
   [junit4]   2> 1344415 WARN  (Thread-3559) [    ] o.a.s.c.ZkTestServer Watch limit violations: 
   [junit4]   2> Maximum concurrent create/delete watches above limit:
   [junit4]   2> 
   [junit4]   2> 	8	/solr/aliases.json
   [junit4]   2> 	6	/solr/security.json
   [junit4]   2> 	4	/solr/configs/solrCloudCollectionConfig
   [junit4]   2> 
   [junit4]   2> Maximum concurrent data watches above limit:
   [junit4]   2> 
   [junit4]   2> 	8	/solr/clusterstate.json
   [junit4]   2> 	4	/solr/collections/testSolrCloudCollection/state.json
   [junit4]   2> 	2	/solr/overseer_elect/election/95182500800167948-127.0.0.1:43577_solr-n_0000000001
   [junit4]   2> 	2	/solr/overseer_elect/election/95182500800167947-127.0.0.1:60595_solr-n_0000000003
   [junit4]   2> 
   [junit4]   2> Maximum concurrent children watches above limit:
   [junit4]   2> 
   [junit4]   2> 	8	/solr/collections
   [junit4]   2> 	7	/solr/live_nodes
   [junit4]   2> 	2	/solr/overseer/collection-queue-work
   [junit4]   2> 
   [junit4]   2> NOTE: reproduce with: ant test  -Dtestcase=TestMiniSolrCloudClusterBase -Dtests.method=testBasics -Dtests.seed=E95D58C1DD15BB74 -Dtests.multiplier=3 -Dtests.slow=true -Dtests.locale=bg_BG -Dtests.timezone=America/Montserrat -Dtests.asserts=true -Dtests.file.encoding=UTF-8
   [junit4] FAILURE 20.0s J2 | TestMiniSolrCloudClusterBase.testBasics <<<
   [junit4]    > Throwable #1: java.lang.AssertionError: expected:<1> but was:<0>
   [junit4]    > 	at __randomizedtesting.SeedInfo.seed([E95D58C1DD15BB74:D485F6EDE5FBE504]:0)
   [junit4]    > 	at org.apache.solr.cloud.TestMiniSolrCloudClusterBase.testCollectionCreateSearchDelete(TestMiniSolrCloudClusterBase.java:149)
   [junit4]    > 	at org.apache.solr.cloud.TestMiniSolrCloudClusterBase.testBasics(TestMiniSolrCloudClusterBase.java:78)
   [junit4]    > 	at java.lang.Thread.run(Thread.java:747)
   [junit4]   2> NOTE: leaving temporary files on disk at: /home/jenkins/workspace/Lucene-Solr-5.x-Linux/solr/build/solr-core/test/J2/temp/solr.cloud.TestMiniSolrCloudClusterBase_E95D58C1DD15BB74-001
   [junit4]   2> Jan 09, 2016 8:02:02 PM com.carrotsearch.randomizedtesting.ThreadLeakControl checkThreadLeaks
   [junit4]   2> WARNING: Will linger awaiting termination of 1 leaked thread(s).
   [junit4]   2> NOTE: test params are: codec=Asserting(Lucene54): {range_facet_l_dv=PostingsFormat(name=LuceneFixedGap), _version_=PostingsFormat(name=Asserting), multiDefault=TestBloomFilteredLucenePostings(BloomFilteringPostingsFormat(Lucene50(blocksize=128))), intDefault=PostingsFormat(name=Asserting), id=PostingsFormat(name=LuceneFixedGap), range_facet_i_dv=TestBloomFilteredLucenePostings(BloomFilteringPostingsFormat(Lucene50(blocksize=128))), range_facet_l=TestBloomFilteredLucenePostings(BloomFilteringPostingsFormat(Lucene50(blocksize=128))), timestamp=TestBloomFilteredLucenePostings(BloomFilteringPostingsFormat(Lucene50(blocksize=128)))}, docValues:{range_facet_l_dv=DocValuesFormat(name=Asserting), range_facet_i_dv=DocValuesFormat(name=Direct), timestamp=DocValuesFormat(name=Direct)}, sim=RandomSimilarityProvider(queryNorm=true,coord=yes): {}, locale=bg_BG, timezone=America/Montserrat
   [junit4]   2> NOTE: Linux 3.19.0-42-generic amd64/Oracle Corporation 9-ea (64-bit)/cpus=12,threads=1,free=121888600,total=525336576
   [junit4]   2> NOTE: All tests run in this JVM: [TestFileDictionaryLookup, TestCSVResponseWriter, BadComponentTest, PKIAuthenticationIntegrationTest, FullSolrCloudDistribCmdsTest, SolrCoreCheckLockOnStartupTest, HdfsCollectionsAPIDistributedZkTest, TestCharFilters, TestOverriddenPrefixQueryForCustomFieldType, TestCollapseQParserPlugin, TestDownShardTolerantSearch, BinaryUpdateRequestHandlerTest, TestPHPSerializedResponseWriter, TestCoreDiscovery, ShardSplitTest, UnloadDistributedZkTest, ClusterStateTest, TestSolrQueryParserResource, RemoteQueryErrorTest, TestManagedSchema, FieldAnalysisRequestHandlerTest, TestGroupingSearch, SearchHandlerTest, ScriptEngineTest, HdfsDirectoryFactoryTest, AddSchemaFieldsUpdateProcessorFactoryTest, CustomCollectionTest, TestJmxMonitoredMap, DistributedFacetPivotWhiteBoxTest, OverseerTest, ConjunctionSolrSpellCheckerTest, TestCollectionAPI, TestUtils, SliceStateTest, TestRecovery, TestManagedSchemaFieldResource, TestReload, DateRangeFieldTest, TestOrdValues, TestInitParams, CoreAdminHandlerTest, TestSchemaVersionResource, TestConfigReload, PreAnalyzedUpdateProcessorTest, TestFastWriter, TestMaxScoreQueryParser, AsyncCallRequestStatusResponseTest, TestSortingResponseWriter, OverriddenZkACLAndCredentialsProvidersTest, TestSearcherReuse, HdfsRecoveryZkTest, TestFieldTypeCollectionResource, TestSolrJ, TestExpandComponent, RecoveryZkTest, InfoHandlerTest, TestRestoreCore, TestSuggestSpellingConverter, SuggestComponentContextFilterQueryTest, DirectSolrConnectionTest, TestScoreJoinQPNoScore, HighlighterConfigTest, RollingRestartTest, DistributedVersionInfoTest, TestRestManager, DirectUpdateHandlerTest, SolrTestCaseJ4Test, TestMacros, CloudMLTQParserTest, TestDynamicFieldResource, CollectionStateFormat2Test, TestTrieFacet, TestNonDefinedSimilarityFactory, TestAuthenticationFramework, AnalysisErrorHandlingTest, TestDistributedMissingSort, TestRawResponseWriter, TestManagedSynonymFilterFactory, TestRuleBasedAuthorizationPlugin, TestIndexingPerformance, DocValuesMultiTest, TestSolrIndexConfig, RegexBoostProcessorTest, XmlUpdateRequestHandlerTest, TestReRankQParserPlugin, HLLSerializationTest, TestSchemaNameResource, DistributedFacetPivotLongTailTest, TestTestInjection, StressHdfsTest, MigrateRouteKeyTest, LeaderFailoverAfterPartitionTest, SSLMigrationTest, SaslZkACLProviderTest, TestExclusionRuleCollectionAccess, TestMiniSolrCloudClusterBase]
   [junit4] Completed [451/563 (2!)] on J2 in 21.04s, 1 test, 1 failure <<< FAILURES!

[...truncated 355 lines...]
BUILD FAILED
/home/jenkins/workspace/Lucene-Solr-5.x-Linux/build.xml:794: The following error occurred while executing this line:
/home/jenkins/workspace/Lucene-Solr-5.x-Linux/build.xml:738: The following error occurred while executing this line:
/home/jenkins/workspace/Lucene-Solr-5.x-Linux/build.xml:59: The following error occurred while executing this line:
/home/jenkins/workspace/Lucene-Solr-5.x-Linux/solr/build.xml:233: The following error occurred while executing this line:
/home/jenkins/workspace/Lucene-Solr-5.x-Linux/solr/common-build.xml:526: The following error occurred while executing this line:
/home/jenkins/workspace/Lucene-Solr-5.x-Linux/lucene/common-build.xml:1444: The following error occurred while executing this line:
/home/jenkins/workspace/Lucene-Solr-5.x-Linux/lucene/common-build.xml:1000: There were test failures: 563 suites (7 ignored), 2236 tests, 2 failures, 84 ignored (39 assumptions) [seed: E95D58C1DD15BB74]

Total time: 47 minutes 59 seconds
Build step 'Invoke Ant' marked build as failure
Archiving artifacts
[WARNINGS] Skipping publisher since build result is FAILURE
Recording test results
Email was triggered for: Failure - Any
Sending email for trigger: Failure - Any



Mime
View raw message