lucene-dev mailing list archives

Site index · List index
Message view « Date » · « Thread »
Top « Date » · « Thread »
From Policeman Jenkins Server <jenk...@thetaphi.de>
Subject [JENKINS] Lucene-Solr-5.x-Solaris (64bit/jdk1.8.0) - Build # 317 - Failure!
Date Fri, 08 Jan 2016 14:21:00 GMT
Build: http://jenkins.thetaphi.de/job/Lucene-Solr-5.x-Solaris/317/
Java: 64bit/jdk1.8.0 -XX:+UseCompressedOops -XX:+UseSerialGC

2 tests failed.
FAILED:  org.apache.solr.cloud.hdfs.StressHdfsTest.test

Error Message:
Could not load collection from ZK: delete_data_dir

Stack Trace:
org.apache.solr.common.SolrException: Could not load collection from ZK: delete_data_dir
	at __randomizedtesting.SeedInfo.seed([376832A856FD205D:BF3C0D72F8014DA5]:0)
	at org.apache.solr.common.cloud.ZkStateReader.getCollectionLive(ZkStateReader.java:962)
	at org.apache.solr.common.cloud.ZkStateReader$LazyCollectionRef.get(ZkStateReader.java:523)
	at org.apache.solr.common.cloud.ClusterState.getCollectionOrNull(ClusterState.java:190)
	at org.apache.solr.common.cloud.ClusterState.hasCollection(ClusterState.java:120)
	at org.apache.solr.client.solrj.impl.CloudSolrClient.getCollectionNames(CloudSolrClient.java:1111)
	at org.apache.solr.client.solrj.impl.CloudSolrClient.requestWithRetryOnStaleState(CloudSolrClient.java:834)
	at org.apache.solr.client.solrj.impl.CloudSolrClient.request(CloudSolrClient.java:807)
	at org.apache.solr.client.solrj.SolrRequest.process(SolrRequest.java:150)
	at org.apache.solr.client.solrj.SolrClient.deleteByQuery(SolrClient.java:896)
	at org.apache.solr.client.solrj.SolrClient.deleteByQuery(SolrClient.java:859)
	at org.apache.solr.client.solrj.SolrClient.deleteByQuery(SolrClient.java:874)
	at org.apache.solr.cloud.hdfs.StressHdfsTest.createAndDeleteCollection(StressHdfsTest.java:191)
	at org.apache.solr.cloud.hdfs.StressHdfsTest.test(StressHdfsTest.java:100)
	at sun.reflect.NativeMethodAccessorImpl.invoke0(Native Method)
	at sun.reflect.NativeMethodAccessorImpl.invoke(NativeMethodAccessorImpl.java:62)
	at sun.reflect.DelegatingMethodAccessorImpl.invoke(DelegatingMethodAccessorImpl.java:43)
	at java.lang.reflect.Method.invoke(Method.java:497)
	at com.carrotsearch.randomizedtesting.RandomizedRunner.invoke(RandomizedRunner.java:1764)
	at com.carrotsearch.randomizedtesting.RandomizedRunner$8.evaluate(RandomizedRunner.java:871)
	at com.carrotsearch.randomizedtesting.RandomizedRunner$9.evaluate(RandomizedRunner.java:907)
	at com.carrotsearch.randomizedtesting.RandomizedRunner$10.evaluate(RandomizedRunner.java:921)
	at org.apache.solr.BaseDistributedSearchTestCase$ShardsRepeatRule$ShardsFixedStatement.callStatement(BaseDistributedSearchTestCase.java:965)
	at org.apache.solr.BaseDistributedSearchTestCase$ShardsRepeatRule$ShardsStatement.evaluate(BaseDistributedSearchTestCase.java:940)
	at com.carrotsearch.randomizedtesting.rules.SystemPropertiesRestoreRule$1.evaluate(SystemPropertiesRestoreRule.java:57)
	at org.apache.lucene.util.TestRuleSetupTeardownChained$1.evaluate(TestRuleSetupTeardownChained.java:50)
	at org.apache.lucene.util.AbstractBeforeAfterRule$1.evaluate(AbstractBeforeAfterRule.java:46)
	at org.apache.lucene.util.TestRuleThreadAndTestName$1.evaluate(TestRuleThreadAndTestName.java:49)
	at org.apache.lucene.util.TestRuleIgnoreAfterMaxFailures$1.evaluate(TestRuleIgnoreAfterMaxFailures.java:65)
	at org.apache.lucene.util.TestRuleMarkFailure$1.evaluate(TestRuleMarkFailure.java:48)
	at com.carrotsearch.randomizedtesting.rules.StatementAdapter.evaluate(StatementAdapter.java:36)
	at com.carrotsearch.randomizedtesting.ThreadLeakControl$StatementRunner.run(ThreadLeakControl.java:367)
	at com.carrotsearch.randomizedtesting.ThreadLeakControl.forkTimeoutingTask(ThreadLeakControl.java:809)
	at com.carrotsearch.randomizedtesting.ThreadLeakControl$3.evaluate(ThreadLeakControl.java:460)
	at com.carrotsearch.randomizedtesting.RandomizedRunner.runSingleTest(RandomizedRunner.java:880)
	at com.carrotsearch.randomizedtesting.RandomizedRunner$5.evaluate(RandomizedRunner.java:781)
	at com.carrotsearch.randomizedtesting.RandomizedRunner$6.evaluate(RandomizedRunner.java:816)
	at com.carrotsearch.randomizedtesting.RandomizedRunner$7.evaluate(RandomizedRunner.java:827)
	at com.carrotsearch.randomizedtesting.rules.StatementAdapter.evaluate(StatementAdapter.java:36)
	at com.carrotsearch.randomizedtesting.rules.SystemPropertiesRestoreRule$1.evaluate(SystemPropertiesRestoreRule.java:57)
	at org.apache.lucene.util.AbstractBeforeAfterRule$1.evaluate(AbstractBeforeAfterRule.java:46)
	at com.carrotsearch.randomizedtesting.rules.StatementAdapter.evaluate(StatementAdapter.java:36)
	at org.apache.lucene.util.TestRuleStoreClassName$1.evaluate(TestRuleStoreClassName.java:42)
	at com.carrotsearch.randomizedtesting.rules.NoShadowingOrOverridesOnMethodsRule$1.evaluate(NoShadowingOrOverridesOnMethodsRule.java:40)
	at com.carrotsearch.randomizedtesting.rules.NoShadowingOrOverridesOnMethodsRule$1.evaluate(NoShadowingOrOverridesOnMethodsRule.java:40)
	at com.carrotsearch.randomizedtesting.rules.StatementAdapter.evaluate(StatementAdapter.java:36)
	at com.carrotsearch.randomizedtesting.rules.StatementAdapter.evaluate(StatementAdapter.java:36)
	at com.carrotsearch.randomizedtesting.rules.StatementAdapter.evaluate(StatementAdapter.java:36)
	at org.apache.lucene.util.TestRuleAssertionsRequired$1.evaluate(TestRuleAssertionsRequired.java:54)
	at org.apache.lucene.util.TestRuleMarkFailure$1.evaluate(TestRuleMarkFailure.java:48)
	at org.apache.lucene.util.TestRuleIgnoreAfterMaxFailures$1.evaluate(TestRuleIgnoreAfterMaxFailures.java:65)
	at org.apache.lucene.util.TestRuleIgnoreTestSuites$1.evaluate(TestRuleIgnoreTestSuites.java:55)
	at com.carrotsearch.randomizedtesting.rules.StatementAdapter.evaluate(StatementAdapter.java:36)
	at com.carrotsearch.randomizedtesting.ThreadLeakControl$StatementRunner.run(ThreadLeakControl.java:367)
	at java.lang.Thread.run(Thread.java:745)
Caused by: org.apache.zookeeper.KeeperException$SessionExpiredException: KeeperErrorCode = Session expired for /collections/delete_data_dir/state.json
	at org.apache.zookeeper.KeeperException.create(KeeperException.java:127)
	at org.apache.zookeeper.KeeperException.create(KeeperException.java:51)
	at org.apache.zookeeper.ZooKeeper.getData(ZooKeeper.java:1155)
	at org.apache.solr.common.cloud.SolrZkClient$7.execute(SolrZkClient.java:345)
	at org.apache.solr.common.cloud.SolrZkClient$7.execute(SolrZkClient.java:342)
	at org.apache.solr.common.cloud.ZkCmdExecutor.retryOperation(ZkCmdExecutor.java:61)
	at org.apache.solr.common.cloud.SolrZkClient.getData(SolrZkClient.java:342)
	at org.apache.solr.common.cloud.ZkStateReader.fetchCollectionState(ZkStateReader.java:973)
	at org.apache.solr.common.cloud.ZkStateReader.getCollectionLive(ZkStateReader.java:960)
	... 53 more


FAILED:  org.apache.solr.core.TestArbitraryIndexDir.testLoadNewIndexDir

Error Message:
Exception during query

Stack Trace:
java.lang.RuntimeException: Exception during query
	at __randomizedtesting.SeedInfo.seed([376832A856FD205D:DE328990C864B0F5]:0)
	at org.apache.solr.SolrTestCaseJ4.assertQ(SolrTestCaseJ4.java:753)
	at org.apache.solr.core.TestArbitraryIndexDir.testLoadNewIndexDir(TestArbitraryIndexDir.java:107)
	at sun.reflect.NativeMethodAccessorImpl.invoke0(Native Method)
	at sun.reflect.NativeMethodAccessorImpl.invoke(NativeMethodAccessorImpl.java:62)
	at sun.reflect.DelegatingMethodAccessorImpl.invoke(DelegatingMethodAccessorImpl.java:43)
	at java.lang.reflect.Method.invoke(Method.java:497)
	at com.carrotsearch.randomizedtesting.RandomizedRunner.invoke(RandomizedRunner.java:1764)
	at com.carrotsearch.randomizedtesting.RandomizedRunner$8.evaluate(RandomizedRunner.java:871)
	at com.carrotsearch.randomizedtesting.RandomizedRunner$9.evaluate(RandomizedRunner.java:907)
	at com.carrotsearch.randomizedtesting.RandomizedRunner$10.evaluate(RandomizedRunner.java:921)
	at com.carrotsearch.randomizedtesting.rules.SystemPropertiesRestoreRule$1.evaluate(SystemPropertiesRestoreRule.java:57)
	at com.carrotsearch.randomizedtesting.rules.SystemPropertiesRestoreRule$1.evaluate(SystemPropertiesRestoreRule.java:57)
	at org.apache.lucene.util.TestRuleSetupTeardownChained$1.evaluate(TestRuleSetupTeardownChained.java:50)
	at org.apache.lucene.util.AbstractBeforeAfterRule$1.evaluate(AbstractBeforeAfterRule.java:46)
	at org.apache.lucene.util.TestRuleThreadAndTestName$1.evaluate(TestRuleThreadAndTestName.java:49)
	at org.apache.lucene.util.TestRuleIgnoreAfterMaxFailures$1.evaluate(TestRuleIgnoreAfterMaxFailures.java:65)
	at org.apache.lucene.util.TestRuleMarkFailure$1.evaluate(TestRuleMarkFailure.java:48)
	at com.carrotsearch.randomizedtesting.rules.StatementAdapter.evaluate(StatementAdapter.java:36)
	at com.carrotsearch.randomizedtesting.ThreadLeakControl$StatementRunner.run(ThreadLeakControl.java:367)
	at com.carrotsearch.randomizedtesting.ThreadLeakControl.forkTimeoutingTask(ThreadLeakControl.java:809)
	at com.carrotsearch.randomizedtesting.ThreadLeakControl$3.evaluate(ThreadLeakControl.java:460)
	at com.carrotsearch.randomizedtesting.RandomizedRunner.runSingleTest(RandomizedRunner.java:880)
	at com.carrotsearch.randomizedtesting.RandomizedRunner$5.evaluate(RandomizedRunner.java:781)
	at com.carrotsearch.randomizedtesting.RandomizedRunner$6.evaluate(RandomizedRunner.java:816)
	at com.carrotsearch.randomizedtesting.RandomizedRunner$7.evaluate(RandomizedRunner.java:827)
	at com.carrotsearch.randomizedtesting.rules.StatementAdapter.evaluate(StatementAdapter.java:36)
	at com.carrotsearch.randomizedtesting.rules.SystemPropertiesRestoreRule$1.evaluate(SystemPropertiesRestoreRule.java:57)
	at org.apache.lucene.util.AbstractBeforeAfterRule$1.evaluate(AbstractBeforeAfterRule.java:46)
	at com.carrotsearch.randomizedtesting.rules.StatementAdapter.evaluate(StatementAdapter.java:36)
	at org.apache.lucene.util.TestRuleStoreClassName$1.evaluate(TestRuleStoreClassName.java:42)
	at com.carrotsearch.randomizedtesting.rules.NoShadowingOrOverridesOnMethodsRule$1.evaluate(NoShadowingOrOverridesOnMethodsRule.java:40)
	at com.carrotsearch.randomizedtesting.rules.NoShadowingOrOverridesOnMethodsRule$1.evaluate(NoShadowingOrOverridesOnMethodsRule.java:40)
	at com.carrotsearch.randomizedtesting.rules.StatementAdapter.evaluate(StatementAdapter.java:36)
	at com.carrotsearch.randomizedtesting.rules.StatementAdapter.evaluate(StatementAdapter.java:36)
	at com.carrotsearch.randomizedtesting.rules.StatementAdapter.evaluate(StatementAdapter.java:36)
	at org.apache.lucene.util.TestRuleAssertionsRequired$1.evaluate(TestRuleAssertionsRequired.java:54)
	at org.apache.lucene.util.TestRuleMarkFailure$1.evaluate(TestRuleMarkFailure.java:48)
	at org.apache.lucene.util.TestRuleIgnoreAfterMaxFailures$1.evaluate(TestRuleIgnoreAfterMaxFailures.java:65)
	at org.apache.lucene.util.TestRuleIgnoreTestSuites$1.evaluate(TestRuleIgnoreTestSuites.java:55)
	at com.carrotsearch.randomizedtesting.rules.StatementAdapter.evaluate(StatementAdapter.java:36)
	at com.carrotsearch.randomizedtesting.ThreadLeakControl$StatementRunner.run(ThreadLeakControl.java:367)
	at java.lang.Thread.run(Thread.java:745)
Caused by: java.lang.RuntimeException: REQUEST FAILED: xpath=*[count(//doc)=1]
	xml response was: <?xml version="1.0" encoding="UTF-8"?>
<response>
<lst name="responseHeader"><int name="status">0</int><int name="QTime">0</int></lst><result name="response" numFound="0" start="0"></result>
</response>

	request was:q=id:2&qt=standard&start=0&rows=20&version=2.2
	at org.apache.solr.SolrTestCaseJ4.assertQ(SolrTestCaseJ4.java:746)
	... 41 more




Build Log:
[...truncated 10829 lines...]
   [junit4] Suite: org.apache.solr.core.TestArbitraryIndexDir
   [junit4]   2> Creating dataDir: /export/home/jenkins/workspace/Lucene-Solr-5.x-Solaris/solr/build/solr-core/test/J0/temp/solr.core.TestArbitraryIndexDir_376832A856FD205D-001/init-core-data-001
   [junit4]   2> 1824121 INFO  (SUITE-TestArbitraryIndexDir-seed#[376832A856FD205D]-worker) [    ] o.a.s.SolrTestCaseJ4 Randomized ssl (false) and clientAuth (false)
   [junit4]   2> 1824124 INFO  (TEST-TestArbitraryIndexDir.testLoadNewIndexDir-seed#[376832A856FD205D]) [    ] o.a.s.SolrTestCaseJ4 ###Starting testLoadNewIndexDir
   [junit4]   2> 1824124 INFO  (TEST-TestArbitraryIndexDir.testLoadNewIndexDir-seed#[376832A856FD205D]) [    ] o.a.s.SolrTestCaseJ4 ####initCore
   [junit4]   2> 1824124 INFO  (TEST-TestArbitraryIndexDir.testLoadNewIndexDir-seed#[376832A856FD205D]) [    ] o.a.s.c.SolrResourceLoader new SolrResourceLoader for directory: '/export/home/jenkins/workspace/Lucene-Solr-5.x-Solaris/solr/core/src/test-files/solr/collection1'
   [junit4]   2> 1824124 INFO  (TEST-TestArbitraryIndexDir.testLoadNewIndexDir-seed#[376832A856FD205D]) [    ] o.a.s.c.SolrResourceLoader JNDI not configured for solr (NoInitialContextEx)
   [junit4]   2> 1824125 INFO  (TEST-TestArbitraryIndexDir.testLoadNewIndexDir-seed#[376832A856FD205D]) [    ] o.a.s.c.SolrResourceLoader using system property solr.solr.home: /export/home/jenkins/workspace/Lucene-Solr-5.x-Solaris/solr/core/src/test-files/solr
   [junit4]   2> 1824125 INFO  (TEST-TestArbitraryIndexDir.testLoadNewIndexDir-seed#[376832A856FD205D]) [    ] o.a.s.c.SolrResourceLoader Adding 'file:/export/home/jenkins/workspace/Lucene-Solr-5.x-Solaris/solr/core/src/test-files/solr/collection1/lib/classes/' to classloader
   [junit4]   2> 1824125 INFO  (TEST-TestArbitraryIndexDir.testLoadNewIndexDir-seed#[376832A856FD205D]) [    ] o.a.s.c.SolrResourceLoader Adding 'file:/export/home/jenkins/workspace/Lucene-Solr-5.x-Solaris/solr/core/src/test-files/solr/collection1/lib/README' to classloader
   [junit4]   2> 1824150 INFO  (TEST-TestArbitraryIndexDir.testLoadNewIndexDir-seed#[376832A856FD205D]) [    ] o.a.s.c.SolrConfig current version of requestparams : -1
   [junit4]   2> 1824155 INFO  (TEST-TestArbitraryIndexDir.testLoadNewIndexDir-seed#[376832A856FD205D]) [    ] o.a.s.c.SolrConfig Using Lucene MatchVersion: 5.5.0
   [junit4]   2> 1824182 INFO  (TEST-TestArbitraryIndexDir.testLoadNewIndexDir-seed#[376832A856FD205D]) [    ] o.a.s.c.SolrConfig Loaded SolrConfig: solrconfig.xml
   [junit4]   2> 1824185 INFO  (TEST-TestArbitraryIndexDir.testLoadNewIndexDir-seed#[376832A856FD205D]) [    ] o.a.s.s.IndexSchema [null] Schema name=test
   [junit4]   2> 1824232 INFO  (TEST-TestArbitraryIndexDir.testLoadNewIndexDir-seed#[376832A856FD205D]) [    ] o.a.s.s.IndexSchema default search field in schema is text
   [junit4]   2> 1824233 INFO  (TEST-TestArbitraryIndexDir.testLoadNewIndexDir-seed#[376832A856FD205D]) [    ] o.a.s.s.IndexSchema unique key field: id
   [junit4]   2> 1824233 WARN  (TEST-TestArbitraryIndexDir.testLoadNewIndexDir-seed#[376832A856FD205D]) [    ] o.a.s.s.IndexSchema Field text is not multivalued and destination for multiple copyFields (2)
   [junit4]   2> 1824237 INFO  (TEST-TestArbitraryIndexDir.testLoadNewIndexDir-seed#[376832A856FD205D]) [    ] o.a.s.s.FileExchangeRateProvider Reloading exchange rates from file currency.xml
   [junit4]   2> 1824239 INFO  (TEST-TestArbitraryIndexDir.testLoadNewIndexDir-seed#[376832A856FD205D]) [    ] o.a.s.s.FileExchangeRateProvider Reloading exchange rates from file currency.xml
   [junit4]   2> 1824242 INFO  (TEST-TestArbitraryIndexDir.testLoadNewIndexDir-seed#[376832A856FD205D]) [    ] o.a.s.c.SolrResourceLoader JNDI not configured for solr (NoInitialContextEx)
   [junit4]   2> 1824242 INFO  (TEST-TestArbitraryIndexDir.testLoadNewIndexDir-seed#[376832A856FD205D]) [    ] o.a.s.c.SolrResourceLoader using system property solr.solr.home: /export/home/jenkins/workspace/Lucene-Solr-5.x-Solaris/solr/core/src/test-files/solr
   [junit4]   2> 1824242 INFO  (TEST-TestArbitraryIndexDir.testLoadNewIndexDir-seed#[376832A856FD205D]) [    ] o.a.s.c.SolrResourceLoader new SolrResourceLoader for directory: '/export/home/jenkins/workspace/Lucene-Solr-5.x-Solaris/solr/core/src/test-files/solr'
   [junit4]   2> 1824242 INFO  (TEST-TestArbitraryIndexDir.testLoadNewIndexDir-seed#[376832A856FD205D]) [    ] o.a.s.c.SolrResourceLoader JNDI not configured for solr (NoInitialContextEx)
   [junit4]   2> 1824242 INFO  (TEST-TestArbitraryIndexDir.testLoadNewIndexDir-seed#[376832A856FD205D]) [    ] o.a.s.c.SolrResourceLoader using system property solr.solr.home: /export/home/jenkins/workspace/Lucene-Solr-5.x-Solaris/solr/core/src/test-files/solr
   [junit4]   2> 1824242 INFO  (TEST-TestArbitraryIndexDir.testLoadNewIndexDir-seed#[376832A856FD205D]) [    ] o.a.s.c.CoreContainer New CoreContainer 85339686
   [junit4]   2> 1824242 INFO  (TEST-TestArbitraryIndexDir.testLoadNewIndexDir-seed#[376832A856FD205D]) [    ] o.a.s.c.CoreContainer Loading cores into CoreContainer [instanceDir=/export/home/jenkins/workspace/Lucene-Solr-5.x-Solaris/solr/core/src/test-files/solr]
   [junit4]   2> 1824242 WARN  (TEST-TestArbitraryIndexDir.testLoadNewIndexDir-seed#[376832A856FD205D]) [    ] o.a.s.c.CoreContainer Couldn't add files from /export/home/jenkins/workspace/Lucene-Solr-5.x-Solaris/solr/core/src/test-files/solr/lib to classpath: /export/home/jenkins/workspace/Lucene-Solr-5.x-Solaris/solr/core/src/test-files/solr/lib
   [junit4]   2> 1824243 INFO  (TEST-TestArbitraryIndexDir.testLoadNewIndexDir-seed#[376832A856FD205D]) [    ] o.a.s.h.c.HttpShardHandlerFactory created with socketTimeout : 600000,connTimeout : 60000,maxConnectionsPerHost : 20,maxConnections : 10000,corePoolSize : 0,maximumPoolSize : 2147483647,maxThreadIdleTime : 5,sizeOfQueue : -1,fairnessPolicy : false,useRetries : false,
   [junit4]   2> 1824244 INFO  (TEST-TestArbitraryIndexDir.testLoadNewIndexDir-seed#[376832A856FD205D]) [    ] o.a.s.u.UpdateShardHandler Creating UpdateShardHandler HTTP client with params: socketTimeout=30000&connTimeout=30000&retry=true
   [junit4]   2> 1824244 INFO  (TEST-TestArbitraryIndexDir.testLoadNewIndexDir-seed#[376832A856FD205D]) [    ] o.a.s.l.LogWatcher SLF4J impl is org.slf4j.impl.Log4jLoggerFactory
   [junit4]   2> 1824245 INFO  (TEST-TestArbitraryIndexDir.testLoadNewIndexDir-seed#[376832A856FD205D]) [    ] o.a.s.l.LogWatcher Registering Log Listener [Log4j (org.slf4j.impl.Log4jLoggerFactory)]
   [junit4]   2> 1824245 INFO  (TEST-TestArbitraryIndexDir.testLoadNewIndexDir-seed#[376832A856FD205D]) [    ] o.a.s.c.CoreContainer Security conf doesn't exist. Skipping setup for authorization module.
   [junit4]   2> 1824245 INFO  (TEST-TestArbitraryIndexDir.testLoadNewIndexDir-seed#[376832A856FD205D]) [    ] o.a.s.c.CoreContainer No authentication plugin used.
   [junit4]   2> 1824246 INFO  (TEST-TestArbitraryIndexDir.testLoadNewIndexDir-seed#[376832A856FD205D]) [    ] o.a.s.c.CoreDescriptor Created CoreDescriptor: {name=collection1, config=solrconfig.xml, transient=false, schema=schema12.xml, loadOnStartup=true, configSetProperties=configsetprops.json, collection=collection1, dataDir=/export/home/jenkins/workspace/Lucene-Solr-5.x-Solaris/solr/build/solr-core/test/J0/temp/solr.core.TestArbitraryIndexDir_376832A856FD205D-001/init-core-data-001, shard=shard1}
   [junit4]   2> 1824246 INFO  (coreLoadExecutor-6046-thread-1) [    ] o.a.s.c.SolrResourceLoader new SolrResourceLoader for directory: '/export/home/jenkins/workspace/Lucene-Solr-5.x-Solaris/solr/core/src/test-files/solr/collection1'
   [junit4]   2> 1824246 INFO  (coreLoadExecutor-6046-thread-1) [    ] o.a.s.c.SolrResourceLoader JNDI not configured for solr (NoInitialContextEx)
   [junit4]   2> 1824246 INFO  (coreLoadExecutor-6046-thread-1) [    ] o.a.s.c.SolrResourceLoader using system property solr.solr.home: /export/home/jenkins/workspace/Lucene-Solr-5.x-Solaris/solr/core/src/test-files/solr
   [junit4]   2> 1824246 INFO  (coreLoadExecutor-6046-thread-1) [    ] o.a.s.c.SolrResourceLoader Adding 'file:/export/home/jenkins/workspace/Lucene-Solr-5.x-Solaris/solr/core/src/test-files/solr/collection1/lib/classes/' to classloader
   [junit4]   2> 1824246 INFO  (coreLoadExecutor-6046-thread-1) [    ] o.a.s.c.SolrResourceLoader Adding 'file:/export/home/jenkins/workspace/Lucene-Solr-5.x-Solaris/solr/core/src/test-files/solr/collection1/lib/README' to classloader
   [junit4]   2> 1824269 INFO  (coreLoadExecutor-6046-thread-1) [    ] o.a.s.c.SolrConfig current version of requestparams : -1
   [junit4]   2> 1824275 INFO  (coreLoadExecutor-6046-thread-1) [    ] o.a.s.c.SolrConfig Using Lucene MatchVersion: 5.5.0
   [junit4]   2> 1824299 INFO  (coreLoadExecutor-6046-thread-1) [    ] o.a.s.c.SolrConfig Loaded SolrConfig: solrconfig.xml
   [junit4]   2> 1824305 INFO  (coreLoadExecutor-6046-thread-1) [    ] o.a.s.s.IndexSchema [collection1] Schema name=test
   [junit4]   2> 1824353 INFO  (coreLoadExecutor-6046-thread-1) [    ] o.a.s.s.IndexSchema default search field in schema is text
   [junit4]   2> 1824353 INFO  (coreLoadExecutor-6046-thread-1) [    ] o.a.s.s.IndexSchema unique key field: id
   [junit4]   2> 1824354 WARN  (coreLoadExecutor-6046-thread-1) [    ] o.a.s.s.IndexSchema Field text is not multivalued and destination for multiple copyFields (2)
   [junit4]   2> 1824358 INFO  (coreLoadExecutor-6046-thread-1) [    ] o.a.s.s.FileExchangeRateProvider Reloading exchange rates from file currency.xml
   [junit4]   2> 1824359 INFO  (coreLoadExecutor-6046-thread-1) [    ] o.a.s.s.FileExchangeRateProvider Reloading exchange rates from file currency.xml
   [junit4]   2> 1824362 INFO  (coreLoadExecutor-6046-thread-1) [    ] o.a.s.c.ConfigSetProperties Did not find ConfigSet properties, assuming default properties: Can't find resource 'configsetprops.json' in classpath or '/export/home/jenkins/workspace/Lucene-Solr-5.x-Solaris/solr/core/src/test-files/solr/collection1'
   [junit4]   2> 1824362 INFO  (coreLoadExecutor-6046-thread-1) [    ] o.a.s.c.CoreContainer Creating SolrCore 'collection1' using configuration from instancedir /export/home/jenkins/workspace/Lucene-Solr-5.x-Solaris/solr/core/src/test-files/solr/collection1
   [junit4]   2> 1824362 INFO  (coreLoadExecutor-6046-thread-1) [    x:collection1] o.a.s.c.SolrCore org.apache.solr.core.MockFSDirectoryFactory
   [junit4]   2> 1824362 INFO  (coreLoadExecutor-6046-thread-1) [    x:collection1] o.a.s.c.SolrCore [[collection1] ] Opening new SolrCore at [/export/home/jenkins/workspace/Lucene-Solr-5.x-Solaris/solr/core/src/test-files/solr/collection1], dataDir=[/export/home/jenkins/workspace/Lucene-Solr-5.x-Solaris/solr/build/solr-core/test/J0/temp/solr.core.TestArbitraryIndexDir_376832A856FD205D-001/init-core-data-001/]
   [junit4]   2> 1824362 INFO  (coreLoadExecutor-6046-thread-1) [    x:collection1] o.a.s.c.JmxMonitoredMap JMX monitoring is enabled. Adding Solr mbeans to JMX Server: com.sun.jmx.mbeanserver.JmxMBeanServer@72967a4b
   [junit4]   2> 1824363 INFO  (coreLoadExecutor-6046-thread-1) [    x:collection1] o.a.s.c.CachingDirectoryFactory return new directory for /export/home/jenkins/workspace/Lucene-Solr-5.x-Solaris/solr/build/solr-core/test/J0/temp/solr.core.TestArbitraryIndexDir_376832A856FD205D-001/init-core-data-001
   [junit4]   2> 1824363 INFO  (coreLoadExecutor-6046-thread-1) [    x:collection1] o.a.s.c.SolrCore New index directory detected: old=null new=/export/home/jenkins/workspace/Lucene-Solr-5.x-Solaris/solr/build/solr-core/test/J0/temp/solr.core.TestArbitraryIndexDir_376832A856FD205D-001/init-core-data-001/index/
   [junit4]   2> 1824363 WARN  (coreLoadExecutor-6046-thread-1) [    x:collection1] o.a.s.c.SolrCore [collection1] Solr index directory '/export/home/jenkins/workspace/Lucene-Solr-5.x-Solaris/solr/build/solr-core/test/J0/temp/solr.core.TestArbitraryIndexDir_376832A856FD205D-001/init-core-data-001/index' doesn't exist. Creating new index...
   [junit4]   2> 1824364 INFO  (coreLoadExecutor-6046-thread-1) [    x:collection1] o.a.s.c.CachingDirectoryFactory return new directory for /export/home/jenkins/workspace/Lucene-Solr-5.x-Solaris/solr/build/solr-core/test/J0/temp/solr.core.TestArbitraryIndexDir_376832A856FD205D-001/init-core-data-001/index
   [junit4]   2> 1824364 INFO  (coreLoadExecutor-6046-thread-1) [    x:collection1] o.a.s.u.RandomMergePolicy RandomMergePolicy wrapping class org.apache.lucene.index.TieredMergePolicy: [TieredMergePolicy: maxMergeAtOnce=23, maxMergeAtOnceExplicit=46, maxMergedSegmentMB=25.8203125, floorSegmentMB=0.876953125, forceMergeDeletesPctAllowed=21.224812778961233, segmentsPerTier=39.0, maxCFSSegmentSizeMB=8.796093022207999E12, noCFSRatio=0.6173991199469726
   [junit4]   2> 1824375 INFO  (coreLoadExecutor-6046-thread-1) [    x:collection1] o.a.s.c.SolrDeletionPolicy SolrDeletionPolicy.onCommit: commits: num=1
   [junit4]   2> 	commit{dir=MockDirectoryWrapper(MMapDirectory@/export/home/jenkins/workspace/Lucene-Solr-5.x-Solaris/solr/build/solr-core/test/J0/temp/solr.core.TestArbitraryIndexDir_376832A856FD205D-001/init-core-data-001/index lockFactory=org.apache.lucene.store.SingleInstanceLockFactory@4ce5d37f),segFN=segments_1,generation=1}
   [junit4]   2> 1824375 INFO  (coreLoadExecutor-6046-thread-1) [    x:collection1] o.a.s.c.SolrDeletionPolicy newest commit generation = 1
   [junit4]   2> 1824376 INFO  (OldIndexDirectoryCleanupThreadForCore-collection1) [    x:collection1] o.a.s.c.SolrCore Looking for old index directories to cleanup for core collection1 in /export/home/jenkins/workspace/Lucene-Solr-5.x-Solaris/solr/build/solr-core/test/J0/temp/solr.core.TestArbitraryIndexDir_376832A856FD205D-001/init-core-data-001/
   [junit4]   2> 1824379 INFO  (coreLoadExecutor-6046-thread-1) [    x:collection1] o.a.s.u.p.UpdateRequestProcessorChain creating updateRequestProcessorChain "dedupe"
   [junit4]   2> 1824379 INFO  (coreLoadExecutor-6046-thread-1) [    x:collection1] o.a.s.u.p.UpdateRequestProcessorChain inserting DistributedUpdateProcessorFactory into updateRequestProcessorChain "dedupe"
   [junit4]   2> 1824379 INFO  (coreLoadExecutor-6046-thread-1) [    x:collection1] o.a.s.u.p.UpdateRequestProcessorChain creating updateRequestProcessorChain "dedupe-allfields"
   [junit4]   2> 1824380 INFO  (coreLoadExecutor-6046-thread-1) [    x:collection1] o.a.s.u.p.UpdateRequestProcessorChain inserting DistributedUpdateProcessorFactory into updateRequestProcessorChain "dedupe-allfields"
   [junit4]   2> 1824380 INFO  (coreLoadExecutor-6046-thread-1) [    x:collection1] o.a.s.u.p.UpdateRequestProcessorChain creating updateRequestProcessorChain "stored_sig"
   [junit4]   2> 1824380 INFO  (coreLoadExecutor-6046-thread-1) [    x:collection1] o.a.s.u.p.UpdateRequestProcessorChain inserting DistributedUpdateProcessorFactory into updateRequestProcessorChain "stored_sig"
   [junit4]   2> 1824380 INFO  (coreLoadExecutor-6046-thread-1) [    x:collection1] o.a.s.u.p.UpdateRequestProcessorChain creating updateRequestProcessorChain "uniq-fields"
   [junit4]   2> 1824380 INFO  (coreLoadExecutor-6046-thread-1) [    x:collection1] o.a.s.u.p.UpdateRequestProcessorChain inserting DistributedUpdateProcessorFactory into updateRequestProcessorChain "uniq-fields"
   [junit4]   2> 1824380 INFO  (coreLoadExecutor-6046-thread-1) [    x:collection1] o.a.s.u.p.UpdateRequestProcessorChain creating updateRequestProcessorChain "distrib-dup-test-chain-explicit"
   [junit4]   2> 1824381 INFO  (coreLoadExecutor-6046-thread-1) [    x:collection1] o.a.s.u.p.UpdateRequestProcessorChain creating updateRequestProcessorChain "distrib-dup-test-chain-implicit"
   [junit4]   2> 1824384 INFO  (coreLoadExecutor-6046-thread-1) [    x:collection1] o.a.s.u.p.UpdateRequestProcessorChain inserting DistributedUpdateProcessorFactory into updateRequestProcessorChain "distrib-dup-test-chain-implicit"
   [junit4]   2> 1824385 INFO  (coreLoadExecutor-6046-thread-1) [    x:collection1] o.a.s.c.SolrCore no updateRequestProcessorChain defined as default, creating implicit default
   [junit4]   2> 1824388 INFO  (coreLoadExecutor-6046-thread-1) [    x:collection1] o.a.s.h.l.XMLLoader xsltCacheLifetimeSeconds=60
   [junit4]   2> 1824389 INFO  (coreLoadExecutor-6046-thread-1) [    x:collection1] o.a.s.h.l.XMLLoader xsltCacheLifetimeSeconds=60
   [junit4]   2> 1824390 INFO  (coreLoadExecutor-6046-thread-1) [    x:collection1] o.a.s.h.l.XMLLoader xsltCacheLifetimeSeconds=60
   [junit4]   2> 1824391 INFO  (coreLoadExecutor-6046-thread-1) [    x:collection1] o.a.s.h.l.XMLLoader xsltCacheLifetimeSeconds=60
   [junit4]   2> 1824404 INFO  (coreLoadExecutor-6046-thread-1) [    x:collection1] o.a.s.c.PluginBag requestHandler : 'lazy' created with startup=lazy 
   [junit4]   2> 1824405 INFO  (coreLoadExecutor-6046-thread-1) [    x:collection1] o.a.s.c.RequestHandlers Registered paths: /admin/mbeans,standard,spellCheckCompRH,lazy,/update/json/docs,/admin/luke,spellCheckWithWordbreak_Direct,tvrh,/get,/admin/properties,/update/json,mltrh,/admin/threads,/search-facet-def,/update/csv,/search-facet-invariants,/admin/segments,spellCheckCompRH1,/mlt,/admin/system,/replication,dismax,defaults,/config,/schema,/admin/plugins,/admin/logging,spellCheckWithWordbreak,mock,/admin/ping,/update,/admin/file,/terms,spellCheckCompRH_Direct,/debug/dump
   [junit4]   2> 1824405 WARN  (coreLoadExecutor-6046-thread-1) [    x:collection1] o.a.s.c.SolrCore solrconfig.xml uses deprecated <admin/gettableFiles>, Please update your config to use the ShowFileRequestHandler.
   [junit4]   2> 1824406 INFO  (coreLoadExecutor-6046-thread-1) [    x:collection1] o.a.s.c.SolrCore Using default statsCache cache: org.apache.solr.search.stats.LocalStatsCache
   [junit4]   2> 1824406 INFO  (coreLoadExecutor-6046-thread-1) [    x:collection1] o.a.s.u.CommitTracker Hard AutoCommit: disabled
   [junit4]   2> 1824406 INFO  (coreLoadExecutor-6046-thread-1) [    x:collection1] o.a.s.u.CommitTracker Soft AutoCommit: disabled
   [junit4]   2> 1824406 INFO  (coreLoadExecutor-6046-thread-1) [    x:collection1] o.a.s.u.RandomMergePolicy RandomMergePolicy wrapping class org.apache.lucene.index.LogDocMergePolicy: [LogDocMergePolicy: minMergeSize=1000, mergeFactor=27, maxMergeSize=9223372036854775807, maxMergeSizeForForcedMerge=9223372036854775807, calibrateSizeByDeletes=true, maxMergeDocs=2147483647, maxCFSSegmentSizeMB=8.796093022207999E12, noCFSRatio=0.23639342403240005]
   [junit4]   2> 1824407 INFO  (coreLoadExecutor-6046-thread-1) [    x:collection1] o.a.s.c.SolrDeletionPolicy SolrDeletionPolicy.onInit: commits: num=1
   [junit4]   2> 	commit{dir=MockDirectoryWrapper(MMapDirectory@/export/home/jenkins/workspace/Lucene-Solr-5.x-Solaris/solr/build/solr-core/test/J0/temp/solr.core.TestArbitraryIndexDir_376832A856FD205D-001/init-core-data-001/index lockFactory=org.apache.lucene.store.SingleInstanceLockFactory@4ce5d37f),segFN=segments_1,generation=1}
   [junit4]   2> 1824407 INFO  (coreLoadExecutor-6046-thread-1) [    x:collection1] o.a.s.c.SolrDeletionPolicy newest commit generation = 1
   [junit4]   2> 1824407 INFO  (coreLoadExecutor-6046-thread-1) [    x:collection1] o.a.s.s.SolrIndexSearcher Opening Searcher@73b83665[collection1] main
   [junit4]   2> 1824407 INFO  (coreLoadExecutor-6046-thread-1) [    x:collection1] o.a.s.r.RestManager Initializing RestManager with initArgs: {storageIO=org.apache.solr.rest.ManagedResourceStorage$InMemoryStorageIO}
   [junit4]   2> 1824407 INFO  (coreLoadExecutor-6046-thread-1) [    x:collection1] o.a.s.r.ManagedResourceStorage Reading _rest_managed.json using InMemoryStorage
   [junit4]   2> 1824408 INFO  (coreLoadExecutor-6046-thread-1) [    x:collection1] o.a.s.r.RestManager Initializing 0 registered ManagedResources
   [junit4]   2> 1824408 INFO  (coreLoadExecutor-6046-thread-1) [    x:collection1] o.a.s.h.c.SpellCheckComponent Initializing spell checkers
   [junit4]   2> 1824441 INFO  (coreLoadExecutor-6046-thread-1) [    x:collection1] o.a.s.s.DirectSolrSpellChecker init: {name=direct,classname=DirectSolrSpellChecker,field=lowerfilt,minQueryLength=3}
   [junit4]   2> 1824515 INFO  (coreLoadExecutor-6046-thread-1) [    x:collection1] o.a.s.h.ReplicationHandler Commits will be reserved for  10000
   [junit4]   2> 1824515 INFO  (searcherExecutor-6047-thread-1-processing-x:collection1) [    x:collection1] o.a.s.h.c.SpellCheckComponent Loading spell index for spellchecker: default
   [junit4]   2> 1824515 INFO  (searcherExecutor-6047-thread-1-processing-x:collection1) [    x:collection1] o.a.s.h.c.SpellCheckComponent Loading spell index for spellchecker: direct
   [junit4]   2> 1824515 INFO  (coreLoadExecutor-6046-thread-1) [    x:collection1] o.a.s.c.CoreContainer registering core: collection1
   [junit4]   2> 1824516 INFO  (searcherExecutor-6047-thread-1-processing-x:collection1) [    x:collection1] o.a.s.h.c.SpellCheckComponent Loading spell index for spellchecker: wordbreak
   [junit4]   2> 1824516 INFO  (searcherExecutor-6047-thread-1-processing-x:collection1) [    x:collection1] o.a.s.h.c.SpellCheckComponent Loading spell index for spellchecker: multipleFields
   [junit4]   2> 1824516 INFO  (searcherExecutor-6047-thread-1-processing-x:collection1) [    x:collection1] o.a.s.h.c.SpellCheckComponent Loading spell index for spellchecker: jarowinkler
   [junit4]   2> 1824517 INFO  (searcherExecutor-6047-thread-1-processing-x:collection1) [    x:collection1] o.a.s.h.c.SpellCheckComponent Loading spell index for spellchecker: external
   [junit4]   2> 1824517 INFO  (searcherExecutor-6047-thread-1-processing-x:collection1) [    x:collection1] o.a.s.h.c.SpellCheckComponent Loading spell index for spellchecker: freq
   [junit4]   2> 1824517 INFO  (TEST-TestArbitraryIndexDir.testLoadNewIndexDir-seed#[376832A856FD205D]) [    ] o.a.s.SolrTestCaseJ4 ####initCore end
   [junit4]   2> 1824518 INFO  (searcherExecutor-6047-thread-1-processing-x:collection1) [    x:collection1] o.a.s.h.c.SpellCheckComponent Loading spell index for spellchecker: fqcn
   [junit4]   2> 1824518 INFO  (searcherExecutor-6047-thread-1-processing-x:collection1) [    x:collection1] o.a.s.h.c.SpellCheckComponent Loading spell index for spellchecker: perDict
   [junit4]   2> 1824519 INFO  (searcherExecutor-6047-thread-1-processing-x:collection1) [    x:collection1] o.a.s.c.SolrCore [collection1] Registered new searcher Searcher@73b83665[collection1] main{ExitableDirectoryReader(UninvertingDirectoryReader())}
   [junit4]   2> 1824519 INFO  (TEST-TestArbitraryIndexDir.testLoadNewIndexDir-seed#[376832A856FD205D]) [    ] o.a.s.u.p.LogUpdateProcessorFactory [collection1]  webapp=null path=null params={}{add=[1]} 0 1
   [junit4]   2> 1824553 INFO  (TEST-TestArbitraryIndexDir.testLoadNewIndexDir-seed#[376832A856FD205D]) [    ] o.a.s.u.DirectUpdateHandler2 start commit{,optimize=false,openSearcher=true,waitSearcher=true,expungeDeletes=false,softCommit=false,prepareCommit=false}
   [junit4]   2> 1824660 INFO  (TEST-TestArbitraryIndexDir.testLoadNewIndexDir-seed#[376832A856FD205D]) [    ] o.a.s.c.SolrDeletionPolicy SolrDeletionPolicy.onCommit: commits: num=2
   [junit4]   2> 	commit{dir=MockDirectoryWrapper(MMapDirectory@/export/home/jenkins/workspace/Lucene-Solr-5.x-Solaris/solr/build/solr-core/test/J0/temp/solr.core.TestArbitraryIndexDir_376832A856FD205D-001/init-core-data-001/index lockFactory=org.apache.lucene.store.SingleInstanceLockFactory@4ce5d37f),segFN=segments_1,generation=1}
   [junit4]   2> 	commit{dir=MockDirectoryWrapper(MMapDirectory@/export/home/jenkins/workspace/Lucene-Solr-5.x-Solaris/solr/build/solr-core/test/J0/temp/solr.core.TestArbitraryIndexDir_376832A856FD205D-001/init-core-data-001/index lockFactory=org.apache.lucene.store.SingleInstanceLockFactory@4ce5d37f),segFN=segments_2,generation=2}
   [junit4]   2> 1824662 INFO  (TEST-TestArbitraryIndexDir.testLoadNewIndexDir-seed#[376832A856FD205D]) [    ] o.a.s.c.SolrDeletionPolicy newest commit generation = 2
   [junit4]   2> 1824664 INFO  (TEST-TestArbitraryIndexDir.testLoadNewIndexDir-seed#[376832A856FD205D]) [    ] o.a.s.c.SolrCore New index directory detected: old=/export/home/jenkins/workspace/Lucene-Solr-5.x-Solaris/solr/build/solr-core/test/J0/temp/solr.core.TestArbitraryIndexDir_376832A856FD205D-001/init-core-data-001/index/ new=/export/home/jenkins/workspace/Lucene-Solr-5.x-Solaris/solr/build/solr-core/test/J0/temp/solr.core.TestArbitraryIndexDir_376832A856FD205D-001/init-core-data-001/index_temp
   [junit4]   2> 1824667 INFO  (TEST-TestArbitraryIndexDir.testLoadNewIndexDir-seed#[376832A856FD205D]) [    ] o.a.s.s.SolrIndexSearcher Opening Searcher@293e8bbe[collection1] main
   [junit4]   2> 1824667 INFO  (TEST-TestArbitraryIndexDir.testLoadNewIndexDir-seed#[376832A856FD205D]) [    ] o.a.s.u.DirectUpdateHandler2 end_commit_flush
   [junit4]   2> 1824668 INFO  (searcherExecutor-6047-thread-1) [    ] o.a.s.c.SolrCore [collection1] Registered new searcher Searcher@293e8bbe[collection1] main{ExitableDirectoryReader(UninvertingDirectoryReader(Uninverting(_0(5.5.0):C1)))}
   [junit4]   2> 1824669 INFO  (TEST-TestArbitraryIndexDir.testLoadNewIndexDir-seed#[376832A856FD205D]) [    ] o.a.s.u.p.LogUpdateProcessorFactory [collection1]  webapp=null path=null params={}{commit=} 0 115
   [junit4]   2> 1824669 INFO  (TEST-TestArbitraryIndexDir.testLoadNewIndexDir-seed#[376832A856FD205D]) [    ] o.a.s.c.SolrResourceLoader new SolrResourceLoader for directory: '/export/home/jenkins/workspace/Lucene-Solr-5.x-Solaris/solr/core/src/test-files/solr/collection1'
   [junit4]   2> 1824669 INFO  (TEST-TestArbitraryIndexDir.testLoadNewIndexDir-seed#[376832A856FD205D]) [    ] o.a.s.c.SolrResourceLoader JNDI not configured for solr (NoInitialContextEx)
   [junit4]   2> 1824669 INFO  (TEST-TestArbitraryIndexDir.testLoadNewIndexDir-seed#[376832A856FD205D]) [    ] o.a.s.c.SolrResourceLoader using system property solr.solr.home: /export/home/jenkins/workspace/Lucene-Solr-5.x-Solaris/solr/core/src/test-files/solr
   [junit4]   2> 1824670 INFO  (TEST-TestArbitraryIndexDir.testLoadNewIndexDir-seed#[376832A856FD205D]) [    ] o.a.s.c.SolrResourceLoader Adding 'file:/export/home/jenkins/workspace/Lucene-Solr-5.x-Solaris/solr/core/src/test-files/solr/collection1/lib/classes/' to classloader
   [junit4]   2> 1824670 INFO  (TEST-TestArbitraryIndexDir.testLoadNewIndexDir-seed#[376832A856FD205D]) [    ] o.a.s.c.SolrResourceLoader Adding 'file:/export/home/jenkins/workspace/Lucene-Solr-5.x-Solaris/solr/core/src/test-files/solr/collection1/lib/README' to classloader
   [junit4]   2> 1824696 INFO  (TEST-TestArbitraryIndexDir.testLoadNewIndexDir-seed#[376832A856FD205D]) [    ] o.a.s.c.SolrConfig current version of requestparams : -1
   [junit4]   2> 1824702 INFO  (TEST-TestArbitraryIndexDir.testLoadNewIndexDir-seed#[376832A856FD205D]) [    ] o.a.s.c.SolrConfig Using Lucene MatchVersion: 5.5.0
   [junit4]   2> 1824715 INFO  (TEST-TestArbitraryIndexDir.testLoadNewIndexDir-seed#[376832A856FD205D]) [    ] o.a.s.c.SolrConfig Loaded SolrConfig: solrconfig.xml
   [junit4]   2> 1824718 INFO  (TEST-TestArbitraryIndexDir.testLoadNewIndexDir-seed#[376832A856FD205D]) [    ] o.a.s.s.IndexSchema [collection1] Schema name=test
   [junit4]   2> 1824774 INFO  (TEST-TestArbitraryIndexDir.testLoadNewIndexDir-seed#[376832A856FD205D]) [    ] o.a.s.s.IndexSchema default search field in schema is text
   [junit4]   2> 1824775 INFO  (TEST-TestArbitraryIndexDir.testLoadNewIndexDir-seed#[376832A856FD205D]) [    ] o.a.s.s.IndexSchema unique key field: id
   [junit4]   2> 1824775 WARN  (TEST-TestArbitraryIndexDir.testLoadNewIndexDir-seed#[376832A856FD205D]) [    ] o.a.s.s.IndexSchema Field text is not multivalued and destination for multiple copyFields (2)
   [junit4]   2> 1824779 INFO  (TEST-TestArbitraryIndexDir.testLoadNewIndexDir-seed#[376832A856FD205D]) [    ] o.a.s.s.FileExchangeRateProvider Reloading exchange rates from file currency.xml
   [junit4]   2> 1824780 INFO  (TEST-TestArbitraryIndexDir.testLoadNewIndexDir-seed#[376832A856FD205D]) [    ] o.a.s.s.FileExchangeRateProvider Reloading exchange rates from file currency.xml
   [junit4]   2> 1824783 INFO  (TEST-TestArbitraryIndexDir.testLoadNewIndexDir-seed#[376832A856FD205D]) [    ] o.a.s.c.ConfigSetProperties Did not find ConfigSet properties, assuming default properties: Can't find resource 'configsetprops.json' in classpath or '/export/home/jenkins/workspace/Lucene-Solr-5.x-Solaris/solr/core/src/test-files/solr/collection1'
   [junit4]   2> 1824783 INFO  (TEST-TestArbitraryIndexDir.testLoadNewIndexDir-seed#[376832A856FD205D]) [    ] o.a.s.c.CoreContainer Reloading SolrCore 'collection1' using configuration from instancedir /export/home/jenkins/workspace/Lucene-Solr-5.x-Solaris/solr/core/src/test-files/solr/collection1
   [junit4]   2> 1824784 INFO  (TEST-TestArbitraryIndexDir.testLoadNewIndexDir-seed#[376832A856FD205D]) [    x:collection1] o.a.s.c.SolrCore [[collection1] ] Opening new SolrCore at [/export/home/jenkins/workspace/Lucene-Solr-5.x-Solaris/solr/core/src/test-files/solr/collection1], dataDir=[/export/home/jenkins/workspace/Lucene-Solr-5.x-Solaris/solr/build/solr-core/test/J0/temp/solr.core.TestArbitraryIndexDir_376832A856FD205D-001/init-core-data-001/]
   [junit4]   2> 1824784 INFO  (TEST-TestArbitraryIndexDir.testLoadNewIndexDir-seed#[376832A856FD205D]) [    x:collection1] o.a.s.c.JmxMonitoredMap JMX monitoring is enabled. Adding Solr mbeans to JMX Server: com.sun.jmx.mbeanserver.JmxMBeanServer@72967a4b
   [junit4]   2> 1824785 INFO  (TEST-TestArbitraryIndexDir.testLoadNewIndexDir-seed#[376832A856FD205D]) [    x:collection1] o.a.s.c.SolrCore New index directory detected: old=null new=/export/home/jenkins/workspace/Lucene-Solr-5.x-Solaris/solr/build/solr-core/test/J0/temp/solr.core.TestArbitraryIndexDir_376832A856FD205D-001/init-core-data-001/index_temp
   [junit4]   2> 1824786 INFO  (OldIndexDirectoryCleanupThreadForCore-collection1) [    x:collection1] o.a.s.c.SolrCore Looking for old index directories to cleanup for core collection1 in /export/home/jenkins/workspace/Lucene-Solr-5.x-Solaris/solr/build/solr-core/test/J0/temp/solr.core.TestArbitraryIndexDir_376832A856FD205D-001/init-core-data-001/
   [junit4]   2> 1824786 INFO  (OldIndexDirectoryCleanupThreadForCore-collection1) [    x:collection1] o.a.s.c.DirectoryFactory Found 1 old index directories to clean-up under /export/home/jenkins/workspace/Lucene-Solr-5.x-Solaris/solr/build/solr-core/test/J0/temp/solr.core.TestArbitraryIndexDir_376832A856FD205D-001/init-core-data-001/
   [junit4]   2> 1824787 WARN  (OldIndexDirectoryCleanupThreadForCore-collection1) [    x:collection1] o.a.s.c.CachingDirectoryFactory Cannot delete directory /export/home/jenkins/workspace/Lucene-Solr-5.x-Solaris/solr/build/solr-core/test/J0/temp/solr.core.TestArbitraryIndexDir_376832A856FD205D-001/init-core-data-001/index as it is still being referenced in the cache!
   [junit4]   2> 1824787 WARN  (OldIndexDirectoryCleanupThreadForCore-collection1) [    x:collection1] o.a.s.c.DirectoryFactory Delete old index directory /export/home/jenkins/workspace/Lucene-Solr-5.x-Solaris/solr/build/solr-core/test/J0/temp/solr.core.TestArbitraryIndexDir_376832A856FD205D-001/init-core-data-001/index failed.
   [junit4]   2> 1824790 INFO  (TEST-TestArbitraryIndexDir.testLoadNewIndexDir-seed#[376832A856FD205D]) [    x:collection1] o.a.s.u.p.UpdateRequestProcessorChain creating updateRequestProcessorChain "dedupe"
   [junit4]   2> 1824791 INFO  (TEST-TestArbitraryIndexDir.testLoadNewIndexDir-seed#[376832A856FD205D]) [    x:collection1] o.a.s.u.p.UpdateRequestProcessorChain inserting DistributedUpdateProcessorFactory into updateRequestProcessorChain "dedupe"
   [junit4]   2> 1824791 INFO  (TEST-TestArbitraryIndexDir.testLoadNewIndexDir-seed#[376832A856FD205D]) [    x:collection1] o.a.s.u.p.UpdateRequestProcessorChain creating updateRequestProcessorChain "dedupe-allfields"
   [junit4]   2> 1824791 INFO  (TEST-TestArbitraryIndexDir.testLoadNewIndexDir-seed#[376832A856FD205D]) [    x:collection1] o.a.s.u.p.UpdateRequestProcessorChain inserting DistributedUpdateProcessorFactory into updateRequestProcessorChain "dedupe-allfields"
   [junit4]   2> 1824800 INFO  (TEST-TestArbitraryIndexDir.testLoadNewIndexDir-seed#[376832A856FD205D]) [    x:collection1] o.a.s.u.p.UpdateRequestProcessorChain creating updateRequestProcessorChain "stored_sig"
   [junit4]   2> 1824800 INFO  (TEST-TestArbitraryIndexDir.testLoadNewIndexDir-seed#[376832A856FD205D]) [    x:collection1] o.a.s.u.p.UpdateRequestProcessorChain inserting DistributedUpdateProcessorFactory into updateRequestProcessorChain "stored_sig"
   [junit4]   2> 1824800 INFO  (TEST-TestArbitraryIndexDir.testLoadNewIndexDir-seed#[376832A856FD205D]) [    x:collection1] o.a.s.u.p.UpdateRequestProcessorChain creating updateRequestProcessorChain "uniq-fields"
   [junit4]   2> 1824800 INFO  (TEST-TestArbitraryIndexDir.testLoadNewIndexDir-seed#[376832A856FD205D]) [    x:collection1] o.a.s.u.p.UpdateRequestProcessorChain inserting DistributedUpdateProcessorFactory into updateRequestProcessorChain "uniq-fields"
   [junit4]   2> 1824800 INFO  (TEST-TestArbitraryIndexDir.testLoadNewIndexDir-seed#[376832A856FD205D]) [    x:collection1] o.a.s.u.p.UpdateRequestProcessorChain creating updateRequestProcessorChain "distrib-dup-test-chain-explicit"
   [junit4]   2> 1824801 INFO  (TEST-TestArbitraryIndexDir.testLoadNewIndexDir-seed#[376832A856FD205D]) [    x:collection1] o.a.s.u.p.UpdateRequestProcessorChain creating updateRequestProcessorChain "distrib-dup-test-chain-implicit"
   [junit4]   2> 1824801 INFO  (TEST-TestArbitraryIndexDir.testLoadNewIndexDir-seed#[376832A856FD205D]) [    x:collection1] o.a.s.u.p.UpdateRequestProcessorChain inserting DistributedUpdateProcessorFactory into updateRequestProcessorChain "distrib-dup-test-chain-implicit"
   [junit4]   2> 1824801 INFO  (TEST-TestArbitraryIndexDir.testLoadNewIndexDir-seed#[376832A856FD205D]) [    x:collection1] o.a.s.c.SolrCore no updateRequestProcessorChain defined as default, creating implicit default
   [junit4]   2> 1824803 INFO  (TEST-TestArbitraryIndexDir.testLoadNewIndexDir-seed#[376832A856FD205D]) [    x:collection1] o.a.s.h.l.XMLLoader xsltCacheLifetimeSeconds=60
   [junit4]   2> 1824803 INFO  (TEST-TestArbitraryIndexDir.testLoadNewIndexDir-seed#[376832A856FD205D]) [    x:collection1] o.a.s.h.l.XMLLoader xsltCacheLifetimeSeconds=60
   [junit4]   2> 1824805 INFO  (TEST-TestArbitraryIndexDir.testLoadNewIndexDir-seed#[376832A856FD205D]) [    x:collection1] o.a.s.h.l.XMLLoader xsltCacheLifetimeSeconds=60
   [junit4]   2> 1824805 INFO  (TEST-TestArbitraryIndexDir.testLoadNewIndexDir-seed#[376832A856FD205D]) [    x:collection1] o.a.s.h.l.XMLLoader xsltCacheLifetimeSeconds=60
   [junit4]   2> 1824807 INFO  (TEST-TestArbitraryIndexDir.testLoadNewIndexDir-seed#[376832A856FD205D]) [    x:collection1] o.a.s.c.CachingDirectoryFactory return new directory for /export/home/jenkins/workspace/Lucene-Solr-5.x-Solaris/solr/build/solr-core/test/J0/temp/solr.core.TestArbitraryIndexDir_376832A856FD205D-001/init-core-data-001/index_temp
   [junit4]   2> 1824810 INFO  (TEST-TestArbitraryIndexDir.testLoadNewIndexDir-seed#[376832A856FD205D]) [    x:collection1] o.a.s.c.PluginBag requestHandler : 'lazy' created with startup=lazy 
   [junit4]   2> 1824813 INFO  (TEST-TestArbitraryIndexDir.testLoadNewIndexDir-seed#[376832A856FD205D]) [    x:collection1] o.a.s.c.RequestHandlers Registered paths: /admin/mbeans,standard,spellCheckCompRH,lazy,/update/json/docs,/admin/luke,spellCheckWithWordbreak_Direct,tvrh,/get,/admin/properties,/update/json,mltrh,/admin/threads,/search-facet-def,/update/csv,/search-facet-invariants,/admin/segments,spellCheckCompRH1,/mlt,/admin/system,/replication,dismax,defaults,/config,/schema,/admin/plugins,/admin/logging,spellCheckWithWordbreak,mock,/admin/ping,/update,/admin/file,/terms,spellCheckCompRH_Direct,/debug/dump
   [junit4]   2> 1824814 WARN  (TEST-TestArbitraryIndexDir.testLoadNewIndexDir-seed#[376832A856FD205D]) [    x:collection1] o.a.s.c.SolrCore solrconfig.xml uses deprecated <admin/gettableFiles>, Please update your config to use the ShowFileRequestHandler.
   [junit4]   2> 1824814 INFO  (TEST-TestArbitraryIndexDir.testLoadNewIndexDir-seed#[376832A856FD205D]) [    x:collection1] o.a.s.c.SolrCore Using default statsCache cache: org.apache.solr.search.stats.LocalStatsCache
   [junit4]   2> 1824815 INFO  (TEST-TestArbitraryIndexDir.testLoadNewIndexDir-seed#[376832A856FD205D]) [    x:collection1] o.a.s.u.CommitTracker Hard AutoCommit: disabled
   [junit4]   2> 1824815 INFO  (TEST-TestArbitraryIndexDir.testLoadNewIndexDir-seed#[376832A856FD205D]) [    x:collection1] o.a.s.u.CommitTracker Soft AutoCommit: disabled
   [junit4]   2> 1824815 INFO  (TEST-TestArbitraryIndexDir.testLoadNewIndexDir-seed#[376832A856FD205D]) [    x:collection1] o.a.s.s.SolrIndexSearcher Opening Searcher@7f0d0f1c[collection1] main
   [junit4]   2> 1824815 INFO  (TEST-TestArbitraryIndexDir.testLoadNewIndexDir-seed#[376832A856FD205D]) [    x:collection1] o.a.s.r.RestManager Initializing RestManager with initArgs: {storageIO=org.apache.solr.rest.ManagedResourceStorage$InMemoryStorageIO}
   [junit4]   2> 1824816 INFO  (TEST-TestArbitraryIndexDir.testLoadNewIndexDir-seed#[376832A856FD205D]) [    x:collection1] o.a.s.r.ManagedResourceStorage Reading _rest_managed.json using InMemoryStorage
   [junit4]   2> 1824816 INFO  (TEST-TestArbitraryIndexDir.testLoadNewIndexDir-seed#[376832A856FD205D]) [    x:collection1] o.a.s.r.RestManager Initializing 0 registered ManagedResources
   [junit4]   2> 1824816 INFO  (TEST-TestArbitraryIndexDir.testLoadNewIndexDir-seed#[376832A856FD205D]) [    x:collection1] o.a.s.h.c.SpellCheckComponent Initializing spell checkers
   [junit4]   2> 1824817 INFO  (TEST-TestArbitraryIndexDir.testLoadNewIndexDir-seed#[376832A856FD205D]) [    x:collection1] o.a.s.s.DirectSolrSpellChecker init: {name=direct,classname=DirectSolrSpellChecker,field=lowerfilt,minQueryLength=3}
   [junit4]   2> 1824820 INFO  (TEST-TestArbitraryIndexDir.testLoadNewIndexDir-seed#[376832A856FD205D]) [    x:collection1] o.a.s.h.ReplicationHandler Commits will be reserved for  10000
   [junit4]   2> 1824820 INFO  (searcherExecutor-6051-thread-1-processing-x:collection1) [    x:collection1] o.a.s.h.c.SpellCheckComponent Loading spell index for spellchecker: default
   [junit4]   2> 1824821 INFO  (searcherExecutor-6051-thread-1-processing-x:collection1) [    x:collection1] o.a.s.h.c.SpellCheckComponent Loading spell index for spellchecker: direct
   [junit4]   2> 1824821 INFO  (searcherExecutor-6051-thread-1-processing-x:collection1) [    x:collection1] o.a.s.h.c.SpellCheckComponent Loading spell index for spellchecker: wordbreak
   [junit4]   2> 1824821 INFO  (searcherExecutor-6051-thread-1-processing-x:collection1) [    x:collection1] o.a.s.h.c.SpellCheckComponent Loading spell index for spellchecker: multipleFields
   [junit4]   2> 1824821 INFO  (TEST-TestArbitraryIndexDir.testLoadNewIndexDir-seed#[376832A856FD205D]) [    x:collection1] o.a.s.u.DefaultSolrCoreState Closing old IndexWriter... core=collection1
   [junit4]   2> 1824821 INFO  (searcherExecutor-6051-thread-1-processing-x:collection1) [    x:collection1] o.a.s.h.c.SpellCheckComponent Loading spell index for spellchecker: jarowinkler
   [junit4]   2> 1824822 INFO  (searcherExecutor-6051-thread-1-processing-x:collection1) [    x:collection1] o.a.s.h.c.SpellCheckComponent Loading spell index for spellchecker: external
   [junit4]   2> 1824822 INFO  (TEST-TestArbitraryIndexDir.testLoadNewIndexDir-seed#[376832A856FD205D]) [    x:collection1] o.a.s.u.RandomMergePolicy RandomMergePolicy wrapping class org.apache.lucene.index.LogDocMergePolicy: [LogDocMergePolicy: minMergeSize=1000, mergeFactor=47, maxMergeSize=9223372036854775807, maxMergeSizeForForcedMerge=9223372036854775807, calibrateSizeByDeletes=true, maxMergeDocs=2147483647, maxCFSSegmentSizeMB=8.796093022207999E12, noCFSRatio=0.18266361220074298]
   [junit4]   2> 1824822 INFO  (searcherExecutor-6051-thread-1-processing-x:collection1) [    x:collection1] o.a.s.h.c.SpellCheckComponent Loading spell index for spellchecker: freq
   [junit4]   2> 1824822 INFO  (searcherExecutor-6051-thread-1-processing-x:collection1) [    x:collection1] o.a.s.h.c.SpellCheckComponent Loading spell index for spellchecker: fqcn
   [junit4]   2> 1824823 INFO  (searcherExecutor-6051-thread-1-processing-x:collection1) [    x:collection1] o.a.s.h.c.SpellCheckComponent Loading spell index for spellchecker: perDict
   [junit4]   2> 1824823 INFO  (TEST-TestArbitraryIndexDir.testLoadNewIndexDir-seed#[376832A856FD205D]) [    x:collection1] o.a.s.c.SolrDeletionPolicy SolrDeletionPolicy.onInit: commits: num=1
   [junit4]   2> 	commit{dir=MockDirectoryWrapper(NIOFSDirectory@/export/home/jenkins/workspace/Lucene-Solr-5.x-Solaris/solr/build/solr-core/test/J0/temp/solr.core.TestArbitraryIndexDir_376832A856FD205D-001/init-core-data-001/index_temp lockFactory=org.apache.lucene.store.SingleInstanceLockFactory@335e80f3),segFN=segments_1,generation=1}
   [junit4]   2> 1824823 INFO  (TEST-TestArbitraryIndexDir.testLoadNewIndexDir-seed#[376832A856FD205D]) [    x:collection1] o.a.s.c.SolrDeletionPolicy newest commit generation = 1
   [junit4]   2> 1824823 INFO  (searcherExecutor-6051-thread-1-processing-x:collection1) [    x:collection1] o.a.s.c.SolrCore [collection1] Registered new searcher Searcher@7f0d0f1c[collection1] main{ExitableDirectoryReader(UninvertingDirectoryReader(Uninverting(_0(5.5.0):C1)))}
   [junit4]   2> 1824824 INFO  (TEST-TestArbitraryIndexDir.testLoadNewIndexDir-seed#[376832A856FD205D]) [    x:collection1] o.a.s.u.DefaultSolrCoreState New IndexWriter is ready to be used.
   [junit4]   2> 1824824 INFO  (TEST-TestArbitraryIndexDir.testLoadNewIndexDir-seed#[376832A856FD205D]) [    x:collection1] o.a.s.s.SolrIndexSearcher Opening Searcher@5891dd8b[collection1] main
   [junit4]   2> 1824825 INFO  (TEST-TestArbitraryIndexDir.testLoadNewIndexDir-seed#[376832A856FD205D]) [    x:collection1] o.a.s.c.CoreContainer replacing core: collection1
   [junit4]   2> 1824825 INFO  (TEST-TestArbitraryIndexDir.testLoadNewIndexDir-seed#[376832A856FD205D]) [    x:collection1] o.a.s.c.SolrCore [collection1]  CLOSING SolrCore org.apache.solr.core.SolrCore@483e66d6
   [junit4]   2> 1824825 INFO  (TEST-TestArbitraryIndexDir.testLoadNewIndexDir-seed#[376832A856FD205D]) [    x:collection1] o.a.s.u.DirectUpdateHandler2 closing DirectUpdateHandler2{commits=1,autocommits=0,soft autocommits=0,optimizes=0,rollbacks=0,expungeDeletes=0,docsPending=0,adds=0,deletesById=0,deletesByQuery=0,errors=0,cumulative_adds=1,cumulative_deletesById=0,cumulative_deletesByQuery=0,cumulative_errors=0}
   [junit4]   2> 1824825 INFO  (TEST-TestArbitraryIndexDir.testLoadNewIndexDir-seed#[376832A856FD205D]) [    x:collection1] o.a.s.c.SolrCore [collection1] Closing main searcher on request.
   [junit4]   2> 1824831 INFO  (TEST-TestArbitraryIndexDir.testLoadNewIndexDir-seed#[376832A856FD205D]) [    x:collection1] o.a.s.c.S.Request [collection1]  webapp=null path=null params={q=id:2&qt=standard&start=0&rows=20&version=2.2} hits=0 status=0 QTime=0
   [junit4]   2> 1824831 ERROR (TEST-TestArbitraryIndexDir.testLoadNewIndexDir-seed#[376832A856FD205D]) [    x:collection1] o.a.s.SolrTestCaseJ4 REQUEST FAILED: xpath=*[count(//doc)=1]
   [junit4]   2> 	xml response was: <?xml version="1.0" encoding="UTF-8"?>
   [junit4]   2> <response>
   [junit4]   2> <lst name="responseHeader"><int name="status">0</int><int name="QTime">0</int></lst><result name="response" numFound="0" start="0"></result>
   [junit4]   2> </response>
   [junit4]   2> 
   [junit4]   2> 	request was:q=id:2&qt=standard&start=0&rows=20&version=2.2
   [junit4]   2> 1824831 ERROR (TEST-TestArbitraryIndexDir.testLoadNewIndexDir-seed#[376832A856FD205D]) [    x:collection1] o.a.s.SolrTestCaseJ4 REQUEST FAILED: q=id:2&qt=standard&start=0&rows=20&version=2.2:java.lang.RuntimeException: REQUEST FAILED: xpath=*[count(//doc)=1]
   [junit4]   2> 	xml response was: <?xml version="1.0" encoding="UTF-8"?>
   [junit4]   2> <response>
   [junit4]   2> <lst name="responseHeader"><int name="status">0</int><int name="QTime">0</int></lst><result name="response" numFound="0" start="0"></result>
   [junit4]   2> </response>
   [junit4]   2> 
   [junit4]   2> 	request was:q=id:2&qt=standard&start=0&rows=20&version=2.2
   [junit4]   2> 	at org.apache.solr.SolrTestCaseJ4.assertQ(SolrTestCaseJ4.java:746)
   [junit4]   2> 	at org.apache.solr.core.TestArbitraryIndexDir.testLoadNewIndexDir(TestArbitraryIndexDir.java:107)
   [junit4]   2> 	at sun.reflect.NativeMethodAccessorImpl.invoke0(Native Method)
   [junit4]   2> 	at sun.reflect.NativeMethodAccessorImpl.invoke(NativeMethodAccessorImpl.java:62)
   [junit4]   2> 	at sun.reflect.DelegatingMethodAccessorImpl.invoke(DelegatingMethodAccessorImpl.java:43)
   [junit4]   2> 	at java.lang.reflect.Method.invoke(Method.java:497)
   [junit4]   2> 	at com.carrotsearch.randomizedtesting.RandomizedRunner.invoke(RandomizedRunner.java:1764)
   [junit4]   2> 	at com.carrotsearch.randomizedtesting.RandomizedRunner$8.evaluate(RandomizedRunner.java:871)
   [junit4]   2> 	at com.carrotsearch.randomizedtesting.RandomizedRunner$9.evaluate(RandomizedRunner.java:907)
   [junit4]   2> 	at com.carrotsearch.randomizedtesting.RandomizedRunner$10.evaluate(RandomizedRunner.java:921)
   [junit4]   2> 	at com.carrotsearch.randomizedtesting.rules.SystemPropertiesRestoreRule$1.evaluate(SystemPropertiesRestoreRule.java:57)
   [junit4]   2> 	at com.carrotsearch.randomizedtesting.rules.SystemPropertiesRestoreRule$1.evaluate(SystemPropertiesRestoreRule.java:57)
   [junit4]   2> 	at org.apache.lucene.util.TestRuleSetupTeardownChained$1.evaluate(TestRuleSetupTeardownChained.java:50)
   [junit4]   2> 	at org.apache.lucene.util.AbstractBeforeAfterRule$1.evaluate(AbstractBeforeAfterRule.java:46)
   [junit4]   2> 	at org.apache.lucene.util.TestRuleThreadAndTestName$1.evaluate(TestRuleThreadAndTestName.java:49)
   [junit4]   2> 	at org.apache.lucene.util.TestRuleIgnoreAfterMaxFailures$1.evaluate(TestRuleIgnoreAfterMaxFailures.java:65)
   [junit4]   2> 	at org.apache.lucene.util.TestRuleMarkFailure$1.evaluate(TestRuleMarkFailure.java:48)
   [junit4]   2> 	at com.carrotsearch.randomizedtesting.rules.StatementAdapter.evaluate(StatementAdapter.java:36)
   [junit4]   2> 	at com.carrotsearch.randomizedtesting.ThreadLeakControl$StatementRunner.run(ThreadLeakControl.java:367)
   [junit4]   2> 	at com.carrotsearch.randomizedtesting.ThreadLeakControl.forkTimeoutingTask(ThreadLeakControl.java:809)
   [junit4]   2> 	at com.carrotsearch.randomizedtesting.ThreadLeakControl$3.evaluate(ThreadLeakControl.java:460)
   [junit4]   2> 	at com.carrotsearch.randomizedtesting.RandomizedRunner.runSingleTest(RandomizedRunner.java:880)
   [junit4]   2> 	at com.carrotsearch.randomizedtesting.RandomizedRunner$5.evaluate(RandomizedRunner.java:781)
   [junit4]   2> 	at com.carrotsearch.randomizedtesting.RandomizedRunner$6.evaluate(RandomizedRunner.java:816)
   [junit4]   2> 	at com.carrotsearch.randomizedtesting.RandomizedRunner$7.evaluate(RandomizedRunner.java:827)
   [junit4]   2> 	at com.carrotsearch.randomizedtesting.rules.StatementAdapter.evaluate(StatementAdapter.java:36)
   [junit4]   2> 	at com.carrotsearch.randomizedtesting.rules.SystemPropertiesRestoreRule$1.evaluate(SystemPropertiesRestoreRule.java:57)
   [junit4]   2> 	at org.apache.lucene.util.AbstractBeforeAfterRule$1.evaluate(AbstractBeforeAfterRule.java:46)
   [junit4]   2> 	at com.carrotsearch.randomizedtesting.rules.StatementAdapter.evaluate(StatementAdapter.java:36)
   [junit4]   2> 	at org.apache.lucene.util.TestRuleStoreClassName$1.evaluate(TestRuleStoreClassName.java:42)
   [junit4]   2> 	at com.carrotsearch.randomizedtesting.rules.NoShadowingOrOverridesOnMethodsRule$1.evaluate(NoShadowingOrOverridesOnMethodsRule.java:40)
   [junit4]   2> 	at com.carrotsearch.randomizedtesting.rules.NoShadowingOrOverridesOnMethodsRule$1.evaluate(NoShadowingOrOverridesOnMethodsRule.java:40)
   [junit4]   2> 	at com.carrotsearch.randomizedtesting.rules.StatementAdapter.evaluate(StatementAdapter.java:36)
   [junit4]   2> 	at com.carrotsearch.randomizedtesting.rules.StatementAdapter.evaluate(StatementAdapter.java:36)
   [junit4]   2> 	at com.carrotsearch.randomizedtesting.rules.StatementAdapter.evaluate(StatementAdapter.java:36)
   [junit4]   2> 	at org.apache.lucene.util.TestRuleAssertionsRequired$1.evaluate(TestRuleAssertionsRequired.java:54)
   [junit4]   2> 	at org.apache.lucene.util.TestRuleMarkFailure$1.evaluate(TestRuleMarkFailure.java:48)
   [junit4]   2> 	at org.apache.lucene.util.TestRuleIgnoreAfterMaxFailures$1.evaluate(TestRuleIgnoreAfterMaxFailures.java:65)
   [junit4]   2> 	at org.apache.lucene.util.TestRuleIgnoreTestSuites$1.evaluate(TestRuleIgnoreTestSuites.java:55)
   [junit4]   2> 	at com.carrotsearch.randomizedtesting.rules.StatementAdapter.evaluate(StatementAdapter.java:36)
   [junit4]   2> 	at com.carrotsearch.randomizedtesting.ThreadLeakControl$StatementRunner.run(ThreadLeakControl.java:367)
   [junit4]   2> 	at java.lang.Thread.run(Thread.java:745)
   [junit4]   2> 
   [junit4]   2> 1824832 INFO  (TEST-TestArbitraryIndexDir.testLoadNewIndexDir-seed#[376832A856FD205D]) [    x:collection1] o.a.s.SolrTestCaseJ4 ###Ending testLoadNewIndexDir
   [junit4]   2> 1824834 INFO  (searcherExecutor-6051-thread-1-processing-x:collection1) [    x:collection1] o.a.s.c.SolrCore [collection1] Registered new searcher Searcher@5891dd8b[collection1] main{ExitableDirectoryReader(UninvertingDirectoryReader(Uninverting(_0(5.5.0):c1)))}
   [junit4]   2> NOTE: reproduce with: ant test  -Dtestcase=TestArbitraryIndexDir -Dtests.method=testLoadNewIndexDir -Dtests.seed=376832A856FD205D -Dtests.slow=true -Dtests.locale=in -Dtests.timezone=Pacific/Rarotonga -Dtests.asserts=true -Dtests.file.encoding=UTF-8
   [junit4] ERROR   0.72s J0 | TestArbitraryIndexDir.testLoadNewIndexDir <<<
   [junit4]    > Throwable #1: java.lang.RuntimeException: Exception during query
   [junit4]    > 	at __randomizedtesting.SeedInfo.seed([376832A856FD205D:DE328990C864B0F5]:0)
   [junit4]    > 	at org.apache.solr.SolrTestCaseJ4.assertQ(SolrTestCaseJ4.java:753)
   [junit4]    > 	at org.apache.solr.core.TestArbitraryIndexDir.testLoadNewIndexDir(TestArbitraryIndexDir.java:107)
   [junit4]    > 	at java.lang.Thread.run(Thread.java:745)
   [junit4]    > Caused by: java.lang.RuntimeException: REQUEST FAILED: xpath=*[count(//doc)=1]
   [junit4]    > 	xml response was: <?xml version="1.0" encoding="UTF-8"?>
   [junit4]    > <response>
   [junit4]    > <lst name="responseHeader"><int name="status">0</int><int name="QTime">0</int></lst><result name="response" numFound="0" start="0"></result>
   [junit4]    > </response>
   [junit4]    > 	request was:q=id:2&qt=standard&start=0&rows=20&version=2.2
   [junit4]    > 	at org.apache.solr.SolrTestCaseJ4.assertQ(SolrTestCaseJ4.java:746)
   [junit4]    > 	... 41 more
   [junit4]   2> 1824841 INFO  (SUITE-TestArbitraryIndexDir-seed#[376832A856FD205D]-worker) [    x:collection1] o.a.s.SolrTestCaseJ4 ###deleteCore
   [junit4]   2> 1824841 INFO  (SUITE-TestArbitraryIndexDir-seed#[376832A856FD205D]-worker) [    x:collection1] o.a.s.c.CoreContainer Shutting down CoreContainer instance=85339686
   [junit4]   2> 1824841 INFO  (SUITE-TestArbitraryIndexDir-seed#[376832A856FD205D]-worker) [    x:collection1] o.a.s.c.SolrCore [collection1]  CLOSING SolrCore org.apache.solr.core.SolrCore@36a20385
   [junit4]   2> 1824842 INFO  (SUITE-TestArbitraryIndexDir-seed#[376832A856FD205D]-worker) [    x:collection1] o.a.s.u.DirectUpdateHandler2 closing DirectUpdateHandler2{commits=0,autocommits=0,soft autocommits=0,optimizes=0,rollbacks=0,expungeDeletes=0,docsPending=0,adds=0,deletesById=0,deletesByQuery=0,errors=0,cumulative_adds=0,cumulative_deletesById=0,cumulative_deletesByQuery=0,cumulative_errors=0}
   [junit4]   2> 1824842 INFO  (SUITE-TestArbitraryIndexDir-seed#[376832A856FD205D]-worker) [    x:collection1] o.a.s.u.SolrCoreState Closing SolrCoreState
   [junit4]   2> 1824842 INFO  (SUITE-TestArbitraryIndexDir-seed#[376832A856FD205D]-worker) [    x:collection1] o.a.s.u.DefaultSolrCoreState SolrCoreState ref count has reached 0 - closing IndexWriter
   [junit4]   2> 1824842 INFO  (SUITE-TestArbitraryIndexDir-seed#[376832A856FD205D]-worker) [    x:collection1] o.a.s.u.DefaultSolrCoreState closing IndexWriter with IndexWriterCloser
   [junit4]   2> 1824842 INFO  (SUITE-TestArbitraryIndexDir-seed#[376832A856FD205D]-worker) [    x:collection1] o.a.s.c.SolrCore [collection1] Closing main searcher on request.
   [junit4]   2> 1824850 INFO  (SUITE-TestArbitraryIndexDir-seed#[376832A856FD205D]-worker) [    x:collection1] o.a.s.c.CachingDirectoryFactory Closing MockFSDirectoryFactory - 3 directories currently being tracked
   [junit4]   2> 1824851 INFO  (SUITE-TestArbitraryIndexDir-seed#[376832A856FD205D]-worker) [    x:collection1] o.a.s.c.CachingDirectoryFactory looking to close /export/home/jenkins/workspace/Lucene-Solr-5.x-Solaris/solr/build/solr-core/test/J0/temp/solr.core.TestArbitraryIndexDir_376832A856FD205D-001/init-core-data-001/index_temp [CachedDir<<refCount=0;path=/export/home/jenkins/workspace/Lucene-Solr-5.x-Solaris/solr/build/solr-core/test/J0/temp/solr.core.TestArbitraryIndexDir_376832A856FD205D-001/init-core-data-001/index_temp;done=false>>]
   [junit4]   2> 1824851 INFO  (SUITE-TestArbitraryIndexDir-seed#[376832A856FD205D]-worker) [    x:collection1] o.a.s.c.CachingDirectoryFactory Closing directory: /export/home/jenkins/workspace/Lucene-Solr-5.x-Solaris/solr/build/solr-core/test/J0/temp/solr.core.TestArbitraryIndexDir_376832A856FD205D-001/init-core-data-001/index_temp
   [junit4]   2> 1824856 INFO  (SUITE-TestArbitraryIndexDir-seed#[376832A856FD205D]-worker) [    x:collection1] o.a.s.c.CachingDirectoryFactory looking to close /export/home/jenkins/workspace/Lucene-Solr-5.x-Solaris/solr/build/solr-core/test/J0/temp/solr.core.TestArbitraryIndexDir_376832A856FD205D-001/init-core-data-001 [CachedDir<<refCount=0;path=/export/home/jenkins/workspace/Lucene-Solr-5.x-Solaris/solr/build/solr-core/test/J0/temp/solr.core.TestArbitraryIndexDir_376832A856FD205D-001/init-core-data-001;done=false>>]
   [junit4]   2> 1824856 INFO  (SUITE-TestArbitraryIndexDir-seed#[376832A856FD205D]-worker) [    x:collection1] o.a.s.c.CachingDirectoryFactory Closing directory: /export/home/jenkins/workspace/Lucene-Solr-5.x-Solaris/solr/build/solr-core/test/J0/temp/solr.core.TestArbitraryIndexDir_376832A856FD205D-001/init-core-data-001
   [junit4]   2> 1824856 INFO  (SUITE-TestArbitraryIndexDir-seed#[376832A856FD205D]-worker) [    x:collection1] o.a.s.c.CachingDirectoryFactory looking to close /export/home/jenkins/workspace/Lucene-Solr-5.x-Solaris/solr/build/solr-core/test/J0/temp/solr.core.TestArbitraryIndexDir_376832A856FD205D-001/init-core-data-001/index [CachedDir<<refCount=0;path=/export/home/jenkins/workspace/Lucene-Solr-5.x-Solaris/solr/build/solr-core/test/J0/temp/solr.core.TestArbitraryIndexDir_376832A856FD205D-001/init-core-data-001/index;done=false>>]
   [junit4]   2> 1824856 INFO  (SUITE-TestArbitraryIndexDir-seed#[376832A856FD205D]-worker) [    x:collection1] o.a.s.c.CachingDirectoryFactory Closing directory: /export/home/jenkins/workspace/Lucene-Solr-5.x-Solaris/solr/build/solr-core/test/J0/temp/solr.core.TestArbitraryIndexDir_376832A856FD205D-001/init-core-data-001/index
   [junit4]   2> NOTE: leaving temporary files on disk at: /export/home/jenkins/workspace/Lucene-Solr-5.x-Solaris/solr/build/solr-core/test/J0/temp/solr.core.TestArbitraryIndexDir_376832A856FD205D-001
   [junit4]   2> NOTE: test params are: codec=Asserting(Lucene54): {name=PostingsFormat(name=SimpleText), id=PostingsFormat(name=SimpleText)}, docValues:{}, sim=DefaultSimilarity, locale=in, timezone=Pacific/Rarotonga
   [junit4]   2> NOTE: SunOS 5.11 amd64/Oracle Corporation 1.8.0_66 (64-bit)/cpus=3,threads=1,free=181946136,total=507461632
   [junit4]   2> NOTE: All tests run in this JVM: [TestSolrCLIRunExample, TestManagedResourceStorage, TestExactSharedStatsCache, TestMissingGroups, TestStressVersions, TestPartialUpdateDeduplication, TestFreeTextSuggestions, TestXIncludeConfig, TestConfigSetProperties, LeaderFailoverAfterPartitionTest, TestRandomDVFaceting, JsonLoaderTest, TestHashPartitioner, TestMinMaxOnMultiValuedField, TestQuerySenderNoQuery, HdfsThreadLeakTest, DistributedQueryElevationComponentTest, TestSchemaNameResource, TestGroupingSearch, TestReqParamsAPI, TestJmxMonitoredMap, TestLRUStatsCache, OverseerRolesTest, DistributedFacetPivotSmallAdvancedTest, TestFieldTypeCollectionResource, ConfigSetsAPITest, TestSort, AddSchemaFieldsUpdateProcessorFactoryTest, TestStandardQParsers, TestBlendedInfixSuggestions, StandardRequestHandlerTest, TestPhraseSuggestions, TestRecoveryHdfs, RegexBoostProcessorTest, TestSearchPerf, MultiThreadedOCPTest, AnalysisAfterCoreReloadTest, FastVectorHighlighterTest, TestWordDelimiterFilterFactory, TestNRTOpen, MBeansHandlerTest, TestConfigOverlay, SolrIndexConfigTest, DistributedQueueTest, TestRequestForwarding, SliceStateTest, BadComponentTest, DocumentAnalysisRequestHandlerTest, TestShardHandlerFactory, TestRandomForceMergePolicy, PolyFieldTest, CheckHdfsIndexTest, TestPKIAuthenticationPlugin, TestSortByMinMaxFunction, ExternalFileFieldSortTest, TestSolrQueryParserResource, TestJettySolrRunner, TestIBSimilarityFactory, TestConfigReload, SimpleFacetsTest, SystemInfoHandlerTest, DOMUtilTest, TestClusterStateMutator, TestCustomDocTransformer, TestCloudPivotFacet, TimeZoneUtilsTest, DirectUpdateHandlerTest, BlockJoinFacetSimpleTest, HdfsChaosMonkeyNothingIsSafeTest, CoreAdminCreateDiscoverTest, HLLUtilTest, HdfsRecoverLeaseTest, TestLMDirichletSimilarityFactory, QueryEqualityTest, TestSolrDeletionPolicy1, TestMiniSolrCloudClusterBase, TestHdfsUpdateLog, FullHLLTest, TestSchemaManager, CircularListTest, AnalysisErrorHandlingTest, ZkControllerTest, OverriddenZkACLAndCredentialsProvidersTest, TestFaceting, SmileWriterTest, DistributedSpellCheckComponentTest, TestLazyCores, AsyncCallRequestStatusResponseTest, UnloadDistributedZkTest, CustomCollectionTest, ZkCLITest, RulesTest, TestCopyFieldCollectionResource, BasicDistributedZkTest, UUIDUpdateProcessorFallbackTest, TestSolrDynamicMBean, PrimUtilsTest, JavabinLoaderTest, CollectionStateFormat2Test, TestRemoteStreaming, TestCoreContainer, SoftAutoCommitTest, PreAnalyzedFieldTest, DirectoryFactoryTest, OverseerTest, UpdateParamsTest, TestConfigSetsAPI, SharedFSAutoReplicaFailoverUtilsTest, HighlighterTest, ClusterStateTest, SchemaVersionSpecificBehaviorTest, TestManagedStopFilterFactory, PreAnalyzedUpdateProcessorTest, TestMacros, IndexBasedSpellCheckerTest, SampleTest, EnumFieldTest, RemoteQueryErrorTest, DistributedFacetPivotLargeTest, DisMaxRequestHandlerTest, TestComplexPhraseQParserPlugin, ClusterStateUpdateTest, SOLR749Test, TestReplicationHandler, TestMiniSolrCloudClusterSSL, HdfsCollectionsAPIDistributedZkTest, TestDFRSimilarityFactory, TestCloudManagedSchemaConcurrent, StatelessScriptUpdateProcessorFactoryTest, SecurityConfHandlerTest, IndexSchemaTest, ShardSplitTest, TestUseDocValuesAsStored2, TestSerializedLuceneMatchVersion, TestFieldSortValues, LeaderElectionTest, AutoCommitTest, TestDistributedGrouping, TermVectorComponentDistributedTest, TestRealTimeGet, TestStressReorder, HardAutoCommitTest, DistributedTermsComponentTest, TestSolr4Spatial, SolrCoreTest, SpellCheckComponentTest, QueryElevationComponentTest, PeerSyncTest, TestFunctionQuery, TestBadConfig, ShowFileRequestHandlerTest, CurrencyFieldXmlFileTest, SimplePostToolTest, TestExtendedDismaxParser, SuggesterFSTTest, SolrRequestParserTest, DocValuesTest, SuggesterTSTTest, SuggesterTest, TestStressLucene, SpatialFilterTest, SuggesterWFSTTest, TestCSVLoader, SolrCoreCheckLockOnStartupTest, TestPseudoReturnFields, TestUpdate, TestAtomicUpdateErrorCases, DocValuesMultiTest, SolrInfoMBeanTest, XsltUpdateRequestHandlerTest, CacheHeaderTest, TestSurroundQueryParser, DirectSolrSpellCheckerTest, PrimitiveFieldTypeTest, FileBasedSpellCheckerTest, TermsComponentTest, DocumentBuilderTest, PathHierarchyTokenizerFactoryTest, TestIndexingPerformance, RequiredFieldsTest, TestArbitraryIndexDir]
   [junit4] Completed [341/563 (1!)] on J0 in 0.76s, 1 test, 1 error <<< FAILURES!

[...truncated 379 lines...]
   [junit4] Suite: org.apache.solr.cloud.hdfs.StressHdfsTest
   [junit4]   2> Creating dataDir: /export/home/jenkins/workspace/Lucene-Solr-5.x-Solaris/solr/build/solr-core/test/J1/temp/solr.cloud.hdfs.StressHdfsTest_376832A856FD205D-001/init-core-data-001
   [junit4]   2> 2658458 INFO  (SUITE-StressHdfsTest-seed#[376832A856FD205D]-worker) [    ] o.a.s.BaseDistributedSearchTestCase Setting hostContext system property: /enfyr/t
   [junit4]   1> Formatting using clusterid: testClusterID
   [junit4]   2> 2658584 WARN  (SUITE-StressHdfsTest-seed#[376832A856FD205D]-worker) [    ] o.a.h.m.i.MetricsConfig Cannot locate configuration: tried hadoop-metrics2-namenode.properties,hadoop-metrics2.properties
   [junit4]   2> 2658593 WARN  (SUITE-StressHdfsTest-seed#[376832A856FD205D]-worker) [    ] o.a.h.h.HttpRequestLog Jetty request log can only be enabled using Log4j
   [junit4]   2> 2658595 INFO  (SUITE-StressHdfsTest-seed#[376832A856FD205D]-worker) [    ] o.m.log jetty-6.1.26
   [junit4]   2> 2658606 INFO  (SUITE-StressHdfsTest-seed#[376832A856FD205D]-worker) [    ] o.m.log Extract jar:file:/export/home/jenkins/.ivy2/cache/org.apache.hadoop/hadoop-hdfs/tests/hadoop-hdfs-2.6.0-tests.jar!/webapps/hdfs to ./temp/Jetty_solaris.vm_61465_hdfs____uq0n3e/webapp
   [junit4]   2> 2658739 INFO  (SUITE-StressHdfsTest-seed#[376832A856FD205D]-worker) [    ] o.m.log NO JSP Support for /, did not find org.apache.jasper.servlet.JspServlet
   [junit4]   2> 2659373 INFO  (SUITE-StressHdfsTest-seed#[376832A856FD205D]-worker) [    ] o.m.log Started HttpServer2$SelectChannelConnectorWithSafeStartup@solaris-vm:61465
   [junit4]   2> 2659649 WARN  (SUITE-StressHdfsTest-seed#[376832A856FD205D]-worker) [    ] o.a.h.h.HttpRequestLog Jetty request log can only be enabled using Log4j
   [junit4]   2> 2659650 INFO  (SUITE-StressHdfsTest-seed#[376832A856FD205D]-worker) [    ] o.m.log jetty-6.1.26
   [junit4]   2> 2659661 INFO  (SUITE-StressHdfsTest-seed#[376832A856FD205D]-worker) [    ] o.m.log Extract jar:file:/export/home/jenkins/.ivy2/cache/org.apache.hadoop/hadoop-hdfs/tests/hadoop-hdfs-2.6.0-tests.jar!/webapps/datanode to ./temp/Jetty_solaris.vm_49098_datanode____bvrh4p/webapp
   [junit4]   2> 2659770 INFO  (SUITE-StressHdfsTest-seed#[376832A856FD205D]-worker) [    ] o.m.log NO JSP Support for /, did not find org.apache.jasper.servlet.JspServlet
   [junit4]   2> 2660161 INFO  (SUITE-StressHdfsTest-seed#[376832A856FD205D]-worker) [    ] o.m.log Started HttpServer2$SelectChannelConnectorWithSafeStartup@solaris-vm:49098
   [junit4]   2> 2660270 WARN  (SUITE-StressHdfsTest-seed#[376832A856FD205D]-worker) [    ] o.a.h.h.HttpRequestLog Jetty request log can only be enabled using Log4j
   [junit4]   2> 2660272 INFO  (SUITE-StressHdfsTest-seed#[376832A856FD205D]-worker) [    ] o.m.log jetty-6.1.26
   [junit4]   2> 2660286 INFO  (SUITE-StressHdfsTest-seed#[376832A856FD205D]-worker) [    ] o.m.log Extract jar:file:/export/home/jenkins/.ivy2/cache/org.apache.hadoop/hadoop-hdfs/tests/hadoop-hdfs-2.6.0-tests.jar!/webapps/datanode to ./temp/Jetty_solaris.vm_63084_datanode____.6ziteq/webapp
   [junit4]   2> 2660411 INFO  (IPC Server handler 3 on 50499) [    ] BlockStateChange BLOCK* processReport: from storage DS-30337cfb-ef15-4ac9-ac80-553167d34c1e node DatanodeRegistration(127.0.0.1, datanodeUuid=71e0724e-1780-4876-b9d5-f337c82aec49, infoPort=49098, ipcPort=57067, storageInfo=lv=-56;cid=testClusterID;nsid=1295373404;c=0), blocks: 0, hasStaleStorages: true, processing time: 0 msecs
   [junit4]   2> 2660411 INFO  (IPC Server handler 3 on 50499) [    ] BlockStateChange BLOCK* processReport: from storage DS-4a3157fd-9979-4382-af76-1a4f9d9c0248 node DatanodeRegistration(127.0.0.1, datanodeUuid=71e0724e-1780-4876-b9d5-f337c82aec49, infoPort=49098, ipcPort=57067, storageInfo=lv=-56;cid=testClusterID;nsid=1295373404;c=0), blocks: 0, hasStaleStorages: false, processing time: 0 msecs
   [junit4]   2> 2660426 INFO  (SUITE-StressHdfsTest-seed#[376832A856FD205D]-worker) [    ] o.m.log NO JSP Support for /, did not find org.apache.jasper.servlet.JspServlet
   [junit4]   2> 2660824 INFO  (SUITE-StressHdfsTest-seed#[376832A856FD205D]-worker) [    ] o.m.log Started HttpServer2$SelectChannelConnectorWithSafeStartup@solaris-vm:63084
   [junit4]   2> 2661053 INFO  (IPC Server handler 6 on 50499) [    ] BlockStateChange BLOCK* processReport: from storage DS-26be1bc1-07b0-4689-b334-1adf1ae0fcc6 node DatanodeRegistration(127.0.0.1, datanodeUuid=3a89a249-1c68-4f72-92b0-5273458cb34b, infoPort=63084, ipcPort=48242, storageInfo=lv=-56;cid=testClusterID;nsid=1295373404;c=0), blocks: 0, hasStaleStorages: true, processing time: 0 msecs
   [junit4]   2> 2661055 INFO  (IPC Server handler 6 on 50499) [    ] BlockStateChange BLOCK* processReport: from storage DS-228ffc1a-ebdb-43b7-8dc8-b5281a75e7d1 node DatanodeRegistration(127.0.0.1, datanodeUuid=3a89a249-1c68-4f72-92b0-5273458cb34b, infoPort=63084, ipcPort=48242, storageInfo=lv=-56;cid=testClusterID;nsid=1295373404;c=0), blocks: 0, hasStaleStorages: false, processing time: 0 msecs
   [junit4]   2> 2661127 INFO  (TEST-StressHdfsTest.test-seed#[376832A856FD205D]) [    ] o.a.s.c.ZkTestServer STARTING ZK TEST SERVER
   [junit4]   2> 2661127 INFO  (Thread-6046) [    ] o.a.s.c.ZkTestServer client port:0.0.0.0/0.0.0.0:0
   [junit4]   2> 2661127 INFO  (Thread-6046) [    ] o.a.s.c.ZkTestServer Starting server
   [junit4]   2> 2661227 INFO  (TEST-StressHdfsTest.test-seed#[376832A856FD205D]) [    ] o.a.s.c.ZkTestServer start zk server on port:46157
   [junit4]   2> 2661228 INFO  (TEST-StressHdfsTest.test-seed#[376832A856FD205D]) [    ] o.a.s.c.c.SolrZkClient Using default ZkCredentialsProvider
   [junit4]   2> 2661228 INFO  (TEST-StressHdfsTest.test-seed#[376832A856FD205D]) [    ] o.a.s.c.c.ConnectionManager Waiting for client to connect to ZooKeeper
   [junit4]   2> 2661232 INFO  (zkCallback-1780-thread-1) [    ] o.a.s.c.c.ConnectionManager Watcher org.apache.solr.common.cloud.ConnectionManager@74a38bba name:ZooKeeperConnection Watcher:127.0.0.1:46157 got event WatchedEvent state:SyncConnected type:None path:null path:null type:None
   [junit4]   2> 2661232 INFO  (TEST-StressHdfsTest.test-seed#[376832A856FD205D]) [    ] o.a.s.c.c.ConnectionManager Client is connected to ZooKeeper
   [junit4]   2> 2661233 INFO  (TEST-StressHdfsTest.test-seed#[376832A856FD205D]) [    ] o.a.s.c.c.SolrZkClient Using default ZkACLProvider
   [junit4]   2> 2661233 INFO  (TEST-StressHdfsTest.test-seed#[376832A856FD205D]) [    ] o.a.s.c.c.SolrZkClient makePath: /solr
   [junit4]   2> 2661237 INFO  (TEST-StressHdfsTest.test-seed#[376832A856FD205D]) [    ] o.a.s.c.c.SolrZkClient Using default ZkCredentialsProvider
   [junit4]   2> 2661237 INFO  (TEST-StressHdfsTest.test-seed#[376832A856FD205D]) [    ] o.a.s.c.c.ConnectionManager Waiting for client to connect to ZooKeeper
   [junit4]   2> 2661238 INFO  (zkCallback-1781-thread-1) [    ] o.a.s.c.c.ConnectionManager Watcher org.apache.solr.common.cloud.ConnectionManager@3b7fa1e8 name:ZooKeeperConnection Watcher:127.0.0.1:46157/solr got event WatchedEvent state:SyncConnected type:None path:null path:null type:None
   [junit4]   2> 2661238 INFO  (TEST-StressHdfsTest.test-seed#[376832A856FD205D]) [    ] o.a.s.c.c.ConnectionManager Client is connected to ZooKeeper
   [junit4]   2> 2661239 INFO  (TEST-StressHdfsTest.test-seed#[376832A856FD205D]) [    ] o.a.s.c.c.SolrZkClient Using default ZkACLProvider
   [junit4]   2> 2661239 INFO  (TEST-StressHdfsTest.test-seed#[376832A856FD205D]) [    ] o.a.s.c.c.SolrZkClient makePath: /collections/collection1
   [junit4]   2> 2661242 INFO  (TEST-StressHdfsTest.test-seed#[376832A856FD205D]) [    ] o.a.s.c.c.SolrZkClient makePath: /collections/collection1/shards
   [junit4]   2> 2661244 INFO  (TEST-StressHdfsTest.test-seed#[376832A856FD205D]) [    ] o.a.s.c.c.SolrZkClient makePath: /collections/control_collection
   [junit4]   2> 2661246 INFO  (TEST-StressHdfsTest.test-seed#[376832A856FD205D]) [    ] o.a.s.c.c.SolrZkClient makePath: /collections/control_collection/shards
   [junit4]   2> 2661248 INFO  (TEST-StressHdfsTest.test-seed#[376832A856FD205D]) [    ] o.a.s.c.AbstractZkTestCase put /export/home/jenkins/workspace/Lucene-Solr-5.x-Solaris/solr/core/src/test-files/solr/collection1/conf/solrconfig-tlog.xml to /configs/conf1/solrconfig.xml
   [junit4]   2> 2661248 INFO  (TEST-StressHdfsTest.test-seed#[376832A856FD205D]) [    ] o.a.s.c.c.SolrZkClient makePath: /configs/conf1/solrconfig.xml
   [junit4]   2> 2661252 INFO  (TEST-StressHdfsTest.test-seed#[376832A856FD205D]) [    ] o.a.s.c.AbstractZkTestCase put /export/home/jenkins/workspace/Lucene-Solr-5.x-Solaris/solr/core/src/test-files/solr/collection1/conf/schema.xml to /configs/conf1/schema.xml
   [junit4]   2> 2661252 INFO  (TEST-StressHdfsTest.test-seed#[376832A856FD205D]) [    ] o.a.s.c.c.SolrZkClient makePath: /configs/conf1/schema.xml
   [junit4]   2> 2661254 INFO  (TEST-StressHdfsTest.test-seed#[376832A856FD205D]) [    ] o.a.s.c.AbstractZkTestCase put /export/home/jenkins/workspace/Lucene-Solr-5.x-Solaris/solr/core/src/test-files/solr/collection1/conf/solrconfig.snippet.randomindexconfig.xml to /configs/conf1/solrconfig.snippet.randomindexconfig.xml
   [junit4]   2> 2661254 INFO  (TEST-StressHdfsTest.test-seed#[376832A856FD205D]) [    ] o.a.s.c.c.SolrZkClient makePath: /configs/conf1/solrconfig.snippet.randomindexconfig.xml
   [junit4]   2> 2661257 INFO  (TEST-StressHdfsTest.test-seed#[376832A856FD205D]) [    ] o.a.s.c.AbstractZkTestCase put /export/home/jenkins/workspace/Lucene-Solr-5.x-Solaris/solr/core/src/test-files/solr/collection1/conf/stopwords.txt to /configs/conf1/stopwords.txt
   [junit4]   2> 2661257 INFO  (TEST-StressHdfsTest.test-seed#[376832A856FD205D]) [    ] o.a.s.c.c.SolrZkClient makePath: /configs/conf1/stopwords.txt
   [junit4]   2> 2661259 INFO  (TEST-StressHdfsTest.test-seed#[376832A856FD205D]) [    ] o.a.s.c.AbstractZkTestCase put /export/home/jenkins/workspace/Lucene-Solr-5.x-Solaris/solr/core/src/test-files/solr/collection1/conf/protwords.txt to /configs/conf1/protwords.txt
   [junit4]   2> 2661259 INFO  (TEST-StressHdfsTest.test-seed#[376832A856FD205D]) [    ] o.a.s.c.c.SolrZkClient makePath: /configs/conf1/protwords.txt
   [junit4]   2> 2661261 INFO  (TEST-StressHdfsTest.test-seed#[376832A856FD205D]) [    ] o.a.s.c.AbstractZkTestCase put /export/home/jenkins/workspace/Lucene-Solr-5.x-Solaris/solr/core/src/test-files/solr/collection1/conf/currency.xml to /configs/conf1/currency.xml
   [junit4]   2> 2661262 INFO  (TEST-StressHdfsTest.test-seed#[376832A856FD205D]) [    ] o.a.s.c.c.SolrZkClient makePath: /configs/conf1/currency.xml
   [junit4]   2> 2661265 INFO  (TEST-StressHdfsTest.test-seed#[376832A856FD205D]) [    ] o.a.s.c.AbstractZkTestCase put /export/home/jenkins/workspace/Lucene-Solr-5.x-Solaris/solr/core/src/test-files/solr/collection1/conf/enumsConfig.xml to /configs/conf1/enumsConfig.xml
   [junit4]   2> 2661265 INFO  (TEST-StressHdfsTest.test-seed#[376832A856FD205D]) [    ] o.a.s.c.c.SolrZkClient makePath: /configs/conf1/enumsConfig.xml
   [junit4]   2> 2661267 INFO  (TEST-StressHdfsTest.test-seed#[376832A856FD205D]) [    ] o.a.s.c.AbstractZkTestCase put /export/home/jenkins/workspace/Lucene-Solr-5.x-Solaris/solr/core/src/test-files/solr/collection1/conf/open-exchange-rates.json to /configs/conf1/open-exchange-rates.json
   [junit4]   2> 2661268 INFO  (TEST-StressHdfsTest.test-seed#[376832A856FD205D]) [    ] o.a.s.c.c.SolrZkClient makePath: /configs/conf1/open-exchange-rates.json
   [junit4]   2> 2661270 INFO  (TEST-StressHdfsTest.test-seed#[376832A856FD205D]) [    ] o.a.s.c.AbstractZkTestCase put /export/home/jenkins/workspace/Lucene-Solr-5.x-Solaris/solr/core/src/test-files/solr/collection1/conf/mapping-ISOLatin1Accent.txt to /configs/conf1/mapping-ISOLatin1Accent.txt
   [junit4]   2> 2661271 INFO  (TEST-StressHdfsTest.test-seed#[376832A856FD205D]) [    ] o.a.s.c.c.SolrZkClient makePath: /configs/conf1/mapping-ISOLatin1Accent.txt
   [junit4]   2> 2661273 INFO  (TEST-StressHdfsTest.test-seed#[376832A856FD205D]) [    ] o.a.s.c.AbstractZkTestCase put /export/home/jenkins/workspace/Lucene-Solr-5.x-Solaris/solr/core/src/test-files/solr/collection1/conf/old_synonyms.txt to /configs/conf1/old_synonyms.txt
   [junit4]   2> 2661273 INFO  (TEST-StressHdfsTest.test-seed#[376832A856FD205D]) [    ] o.a.s.c.c.SolrZkClient makePath: /configs/conf1/old_synonyms.txt
   [junit4]   2> 2661277 INFO  (TEST-StressHdfsTest.test-seed#[376832A856FD205D]) [    ] o.a.s.c.AbstractZkTestCase put /export/home/jenkins/workspace/Lucene-Solr-5.x-Solaris/solr/core/src/test-files/solr/collection1/conf/synonyms.txt to /configs/conf1/synonyms.txt
   [junit4]   2> 2661277 INFO  (TEST-StressHdfsTest.test-seed#[376832A856FD205D]) [    ] o.a.s.c.c.SolrZkClient makePath: /configs/conf1/synonyms.txt
   [junit4]   2> 2661461 INFO  (TEST-StressHdfsTest.test-seed#[376832A856FD205D]) [    ] o.a.s.SolrTestCaseJ4 Writing core.properties file to /export/home/jenkins/workspace/Lucene-Solr-5.x-Solaris/solr/build/solr-core/test/J1/temp/solr.cloud.hdfs.StressHdfsTest_376832A856FD205D-001/control-001/cores/collection1
   [junit4]   2> 2661462 INFO  (TEST-StressHdfsTest.test-seed#[376832A856FD205D]) [    ] o.e.j.s.Server jetty-9.2.13.v20150730
   [junit4]   2> 2661465 INFO  (TEST-StressHdfsTest.test-seed#[376832A856FD205D]) [    ] o.e.j.s.h.ContextHandler Started o.e.j.s.ServletContextHandler@2f24e223{/enfyr/t,null,AVAILABLE}
   [junit4]   2> 2661465 INFO  (TEST-StressHdfsTest.test-seed#[376832A856FD205D]) [    ] o.e.j.s.ServerConnector Started ServerConnector@5b30f98a{HTTP/1.1}{127.0.0.1:56721}
   [junit4]   2> 2661465 INFO  (TEST-StressHdfsTest.test-seed#[376832A856FD205D]) [    ] o.e.j.s.Server Started @2665348ms
   [junit4]   2> 2661465 INFO  (TEST-StressHdfsTest.test-seed#[376832A856FD205D]) [    ] o.a.s.c.s.e.JettySolrRunner Jetty properties: {solr.data.dir=hdfs://solaris-vm:50499/hdfs__solaris-vm_50499__export_home_jenkins_workspace_Lucene-Solr-5.x-Solaris_solr_build_solr-core_test_J1_temp_solr.cloud.hdfs.StressHdfsTest_376832A856FD205D-001_tempDir-002_control_data, hostContext=/enfyr/t, hostPort=56721, coreRootDirectory=/export/home/jenkins/workspace/Lucene-Solr-5.x-Solaris/solr/build/solr-core/test/J1/../../../../../../../../../../export/home/jenkins/workspace/Lucene-Solr-5.x-Solaris/solr/build/solr-core/test/J1/temp/solr.cloud.hdfs.StressHdfsTest_376832A856FD205D-001/control-001/cores}
   [junit4]   2> 2661465 INFO  (TEST-StressHdfsTest.test-seed#[376832A856FD205D]) [    ] o.a.s.s.SolrDispatchFilter SolrDispatchFilter.init(): sun.misc.Launcher$AppClassLoader@659e0bfd
   [junit4]   2> 2661465 INFO  (TEST-StressHdfsTest.test-seed#[376832A856FD205D]) [    ] o.a.s.c.SolrResourceLoader new SolrResourceLoader for directory: '/export/home/jenkins/workspace/Lucene-Solr-5.x-Solaris/solr/build/solr-core/test/J1/temp/solr.cloud.hdfs.StressHdfsTest_376832A856FD205D-001/control-001'
   [junit4]   2> 2661466 INFO  (TEST-StressHdfsTest.test-seed#[376832A856FD205D]) [    ] o.a.s.c.SolrResourceLoader JNDI not configured for solr (NoInitialContextEx)
   [junit4]   2> 2661466 INFO  (TEST-StressHdfsTest.test-seed#[376832A856FD205D]) [    ] o.a.s.c.SolrResourceLoader solr home defaulted to 'solr/' (could not find system property or JNDI)
   [junit4]   2> 2661466 INFO  (TEST-StressHdfsTest.test-seed#[376832A856FD205D]) [    ] o.a.s.c.c.SolrZkClient Using default ZkCredentialsProvider
   [junit4]   2> 2661466 INFO  (TEST-StressHdfsTest.test-seed#[376832A856FD205D]) [    ] o.a.s.c.c.ConnectionManager Waiting for client to connect to ZooKeeper
   [junit4]   2> 2661468 INFO  (zkCallback-1782-thread-1) [    ] o.a.s.c.c.ConnectionManager Watcher org.apache.solr.common.cloud.ConnectionManager@2867d0be name:ZooKeeperConnection Watcher:127.0.0.1:46157/solr got event WatchedEvent state:SyncConnected type:None path:null path:null type:None
   [junit4]   2> 2661468 INFO  (TEST-StressHdfsTest.test-seed#[376832A856FD205D]) [    ] o.a.s.c.c.ConnectionManager Client is connected to ZooKeeper
   [junit4]   2> 2661469 INFO  (TEST-StressHdfsTest.test-seed#[376832A856FD205D]) [    ] o.a.s.c.c.SolrZkClient Using default ZkACLProvider
   [junit4]   2> 2661470 INFO  (TEST-StressHdfsTest.test-seed#[376832A856FD205D]) [    ] o.a.s.s.SolrDispatchFilter Loading solr.xml from SolrHome (not found in ZooKeeper)
   [junit4]   2> 2661470 INFO  (TEST-StressHdfsTest.test-seed#[376832A856FD205D]) [    ] o.a.s.c.SolrXmlConfig Loading container configuration from /export/home/jenkins/workspace/Lucene-Solr-5.x-Solaris/solr/build/solr-core/test/J1/temp/solr.cloud.hdfs.StressHdfsTest_376832A856FD205D-001/control-001/solr.xml
   [junit4]   2> 2661473 INFO  (TEST-StressHdfsTest.test-seed#[376832A856FD205D]) [    ] o.a.s.c.CorePropertiesLocator Config-defined core root directory: /export/home/jenkins/workspace/Lucene-Solr-5.x-Solaris/solr/build/solr-core/test/J1/../../../../../../../../../../export/home/jenkins/workspace/Lucene-Solr-5.x-Solaris/solr/build/solr-core/test/J1/temp/solr.cloud.hdfs.StressHdfsTest_376832A856FD205D-001/control-001/cores
   [junit4]   2> 2661473 INFO  (TEST-StressHdfsTest.test-seed#[376832A856FD205D]) [    ] o.a.s.c.CoreContainer New CoreContainer 1468627099
   [junit4]   2> 2661474 INFO  (TEST-StressHdfsTest.test-seed#[376832A856FD205D]) [    ] o.a.s.c.CoreContainer Loading cores into CoreContainer [instanceDir=/export/home/jenkins/workspace/Lucene-Solr-5.x-Solaris/solr/build/solr-core/test/J1/temp/solr.cloud.hdfs.StressHdfsTest_376832A856FD205D-001/control-001]
   [junit4]   2> 2661474 WARN  (TEST-StressHdfsTest.test-seed#[376832A856FD205D]) [    ] o.a.s.c.CoreContainer Couldn't add files from /export/home/jenkins/workspace/Lucene-Solr-5.x-Solaris/solr/build/solr-core/test/J1/temp/solr.cloud.hdfs.StressHdfsTest_376832A856FD205D-001/control-001/lib to classpath: /export/home/jenkins/workspace/Lucene-Solr-5.x-Solaris/solr/build/solr-core/test/J1/temp/solr.cloud.hdfs.StressHdfsTest_376832A856FD205D-001/control-001/lib
   [junit4]   2> 2661474 INFO  (TEST-StressHdfsTest.test-seed#[376832A856FD205D]) [    ] o.a.s.h.c.HttpShardHandlerFactory created with socketTimeout : 90000,urlScheme : ,connTimeout : 15000,maxConnectionsPerHost : 20,maxConnections : 10000,corePoolSize : 0,maximumPoolSize : 2147483647,maxThreadIdleTime : 5,sizeOfQueue : -1,fairnessPolicy : false,useRetries : false,
   [junit4]

[...truncated too long message...]

at com.carrotsearch.randomizedtesting.RandomizedRunner$7.evaluate(RandomizedRunner.java:834)
   [junit4]   2> 	at com.carrotsearch.randomizedtesting.rules.StatementAdapter.evaluate(StatementAdapter.java:36)
   [junit4]   2> 	at com.carrotsearch.randomizedtesting.rules.SystemPropertiesRestoreRule$1.evaluate(SystemPropertiesRestoreRule.java:57)
   [junit4]   2> 	at org.apache.lucene.util.AbstractBeforeAfterRule$1.evaluate(AbstractBeforeAfterRule.java:46)
   [junit4]   2> 	at com.carrotsearch.randomizedtesting.rules.StatementAdapter.evaluate(StatementAdapter.java:36)
   [junit4]   2> 	at org.apache.lucene.util.TestRuleStoreClassName$1.evaluate(TestRuleStoreClassName.java:42)
   [junit4]   2> 	at com.carrotsearch.randomizedtesting.rules.NoShadowingOrOverridesOnMethodsRule$1.evaluate(NoShadowingOrOverridesOnMethodsRule.java:40)
   [junit4]   2> 	at com.carrotsearch.randomizedtesting.rules.NoShadowingOrOverridesOnMethodsRule$1.evaluate(NoShadowingOrOverridesOnMethodsRule.java:40)
   [junit4]   2> 	at com.carrotsearch.randomizedtesting.rules.StatementAdapter.evaluate(StatementAdapter.java:36)
   [junit4]   2> 	at com.carrotsearch.randomizedtesting.rules.StatementAdapter.evaluate(StatementAdapter.java:36)
   [junit4]   2> 	at com.carrotsearch.randomizedtesting.rules.StatementAdapter.evaluate(StatementAdapter.java:36)
   [junit4]   2> 	at org.apache.lucene.util.TestRuleAssertionsRequired$1.evaluate(TestRuleAssertionsRequired.java:54)
   [junit4]   2> 	at org.apache.lucene.util.TestRuleMarkFailure$1.evaluate(TestRuleMarkFailure.java:48)
   [junit4]   2> 	at org.apache.lucene.util.TestRuleIgnoreAfterMaxFailures$1.evaluate(TestRuleIgnoreAfterMaxFailures.java:65)
   [junit4]   2> 	at org.apache.lucene.util.TestRuleIgnoreTestSuites$1.evaluate(TestRuleIgnoreTestSuites.java:55)
   [junit4]   2> 	at com.carrotsearch.randomizedtesting.rules.StatementAdapter.evaluate(StatementAdapter.java:36)
   [junit4]   2> 	at com.carrotsearch.randomizedtesting.ThreadLeakControl$StatementRunner.run(ThreadLeakControl.java:367)
   [junit4]   2> 	at java.lang.Thread.run(Thread.java:745)
   [junit4]   2> Caused by: java.lang.NullPointerException
   [junit4]   2> 	at org.apache.hadoop.hdfs.server.blockmanagement.BlocksMap.size(BlocksMap.java:198)
   [junit4]   2> 	at org.apache.hadoop.hdfs.server.blockmanagement.BlockManager.getTotalBlocks(BlockManager.java:3291)
   [junit4]   2> 	at org.apache.hadoop.hdfs.server.namenode.FSNamesystem.getBlocksTotal(FSNamesystem.java:6223)
   [junit4]   2> 	... 54 more
   [junit4]   2> 2705673 INFO  (SUITE-StressHdfsTest-seed#[376832A856FD205D]-worker) [n:127.0.0.1:50198_enfyr%2Ft c:delete_data_dir s:shard2 r:core_node1 x:delete_data_dir_shard2_replica1] o.a.s.SolrTestCaseJ4 ###deleteCore
   [junit4]   2> NOTE: leaving temporary files on disk at: /export/home/jenkins/workspace/Lucene-Solr-5.x-Solaris/solr/build/solr-core/test/J1/temp/solr.cloud.hdfs.StressHdfsTest_376832A856FD205D-001
   [junit4]   2> Jan 08, 2016 2:10:48 PM com.carrotsearch.randomizedtesting.ThreadLeakControl checkThreadLeaks
   [junit4]   2> WARNING: Will linger awaiting termination of 3 leaked thread(s).
   [junit4]   2> NOTE: test params are: codec=FastCompressingStoredFields(storedFieldsFormat=CompressingStoredFieldsFormat(compressionMode=FAST, chunkSize=18976, maxDocsPerChunk=633, blockSize=5), termVectorsFormat=CompressingTermVectorsFormat(compressionMode=FAST, chunkSize=18976, blockSize=5)), sim=DefaultSimilarity, locale=ga_IE, timezone=CET
   [junit4]   2> NOTE: SunOS 5.11 amd64/Oracle Corporation 1.8.0_66 (64-bit)/cpus=3,threads=2,free=188520992,total=518979584
   [junit4]   2> NOTE: All tests run in this JVM: [TestTrackingShardHandlerFactory, TestPHPSerializedResponseWriter, QueryParsingTest, DeleteReplicaTest, TestRequestStatusCollectionAPI, TestSolrIndexConfig, TestReplicaProperties, TestJsonRequest, TestReloadDeadlock, NoCacheHeaderTest, TestQuerySenderListener, TestBinaryResponseWriter, TestLMJelinekMercerSimilarityFactory, CurrencyFieldOpenExchangeTest, OutputWriterTest, TestFiltering, BlockJoinFacetRandomTest, TestValueSourceCache, TestStressRecovery, TestSolrCoreProperties, CachingDirectoryFactoryTest, OverseerStatusTest, StatsComponentTest, CoreAdminHandlerTest, TestRawResponseWriter, SpatialRPTFieldTypeTest, DistribCursorPagingTest, SparseHLLTest, ExitableDirectoryReaderTest, BasicFunctionalityTest, BadIndexSchemaTest, WordBreakSolrSpellCheckerTest, TestHashQParserPlugin, ConnectionManagerTest, TestInitParams, TestMaxScoreQueryParser, SolrIndexSplitterTest, RankQueryTest, TestDefaultSearchFieldResource, TestRecovery, TestStressUserVersions, TestReloadAndDeleteDocs, CollectionsAPIDistributedZkTest, ChangedSchemaMergeTest, CleanupOldIndexTest, TestRangeQuery, HdfsNNFailoverTest, SpellingQueryConverterTest, DebugComponentTest, BasicZkTest, TestRandomFaceting, EchoParamsTest, ActionThrottleTest, TestClassNameShortening, DefaultValueUpdateProcessorTest, SpellCheckCollatorTest, TestConfigSetImmutable, TestAuthorizationFramework, TestReversedWildcardFilterFactory, TestSolrJ, TestFoldingMultitermQuery, DocValuesMissingTest, CursorMarkTest, SynonymTokenizerTest, DirectUpdateHandlerOptimizeTest, TestIntervalFaceting, TestExactStatsCache, NotRequiredUniqueKeyTest, PluginInfoTest, TestOrdValues, RequestHandlersTest, TestJoin, TestSolrDeletionPolicy2, TestChildDocTransformer, TestNamedUpdateProcessors, TestDistributedMissingSort, TestSuggestSpellingConverter, TestZkChroot, TestRTimerTree, TestCharFilters, TestFastOutputStream, TestSolrConfigHandler, TestRandomCollapseQParserPlugin, TestFastWriter, TestCollationField, FieldMutatingUpdateProcessorTest, HighlighterConfigTest, HighlighterMaxOffsetTest, TestManagedSchemaFieldResource, TestOmitPositions, TestCoreDiscovery, TestScoreJoinQPNoScore, DistributedMLTComponentTest, DistributedFacetPivotSmallTest, HdfsRecoveryZkTest, TestQueryTypes, TestQueryUtils, SpellPossibilityIteratorTest, TestJsonFacets, RAMDirectoryFactoryTest, TestCloudManagedSchema, TestSolrConfigHandlerConcurrent, HttpPartitionTest, SimpleMLTQParserTest, DistributedSuggestComponentTest, TestRestoreCore, SignatureUpdateProcessorFactoryTest, ConvertedLegacyTest, SegmentsInfoRequestHandlerTest, TestSimpleTrackingShardHandler, TestTrie, SortByFunctionTest, TestWriterPerf, TestRandomRequestDistribution, HdfsUnloadDistributedZkTest, TestNonDefinedSimilarityFactory, SolrCmdDistributorTest, FileUtilsTest, TestReRankQParserPlugin, TestSolrQueryParser, ZkSolrClientTest, QueryResultKeyTest, TestIndexSearcher, SaslZkACLProviderTest, CopyFieldTest, TestFileDictionaryLookup, DistributedVersionInfoTest, TestSolrQueryParserDefaultOperatorResource, DistanceFunctionTest, TestFieldResource, ResponseLogComponentTest, BasicDistributedZk2Test, LukeRequestHandlerTest, AtomicUpdatesTest, TestReload, TestFieldTypeResource, DataDrivenBlockJoinTest, TestBlobHandler, ChaosMonkeySafeLeaderTest, SyncSliceTest, OpenCloseCoreStressTest, LeaderElectionIntegrationTest, ShardRoutingTest, RecoveryZkTest, FullSolrCloudDistribCmdsTest, ShardRoutingCustomTest, TestDistributedSearch, XmlUpdateRequestHandlerTest, TermVectorComponentTest, MoreLikeThisHandlerTest, FieldAnalysisRequestHandlerTest, IndexSchemaRuntimeFieldTest, SolrPluginUtilsTest, ReturnFieldsTest, UpdateRequestProcessorFactoryTest, TestCSVResponseWriter, UniqFieldsUpdateProcessorFactoryTest, BinaryUpdateRequestHandlerTest, CSVRequestHandlerTest, TestComponentsName, SearchHandlerTest, TestLFUCache, TestSystemIdResolver, DateFieldTest, TestLRUCache, TestUtils, TestDocumentBuilder, ZkNodePropsTest, UUIDFieldTest, TestRTGBase, CursorPagingTest, DistributedIntervalFacetingTest, SolrTestCaseJ4Test, TestCrossCoreJoin, TestCursorMarkWithoutUniqueKey, TestHighlightDedupGrouping, AssignTest, AsyncMigrateRouteKeyTest, CollectionReloadTest, CollectionsAPIAsyncDistributedZkTest, DeleteLastCustomShardedReplicaTest, DeleteShardTest, DistribDocExpirationUpdateProcessorTest, LeaderInitiatedRecoveryOnCommitTest, LeaderInitiatedRecoveryOnShardRestartTest, MigrateRouteKeyTest, OutOfBoxZkACLAndCredentialsProvidersTest, OverseerCollectionConfigSetProcessorTest, OverseerTaskQueueTest, RecoveryAfterSoftCommitTest, SSLMigrationTest, SharedFSAutoReplicaFailoverTest, SimpleCollectionCreateDeleteTest, SolrCloudExampleTest, SolrXmlInZkTest, TestAuthenticationFramework, TestLeaderInitiatedRecoveryThread, TestRebalanceLeaders, TestShortCircuitedRequests, TriLevelCompositeIdRoutingTest, HdfsBasicDistributedZk2Test, HdfsBasicDistributedZkTest, HdfsChaosMonkeySafeLeaderTest, HdfsRestartWhileUpdatingTest, HdfsSyncSliceTest, HdfsWriteToMultipleCollectionsTest, StressHdfsTest]
   [junit4] Completed [460/563 (2!)] on J1 in 56.62s, 1 test, 1 error <<< FAILURES!

[...truncated 324 lines...]
BUILD FAILED
/export/home/jenkins/workspace/Lucene-Solr-5.x-Solaris/build.xml:794: The following error occurred while executing this line:
/export/home/jenkins/workspace/Lucene-Solr-5.x-Solaris/build.xml:738: The following error occurred while executing this line:
/export/home/jenkins/workspace/Lucene-Solr-5.x-Solaris/build.xml:59: The following error occurred while executing this line:
/export/home/jenkins/workspace/Lucene-Solr-5.x-Solaris/solr/build.xml:233: The following error occurred while executing this line:
/export/home/jenkins/workspace/Lucene-Solr-5.x-Solaris/solr/common-build.xml:526: The following error occurred while executing this line:
/export/home/jenkins/workspace/Lucene-Solr-5.x-Solaris/lucene/common-build.xml:1444: The following error occurred while executing this line:
/export/home/jenkins/workspace/Lucene-Solr-5.x-Solaris/lucene/common-build.xml:1000: There were test failures: 563 suites (7 ignored), 2236 tests, 2 errors, 54 ignored (39 assumptions) [seed: 376832A856FD205D]

Total time: 77 minutes 9 seconds
Build step 'Invoke Ant' marked build as failure
Archiving artifacts
[WARNINGS] Skipping publisher since build result is FAILURE
Recording test results
Email was triggered for: Failure - Any
Sending email for trigger: Failure - Any



Mime
View raw message