lucene-dev mailing list archives

Site index · List index
Message view « Date » · « Thread »
Top « Date » · « Thread »
From Policeman Jenkins Server <jenk...@thetaphi.de>
Subject [JENKINS] Lucene-Solr-5.x-Linux (64bit/jdk1.7.0_80) - Build # 15177 - Still Failing!
Date Thu, 07 Jan 2016 21:20:25 GMT
Build: http://jenkins.thetaphi.de/job/Lucene-Solr-5.x-Linux/15177/
Java: 64bit/jdk1.7.0_80 -XX:+UseCompressedOops -XX:+UseSerialGC

7 tests failed.
FAILED:  org.apache.solr.cloud.BasicDistributedZk2Test.test

Error Message:
No live SolrServers available to handle this request:[http://127.0.0.1:37744/wasow/v/collection1, http://127.0.0.1:48791/wasow/v/collection1]

Stack Trace:
org.apache.solr.client.solrj.SolrServerException: No live SolrServers available to handle this request:[http://127.0.0.1:37744/wasow/v/collection1, http://127.0.0.1:48791/wasow/v/collection1]
	at __randomizedtesting.SeedInfo.seed([9EB7E12EA912CEE6:16E3DEF407EEA31E]:0)
	at org.apache.solr.client.solrj.impl.LBHttpSolrClient.request(LBHttpSolrClient.java:352)
	at org.apache.solr.client.solrj.impl.CloudSolrClient.sendRequest(CloudSolrClient.java:1100)
	at org.apache.solr.client.solrj.impl.CloudSolrClient.requestWithRetryOnStaleState(CloudSolrClient.java:871)
	at org.apache.solr.client.solrj.impl.CloudSolrClient.request(CloudSolrClient.java:807)
	at org.apache.solr.client.solrj.SolrRequest.process(SolrRequest.java:150)
	at org.apache.solr.client.solrj.SolrClient.query(SolrClient.java:943)
	at org.apache.solr.client.solrj.SolrClient.query(SolrClient.java:958)
	at org.apache.solr.cloud.AbstractFullDistribZkTestBase.queryServer(AbstractFullDistribZkTestBase.java:1378)
	at org.apache.solr.BaseDistributedSearchTestCase.query(BaseDistributedSearchTestCase.java:610)
	at org.apache.solr.BaseDistributedSearchTestCase.query(BaseDistributedSearchTestCase.java:592)
	at org.apache.solr.BaseDistributedSearchTestCase.query(BaseDistributedSearchTestCase.java:571)
	at org.apache.solr.cloud.BasicDistributedZk2Test.brindDownShardIndexSomeDocsAndRecover(BasicDistributedZk2Test.java:280)
	at org.apache.solr.cloud.BasicDistributedZk2Test.test(BasicDistributedZk2Test.java:98)
	at sun.reflect.NativeMethodAccessorImpl.invoke0(Native Method)
	at sun.reflect.NativeMethodAccessorImpl.invoke(NativeMethodAccessorImpl.java:57)
	at sun.reflect.DelegatingMethodAccessorImpl.invoke(DelegatingMethodAccessorImpl.java:43)
	at java.lang.reflect.Method.invoke(Method.java:606)
	at com.carrotsearch.randomizedtesting.RandomizedRunner.invoke(RandomizedRunner.java:1764)
	at com.carrotsearch.randomizedtesting.RandomizedRunner$8.evaluate(RandomizedRunner.java:871)
	at com.carrotsearch.randomizedtesting.RandomizedRunner$9.evaluate(RandomizedRunner.java:907)
	at com.carrotsearch.randomizedtesting.RandomizedRunner$10.evaluate(RandomizedRunner.java:921)
	at org.apache.solr.BaseDistributedSearchTestCase$ShardsRepeatRule$ShardsFixedStatement.callStatement(BaseDistributedSearchTestCase.java:965)
	at org.apache.solr.BaseDistributedSearchTestCase$ShardsRepeatRule$ShardsStatement.evaluate(BaseDistributedSearchTestCase.java:940)
	at com.carrotsearch.randomizedtesting.rules.SystemPropertiesRestoreRule$1.evaluate(SystemPropertiesRestoreRule.java:57)
	at org.apache.lucene.util.TestRuleSetupTeardownChained$1.evaluate(TestRuleSetupTeardownChained.java:50)
	at org.apache.lucene.util.AbstractBeforeAfterRule$1.evaluate(AbstractBeforeAfterRule.java:46)
	at org.apache.lucene.util.TestRuleThreadAndTestName$1.evaluate(TestRuleThreadAndTestName.java:49)
	at org.apache.lucene.util.TestRuleIgnoreAfterMaxFailures$1.evaluate(TestRuleIgnoreAfterMaxFailures.java:65)
	at org.apache.lucene.util.TestRuleMarkFailure$1.evaluate(TestRuleMarkFailure.java:48)
	at com.carrotsearch.randomizedtesting.rules.StatementAdapter.evaluate(StatementAdapter.java:36)
	at com.carrotsearch.randomizedtesting.ThreadLeakControl$StatementRunner.run(ThreadLeakControl.java:367)
	at com.carrotsearch.randomizedtesting.ThreadLeakControl.forkTimeoutingTask(ThreadLeakControl.java:809)
	at com.carrotsearch.randomizedtesting.ThreadLeakControl$3.evaluate(ThreadLeakControl.java:460)
	at com.carrotsearch.randomizedtesting.RandomizedRunner.runSingleTest(RandomizedRunner.java:880)
	at com.carrotsearch.randomizedtesting.RandomizedRunner$5.evaluate(RandomizedRunner.java:781)
	at com.carrotsearch.randomizedtesting.RandomizedRunner$6.evaluate(RandomizedRunner.java:816)
	at com.carrotsearch.randomizedtesting.RandomizedRunner$7.evaluate(RandomizedRunner.java:827)
	at com.carrotsearch.randomizedtesting.rules.StatementAdapter.evaluate(StatementAdapter.java:36)
	at com.carrotsearch.randomizedtesting.rules.SystemPropertiesRestoreRule$1.evaluate(SystemPropertiesRestoreRule.java:57)
	at org.apache.lucene.util.AbstractBeforeAfterRule$1.evaluate(AbstractBeforeAfterRule.java:46)
	at com.carrotsearch.randomizedtesting.rules.StatementAdapter.evaluate(StatementAdapter.java:36)
	at org.apache.lucene.util.TestRuleStoreClassName$1.evaluate(TestRuleStoreClassName.java:42)
	at com.carrotsearch.randomizedtesting.rules.NoShadowingOrOverridesOnMethodsRule$1.evaluate(NoShadowingOrOverridesOnMethodsRule.java:40)
	at com.carrotsearch.randomizedtesting.rules.NoShadowingOrOverridesOnMethodsRule$1.evaluate(NoShadowingOrOverridesOnMethodsRule.java:40)
	at com.carrotsearch.randomizedtesting.rules.StatementAdapter.evaluate(StatementAdapter.java:36)
	at com.carrotsearch.randomizedtesting.rules.StatementAdapter.evaluate(StatementAdapter.java:36)
	at com.carrotsearch.randomizedtesting.rules.StatementAdapter.evaluate(StatementAdapter.java:36)
	at org.apache.lucene.util.TestRuleAssertionsRequired$1.evaluate(TestRuleAssertionsRequired.java:54)
	at org.apache.lucene.util.TestRuleMarkFailure$1.evaluate(TestRuleMarkFailure.java:48)
	at org.apache.lucene.util.TestRuleIgnoreAfterMaxFailures$1.evaluate(TestRuleIgnoreAfterMaxFailures.java:65)
	at org.apache.lucene.util.TestRuleIgnoreTestSuites$1.evaluate(TestRuleIgnoreTestSuites.java:55)
	at com.carrotsearch.randomizedtesting.rules.StatementAdapter.evaluate(StatementAdapter.java:36)
	at com.carrotsearch.randomizedtesting.ThreadLeakControl$StatementRunner.run(ThreadLeakControl.java:367)
	at java.lang.Thread.run(Thread.java:745)
Caused by: org.apache.solr.client.solrj.impl.HttpSolrClient$RemoteSolrException: Error from server at http://127.0.0.1:48791/wasow/v/collection1: no servers hosting shard: shard1
	at org.apache.solr.client.solrj.impl.HttpSolrClient.executeMethod(HttpSolrClient.java:575)
	at org.apache.solr.client.solrj.impl.HttpSolrClient.request(HttpSolrClient.java:241)
	at org.apache.solr.client.solrj.impl.HttpSolrClient.request(HttpSolrClient.java:230)
	at org.apache.solr.client.solrj.impl.LBHttpSolrClient.doRequest(LBHttpSolrClient.java:372)
	at org.apache.solr.client.solrj.impl.LBHttpSolrClient.request(LBHttpSolrClient.java:325)
	... 53 more


FAILED:  org.apache.solr.cloud.CustomCollectionTest.test

Error Message:
expected:<3> but was:<0>

Stack Trace:
java.lang.AssertionError: expected:<3> but was:<0>
	at __randomizedtesting.SeedInfo.seed([9EB7E12EA912CEE6:16E3DEF407EEA31E]:0)
	at org.junit.Assert.fail(Assert.java:93)
	at org.junit.Assert.failNotEquals(Assert.java:647)
	at org.junit.Assert.assertEquals(Assert.java:128)
	at org.junit.Assert.assertEquals(Assert.java:472)
	at org.junit.Assert.assertEquals(Assert.java:456)
	at org.apache.solr.cloud.CustomCollectionTest.testCustomCollectionsAPI(CustomCollectionTest.java:216)
	at org.apache.solr.cloud.CustomCollectionTest.test(CustomCollectionTest.java:100)
	at sun.reflect.NativeMethodAccessorImpl.invoke0(Native Method)
	at sun.reflect.NativeMethodAccessorImpl.invoke(NativeMethodAccessorImpl.java:57)
	at sun.reflect.DelegatingMethodAccessorImpl.invoke(DelegatingMethodAccessorImpl.java:43)
	at java.lang.reflect.Method.invoke(Method.java:606)
	at com.carrotsearch.randomizedtesting.RandomizedRunner.invoke(RandomizedRunner.java:1764)
	at com.carrotsearch.randomizedtesting.RandomizedRunner$8.evaluate(RandomizedRunner.java:871)
	at com.carrotsearch.randomizedtesting.RandomizedRunner$9.evaluate(RandomizedRunner.java:907)
	at com.carrotsearch.randomizedtesting.RandomizedRunner$10.evaluate(RandomizedRunner.java:921)
	at org.apache.solr.BaseDistributedSearchTestCase$ShardsRepeatRule$ShardsFixedStatement.callStatement(BaseDistributedSearchTestCase.java:965)
	at org.apache.solr.BaseDistributedSearchTestCase$ShardsRepeatRule$ShardsStatement.evaluate(BaseDistributedSearchTestCase.java:940)
	at com.carrotsearch.randomizedtesting.rules.SystemPropertiesRestoreRule$1.evaluate(SystemPropertiesRestoreRule.java:57)
	at org.apache.lucene.util.TestRuleSetupTeardownChained$1.evaluate(TestRuleSetupTeardownChained.java:50)
	at org.apache.lucene.util.AbstractBeforeAfterRule$1.evaluate(AbstractBeforeAfterRule.java:46)
	at org.apache.lucene.util.TestRuleThreadAndTestName$1.evaluate(TestRuleThreadAndTestName.java:49)
	at org.apache.lucene.util.TestRuleIgnoreAfterMaxFailures$1.evaluate(TestRuleIgnoreAfterMaxFailures.java:65)
	at org.apache.lucene.util.TestRuleMarkFailure$1.evaluate(TestRuleMarkFailure.java:48)
	at com.carrotsearch.randomizedtesting.rules.StatementAdapter.evaluate(StatementAdapter.java:36)
	at com.carrotsearch.randomizedtesting.ThreadLeakControl$StatementRunner.run(ThreadLeakControl.java:367)
	at com.carrotsearch.randomizedtesting.ThreadLeakControl.forkTimeoutingTask(ThreadLeakControl.java:809)
	at com.carrotsearch.randomizedtesting.ThreadLeakControl$3.evaluate(ThreadLeakControl.java:460)
	at com.carrotsearch.randomizedtesting.RandomizedRunner.runSingleTest(RandomizedRunner.java:880)
	at com.carrotsearch.randomizedtesting.RandomizedRunner$5.evaluate(RandomizedRunner.java:781)
	at com.carrotsearch.randomizedtesting.RandomizedRunner$6.evaluate(RandomizedRunner.java:816)
	at com.carrotsearch.randomizedtesting.RandomizedRunner$7.evaluate(RandomizedRunner.java:827)
	at com.carrotsearch.randomizedtesting.rules.StatementAdapter.evaluate(StatementAdapter.java:36)
	at com.carrotsearch.randomizedtesting.rules.SystemPropertiesRestoreRule$1.evaluate(SystemPropertiesRestoreRule.java:57)
	at org.apache.lucene.util.AbstractBeforeAfterRule$1.evaluate(AbstractBeforeAfterRule.java:46)
	at com.carrotsearch.randomizedtesting.rules.StatementAdapter.evaluate(StatementAdapter.java:36)
	at org.apache.lucene.util.TestRuleStoreClassName$1.evaluate(TestRuleStoreClassName.java:42)
	at com.carrotsearch.randomizedtesting.rules.NoShadowingOrOverridesOnMethodsRule$1.evaluate(NoShadowingOrOverridesOnMethodsRule.java:40)
	at com.carrotsearch.randomizedtesting.rules.NoShadowingOrOverridesOnMethodsRule$1.evaluate(NoShadowingOrOverridesOnMethodsRule.java:40)
	at com.carrotsearch.randomizedtesting.rules.StatementAdapter.evaluate(StatementAdapter.java:36)
	at com.carrotsearch.randomizedtesting.rules.StatementAdapter.evaluate(StatementAdapter.java:36)
	at com.carrotsearch.randomizedtesting.rules.StatementAdapter.evaluate(StatementAdapter.java:36)
	at org.apache.lucene.util.TestRuleAssertionsRequired$1.evaluate(TestRuleAssertionsRequired.java:54)
	at org.apache.lucene.util.TestRuleMarkFailure$1.evaluate(TestRuleMarkFailure.java:48)
	at org.apache.lucene.util.TestRuleIgnoreAfterMaxFailures$1.evaluate(TestRuleIgnoreAfterMaxFailures.java:65)
	at org.apache.lucene.util.TestRuleIgnoreTestSuites$1.evaluate(TestRuleIgnoreTestSuites.java:55)
	at com.carrotsearch.randomizedtesting.rules.StatementAdapter.evaluate(StatementAdapter.java:36)
	at com.carrotsearch.randomizedtesting.ThreadLeakControl$StatementRunner.run(ThreadLeakControl.java:367)
	at java.lang.Thread.run(Thread.java:745)


FAILED:  org.apache.solr.cloud.DistributedVersionInfoTest.test

Error Message:
Doc with id=1 not found in http://127.0.0.1:33937/c8n_vers_1x3_shard1_replica1 due to: Path not found: /id; rsp={doc=null}

Stack Trace:
java.lang.AssertionError: Doc with id=1 not found in http://127.0.0.1:33937/c8n_vers_1x3_shard1_replica1 due to: Path not found: /id; rsp={doc=null}
	at __randomizedtesting.SeedInfo.seed([9EB7E12EA912CEE6:16E3DEF407EEA31E]:0)
	at org.junit.Assert.fail(Assert.java:93)
	at org.junit.Assert.assertTrue(Assert.java:43)
	at org.apache.solr.cloud.DistributedVersionInfoTest.assertDocExists(DistributedVersionInfoTest.java:367)
	at org.apache.solr.cloud.DistributedVersionInfoTest.assertDocsExistInAllReplicas(DistributedVersionInfoTest.java:334)
	at org.apache.solr.cloud.DistributedVersionInfoTest.testReplicaVersionHandling(DistributedVersionInfoTest.java:100)
	at org.apache.solr.cloud.DistributedVersionInfoTest.test(DistributedVersionInfoTest.java:75)
	at sun.reflect.NativeMethodAccessorImpl.invoke0(Native Method)
	at sun.reflect.NativeMethodAccessorImpl.invoke(NativeMethodAccessorImpl.java:57)
	at sun.reflect.DelegatingMethodAccessorImpl.invoke(DelegatingMethodAccessorImpl.java:43)
	at java.lang.reflect.Method.invoke(Method.java:606)
	at com.carrotsearch.randomizedtesting.RandomizedRunner.invoke(RandomizedRunner.java:1764)
	at com.carrotsearch.randomizedtesting.RandomizedRunner$8.evaluate(RandomizedRunner.java:871)
	at com.carrotsearch.randomizedtesting.RandomizedRunner$9.evaluate(RandomizedRunner.java:907)
	at com.carrotsearch.randomizedtesting.RandomizedRunner$10.evaluate(RandomizedRunner.java:921)
	at org.apache.solr.BaseDistributedSearchTestCase$ShardsRepeatRule$ShardsFixedStatement.callStatement(BaseDistributedSearchTestCase.java:965)
	at org.apache.solr.BaseDistributedSearchTestCase$ShardsRepeatRule$ShardsStatement.evaluate(BaseDistributedSearchTestCase.java:940)
	at com.carrotsearch.randomizedtesting.rules.SystemPropertiesRestoreRule$1.evaluate(SystemPropertiesRestoreRule.java:57)
	at org.apache.lucene.util.TestRuleSetupTeardownChained$1.evaluate(TestRuleSetupTeardownChained.java:50)
	at org.apache.lucene.util.AbstractBeforeAfterRule$1.evaluate(AbstractBeforeAfterRule.java:46)
	at org.apache.lucene.util.TestRuleThreadAndTestName$1.evaluate(TestRuleThreadAndTestName.java:49)
	at org.apache.lucene.util.TestRuleIgnoreAfterMaxFailures$1.evaluate(TestRuleIgnoreAfterMaxFailures.java:65)
	at org.apache.lucene.util.TestRuleMarkFailure$1.evaluate(TestRuleMarkFailure.java:48)
	at com.carrotsearch.randomizedtesting.rules.StatementAdapter.evaluate(StatementAdapter.java:36)
	at com.carrotsearch.randomizedtesting.ThreadLeakControl$StatementRunner.run(ThreadLeakControl.java:367)
	at com.carrotsearch.randomizedtesting.ThreadLeakControl.forkTimeoutingTask(ThreadLeakControl.java:809)
	at com.carrotsearch.randomizedtesting.ThreadLeakControl$3.evaluate(ThreadLeakControl.java:460)
	at com.carrotsearch.randomizedtesting.RandomizedRunner.runSingleTest(RandomizedRunner.java:880)
	at com.carrotsearch.randomizedtesting.RandomizedRunner$5.evaluate(RandomizedRunner.java:781)
	at com.carrotsearch.randomizedtesting.RandomizedRunner$6.evaluate(RandomizedRunner.java:816)
	at com.carrotsearch.randomizedtesting.RandomizedRunner$7.evaluate(RandomizedRunner.java:827)
	at com.carrotsearch.randomizedtesting.rules.StatementAdapter.evaluate(StatementAdapter.java:36)
	at com.carrotsearch.randomizedtesting.rules.SystemPropertiesRestoreRule$1.evaluate(SystemPropertiesRestoreRule.java:57)
	at org.apache.lucene.util.AbstractBeforeAfterRule$1.evaluate(AbstractBeforeAfterRule.java:46)
	at com.carrotsearch.randomizedtesting.rules.StatementAdapter.evaluate(StatementAdapter.java:36)
	at org.apache.lucene.util.TestRuleStoreClassName$1.evaluate(TestRuleStoreClassName.java:42)
	at com.carrotsearch.randomizedtesting.rules.NoShadowingOrOverridesOnMethodsRule$1.evaluate(NoShadowingOrOverridesOnMethodsRule.java:40)
	at com.carrotsearch.randomizedtesting.rules.NoShadowingOrOverridesOnMethodsRule$1.evaluate(NoShadowingOrOverridesOnMethodsRule.java:40)
	at com.carrotsearch.randomizedtesting.rules.StatementAdapter.evaluate(StatementAdapter.java:36)
	at com.carrotsearch.randomizedtesting.rules.StatementAdapter.evaluate(StatementAdapter.java:36)
	at com.carrotsearch.randomizedtesting.rules.StatementAdapter.evaluate(StatementAdapter.java:36)
	at org.apache.lucene.util.TestRuleAssertionsRequired$1.evaluate(TestRuleAssertionsRequired.java:54)
	at org.apache.lucene.util.TestRuleMarkFailure$1.evaluate(TestRuleMarkFailure.java:48)
	at org.apache.lucene.util.TestRuleIgnoreAfterMaxFailures$1.evaluate(TestRuleIgnoreAfterMaxFailures.java:65)
	at org.apache.lucene.util.TestRuleIgnoreTestSuites$1.evaluate(TestRuleIgnoreTestSuites.java:55)
	at com.carrotsearch.randomizedtesting.rules.StatementAdapter.evaluate(StatementAdapter.java:36)
	at com.carrotsearch.randomizedtesting.ThreadLeakControl$StatementRunner.run(ThreadLeakControl.java:367)
	at java.lang.Thread.run(Thread.java:745)


FAILED:  org.apache.solr.cloud.HttpPartitionTest.test

Error Message:
Unexpected achieved replication factor expected:<2> but was:<1>

Stack Trace:
java.lang.AssertionError: Unexpected achieved replication factor expected:<2> but was:<1>
	at __randomizedtesting.SeedInfo.seed([9EB7E12EA912CEE6:16E3DEF407EEA31E]:0)
	at org.junit.Assert.fail(Assert.java:93)
	at org.junit.Assert.failNotEquals(Assert.java:647)
	at org.junit.Assert.assertEquals(Assert.java:128)
	at org.junit.Assert.assertEquals(Assert.java:472)
	at org.apache.solr.cloud.HttpPartitionTest.testMinRf(HttpPartitionTest.java:212)
	at org.apache.solr.cloud.HttpPartitionTest.test(HttpPartitionTest.java:104)
	at sun.reflect.NativeMethodAccessorImpl.invoke0(Native Method)
	at sun.reflect.NativeMethodAccessorImpl.invoke(NativeMethodAccessorImpl.java:57)
	at sun.reflect.DelegatingMethodAccessorImpl.invoke(DelegatingMethodAccessorImpl.java:43)
	at java.lang.reflect.Method.invoke(Method.java:606)
	at com.carrotsearch.randomizedtesting.RandomizedRunner.invoke(RandomizedRunner.java:1764)
	at com.carrotsearch.randomizedtesting.RandomizedRunner$8.evaluate(RandomizedRunner.java:871)
	at com.carrotsearch.randomizedtesting.RandomizedRunner$9.evaluate(RandomizedRunner.java:907)
	at com.carrotsearch.randomizedtesting.RandomizedRunner$10.evaluate(RandomizedRunner.java:921)
	at org.apache.solr.BaseDistributedSearchTestCase$ShardsRepeatRule$ShardsFixedStatement.callStatement(BaseDistributedSearchTestCase.java:965)
	at org.apache.solr.BaseDistributedSearchTestCase$ShardsRepeatRule$ShardsStatement.evaluate(BaseDistributedSearchTestCase.java:940)
	at com.carrotsearch.randomizedtesting.rules.SystemPropertiesRestoreRule$1.evaluate(SystemPropertiesRestoreRule.java:57)
	at org.apache.lucene.util.TestRuleSetupTeardownChained$1.evaluate(TestRuleSetupTeardownChained.java:50)
	at org.apache.lucene.util.AbstractBeforeAfterRule$1.evaluate(AbstractBeforeAfterRule.java:46)
	at org.apache.lucene.util.TestRuleThreadAndTestName$1.evaluate(TestRuleThreadAndTestName.java:49)
	at org.apache.lucene.util.TestRuleIgnoreAfterMaxFailures$1.evaluate(TestRuleIgnoreAfterMaxFailures.java:65)
	at org.apache.lucene.util.TestRuleMarkFailure$1.evaluate(TestRuleMarkFailure.java:48)
	at com.carrotsearch.randomizedtesting.rules.StatementAdapter.evaluate(StatementAdapter.java:36)
	at com.carrotsearch.randomizedtesting.ThreadLeakControl$StatementRunner.run(ThreadLeakControl.java:367)
	at com.carrotsearch.randomizedtesting.ThreadLeakControl.forkTimeoutingTask(ThreadLeakControl.java:809)
	at com.carrotsearch.randomizedtesting.ThreadLeakControl$3.evaluate(ThreadLeakControl.java:460)
	at com.carrotsearch.randomizedtesting.RandomizedRunner.runSingleTest(RandomizedRunner.java:880)
	at com.carrotsearch.randomizedtesting.RandomizedRunner$5.evaluate(RandomizedRunner.java:781)
	at com.carrotsearch.randomizedtesting.RandomizedRunner$6.evaluate(RandomizedRunner.java:816)
	at com.carrotsearch.randomizedtesting.RandomizedRunner$7.evaluate(RandomizedRunner.java:827)
	at com.carrotsearch.randomizedtesting.rules.StatementAdapter.evaluate(StatementAdapter.java:36)
	at com.carrotsearch.randomizedtesting.rules.SystemPropertiesRestoreRule$1.evaluate(SystemPropertiesRestoreRule.java:57)
	at org.apache.lucene.util.AbstractBeforeAfterRule$1.evaluate(AbstractBeforeAfterRule.java:46)
	at com.carrotsearch.randomizedtesting.rules.StatementAdapter.evaluate(StatementAdapter.java:36)
	at org.apache.lucene.util.TestRuleStoreClassName$1.evaluate(TestRuleStoreClassName.java:42)
	at com.carrotsearch.randomizedtesting.rules.NoShadowingOrOverridesOnMethodsRule$1.evaluate(NoShadowingOrOverridesOnMethodsRule.java:40)
	at com.carrotsearch.randomizedtesting.rules.NoShadowingOrOverridesOnMethodsRule$1.evaluate(NoShadowingOrOverridesOnMethodsRule.java:40)
	at com.carrotsearch.randomizedtesting.rules.StatementAdapter.evaluate(StatementAdapter.java:36)
	at com.carrotsearch.randomizedtesting.rules.StatementAdapter.evaluate(StatementAdapter.java:36)
	at com.carrotsearch.randomizedtesting.rules.StatementAdapter.evaluate(StatementAdapter.java:36)
	at org.apache.lucene.util.TestRuleAssertionsRequired$1.evaluate(TestRuleAssertionsRequired.java:54)
	at org.apache.lucene.util.TestRuleMarkFailure$1.evaluate(TestRuleMarkFailure.java:48)
	at org.apache.lucene.util.TestRuleIgnoreAfterMaxFailures$1.evaluate(TestRuleIgnoreAfterMaxFailures.java:65)
	at org.apache.lucene.util.TestRuleIgnoreTestSuites$1.evaluate(TestRuleIgnoreTestSuites.java:55)
	at com.carrotsearch.randomizedtesting.rules.StatementAdapter.evaluate(StatementAdapter.java:36)
	at com.carrotsearch.randomizedtesting.ThreadLeakControl$StatementRunner.run(ThreadLeakControl.java:367)
	at java.lang.Thread.run(Thread.java:745)


FAILED:  org.apache.solr.cloud.LeaderFailoverAfterPartitionTest.test

Error Message:
Doc with id=4 not found in http://127.0.0.1:60667/c8n_1x3_lf due to: Path not found: /id; rsp={doc=null}

Stack Trace:
java.lang.AssertionError: Doc with id=4 not found in http://127.0.0.1:60667/c8n_1x3_lf due to: Path not found: /id; rsp={doc=null}
	at __randomizedtesting.SeedInfo.seed([9EB7E12EA912CEE6:16E3DEF407EEA31E]:0)
	at org.junit.Assert.fail(Assert.java:93)
	at org.junit.Assert.assertTrue(Assert.java:43)
	at org.apache.solr.cloud.HttpPartitionTest.assertDocExists(HttpPartitionTest.java:620)
	at org.apache.solr.cloud.HttpPartitionTest.assertDocsExistInAllReplicas(HttpPartitionTest.java:575)
	at org.apache.solr.cloud.LeaderFailoverAfterPartitionTest.testRf3WithLeaderFailover(LeaderFailoverAfterPartitionTest.java:103)
	at org.apache.solr.cloud.LeaderFailoverAfterPartitionTest.test(LeaderFailoverAfterPartitionTest.java:56)
	at sun.reflect.NativeMethodAccessorImpl.invoke0(Native Method)
	at sun.reflect.NativeMethodAccessorImpl.invoke(NativeMethodAccessorImpl.java:57)
	at sun.reflect.DelegatingMethodAccessorImpl.invoke(DelegatingMethodAccessorImpl.java:43)
	at java.lang.reflect.Method.invoke(Method.java:606)
	at com.carrotsearch.randomizedtesting.RandomizedRunner.invoke(RandomizedRunner.java:1764)
	at com.carrotsearch.randomizedtesting.RandomizedRunner$8.evaluate(RandomizedRunner.java:871)
	at com.carrotsearch.randomizedtesting.RandomizedRunner$9.evaluate(RandomizedRunner.java:907)
	at com.carrotsearch.randomizedtesting.RandomizedRunner$10.evaluate(RandomizedRunner.java:921)
	at org.apache.solr.BaseDistributedSearchTestCase$ShardsRepeatRule$ShardsFixedStatement.callStatement(BaseDistributedSearchTestCase.java:965)
	at org.apache.solr.BaseDistributedSearchTestCase$ShardsRepeatRule$ShardsStatement.evaluate(BaseDistributedSearchTestCase.java:940)
	at com.carrotsearch.randomizedtesting.rules.SystemPropertiesRestoreRule$1.evaluate(SystemPropertiesRestoreRule.java:57)
	at org.apache.lucene.util.TestRuleSetupTeardownChained$1.evaluate(TestRuleSetupTeardownChained.java:50)
	at org.apache.lucene.util.AbstractBeforeAfterRule$1.evaluate(AbstractBeforeAfterRule.java:46)
	at org.apache.lucene.util.TestRuleThreadAndTestName$1.evaluate(TestRuleThreadAndTestName.java:49)
	at org.apache.lucene.util.TestRuleIgnoreAfterMaxFailures$1.evaluate(TestRuleIgnoreAfterMaxFailures.java:65)
	at org.apache.lucene.util.TestRuleMarkFailure$1.evaluate(TestRuleMarkFailure.java:48)
	at com.carrotsearch.randomizedtesting.rules.StatementAdapter.evaluate(StatementAdapter.java:36)
	at com.carrotsearch.randomizedtesting.ThreadLeakControl$StatementRunner.run(ThreadLeakControl.java:367)
	at com.carrotsearch.randomizedtesting.ThreadLeakControl.forkTimeoutingTask(ThreadLeakControl.java:809)
	at com.carrotsearch.randomizedtesting.ThreadLeakControl$3.evaluate(ThreadLeakControl.java:460)
	at com.carrotsearch.randomizedtesting.RandomizedRunner.runSingleTest(RandomizedRunner.java:880)
	at com.carrotsearch.randomizedtesting.RandomizedRunner$5.evaluate(RandomizedRunner.java:781)
	at com.carrotsearch.randomizedtesting.RandomizedRunner$6.evaluate(RandomizedRunner.java:816)
	at com.carrotsearch.randomizedtesting.RandomizedRunner$7.evaluate(RandomizedRunner.java:827)
	at com.carrotsearch.randomizedtesting.rules.StatementAdapter.evaluate(StatementAdapter.java:36)
	at com.carrotsearch.randomizedtesting.rules.SystemPropertiesRestoreRule$1.evaluate(SystemPropertiesRestoreRule.java:57)
	at org.apache.lucene.util.AbstractBeforeAfterRule$1.evaluate(AbstractBeforeAfterRule.java:46)
	at com.carrotsearch.randomizedtesting.rules.StatementAdapter.evaluate(StatementAdapter.java:36)
	at org.apache.lucene.util.TestRuleStoreClassName$1.evaluate(TestRuleStoreClassName.java:42)
	at com.carrotsearch.randomizedtesting.rules.NoShadowingOrOverridesOnMethodsRule$1.evaluate(NoShadowingOrOverridesOnMethodsRule.java:40)
	at com.carrotsearch.randomizedtesting.rules.NoShadowingOrOverridesOnMethodsRule$1.evaluate(NoShadowingOrOverridesOnMethodsRule.java:40)
	at com.carrotsearch.randomizedtesting.rules.StatementAdapter.evaluate(StatementAdapter.java:36)
	at com.carrotsearch.randomizedtesting.rules.StatementAdapter.evaluate(StatementAdapter.java:36)
	at com.carrotsearch.randomizedtesting.rules.StatementAdapter.evaluate(StatementAdapter.java:36)
	at org.apache.lucene.util.TestRuleAssertionsRequired$1.evaluate(TestRuleAssertionsRequired.java:54)
	at org.apache.lucene.util.TestRuleMarkFailure$1.evaluate(TestRuleMarkFailure.java:48)
	at org.apache.lucene.util.TestRuleIgnoreAfterMaxFailures$1.evaluate(TestRuleIgnoreAfterMaxFailures.java:65)
	at org.apache.lucene.util.TestRuleIgnoreTestSuites$1.evaluate(TestRuleIgnoreTestSuites.java:55)
	at com.carrotsearch.randomizedtesting.rules.StatementAdapter.evaluate(StatementAdapter.java:36)
	at com.carrotsearch.randomizedtesting.ThreadLeakControl$StatementRunner.run(ThreadLeakControl.java:367)
	at java.lang.Thread.run(Thread.java:745)


FAILED:  org.apache.solr.cloud.ShardSplitTest.test

Error Message:
There are still nodes recoverying - waited for 330 seconds

Stack Trace:
java.lang.AssertionError: There are still nodes recoverying - waited for 330 seconds
	at __randomizedtesting.SeedInfo.seed([9EB7E12EA912CEE6:16E3DEF407EEA31E]:0)
	at org.junit.Assert.fail(Assert.java:93)
	at org.apache.solr.cloud.AbstractDistribZkTestBase.waitForRecoveriesToFinish(AbstractDistribZkTestBase.java:175)
	at org.apache.solr.cloud.AbstractDistribZkTestBase.waitForRecoveriesToFinish(AbstractDistribZkTestBase.java:136)
	at org.apache.solr.cloud.AbstractDistribZkTestBase.waitForRecoveriesToFinish(AbstractDistribZkTestBase.java:131)
	at org.apache.solr.cloud.AbstractFullDistribZkTestBase.waitForRecoveriesToFinish(AbstractFullDistribZkTestBase.java:825)
	at org.apache.solr.cloud.ShardSplitTest.splitByUniqueKeyTest(ShardSplitTest.java:219)
	at org.apache.solr.cloud.ShardSplitTest.test(ShardSplitTest.java:82)
	at sun.reflect.NativeMethodAccessorImpl.invoke0(Native Method)
	at sun.reflect.NativeMethodAccessorImpl.invoke(NativeMethodAccessorImpl.java:57)
	at sun.reflect.DelegatingMethodAccessorImpl.invoke(DelegatingMethodAccessorImpl.java:43)
	at java.lang.reflect.Method.invoke(Method.java:606)
	at com.carrotsearch.randomizedtesting.RandomizedRunner.invoke(RandomizedRunner.java:1764)
	at com.carrotsearch.randomizedtesting.RandomizedRunner$8.evaluate(RandomizedRunner.java:871)
	at com.carrotsearch.randomizedtesting.RandomizedRunner$9.evaluate(RandomizedRunner.java:907)
	at com.carrotsearch.randomizedtesting.RandomizedRunner$10.evaluate(RandomizedRunner.java:921)
	at org.apache.solr.BaseDistributedSearchTestCase$ShardsRepeatRule$ShardsFixedStatement.callStatement(BaseDistributedSearchTestCase.java:965)
	at org.apache.solr.BaseDistributedSearchTestCase$ShardsRepeatRule$ShardsStatement.evaluate(BaseDistributedSearchTestCase.java:940)
	at com.carrotsearch.randomizedtesting.rules.SystemPropertiesRestoreRule$1.evaluate(SystemPropertiesRestoreRule.java:57)
	at org.apache.lucene.util.TestRuleSetupTeardownChained$1.evaluate(TestRuleSetupTeardownChained.java:50)
	at org.apache.lucene.util.AbstractBeforeAfterRule$1.evaluate(AbstractBeforeAfterRule.java:46)
	at org.apache.lucene.util.TestRuleThreadAndTestName$1.evaluate(TestRuleThreadAndTestName.java:49)
	at org.apache.lucene.util.TestRuleIgnoreAfterMaxFailures$1.evaluate(TestRuleIgnoreAfterMaxFailures.java:65)
	at org.apache.lucene.util.TestRuleMarkFailure$1.evaluate(TestRuleMarkFailure.java:48)
	at com.carrotsearch.randomizedtesting.rules.StatementAdapter.evaluate(StatementAdapter.java:36)
	at com.carrotsearch.randomizedtesting.ThreadLeakControl$StatementRunner.run(ThreadLeakControl.java:367)
	at com.carrotsearch.randomizedtesting.ThreadLeakControl.forkTimeoutingTask(ThreadLeakControl.java:809)
	at com.carrotsearch.randomizedtesting.ThreadLeakControl$3.evaluate(ThreadLeakControl.java:460)
	at com.carrotsearch.randomizedtesting.RandomizedRunner.runSingleTest(RandomizedRunner.java:880)
	at com.carrotsearch.randomizedtesting.RandomizedRunner$5.evaluate(RandomizedRunner.java:781)
	at com.carrotsearch.randomizedtesting.RandomizedRunner$6.evaluate(RandomizedRunner.java:816)
	at com.carrotsearch.randomizedtesting.RandomizedRunner$7.evaluate(RandomizedRunner.java:827)
	at com.carrotsearch.randomizedtesting.rules.StatementAdapter.evaluate(StatementAdapter.java:36)
	at com.carrotsearch.randomizedtesting.rules.SystemPropertiesRestoreRule$1.evaluate(SystemPropertiesRestoreRule.java:57)
	at org.apache.lucene.util.AbstractBeforeAfterRule$1.evaluate(AbstractBeforeAfterRule.java:46)
	at com.carrotsearch.randomizedtesting.rules.StatementAdapter.evaluate(StatementAdapter.java:36)
	at org.apache.lucene.util.TestRuleStoreClassName$1.evaluate(TestRuleStoreClassName.java:42)
	at com.carrotsearch.randomizedtesting.rules.NoShadowingOrOverridesOnMethodsRule$1.evaluate(NoShadowingOrOverridesOnMethodsRule.java:40)
	at com.carrotsearch.randomizedtesting.rules.NoShadowingOrOverridesOnMethodsRule$1.evaluate(NoShadowingOrOverridesOnMethodsRule.java:40)
	at com.carrotsearch.randomizedtesting.rules.StatementAdapter.evaluate(StatementAdapter.java:36)
	at com.carrotsearch.randomizedtesting.rules.StatementAdapter.evaluate(StatementAdapter.java:36)
	at com.carrotsearch.randomizedtesting.rules.StatementAdapter.evaluate(StatementAdapter.java:36)
	at org.apache.lucene.util.TestRuleAssertionsRequired$1.evaluate(TestRuleAssertionsRequired.java:54)
	at org.apache.lucene.util.TestRuleMarkFailure$1.evaluate(TestRuleMarkFailure.java:48)
	at org.apache.lucene.util.TestRuleIgnoreAfterMaxFailures$1.evaluate(TestRuleIgnoreAfterMaxFailures.java:65)
	at org.apache.lucene.util.TestRuleIgnoreTestSuites$1.evaluate(TestRuleIgnoreTestSuites.java:55)
	at com.carrotsearch.randomizedtesting.rules.StatementAdapter.evaluate(StatementAdapter.java:36)
	at com.carrotsearch.randomizedtesting.ThreadLeakControl$StatementRunner.run(ThreadLeakControl.java:367)
	at java.lang.Thread.run(Thread.java:745)


FAILED:  org.apache.solr.cloud.UnloadDistributedZkTest.test

Error Message:
No registered leader was found after waiting for 15000ms , collection: unloadcollection slice: shard1

Stack Trace:
org.apache.solr.common.SolrException: No registered leader was found after waiting for 15000ms , collection: unloadcollection slice: shard1
	at __randomizedtesting.SeedInfo.seed([9EB7E12EA912CEE6:16E3DEF407EEA31E]:0)
	at org.apache.solr.common.cloud.ZkStateReader.getLeaderRetry(ZkStateReader.java:608)
	at org.apache.solr.common.cloud.ZkStateReader.getLeaderUrl(ZkStateReader.java:576)
	at org.apache.solr.cloud.UnloadDistributedZkTest.testCoreUnloadAndLeaders(UnloadDistributedZkTest.java:287)
	at org.apache.solr.cloud.UnloadDistributedZkTest.test(UnloadDistributedZkTest.java:68)
	at sun.reflect.NativeMethodAccessorImpl.invoke0(Native Method)
	at sun.reflect.NativeMethodAccessorImpl.invoke(NativeMethodAccessorImpl.java:57)
	at sun.reflect.DelegatingMethodAccessorImpl.invoke(DelegatingMethodAccessorImpl.java:43)
	at java.lang.reflect.Method.invoke(Method.java:606)
	at com.carrotsearch.randomizedtesting.RandomizedRunner.invoke(RandomizedRunner.java:1764)
	at com.carrotsearch.randomizedtesting.RandomizedRunner$8.evaluate(RandomizedRunner.java:871)
	at com.carrotsearch.randomizedtesting.RandomizedRunner$9.evaluate(RandomizedRunner.java:907)
	at com.carrotsearch.randomizedtesting.RandomizedRunner$10.evaluate(RandomizedRunner.java:921)
	at org.apache.solr.BaseDistributedSearchTestCase$ShardsRepeatRule$ShardsFixedStatement.callStatement(BaseDistributedSearchTestCase.java:965)
	at org.apache.solr.BaseDistributedSearchTestCase$ShardsRepeatRule$ShardsStatement.evaluate(BaseDistributedSearchTestCase.java:940)
	at com.carrotsearch.randomizedtesting.rules.SystemPropertiesRestoreRule$1.evaluate(SystemPropertiesRestoreRule.java:57)
	at org.apache.lucene.util.TestRuleSetupTeardownChained$1.evaluate(TestRuleSetupTeardownChained.java:50)
	at org.apache.lucene.util.AbstractBeforeAfterRule$1.evaluate(AbstractBeforeAfterRule.java:46)
	at org.apache.lucene.util.TestRuleThreadAndTestName$1.evaluate(TestRuleThreadAndTestName.java:49)
	at org.apache.lucene.util.TestRuleIgnoreAfterMaxFailures$1.evaluate(TestRuleIgnoreAfterMaxFailures.java:65)
	at org.apache.lucene.util.TestRuleMarkFailure$1.evaluate(TestRuleMarkFailure.java:48)
	at com.carrotsearch.randomizedtesting.rules.StatementAdapter.evaluate(StatementAdapter.java:36)
	at com.carrotsearch.randomizedtesting.ThreadLeakControl$StatementRunner.run(ThreadLeakControl.java:367)
	at com.carrotsearch.randomizedtesting.ThreadLeakControl.forkTimeoutingTask(ThreadLeakControl.java:809)
	at com.carrotsearch.randomizedtesting.ThreadLeakControl$3.evaluate(ThreadLeakControl.java:460)
	at com.carrotsearch.randomizedtesting.RandomizedRunner.runSingleTest(RandomizedRunner.java:880)
	at com.carrotsearch.randomizedtesting.RandomizedRunner$5.evaluate(RandomizedRunner.java:781)
	at com.carrotsearch.randomizedtesting.RandomizedRunner$6.evaluate(RandomizedRunner.java:816)
	at com.carrotsearch.randomizedtesting.RandomizedRunner$7.evaluate(RandomizedRunner.java:827)
	at com.carrotsearch.randomizedtesting.rules.StatementAdapter.evaluate(StatementAdapter.java:36)
	at com.carrotsearch.randomizedtesting.rules.SystemPropertiesRestoreRule$1.evaluate(SystemPropertiesRestoreRule.java:57)
	at org.apache.lucene.util.AbstractBeforeAfterRule$1.evaluate(AbstractBeforeAfterRule.java:46)
	at com.carrotsearch.randomizedtesting.rules.StatementAdapter.evaluate(StatementAdapter.java:36)
	at org.apache.lucene.util.TestRuleStoreClassName$1.evaluate(TestRuleStoreClassName.java:42)
	at com.carrotsearch.randomizedtesting.rules.NoShadowingOrOverridesOnMethodsRule$1.evaluate(NoShadowingOrOverridesOnMethodsRule.java:40)
	at com.carrotsearch.randomizedtesting.rules.NoShadowingOrOverridesOnMethodsRule$1.evaluate(NoShadowingOrOverridesOnMethodsRule.java:40)
	at com.carrotsearch.randomizedtesting.rules.StatementAdapter.evaluate(StatementAdapter.java:36)
	at com.carrotsearch.randomizedtesting.rules.StatementAdapter.evaluate(StatementAdapter.java:36)
	at com.carrotsearch.randomizedtesting.rules.StatementAdapter.evaluate(StatementAdapter.java:36)
	at org.apache.lucene.util.TestRuleAssertionsRequired$1.evaluate(TestRuleAssertionsRequired.java:54)
	at org.apache.lucene.util.TestRuleMarkFailure$1.evaluate(TestRuleMarkFailure.java:48)
	at org.apache.lucene.util.TestRuleIgnoreAfterMaxFailures$1.evaluate(TestRuleIgnoreAfterMaxFailures.java:65)
	at org.apache.lucene.util.TestRuleIgnoreTestSuites$1.evaluate(TestRuleIgnoreTestSuites.java:55)
	at com.carrotsearch.randomizedtesting.rules.StatementAdapter.evaluate(StatementAdapter.java:36)
	at com.carrotsearch.randomizedtesting.ThreadLeakControl$StatementRunner.run(ThreadLeakControl.java:367)
	at java.lang.Thread.run(Thread.java:745)




Build Log:
[...truncated 9687 lines...]
   [junit4] Suite: org.apache.solr.cloud.DistributedVersionInfoTest
   [junit4]   2> Creating dataDir: /home/jenkins/workspace/Lucene-Solr-5.x-Linux/solr/build/solr-core/test/J2/temp/solr.cloud.DistributedVersionInfoTest_9EB7E12EA912CEE6-001/init-core-data-001
   [junit4]   2> 3701 INFO  (SUITE-DistributedVersionInfoTest-seed#[9EB7E12EA912CEE6]-worker) [    ] o.a.s.BaseDistributedSearchTestCase Setting hostContext system property: /
   [junit4]   2> 3724 INFO  (TEST-DistributedVersionInfoTest.test-seed#[9EB7E12EA912CEE6]) [    ] o.a.s.c.ZkTestServer STARTING ZK TEST SERVER
   [junit4]   2> 3726 INFO  (Thread-15) [    ] o.a.s.c.ZkTestServer client port:0.0.0.0/0.0.0.0:0
   [junit4]   2> 3726 INFO  (Thread-15) [    ] o.a.s.c.ZkTestServer Starting server
   [junit4]   2> 3879 INFO  (TEST-DistributedVersionInfoTest.test-seed#[9EB7E12EA912CEE6]) [    ] o.a.s.c.ZkTestServer start zk server on port:55010
   [junit4]   2> 3892 INFO  (TEST-DistributedVersionInfoTest.test-seed#[9EB7E12EA912CEE6]) [    ] o.a.s.c.c.SolrZkClient Using default ZkCredentialsProvider
   [junit4]   2> 3923 INFO  (TEST-DistributedVersionInfoTest.test-seed#[9EB7E12EA912CEE6]) [    ] o.a.s.c.c.ConnectionManager Waiting for client to connect to ZooKeeper
   [junit4]   2> 3956 INFO  (zkCallback-2-thread-1) [    ] o.a.s.c.c.ConnectionManager Watcher org.apache.solr.common.cloud.ConnectionManager@381afd92 name:ZooKeeperConnection Watcher:127.0.0.1:55010 got event WatchedEvent state:SyncConnected type:None path:null path:null type:None
   [junit4]   2> 3956 INFO  (TEST-DistributedVersionInfoTest.test-seed#[9EB7E12EA912CEE6]) [    ] o.a.s.c.c.ConnectionManager Client is connected to ZooKeeper
   [junit4]   2> 3957 INFO  (TEST-DistributedVersionInfoTest.test-seed#[9EB7E12EA912CEE6]) [    ] o.a.s.c.c.SolrZkClient Using default ZkACLProvider
   [junit4]   2> 3958 INFO  (TEST-DistributedVersionInfoTest.test-seed#[9EB7E12EA912CEE6]) [    ] o.a.s.c.c.SolrZkClient makePath: /solr
   [junit4]   2> 3977 INFO  (TEST-DistributedVersionInfoTest.test-seed#[9EB7E12EA912CEE6]) [    ] o.a.s.c.c.SolrZkClient Using default ZkCredentialsProvider
   [junit4]   2> 3977 INFO  (TEST-DistributedVersionInfoTest.test-seed#[9EB7E12EA912CEE6]) [    ] o.a.s.c.c.ConnectionManager Waiting for client to connect to ZooKeeper
   [junit4]   2> 3979 INFO  (zkCallback-3-thread-1) [    ] o.a.s.c.c.ConnectionManager Watcher org.apache.solr.common.cloud.ConnectionManager@7bc68525 name:ZooKeeperConnection Watcher:127.0.0.1:55010/solr got event WatchedEvent state:SyncConnected type:None path:null path:null type:None
   [junit4]   2> 3979 INFO  (TEST-DistributedVersionInfoTest.test-seed#[9EB7E12EA912CEE6]) [    ] o.a.s.c.c.ConnectionManager Client is connected to ZooKeeper
   [junit4]   2> 3980 INFO  (TEST-DistributedVersionInfoTest.test-seed#[9EB7E12EA912CEE6]) [    ] o.a.s.c.c.SolrZkClient Using default ZkACLProvider
   [junit4]   2> 3981 INFO  (TEST-DistributedVersionInfoTest.test-seed#[9EB7E12EA912CEE6]) [    ] o.a.s.c.c.SolrZkClient makePath: /collections/collection1
   [junit4]   2> 3985 INFO  (TEST-DistributedVersionInfoTest.test-seed#[9EB7E12EA912CEE6]) [    ] o.a.s.c.c.SolrZkClient makePath: /collections/collection1/shards
   [junit4]   2> 3987 INFO  (TEST-DistributedVersionInfoTest.test-seed#[9EB7E12EA912CEE6]) [    ] o.a.s.c.c.SolrZkClient makePath: /collections/control_collection
   [junit4]   2> 3990 INFO  (TEST-DistributedVersionInfoTest.test-seed#[9EB7E12EA912CEE6]) [    ] o.a.s.c.c.SolrZkClient makePath: /collections/control_collection/shards
   [junit4]   2> 3993 INFO  (TEST-DistributedVersionInfoTest.test-seed#[9EB7E12EA912CEE6]) [    ] o.a.s.c.AbstractZkTestCase put /home/jenkins/workspace/Lucene-Solr-5.x-Linux/solr/core/src/test-files/solr/collection1/conf/solrconfig-tlog.xml to /configs/conf1/solrconfig.xml
   [junit4]   2> 3998 INFO  (TEST-DistributedVersionInfoTest.test-seed#[9EB7E12EA912CEE6]) [    ] o.a.s.c.c.SolrZkClient makePath: /configs/conf1/solrconfig.xml
   [junit4]   2> 4002 INFO  (TEST-DistributedVersionInfoTest.test-seed#[9EB7E12EA912CEE6]) [    ] o.a.s.c.AbstractZkTestCase put /home/jenkins/workspace/Lucene-Solr-5.x-Linux/solr/core/src/test-files/solr/collection1/conf/schema.xml to /configs/conf1/schema.xml
   [junit4]   2> 4002 INFO  (TEST-DistributedVersionInfoTest.test-seed#[9EB7E12EA912CEE6]) [    ] o.a.s.c.c.SolrZkClient makePath: /configs/conf1/schema.xml
   [junit4]   2> 4006 INFO  (TEST-DistributedVersionInfoTest.test-seed#[9EB7E12EA912CEE6]) [    ] o.a.s.c.AbstractZkTestCase put /home/jenkins/workspace/Lucene-Solr-5.x-Linux/solr/core/src/test-files/solr/collection1/conf/solrconfig.snippet.randomindexconfig.xml to /configs/conf1/solrconfig.snippet.randomindexconfig.xml
   [junit4]   2> 4006 INFO  (TEST-DistributedVersionInfoTest.test-seed#[9EB7E12EA912CEE6]) [    ] o.a.s.c.c.SolrZkClient makePath: /configs/conf1/solrconfig.snippet.randomindexconfig.xml
   [junit4]   2> 4010 INFO  (TEST-DistributedVersionInfoTest.test-seed#[9EB7E12EA912CEE6]) [    ] o.a.s.c.AbstractZkTestCase put /home/jenkins/workspace/Lucene-Solr-5.x-Linux/solr/core/src/test-files/solr/collection1/conf/stopwords.txt to /configs/conf1/stopwords.txt
   [junit4]   2> 4010 INFO  (TEST-DistributedVersionInfoTest.test-seed#[9EB7E12EA912CEE6]) [    ] o.a.s.c.c.SolrZkClient makePath: /configs/conf1/stopwords.txt
   [junit4]   2> 4013 INFO  (TEST-DistributedVersionInfoTest.test-seed#[9EB7E12EA912CEE6]) [    ] o.a.s.c.AbstractZkTestCase put /home/jenkins/workspace/Lucene-Solr-5.x-Linux/solr/core/src/test-files/solr/collection1/conf/protwords.txt to /configs/conf1/protwords.txt
   [junit4]   2> 4013 INFO  (TEST-DistributedVersionInfoTest.test-seed#[9EB7E12EA912CEE6]) [    ] o.a.s.c.c.SolrZkClient makePath: /configs/conf1/protwords.txt
   [junit4]   2> 4016 INFO  (TEST-DistributedVersionInfoTest.test-seed#[9EB7E12EA912CEE6]) [    ] o.a.s.c.AbstractZkTestCase put /home/jenkins/workspace/Lucene-Solr-5.x-Linux/solr/core/src/test-files/solr/collection1/conf/currency.xml to /configs/conf1/currency.xml
   [junit4]   2> 4016 INFO  (TEST-DistributedVersionInfoTest.test-seed#[9EB7E12EA912CEE6]) [    ] o.a.s.c.c.SolrZkClient makePath: /configs/conf1/currency.xml
   [junit4]   2> 4019 INFO  (TEST-DistributedVersionInfoTest.test-seed#[9EB7E12EA912CEE6]) [    ] o.a.s.c.AbstractZkTestCase put /home/jenkins/workspace/Lucene-Solr-5.x-Linux/solr/core/src/test-files/solr/collection1/conf/enumsConfig.xml to /configs/conf1/enumsConfig.xml
   [junit4]   2> 4019 INFO  (TEST-DistributedVersionInfoTest.test-seed#[9EB7E12EA912CEE6]) [    ] o.a.s.c.c.SolrZkClient makePath: /configs/conf1/enumsConfig.xml
   [junit4]   2> 4022 INFO  (TEST-DistributedVersionInfoTest.test-seed#[9EB7E12EA912CEE6]) [    ] o.a.s.c.AbstractZkTestCase put /home/jenkins/workspace/Lucene-Solr-5.x-Linux/solr/core/src/test-files/solr/collection1/conf/open-exchange-rates.json to /configs/conf1/open-exchange-rates.json
   [junit4]   2> 4022 INFO  (TEST-DistributedVersionInfoTest.test-seed#[9EB7E12EA912CEE6]) [    ] o.a.s.c.c.SolrZkClient makePath: /configs/conf1/open-exchange-rates.json
   [junit4]   2> 4025 INFO  (TEST-DistributedVersionInfoTest.test-seed#[9EB7E12EA912CEE6]) [    ] o.a.s.c.AbstractZkTestCase put /home/jenkins/workspace/Lucene-Solr-5.x-Linux/solr/core/src/test-files/solr/collection1/conf/mapping-ISOLatin1Accent.txt to /configs/conf1/mapping-ISOLatin1Accent.txt
   [junit4]   2> 4025 INFO  (TEST-DistributedVersionInfoTest.test-seed#[9EB7E12EA912CEE6]) [    ] o.a.s.c.c.SolrZkClient makePath: /configs/conf1/mapping-ISOLatin1Accent.txt
   [junit4]   2> 4028 INFO  (TEST-DistributedVersionInfoTest.test-seed#[9EB7E12EA912CEE6]) [    ] o.a.s.c.AbstractZkTestCase put /home/jenkins/workspace/Lucene-Solr-5.x-Linux/solr/core/src/test-files/solr/collection1/conf/old_synonyms.txt to /configs/conf1/old_synonyms.txt
   [junit4]   2> 4028 INFO  (TEST-DistributedVersionInfoTest.test-seed#[9EB7E12EA912CEE6]) [    ] o.a.s.c.c.SolrZkClient makePath: /configs/conf1/old_synonyms.txt
   [junit4]   2> 4031 INFO  (TEST-DistributedVersionInfoTest.test-seed#[9EB7E12EA912CEE6]) [    ] o.a.s.c.AbstractZkTestCase put /home/jenkins/workspace/Lucene-Solr-5.x-Linux/solr/core/src/test-files/solr/collection1/conf/synonyms.txt to /configs/conf1/synonyms.txt
   [junit4]   2> 4031 INFO  (TEST-DistributedVersionInfoTest.test-seed#[9EB7E12EA912CEE6]) [    ] o.a.s.c.c.SolrZkClient makePath: /configs/conf1/synonyms.txt
   [junit4]   2> 4114 INFO  (TEST-DistributedVersionInfoTest.test-seed#[9EB7E12EA912CEE6]) [    ] o.a.s.SolrTestCaseJ4 Writing core.properties file to /home/jenkins/workspace/Lucene-Solr-5.x-Linux/solr/build/solr-core/test/J2/temp/solr.cloud.DistributedVersionInfoTest_9EB7E12EA912CEE6-001/control-001/cores/collection1
   [junit4]   2> 4116 INFO  (TEST-DistributedVersionInfoTest.test-seed#[9EB7E12EA912CEE6]) [    ] o.e.j.s.Server jetty-9.2.13.v20150730
   [junit4]   2> 4118 INFO  (TEST-DistributedVersionInfoTest.test-seed#[9EB7E12EA912CEE6]) [    ] o.e.j.s.h.ContextHandler Started o.e.j.s.ServletContextHandler@6b991f15{/,null,AVAILABLE}
   [junit4]   2> 4122 INFO  (TEST-DistributedVersionInfoTest.test-seed#[9EB7E12EA912CEE6]) [    ] o.e.j.s.ServerConnector Started ServerConnector@12256c4b{HTTP/1.1}{127.0.0.1:44757}
   [junit4]   2> 4122 INFO  (TEST-DistributedVersionInfoTest.test-seed#[9EB7E12EA912CEE6]) [    ] o.e.j.s.Server Started @5768ms
   [junit4]   2> 4123 INFO  (TEST-DistributedVersionInfoTest.test-seed#[9EB7E12EA912CEE6]) [    ] o.a.s.c.s.e.JettySolrRunner Jetty properties: {coreRootDirectory=/home/jenkins/workspace/Lucene-Solr-5.x-Linux/solr/build/solr-core/test/J2/temp/solr.cloud.DistributedVersionInfoTest_9EB7E12EA912CEE6-001/control-001/cores, hostContext=/, hostPort=44757, solr.data.dir=/home/jenkins/workspace/Lucene-Solr-5.x-Linux/solr/build/solr-core/test/J2/temp/solr.cloud.DistributedVersionInfoTest_9EB7E12EA912CEE6-001/tempDir-001/control/data}
   [junit4]   2> 4124 INFO  (TEST-DistributedVersionInfoTest.test-seed#[9EB7E12EA912CEE6]) [    ] o.a.s.s.SolrDispatchFilter SolrDispatchFilter.init(): sun.misc.Launcher$AppClassLoader@2792e317
   [junit4]   2> 4124 INFO  (TEST-DistributedVersionInfoTest.test-seed#[9EB7E12EA912CEE6]) [    ] o.a.s.c.SolrResourceLoader new SolrResourceLoader for directory: '/home/jenkins/workspace/Lucene-Solr-5.x-Linux/solr/build/solr-core/test/J2/temp/solr.cloud.DistributedVersionInfoTest_9EB7E12EA912CEE6-001/control-001'
   [junit4]   2> 4124 INFO  (TEST-DistributedVersionInfoTest.test-seed#[9EB7E12EA912CEE6]) [    ] o.a.s.c.SolrResourceLoader JNDI not configured for solr (NoInitialContextEx)
   [junit4]   2> 4124 INFO  (TEST-DistributedVersionInfoTest.test-seed#[9EB7E12EA912CEE6]) [    ] o.a.s.c.SolrResourceLoader solr home defaulted to 'solr/' (could not find system property or JNDI)
   [junit4]   2> 4124 INFO  (TEST-DistributedVersionInfoTest.test-seed#[9EB7E12EA912CEE6]) [    ] o.a.s.c.c.SolrZkClient Using default ZkCredentialsProvider
   [junit4]   2> 4125 INFO  (TEST-DistributedVersionInfoTest.test-seed#[9EB7E12EA912CEE6]) [    ] o.a.s.c.c.ConnectionManager Waiting for client to connect to ZooKeeper
   [junit4]   2> 4127 INFO  (zkCallback-4-thread-1) [    ] o.a.s.c.c.ConnectionManager Watcher org.apache.solr.common.cloud.ConnectionManager@6be738f3 name:ZooKeeperConnection Watcher:127.0.0.1:55010/solr got event WatchedEvent state:SyncConnected type:None path:null path:null type:None
   [junit4]   2> 4127 INFO  (TEST-DistributedVersionInfoTest.test-seed#[9EB7E12EA912CEE6]) [    ] o.a.s.c.c.ConnectionManager Client is connected to ZooKeeper
   [junit4]   2> 4128 INFO  (TEST-DistributedVersionInfoTest.test-seed#[9EB7E12EA912CEE6]) [    ] o.a.s.c.c.SolrZkClient Using default ZkACLProvider
   [junit4]   2> 4129 INFO  (TEST-DistributedVersionInfoTest.test-seed#[9EB7E12EA912CEE6]) [    ] o.a.s.s.SolrDispatchFilter Loading solr.xml from SolrHome (not found in ZooKeeper)
   [junit4]   2> 4130 INFO  (TEST-DistributedVersionInfoTest.test-seed#[9EB7E12EA912CEE6]) [    ] o.a.s.c.SolrXmlConfig Loading container configuration from /home/jenkins/workspace/Lucene-Solr-5.x-Linux/solr/build/solr-core/test/J2/temp/solr.cloud.DistributedVersionInfoTest_9EB7E12EA912CEE6-001/control-001/solr.xml
   [junit4]   2> 4150 INFO  (TEST-DistributedVersionInfoTest.test-seed#[9EB7E12EA912CEE6]) [    ] o.a.s.c.CorePropertiesLocator Config-defined core root directory: /home/jenkins/workspace/Lucene-Solr-5.x-Linux/solr/build/solr-core/test/J2/temp/solr.cloud.DistributedVersionInfoTest_9EB7E12EA912CEE6-001/control-001/cores
   [junit4]   2> 4151 INFO  (TEST-DistributedVersionInfoTest.test-seed#[9EB7E12EA912CEE6]) [    ] o.a.s.c.CoreContainer New CoreContainer 219963551
   [junit4]   2> 4151 INFO  (TEST-DistributedVersionInfoTest.test-seed#[9EB7E12EA912CEE6]) [    ] o.a.s.c.CoreContainer Loading cores into CoreContainer [instanceDir=/home/jenkins/workspace/Lucene-Solr-5.x-Linux/solr/build/solr-core/test/J2/temp/solr.cloud.DistributedVersionInfoTest_9EB7E12EA912CEE6-001/control-001]
   [junit4]   2> 4152 WARN  (TEST-DistributedVersionInfoTest.test-seed#[9EB7E12EA912CEE6]) [    ] o.a.s.c.CoreContainer Couldn't add files from /home/jenkins/workspace/Lucene-Solr-5.x-Linux/solr/build/solr-core/test/J2/temp/solr.cloud.DistributedVersionInfoTest_9EB7E12EA912CEE6-001/control-001/lib to classpath: /home/jenkins/workspace/Lucene-Solr-5.x-Linux/solr/build/solr-core/test/J2/temp/solr.cloud.DistributedVersionInfoTest_9EB7E12EA912CEE6-001/control-001/lib
   [junit4]   2> 4152 INFO  (TEST-DistributedVersionInfoTest.test-seed#[9EB7E12EA912CEE6]) [    ] o.a.s.h.c.HttpShardHandlerFactory created with socketTimeout : 90000,urlScheme : ,connTimeout : 15000,maxConnectionsPerHost : 20,maxConnections : 10000,corePoolSize : 0,maximumPoolSize : 2147483647,maxThreadIdleTime : 5,sizeOfQueue : -1,fairnessPolicy : false,useRetries : false,
   [junit4]   2> 4154 INFO  (TEST-DistributedVersionInfoTest.test-seed#[9EB7E12EA912CEE6]) [    ] o.a.s.u.UpdateShardHandler Creating UpdateShardHandler HTTP client with params: socketTimeout=340000&connTimeout=45000&retry=true
   [junit4]   2> 4155 INFO  (TEST-DistributedVersionInfoTest.test-seed#[9EB7E12EA912CEE6]) [    ] o.a.s.l.LogWatcher SLF4J impl is org.slf4j.impl.Log4jLoggerFactory
   [junit4]   2> 4155 INFO  (TEST-DistributedVersionInfoTest.test-seed#[9EB7E12EA912CEE6]) [    ] o.a.s.l.LogWatcher Registering Log Listener [Log4j (org.slf4j.impl.Log4jLoggerFactory)]
   [junit4]   2> 4155 INFO  (TEST-DistributedVersionInfoTest.test-seed#[9EB7E12EA912CEE6]) [    ] o.a.s.c.ZkContainer Zookeeper client=127.0.0.1:55010/solr
   [junit4]   2> 4171 INFO  (TEST-DistributedVersionInfoTest.test-seed#[9EB7E12EA912CEE6]) [    ] o.a.s.c.ZkController zkHost includes chroot
   [junit4]   2> 4172 INFO  (TEST-DistributedVersionInfoTest.test-seed#[9EB7E12EA912CEE6]) [    ] o.a.s.c.c.SolrZkClient Using default ZkCredentialsProvider
   [junit4]   2> 4172 INFO  (TEST-DistributedVersionInfoTest.test-seed#[9EB7E12EA912CEE6]) [    ] o.a.s.c.c.ConnectionManager Waiting for client to connect to ZooKeeper
   [junit4]   2> 4174 INFO  (zkCallback-6-thread-1) [    ] o.a.s.c.c.ConnectionManager Watcher org.apache.solr.common.cloud.ConnectionManager@f60da62 name:ZooKeeperConnection Watcher:127.0.0.1:55010 got event WatchedEvent state:SyncConnected type:None path:null path:null type:None
   [junit4]   2> 4175 INFO  (TEST-DistributedVersionInfoTest.test-seed#[9EB7E12EA912CEE6]) [    ] o.a.s.c.c.ConnectionManager Client is connected to ZooKeeper
   [junit4]   2> 4176 INFO  (TEST-DistributedVersionInfoTest.test-seed#[9EB7E12EA912CEE6]) [    ] o.a.s.c.c.SolrZkClient Using default ZkACLProvider
   [junit4]   2> 4182 INFO  (TEST-DistributedVersionInfoTest.test-seed#[9EB7E12EA912CEE6]) [n:127.0.0.1:44757_    ] o.a.s.c.c.ConnectionManager Waiting for client to connect to ZooKeeper
   [junit4]   2> 4185 INFO  (zkCallback-7-thread-1-processing-n:127.0.0.1:44757_) [n:127.0.0.1:44757_    ] o.a.s.c.c.ConnectionManager Watcher org.apache.solr.common.cloud.ConnectionManager@37dc8eab name:ZooKeeperConnection Watcher:127.0.0.1:55010/solr got event WatchedEvent state:SyncConnected type:None path:null path:null type:None
   [junit4]   2> 4185 INFO  (TEST-DistributedVersionInfoTest.test-seed#[9EB7E12EA912CEE6]) [n:127.0.0.1:44757_    ] o.a.s.c.c.ConnectionManager Client is connected to ZooKeeper
   [junit4]   2> 4191 INFO  (TEST-DistributedVersionInfoTest.test-seed#[9EB7E12EA912CEE6]) [n:127.0.0.1:44757_    ] o.a.s.c.c.SolrZkClient makePath: /overseer/queue
   [junit4]   2> 4199 INFO  (TEST-DistributedVersionInfoTest.test-seed#[9EB7E12EA912CEE6]) [n:127.0.0.1:44757_    ] o.a.s.c.c.SolrZkClient makePath: /overseer/collection-queue-work
   [junit4]   2> 4205 INFO  (TEST-DistributedVersionInfoTest.test-seed#[9EB7E12EA912CEE6]) [n:127.0.0.1:44757_    ] o.a.s.c.c.SolrZkClient makePath: /overseer/collection-map-running
   [junit4]   2> 4209 INFO  (TEST-DistributedVersionInfoTest.test-seed#[9EB7E12EA912CEE6]) [n:127.0.0.1:44757_    ] o.a.s.c.c.SolrZkClient makePath: /overseer/collection-map-completed
   [junit4]   2> 4213 INFO  (TEST-DistributedVersionInfoTest.test-seed#[9EB7E12EA912CEE6]) [n:127.0.0.1:44757_    ] o.a.s.c.c.SolrZkClient makePath: /overseer/collection-map-failure
   [junit4]   2> 4220 INFO  (TEST-DistributedVersionInfoTest.test-seed#[9EB7E12EA912CEE6]) [n:127.0.0.1:44757_    ] o.a.s.c.c.SolrZkClient makePath: /live_nodes
   [junit4]   2> 4222 INFO  (TEST-DistributedVersionInfoTest.test-seed#[9EB7E12EA912CEE6]) [n:127.0.0.1:44757_    ] o.a.s.c.c.SolrZkClient makePath: /aliases.json
   [junit4]   2> 4225 INFO  (TEST-DistributedVersionInfoTest.test-seed#[9EB7E12EA912CEE6]) [n:127.0.0.1:44757_    ] o.a.s.c.c.SolrZkClient makePath: /clusterstate.json
   [junit4]   2> 4227 INFO  (TEST-DistributedVersionInfoTest.test-seed#[9EB7E12EA912CEE6]) [n:127.0.0.1:44757_    ] o.a.s.c.c.SolrZkClient makePath: /security.json
   [junit4]   2> 4228 INFO  (TEST-DistributedVersionInfoTest.test-seed#[9EB7E12EA912CEE6]) [n:127.0.0.1:44757_    ] o.a.s.c.ZkController Register node as live in ZooKeeper:/live_nodes/127.0.0.1:44757_
   [junit4]   2> 4230 INFO  (TEST-DistributedVersionInfoTest.test-seed#[9EB7E12EA912CEE6]) [n:127.0.0.1:44757_    ] o.a.s.c.c.SolrZkClient makePath: /live_nodes/127.0.0.1:44757_
   [junit4]   2> 4234 INFO  (TEST-DistributedVersionInfoTest.test-seed#[9EB7E12EA912CEE6]) [n:127.0.0.1:44757_    ] o.a.s.c.c.SolrZkClient makePath: /overseer_elect
   [junit4]   2> 4237 INFO  (TEST-DistributedVersionInfoTest.test-seed#[9EB7E12EA912CEE6]) [n:127.0.0.1:44757_    ] o.a.s.c.c.SolrZkClient makePath: /overseer_elect/election
   [junit4]   2> 4239 INFO  (TEST-DistributedVersionInfoTest.test-seed#[9EB7E12EA912CEE6]) [n:127.0.0.1:44757_    ] o.a.s.c.Overseer Overseer (id=null) closing
   [junit4]   2> 4240 INFO  (TEST-DistributedVersionInfoTest.test-seed#[9EB7E12EA912CEE6]) [n:127.0.0.1:44757_    ] o.a.s.c.LeaderElector Joined leadership election with path: /overseer_elect/election/95171365113561092-127.0.0.1:44757_-n_0000000000
   [junit4]   2> 4243 INFO  (TEST-DistributedVersionInfoTest.test-seed#[9EB7E12EA912CEE6]) [n:127.0.0.1:44757_    ] o.a.s.c.OverseerElectionContext I am going to be the leader 127.0.0.1:44757_
   [junit4]   2> 4243 INFO  (TEST-DistributedVersionInfoTest.test-seed#[9EB7E12EA912CEE6]) [n:127.0.0.1:44757_    ] o.a.s.c.c.SolrZkClient makePath: /overseer_elect/leader
   [junit4]   2> 4245 INFO  (TEST-DistributedVersionInfoTest.test-seed#[9EB7E12EA912CEE6]) [n:127.0.0.1:44757_    ] o.a.s.c.Overseer Overseer (id=95171365113561092-127.0.0.1:44757_-n_0000000000) starting
   [junit4]   2> 4250 INFO  (TEST-DistributedVersionInfoTest.test-seed#[9EB7E12EA912CEE6]) [n:127.0.0.1:44757_    ] o.a.s.c.c.SolrZkClient makePath: /overseer/queue-work
   [junit4]   2> 4270 INFO  (TEST-DistributedVersionInfoTest.test-seed#[9EB7E12EA912CEE6]) [n:127.0.0.1:44757_    ] o.a.s.c.OverseerAutoReplicaFailoverThread Starting OverseerAutoReplicaFailoverThread autoReplicaFailoverWorkLoopDelay=10000 autoReplicaFailoverWaitAfterExpiration=30000 autoReplicaFailoverBadNodeExpiration=60000
   [junit4]   2> 4309 INFO  (OverseerCollectionConfigSetProcessor-95171365113561092-127.0.0.1:44757_-n_0000000000) [n:127.0.0.1:44757_    ] o.a.s.c.OverseerTaskProcessor Process current queue of overseer operations
   [junit4]   2> 4309 INFO  (TEST-DistributedVersionInfoTest.test-seed#[9EB7E12EA912CEE6]) [n:127.0.0.1:44757_    ] o.a.s.c.c.ZkStateReader Updating cluster state from ZooKeeper... 
   [junit4]   2> 4313 INFO  (OverseerStateUpdate-95171365113561092-127.0.0.1:44757_-n_0000000000) [n:127.0.0.1:44757_    ] o.a.s.c.Overseer Starting to work on the main queue
   [junit4]   2> 4393 INFO  (TEST-DistributedVersionInfoTest.test-seed#[9EB7E12EA912CEE6]) [n:127.0.0.1:44757_    ] o.a.s.c.CoreContainer Security conf doesn't exist. Skipping setup for authorization module.
   [junit4]   2> 4393 INFO  (TEST-DistributedVersionInfoTest.test-seed#[9EB7E12EA912CEE6]) [n:127.0.0.1:44757_    ] o.a.s.c.CoreContainer No authentication plugin used.
   [junit4]   2> 4394 INFO  (TEST-DistributedVersionInfoTest.test-seed#[9EB7E12EA912CEE6]) [n:127.0.0.1:44757_    ] o.a.s.c.CorePropertiesLocator Looking for core definitions underneath /home/jenkins/workspace/Lucene-Solr-5.x-Linux/solr/build/solr-core/test/J2/temp/solr.cloud.DistributedVersionInfoTest_9EB7E12EA912CEE6-001/control-001/cores
   [junit4]   2> 4396 INFO  (TEST-DistributedVersionInfoTest.test-seed#[9EB7E12EA912CEE6]) [n:127.0.0.1:44757_    ] o.a.s.c.CoreDescriptor Created CoreDescriptor: {name=collection1, configSetProperties=configsetprops.json, dataDir=data/, coreNodeName=, collection=control_collection, shard=, loadOnStartup=true, config=solrconfig.xml, transient=false, schema=schema.xml}
   [junit4]   2> 4396 INFO  (TEST-DistributedVersionInfoTest.test-seed#[9EB7E12EA912CEE6]) [n:127.0.0.1:44757_    ] o.a.s.c.CorePropertiesLocator Found core collection1 in /home/jenkins/workspace/Lucene-Solr-5.x-Linux/solr/build/solr-core/test/J2/temp/solr.cloud.DistributedVersionInfoTest_9EB7E12EA912CEE6-001/control-001/cores/collection1
   [junit4]   2> 4396 INFO  (TEST-DistributedVersionInfoTest.test-seed#[9EB7E12EA912CEE6]) [n:127.0.0.1:44757_    ] o.a.s.c.CorePropertiesLocator Found 1 core definitions
   [junit4]   2> 4397 INFO  (TEST-DistributedVersionInfoTest.test-seed#[9EB7E12EA912CEE6]) [n:127.0.0.1:44757_    ] o.a.s.s.SolrDispatchFilter user.dir=/home/jenkins/workspace/Lucene-Solr-5.x-Linux/solr/build/solr-core/test/J2
   [junit4]   2> 4398 INFO  (TEST-DistributedVersionInfoTest.test-seed#[9EB7E12EA912CEE6]) [n:127.0.0.1:44757_    ] o.a.s.s.SolrDispatchFilter SolrDispatchFilter.init() done
   [junit4]   2> 4398 INFO  (coreLoadExecutor-18-thread-1-processing-n:127.0.0.1:44757_) [n:127.0.0.1:44757_ c:control_collection   x:collection1] o.a.s.c.ZkController publishing state=down
   [junit4]   2> 4398 INFO  (coreLoadExecutor-18-thread-1-processing-n:127.0.0.1:44757_) [n:127.0.0.1:44757_ c:control_collection   x:collection1] o.a.s.c.ZkController numShards not found on descriptor - reading it from system property
   [junit4]   2> 4405 INFO  (coreLoadExecutor-18-thread-1-processing-n:127.0.0.1:44757_) [n:127.0.0.1:44757_ c:control_collection   x:collection1] o.a.s.c.ZkController look for our core node name
   [junit4]   2> 4405 INFO  (OverseerStateUpdate-95171365113561092-127.0.0.1:44757_-n_0000000000) [n:127.0.0.1:44757_    ] o.a.s.c.Overseer processMessage: queueSize: 1, message = {
   [junit4]   2>   "roles":null,
   [junit4]   2>   "state":"down",
   [junit4]   2>   "collection":"control_collection",
   [junit4]   2>   "core":"collection1",
   [junit4]   2>   "numShards":"1",
   [junit4]   2>   "node_name":"127.0.0.1:44757_",
   [junit4]   2>   "base_url":"http://127.0.0.1:44757",
   [junit4]   2>   "operation":"state",
   [junit4]   2>   "shard":null} current state version: 0
   [junit4]   2> 4412 INFO  (OverseerStateUpdate-95171365113561092-127.0.0.1:44757_-n_0000000000) [n:127.0.0.1:44757_    ] o.a.s.c.o.ReplicaMutator Update state numShards=1 message={
   [junit4]   2>   "roles":null,
   [junit4]   2>   "state":"down",
   [junit4]   2>   "collection":"control_collection",
   [junit4]   2>   "core":"collection1",
   [junit4]   2>   "numShards":"1",
   [junit4]   2>   "node_name":"127.0.0.1:44757_",
   [junit4]   2>   "base_url":"http://127.0.0.1:44757",
   [junit4]   2>   "operation":"state",
   [junit4]   2>   "shard":null}
   [junit4]   2> 4413 INFO  (OverseerStateUpdate-95171365113561092-127.0.0.1:44757_-n_0000000000) [n:127.0.0.1:44757_    ] o.a.s.c.o.ClusterStateMutator building a new cName: control_collection
   [junit4]   2> 4420 INFO  (OverseerStateUpdate-95171365113561092-127.0.0.1:44757_-n_0000000000) [n:127.0.0.1:44757_    ] o.a.s.c.o.ReplicaMutator Assigning new node to shard shard=shard1
   [junit4]   2> 4425 INFO  (zkCallback-7-thread-1-processing-n:127.0.0.1:44757_) [n:127.0.0.1:44757_    ] o.a.s.c.c.ZkStateReader A cluster state change: [WatchedEvent state:SyncConnected type:NodeDataChanged path:/clusterstate.json], has occurred - updating... (live nodes size: [1])
   [junit4]   2> 5405 INFO  (coreLoadExecutor-18-thread-1-processing-n:127.0.0.1:44757_) [n:127.0.0.1:44757_ c:control_collection   x:collection1] o.a.s.c.ZkController waiting to find shard id in clusterstate for collection1
   [junit4]   2> 5406 INFO  (coreLoadExecutor-18-thread-1-processing-n:127.0.0.1:44757_) [n:127.0.0.1:44757_ c:control_collection   x:collection1] o.a.s.c.ZkController Check for collection zkNode:control_collection
   [junit4]   2> 5406 INFO  (coreLoadExecutor-18-thread-1-processing-n:127.0.0.1:44757_) [n:127.0.0.1:44757_ c:control_collection   x:collection1] o.a.s.c.ZkController Collection zkNode exists
   [junit4]   2> 5406 INFO  (coreLoadExecutor-18-thread-1-processing-n:127.0.0.1:44757_) [n:127.0.0.1:44757_ c:control_collection   x:collection1] o.a.s.c.c.ZkStateReader Load collection config from: [/collections/control_collection]
   [junit4]   2> 5408 INFO  (coreLoadExecutor-18-thread-1-processing-n:127.0.0.1:44757_) [n:127.0.0.1:44757_ c:control_collection   x:collection1] o.a.s.c.c.ZkStateReader path=[/collections/control_collection] [configName]=[conf1] specified config exists in ZooKeeper
   [junit4]   2> 5408 INFO  (coreLoadExecutor-18-thread-1-processing-n:127.0.0.1:44757_) [n:127.0.0.1:44757_ c:control_collection   x:collection1] o.a.s.c.SolrResourceLoader new SolrResourceLoader for directory: '/home/jenkins/workspace/Lucene-Solr-5.x-Linux/solr/build/solr-core/test/J2/temp/solr.cloud.DistributedVersionInfoTest_9EB7E12EA912CEE6-001/control-001/cores/collection1'
   [junit4]   2> 5408 INFO  (coreLoadExecutor-18-thread-1-processing-n:127.0.0.1:44757_) [n:127.0.0.1:44757_ c:control_collection   x:collection1] o.a.s.c.SolrResourceLoader JNDI not configured for solr (NoInitialContextEx)
   [junit4]   2> 5408 INFO  (coreLoadExecutor-18-thread-1-processing-n:127.0.0.1:44757_) [n:127.0.0.1:44757_ c:control_collection   x:collection1] o.a.s.c.SolrResourceLoader solr home defaulted to 'solr/' (could not find system property or JNDI)
   [junit4]   2> 5411 INFO  (coreLoadExecutor-18-thread-1-processing-n:127.0.0.1:44757_) [n:127.0.0.1:44757_ c:control_collection   x:collection1] o.a.s.c.Config loaded config solrconfig.xml with version 0 
   [junit4]   2> 5426 INFO  (coreLoadExecutor-18-thread-1-processing-n:127.0.0.1:44757_) [n:127.0.0.1:44757_ c:control_collection   x:collection1] o.a.s.c.SolrConfig current version of requestparams : -1
   [junit4]   2> 5446 INFO  (coreLoadExecutor-18-thread-1-processing-n:127.0.0.1:44757_) [n:127.0.0.1:44757_ c:control_collection   x:collection1] o.a.s.c.SolrConfig Using Lucene MatchVersion: 5.5.0
   [junit4]   2> 5487 INFO  (coreLoadExecutor-18-thread-1-processing-n:127.0.0.1:44757_) [n:127.0.0.1:44757_ c:control_collection   x:collection1] o.a.s.c.SolrConfig Loaded SolrConfig: solrconfig.xml
   [junit4]   2> 5563 INFO  (coreLoadExecutor-18-thread-1-processing-n:127.0.0.1:44757_) [n:127.0.0.1:44757_ c:control_collection   x:collection1] o.a.s.s.IndexSchema [collection1] Schema name=test
   [junit4]   2> 5867 INFO  (coreLoadExecutor-18-thread-1-processing-n:127.0.0.1:44757_) [n:127.0.0.1:44757_ c:control_collection   x:collection1] o.a.s.s.OpenExchangeRatesOrgProvider Initialized with rates=open-exchange-rates.json, refreshInterval=1440.
   [junit4]   2> 5883 INFO  (coreLoadExecutor-18-thread-1-processing-n:127.0.0.1:44757_) [n:127.0.0.1:44757_ c:control_collection   x:collection1] o.a.s.s.IndexSchema default search field in schema is text
   [junit4]   2> 5884 INFO  (coreLoadExecutor-18-thread-1-processing-n:127.0.0.1:44757_) [n:127.0.0.1:44757_ c:control_collection   x:collection1] o.a.s.s.IndexSchema unique key field: id
   [junit4]   2> 5919 INFO  (coreLoadExecutor-18-thread-1-processing-n:127.0.0.1:44757_) [n:127.0.0.1:44757_ c:control_collection   x:collection1] o.a.s.s.FileExchangeRateProvider Reloading exchange rates from file currency.xml
   [junit4]   2> 5923 INFO  (coreLoadExecutor-18-thread-1-processing-n:127.0.0.1:44757_) [n:127.0.0.1:44757_ c:control_collection   x:collection1] o.a.s.s.FileExchangeRateProvider Reloading exchange rates from file currency.xml
   [junit4]   2> 5926 INFO  (coreLoadExecutor-18-thread-1-processing-n:127.0.0.1:44757_) [n:127.0.0.1:44757_ c:control_collection   x:collection1] o.a.s.s.OpenExchangeRatesOrgProvider Reloading exchange rates from open-exchange-rates.json
   [junit4]   2> 5929 INFO  (coreLoadExecutor-18-thread-1-processing-n:127.0.0.1:44757_) [n:127.0.0.1:44757_ c:control_collection   x:collection1] o.a.s.s.OpenExchangeRatesOrgProvider Reloading exchange rates from open-exchange-rates.json
   [junit4]   2> 5931 INFO  (coreLoadExecutor-18-thread-1-processing-n:127.0.0.1:44757_) [n:127.0.0.1:44757_ c:control_collection   x:collection1] o.a.s.c.ConfigSetProperties Did not find ConfigSet properties, assuming default properties: Can't find resource 'configsetprops.json' in classpath or '/configs/conf1', cwd=/home/jenkins/workspace/Lucene-Solr-5.x-Linux/solr/build/solr-core/test/J2
   [junit4]   2> 5931 INFO  (coreLoadExecutor-18-thread-1-processing-n:127.0.0.1:44757_) [n:127.0.0.1:44757_ c:control_collection   x:collection1] o.a.s.c.CoreContainer Creating SolrCore 'collection1' using configuration from collection control_collection
   [junit4]   2> 5932 INFO  (coreLoadExecutor-18-thread-1-processing-n:127.0.0.1:44757_) [n:127.0.0.1:44757_ c:control_collection s:shard1 r:core_node1 x:collection1] o.a.s.c.SolrCore org.apache.solr.core.MockDirectoryFactory
   [junit4]   2> 5932 INFO  (coreLoadExecutor-18-thread-1-processing-n:127.0.0.1:44757_) [n:127.0.0.1:44757_ c:control_collection s:shard1 r:core_node1 x:collection1] o.a.s.c.SolrCore [[collection1] ] Opening new SolrCore at [/home/jenkins/workspace/Lucene-Solr-5.x-Linux/solr/build/solr-core/test/J2/temp/solr.cloud.DistributedVersionInfoTest_9EB7E12EA912CEE6-001/control-001/cores/collection1], dataDir=[/home/jenkins/workspace/Lucene-Solr-5.x-Linux/solr/build/solr-core/test/J2/temp/solr.cloud.DistributedVersionInfoTest_9EB7E12EA912CEE6-001/control-001/cores/collection1/data/]
   [junit4]   2> 5932 INFO  (coreLoadExecutor-18-thread-1-processing-n:127.0.0.1:44757_) [n:127.0.0.1:44757_ c:control_collection s:shard1 r:core_node1 x:collection1] o.a.s.c.JmxMonitoredMap JMX monitoring is enabled. Adding Solr mbeans to JMX Server: com.sun.jmx.mbeanserver.JmxMBeanServer@52b5ca00
   [junit4]   2> 5945 INFO  (coreLoadExecutor-18-thread-1-processing-n:127.0.0.1:44757_) [n:127.0.0.1:44757_ c:control_collection s:shard1 r:core_node1 x:collection1] o.a.s.c.CachingDirectoryFactory return new directory for /home/jenkins/workspace/Lucene-Solr-5.x-Linux/solr/build/solr-core/test/J2/temp/solr.cloud.DistributedVersionInfoTest_9EB7E12EA912CEE6-001/control-001/cores/collection1/data
   [junit4]   2> 5945 INFO  (coreLoadExecutor-18-thread-1-processing-n:127.0.0.1:44757_) [n:127.0.0.1:44757_ c:control_collection s:shard1 r:core_node1 x:collection1] o.a.s.c.SolrCore New index directory detected: old=null new=/home/jenkins/workspace/Lucene-Solr-5.x-Linux/solr/build/solr-core/test/J2/temp/solr.cloud.DistributedVersionInfoTest_9EB7E12EA912CEE6-001/control-001/cores/collection1/data/index/
   [junit4]   2> 5945 WARN  (coreLoadExecutor-18-thread-1-processing-n:127.0.0.1:44757_) [n:127.0.0.1:44757_ c:control_collection s:shard1 r:core_node1 x:collection1] o.a.s.c.SolrCore [collection1] Solr index directory '/home/jenkins/workspace/Lucene-Solr-5.x-Linux/solr/build/solr-core/test/J2/temp/solr.cloud.DistributedVersionInfoTest_9EB7E12EA912CEE6-001/control-001/cores/collection1/data/index' doesn't exist. Creating new index...
   [junit4]   2> 5945 INFO  (coreLoadExecutor-18-thread-1-processing-n:127.0.0.1:44757_) [n:127.0.0.1:44757_ c:control_collection s:shard1 r:core_node1 x:collection1] o.a.s.c.CachingDirectoryFactory return new directory for /home/jenkins/workspace/Lucene-Solr-5.x-Linux/solr/build/solr-core/test/J2/temp/solr.cloud.DistributedVersionInfoTest_9EB7E12EA912CEE6-001/control-001/cores/collection1/data/index
   [junit4]   2> 5946 INFO  (coreLoadExecutor-18-thread-1-processing-n:127.0.0.1:44757_) [n:127.0.0.1:44757_ c:control_collection s:shard1 r:core_node1 x:collection1] o.a.s.u.RandomMergePolicy RandomMergePolicy wrapping class org.apache.lucene.index.LogDocMergePolicy: [LogDocMergePolicy: minMergeSize=1000, mergeFactor=50, maxMergeSize=9223372036854775807, maxMergeSizeForForcedMerge=9223372036854775807, calibrateSizeByDeletes=false, maxMergeDocs=2147483647, maxCFSSegmentSizeMB=8.796093022207999E12, noCFSRatio=0.7840807025102337]
   [junit4]   2> 5946 INFO  (coreLoadExecutor-18-thread-1-processing-n:127.0.0.1:44757_) [n:127.0.0.1:44757_ c:control_collection s:shard1 r:core_node1 x:collection1] o.a.s.c.SolrDeletionPolicy SolrDeletionPolicy.onCommit: commits: num=1
   [junit4]   2> 	commit{dir=MockDirectoryWrapper(RAMDirectory@fe154dd lockFactory=org.apache.lucene.store.SingleInstanceLockFactory@128a8150),segFN=segments_1,generation=1}
   [junit4]   2> 5947 INFO  (coreLoadExecutor-18-thread-1-processing-n:127.0.0.1:44757_) [n:127.0.0.1:44757_ c:control_collection s:shard1 r:core_node1 x:collection1] o.a.s.c.SolrDeletionPolicy newest commit generation = 1
   [junit4]   2> 5947 INFO  (OldIndexDirectoryCleanupThreadForCore-collection1) [n:127.0.0.1:44757_ c:control_collection s:shard1 r:core_node1 x:collection1] o.a.s.c.SolrCore Looking for old index directories to cleanup for core collection1 in /home/jenkins/workspace/Lucene-Solr-5.x-Linux/solr/build/solr-core/test/J2/temp/solr.cloud.DistributedVersionInfoTest_9EB7E12EA912CEE6-001/control-001/cores/collection1/data/
   [junit4]   2> 5947 WARN  (OldIndexDirectoryCleanupThreadForCore-collection1) [n:127.0.0.1:44757_ c:control_collection s:shard1 r:core_node1 x:collection1] o.a.s.c.DirectoryFactory /home/jenkins/workspace/Lucene-Solr-5.x-Linux/solr/build/solr-core/test/J2/temp/solr.cloud.DistributedVersionInfoTest_9EB7E12EA912CEE6-001/control-001/cores/collection1/data/ does not point to a valid data directory; skipping clean-up of old index directories.
   [junit4]   2> 5954 INFO  (coreLoadExecutor-18-thread-1-processing-n:127.0.0.1:44757_) [n:127.0.0.1:44757_ c:control_collection s:shard1 r:core_node1 x:collection1] o.a.s.u.p.UpdateRequestProcessorChain creating updateRequestProcessorChain "nodistrib"
   [junit4]   2> 5959 INFO  (coreLoadExecutor-18-thread-1-processing-n:127.0.0.1:44757_) [n:127.0.0.1:44757_ c:control_collection s:shard1 r:core_node1 x:collection1] o.a.s.u.p.UpdateRequestProcessorChain creating updateRequestProcessorChain "dedupe"
   [junit4]   2> 5959 INFO  (coreLoadExecutor-18-thread-1-processing-n:127.0.0.1:44757_) [n:127.0.0.1:44757_ c:control_collection s:shard1 r:core_node1 x:collection1] o.a.s.u.p.UpdateRequestProcessorChain inserting DistributedUpdateProcessorFactory into updateRequestProcessorChain "dedupe"
   [junit4]   2> 5959 INFO  (coreLoadExecutor-18-thread-1-processing-n:127.0.0.1:44757_) [n:127.0.0.1:44757_ c:control_collection s:shard1 r:core_node1 x:collection1] o.a.s.u.p.UpdateRequestProcessorChain creating updateRequestProcessorChain "stored_sig"
   [junit4]   2> 5959 INFO  (coreLoadExecutor-18-thread-1-processing-n:127.0.0.1:44757_) [n:127.0.0.1:44757_ c:control_collection s:shard1 r:core_node1 x:collection1] o.a.s.u.p.UpdateRequestProcessorChain inserting DistributedUpdateProcessorFactory into updateRequestProcessorChain "stored_sig"
   [junit4]   2> 5959 INFO  (coreLoadExecutor-18-thread-1-processing-n:127.0.0.1:44757_) [n:127.0.0.1:44757_ c:control_collection s:shard1 r:core_node1 x:collection1] o.a.s.u.p.UpdateRequestProcessorChain creating updateRequestProcessorChain "distrib-dup-test-chain-explicit"
   [junit4]   2> 5959 INFO  (coreLoadExecutor-18-thread-1-processing-n:127.0.0.1:44757_) [n:127.0.0.1:44757_ c:control_collection s:shard1 r:core_node1 x:collection1] o.a.s.u.p.UpdateRequestProcessorChain creating updateRequestProcessorChain "distrib-dup-test-chain-implicit"
   [junit4]   2> 5960 INFO  (coreLoadExecutor-18-thread-1-processing-n:127.0.0.1:44757_) [n:127.0.0.1:44757_ c:control_collection s:shard1 r:core_node1 x:collection1] o.a.s.u.p.UpdateRequestProcessorChain inserting DistributedUpdateProcessorFactory into updateRequestProcessorChain "distrib-dup-test-chain-implicit"
   [junit4]   2> 5960 INFO  (coreLoadExecutor-18-thread-1-processing-n:127.0.0.1:44757_) [n:127.0.0.1:44757_ c:control_collection s:shard1 r:core_node1 x:collection1] o.a.s.c.SolrCore no updateRequestProcessorChain defined as default, creating implicit default
   [junit4]   2> 5960 WARN  (coreLoadExecutor-18-thread-1-processing-n:127.0.0.1:44757_) [n:127.0.0.1:44757_ c:control_collection s:shard1 r:core_node1 x:collection1] o.a.s.c.RequestHandlers INVALID paramSet a in requestHandler {type = requestHandler,name = /dump,class = DumpRequestHandler,args = {defaults={a=A,b=B}}}
   [junit4]   2> 5962 INFO  (coreLoadExecutor-18-thread-1-processing-n:127.0.0.1:44757_) [n:127.0.0.1:44757_ c:control_collection s:shard1 r:core_node1 x:collection1] o.a.s.h.l.XMLLoader xsltCacheLifetimeSeconds=60
   [junit4]   2> 5964 INFO  (coreLoadExecutor-18-thread-1-processing-n:127.0.0.1:44757_) [n:127.0.0.1:44757_ c:control_collection s:shard1 r:core_node1 x:collection1] o.a.s.h.l.XMLLoader xsltCacheLifetimeSeconds=60
   [junit4]   2> 5966 INFO  (coreLoadExecutor-18-thread-1-processing-n:127.0.0.1:44757_) [n:127.0.0.1:44757_ c:control_collection s:shard1 r:core_node1 x:collection1] o.a.s.h.l.XMLLoader xsltCacheLifetimeSeconds=60
   [junit4]   2> 5967 INFO  (coreLoadExecutor-18-thread-1-processing-n:127.0.0.1:44757_) [n:127.0.0.1:44757_ c:control_collection s:shard1 r:core_node1 x:collection1] o.a.s.h.l.XMLLoader xsltCacheLifetimeSeconds=60
   [junit4]   2> 5980 INFO  (coreLoadExecutor-18-thread-1-processing-n:127.0.0.1:44757_) [n:127.0.0.1:44757_ c:control_collection s:shard1 r:core_node1 x:collection1] o.a.s.c.RequestHandlers Registered paths: /admin/ping,/get,standard,/update/json/docs,/update/json,/admin/logging,/admin/mbeans,/admin/system,/admin/plugins,/replication,/admin/segments,/admin/threads,/admin/properties,/dump,/config,/admin/file,/update,/schema,/admin/luke,/update/csv
   [junit4]   2> 5982 INFO  (coreLoadExecutor-18-thread-1-processing-n:127.0.0.1:44757_) [n:127.0.0.1:44757_ c:control_collection s:shard1 r:core_node1 x:collection1] o.a.s.c.SolrCore Using default statsCache cache: org.apache.solr.search.stats.LocalStatsCache
   [junit4]   2> 5982 INFO  (coreLoadExecutor-18-thread-1-processing-n:127.0.0.1:44757_) [n:127.0.0.1:44757_ c:control_collection s:shard1 r:core_node1 x:collection1] o.a.s.u.UpdateHandler Using UpdateLog implementation: org.apache.solr.update.UpdateLog
   [junit4]   2> 5982 INFO  (coreLoadExecutor-18-thread-1-processing-n:127.0.0.1:44757_) [n:127.0.0.1:44757_ c:control_collection s:shard1 r:core_node1 x:collection1] o.a.s.u.UpdateLog Initializing UpdateLog: dataDir= defaultSyncLevel=FLUSH numRecordsToKeep=100 maxNumLogsToKeep=10 numVersionBuckets=65536
   [junit4]   2> 5986 INFO  (coreLoadExecutor-18-thread-1-processing-n:127.0.0.1:44757_) [n:127.0.0.1:44757_ c:control_collection s:shard1 r:core_node1 x:collection1] o.a.s.u.CommitTracker Hard AutoCommit: disabled
   [junit4]   2> 5986 INFO  (coreLoadExecutor-18-thread-1-processing-n:127.0.0.1:44757_) [n:127.0.0.1:44757_ c:control_collection s:shard1 r:core_node1 x:collection1] o.a.s.u.CommitTracker Soft AutoCommit: disabled
   [junit4]   2> 5987 INFO  (coreLoadExecutor-18-thread-1-processing-n:127.0.0.1:44757_) [n:127.0.0.1:44757_ c:control_collection s:shard1 r:core_node1 x:collection1] o.a.s.u.RandomMergePolicy RandomMergePolicy wrapping class org.apache.lucene.index.LogDocMergePolicy: [LogDocMergePolicy: minMergeSize=1000, mergeFactor=24, maxMergeSize=9223372036854775807, maxMergeSizeForForcedMerge=9223372036854775807, calibrateSizeByDeletes=false, maxMergeDocs=2147483647, maxCFSSegmentSizeMB=8.796093022207999E12, noCFSRatio=0.3299835019830837]
   [junit4]   2> 5988 INFO  (coreLoadExecutor-18-thread-1-processing-n:127.0.0.1:44757_) [n:127.0.0.1:44757_ c:control_collection s:shard1 r:core_node1 x:collection1] o.a.s.c.SolrDeletionPolicy SolrDeletionPolicy.onInit: commits: num=1
   [junit4]   2> 	commit{dir=MockDirectoryWrapper(RAMDirectory@fe154dd lockFactory=org.apache.lucene.store.SingleInstanceLockFactory@128a8150),segFN=segments_1,generation=1}
   [junit4]   2> 5988 INFO  (coreLoadExecutor-18-thread-1-processing-n:127.0.0.1:44757_) [n:127.0.0.1:44757_ c:control_collection s:shard1 r:core_node1 x:collection1] o.a.s.c.SolrDeletionPolicy newest commit generation = 1
   [junit4]   2> 5988 INFO  (coreLoadExecutor-18-thread-1-processing-n:127.0.0.1:44757_) [n:127.0.0.1:44757_ c:control_collection s:shard1 r:core_node1 x:collection1] o.a.s.s.SolrIndexSearcher Opening Searcher@3474f6b0[collection1] main
   [junit4]   2> 5988 INFO  (coreLoadExecutor-18-thread-1-processing-n:127.0.0.1:44757_) [n:127.0.0.1:44757_ c:control_collection s:shard1 r:core_node1 x:collection1] o.a.s.c.c.ZkStateReader Load collection config from: [/collections/control_collection]
   [junit4]   2> 5989 INFO  (coreLoadExecutor-18-thread-1-processing-n:127.0.0.1:44757_) [n:127.0.0.1:44757_ c:control_collection s:shard1 r:core_node1 x:collection1] o.a.s.c.c.ZkStateReader path=[/collections/control_collection] [configName]=[conf1] specified config exists in ZooKeeper
   [junit4]   2> 5990 INFO  (coreLoadExecutor-18-thread-1-processing-n:127.0.0.1:44757_) [n:127.0.0.1:44757_ c:control_collection s:shard1 r:core_node1 x:collection1] o.a.s.r.ManagedResourceStorage Setting up ZooKeeper-based storage for the RestManager with znodeBase: /configs/conf1
   [junit4]   2> 5991 INFO  (coreLoadExecutor-18-thread-1-processing-n:127.0.0.1:44757_) [n:127.0.0.1:44757_ c:control_collection s:shard1 r:core_node1 x:collection1] o.a.s.r.ManagedResourceStorage Configured ZooKeeperStorageIO with znodeBase: /configs/conf1
   [junit4]   2> 5991 INFO  (coreLoadExecutor-18-thread-1-processing-n:127.0.0.1:44757_) [n:127.0.0.1:44757_ c:control_collection s:shard1 r:core_node1 x:collection1] o.a.s.r.RestManager Initializing RestManager with initArgs: {}
   [junit4]   2> 5992 INFO  (coreLoadExecutor-18-thread-1-processing-n:127.0.0.1:44757_) [n:127.0.0.1:44757_ c:control_collection s:shard1 r:core_node1 x:collection1] o.a.s.r.ManagedResourceStorage Reading _rest_managed.json using ZooKeeperStorageIO:path=/configs/conf1
   [junit4]   2> 5992 INFO  (coreLoadExecutor-18-thread-1-processing-n:127.0.0.1:44757_) [n:127.0.0.1:44757_ c:control_collection s:shard1 r:core_node1 x:collection1] o.a.s.r.ManagedResourceStorage No data found for znode /configs/conf1/_rest_managed.json
   [junit4]   2> 5992 INFO  (coreLoadExecutor-18-thread-1-processing-n:127.0.0.1:44757_) [n:127.0.0.1:44757_ c:control_collection s:shard1 r:core_node1 x:collection1] o.a.s.r.ManagedResourceStorage Loaded null at path _rest_managed.json using ZooKeeperStorageIO:path=/configs/conf1
   [junit4]   2> 5992 INFO  (coreLoadExecutor-18-thread-1-processing-n:127.0.0.1:44757_) [n:127.0.0.1:44757_ c:control_collection s:shard1 r:core_node1 x:collection1] o.a.s.r.RestManager Initializing 0 registered ManagedResources
   [junit4]   2> 5993 INFO  (coreLoadExecutor-18-thread-1-processing-n:127.0.0.1:44757_) [n:127.0.0.1:44757_ c:control_collection s:shard1 r:core_node1 x:collection1] o.a.s.h.ReplicationHandler Commits will be reserved for  10000
   [junit4]   2> 5995 INFO  (searcherExecutor-19-thread-1-processing-r:core_node1 x:collection1 c:control_collection n:127.0.0.1:44757_ s:shard1) [n:127.0.0.1:44757_ c:control_collection s:shard1 r:core_node1 x:collection1] o.a.s.c.SolrCore [collection1] Registered new searcher Searcher@3474f6b0[collection1] main{ExitableDirectoryReader(UninvertingDirectoryReader())}
   [junit4]   2> 5995 INFO  (coreLoadExecutor-18-thread-1-processing-n:127.0.0.1:44757_) [n:127.0.0.1:44757_ c:control_collection s:shard1 r:core_node1 x:collection1] o.a.s.u.UpdateLog Looking up max value of version field to seed version buckets
   [junit4]   2> 5995 INFO  (coreLoadExecutor-18-thread-1-processing-n:127.0.0.1:44757_) [n:127.0.0.1:44757_ c:control_collection s:shard1 r:core_node1 x:collection1] o.a.s.u.VersionInfo Refreshing highest value of _version_ for 65536 version buckets from index
   [junit4]   2> 5995 INFO  (coreLoadExecutor-18-thread-1-processing-n:127.0.0.1:44757_) [n:127.0.0.1:44757_ c:control_collection s:shard1 r:core_node1 x:collection1] o.a.s.u.VersionInfo No terms found for _version_, cannot seed version bucket highest value from index
   [junit4]   2> 5995 INFO  (coreLoadExecutor-18-thread-1-processing-n:127.0.0.1:44757_) [n:127.0.0.1:44757_ c:control_collection s:shard1 r:core_node1 x:collection1] o.a.s.u.UpdateLog Could not find max version in index or recent updates, using new clock 1522741844154253312
   [junit4]   2> 5996 INFO  (coreLoadExecutor-18-thread-1-processing-n:127.0.0.1:44757_) [n:127.0.0.1:44757_ c:control_collection s:shard1 r:core_node1 x:collection1] o.a.s.u.UpdateLog Took 1.0ms to seed version buckets with highest version 1522741844154253312
   [junit4]   2> 5997 INFO  (coreLoadExecutor-18-thread-1-processing-n:127.0.0.1:44757_) [n:127.0.0.1:44757_ c:control_collection s:shard1 r:core_node1 x:collection1] o.a.s.c.ZkController watch zkdir /configs/conf1
   [junit4]   2> 5998 INFO  (coreLoadExecutor-18-thread-1-processing-n:127.0.0.1:44757_) [n:127.0.0.1:44757_ c:control_collection s:shard1 r:core_node1 x:collection1] o.a.s.c.CoreContainer registering core: collection1
   [junit4]   2> 5999 INFO  (coreZkRegister-12-thread-1-processing-r:core_node1 x:collection1 c:control_collection n:127.0.0.1:44757_ s:shard1) [n:127.0.0.1:44757_ c:control_collection s:shard1 r:core_node1 x:collection1] o.a.s.c.ZkController Register replica - core:collection1 address:http://127.0.0.1:44757 collection:control_collection shard:shard1
   [junit4]   2> 6004 INFO  (coreZkRegister-12-thread-1-processing-r:core_node1 x:collection1 c:control_collection n:127.0.0.1:44757_ s:shard1) [n:127.0.0.1:44757_ c:control_collection s:shard1 r:core_node1 x:collection1] o.a.s.c.c.SolrZkClient makePath: /collections/control_collection/leader_elect/shard1/election
   [junit4]   2> 6010 INFO  (coreZkRegister-12-thread-1-processing-r:core_node1 x:collection1 c:control_collection n:127.0.0.1:44757_ s:shard1) [n:127.0.0.1:44757_ c:control_collection s:shard1 r:core_node1 x:collection1] o.a.s.c.LeaderElector Joined leadership election with path: /collections/control_collection/leader_elect/shard1/election/95171365113561092-core_node1-n_0000000000
   [junit4]   2> 6010 INFO  (coreZkRegister-12-thread-1-processing-r:core_node1 x:collection1 c:control_collection n:127.0.0.1:44757_ s:shard1) [n:127.0.0.1:44757_ c:control_collection s:shard1 r:core_node1 x:collection1] o.a.s.c.ShardLeaderElectionContext Running the leader process for shard=shard1 and weAreReplacement=false and leaderVoteWait=10000
   [junit4]   2> 6013 INFO  (coreZkRegister-12-thread-1-processing-r:core_node1 x:collection1 c:control_collection n:127.0.0.1:44757_ s:shard1) [n:127.0.0.1:44757_ c:control_collection s:shard1 r:core_node1 x:collection1] o.a.s.c.ShardLeaderElectionContext Enough replicas found to continue.
   [junit4]   2> 6013 INFO  (coreZkRegister-12-thread-1-processing-r:core_node1 x:collection1 c:control_collection n:127.0.0.1:44757_ s:shard1) [n:127.0.0.1:44757_ c:control_collection s:shard1 r:core_node1 x:collection1] o.a.s.c.ShardLeaderElectionContext I may be the new leader - try and sync
   [junit4]   2> 6014 INFO  (OverseerStateUpdate-95171365113561092-127.0.0.1:44757_-n_0000000000) [n:127.0.0.1:44757_    ] o.a.s.c.Overseer processMessage: queueSize: 1, message = {
   [junit4]   2>   "operation":"leader",
   [junit4]   2>   "shard":"shard1",
   [junit4]   2>   "collection":"control_collection"} current state version: 1
   [junit4]   2> 6014 INFO  (coreZkRegister-12-thread-1-processing-r:core_node1 x:collection1 c:control_collection n:127.0.0.1:44757_ s:shard1) [n:127.0.0.1:44757_ c:control_collection s:shard1 r:core_node1 x:collection1] o.a.s.c.SyncStrategy Sync replicas to http://127.0.0.1:44757/collection1/
   [junit4]   2> 6014 INFO  (coreZkRegister-12-thread-1-processing-r:core_node1 x:collection1 c:control_collection n:127.0.0.1:44757_ s:shard1) [n:127.0.0.1:44757_ c:control_collection s:shard1 r:core_node1 x:collection1] o.a.s.c.SyncStrategy Sync Success - now sync replicas to me
   [junit4]   2> 6014 INFO  (coreZkRegister-12-thread-1-processing-r:core_node1 x:collection1 c:control_collection n:127.0.0.1:44757_ s:shard1) [n:127.0.0.1:44757_ c:control_collection s:shard1 r:core_node1 x:collection1] o.a.s.c.SyncStrategy http://127.0.0.1:44757/collection1/ has no replicas
   [junit4]   2> 6017 INFO  (zkCallback-7-thread-1-processing-n:127.0.0.1:44757_) [n:127.0.0.1:44757_    ] o.a.s.c.c.ZkStateReader A cluster state change: [WatchedEvent state:SyncConnected type:NodeDataChanged path:/clusterstate.json], has occurred - updating... (live nodes size: [1])
   [junit4]   2> 6018 INFO  (coreZkRegister-12-thread-1-processing-r:core_node1 x:collection1 c:control_collection n:127.0.0.1:44757_ s:shard1) [n:127.0.0.1:44757_ c:control_collection s:shard1 r:core_node1 x:collection1] o.a.s.c.c.SolrZkClient makePath: /collections/control_collection/leaders/shard1
   [junit4]   2> 6024 INFO  (coreZkRegister-12-thread-1-processing-r:core_node1 x:collection1 c:control_collection n:127.0.0.1:44757_ s:shard1) [n:127.0.0.1:44757_ c:control_collection s:shard1 r:core_node1 x:collection1] o.a.s.c.ShardLeaderElectionContextBase Creating leader registration node
   [junit4]   2> 6035 INFO  (coreZkRegister-12-thread-1-processing-r:core_node1 x:collection1 c:control_collection n:127.0.0.1:44757_ s:shard1) [n:127.0.0.1:44757_ c:control_collection s:shard1 r:core_node1 x:collection1] o.a.s.c.ShardLeaderElectionContext I am the new leader: http://127.0.0.1:44757/collection1/ shard1
   [junit4]   2> 6036 INFO  (OverseerStateUpdate-95171365113561092-127.0.0.1:44757_-n_0000000000) [n:127.0.0.1:44757_    ] o.a.s.c.Overseer processMessage: queueSize: 1, message = {
   [junit4]   2>   "operation":"leader",
   [junit4]   2>   "shard":"shard1",
   [junit4]   2>   "collection":"control_collection",
   [junit4]   2>   "base_url":"http://127.0.0.1:44757",
   [junit4]   2>   "core":"collection1",
   [junit4]   2>   "state":"active"} current state version: 2
   [junit4]   2> 6140 INFO  (zkCallback-7-thread-1-processing-n:127.0.0.1:44757_) [n:127.0.0.1:44757_    ] o.a.s.c.c.ZkStateReader A cluster state change: [WatchedEvent state:SyncConnected type:NodeDataChanged path:/clusterstate.json], has occurred - updating... (live nodes size: [1])
   [junit4]   2> 6186 INFO  (coreZkRegister-12-thread-1-processing-r:core_node1 x:collection1 c:control_collection n:127.0.0.1:44757_ s:shard1) [n:127.0.0.1:44757_ c:control_collection s:shard1 r:core_node1 x:collection1] o.a.s.c.ZkController We are http://127.0.0.1:44757/collection1/ and leader is http://127.0.0.1:44757/collection1/
   [junit4]   2> 6187 INFO  (coreZkRegister-12-thread-1-processing-r:core_node1 x:collection1 c:control_collection n:127.0.0.1:44757_ s:shard1) [n:127.0.0.1:44757_ c:control_collection s:shard1 r:core_node1 x:collection1] o.a.s.c.ZkController No LogReplay needed for core=collection1 baseURL=http://127.0.0.1:44757
   [junit4]   2> 6187 INFO  (coreZkRegister-12-thread-1-processing-r:core_node1 x:collection1 c:control_collection n:127.0.0.1:44757_ s:shard1) [n:127.0.0.1:44757_ c:control_collection s:shard1 r:core_node1 x:collection1] o.a.s.c.ZkController I am the leader, no recovery necessary
   [junit4]   2> 6187 INFO  (coreZkRegister-12-thread-1-processing-r:core_node1 x:collection1 c:control_collection n:127.0.0.1:44757_ s:shard1) [n:127.0.0.1:44757_ c:control_collection s:shard1 r:core_node1 x:collection1] o.a.s.c.ZkController publishing state=active
   [junit4]   2> 6187 INFO  (coreZkRegister-12-thread-1-processing-r:core_node1 x:collection1 c:control_collection n:127.0.0.1:44757_ s:shard1) [n:127.0.0.1:44757_ c:control_collection s:shard1 r:core_node1 x:collection1] o.a.s.c.ZkController numShards not found on descriptor - reading it from system property
   [junit4]   2> 6189 INFO  (OverseerStateUpdate-95171365113561092-127.0.0.1:44757_-n_0000000000) [n:127.0.0.1:44757_    ] o.a.s.c.Overseer processMessage: queueSize: 1, message = {
   [junit4]   2>   "roles":null,
   [junit4]   2>   "state":"active",
   [junit4]   2>   "collection":"control_collection",
   [junit4]   2>   "core":"collection1",
   [junit4]   2>   "numShards":"1",
   [junit4]   2>   "node_name":"127.0.0.1:44757_",
   [junit4]   2>   "base_url":"http://127.0.0.1:44757",
   [junit4]   2>   "operation":"state",
   [junit4]   2>   "core_node_name":"core_node1",
   [junit4]   2>   "shard":"shard1"} current state version: 3
   [junit4]   2> 6190 INFO  (OverseerStateUpdate-95171365113561092-127.0.0.1:44757_-n_0000000000) [n:127.0.0.1:44757_    ] o.a.s.c.o.ReplicaMutator Update state numShards=1 message={
   [junit4]   2>   "roles":null,
   [junit4]   2>   "state":"active",
   [junit4]   2>   "collection":"control_collecti

[...truncated too long message...]

g directory: /home/jenkins/workspace/Lucene-Solr-5.x-Linux/solr/build/solr-core/test/J2/temp/solr.cloud.ShardSplitTest_9EB7E12EA912CEE6-001/shard-4-001/cores/collection1_shard1_1_replica2/data/index
   [junit4]   2> 1820836 INFO  (TEST-ShardSplitTest.test-seed#[9EB7E12EA912CEE6]) [n:127.0.0.1:56346_ c:collection1 s:shard1_1 r:core_node8 x:collection1_shard1_1_replica2] o.a.s.c.CachingDirectoryFactory looking to close /home/jenkins/workspace/Lucene-Solr-5.x-Linux/solr/build/solr-core/test/J2/temp/solr.cloud.ShardSplitTest_9EB7E12EA912CEE6-001/shard-4-001/cores/collection1_shard1_1_replica2/data [CachedDir<<refCount=0;path=/home/jenkins/workspace/Lucene-Solr-5.x-Linux/solr/build/solr-core/test/J2/temp/solr.cloud.ShardSplitTest_9EB7E12EA912CEE6-001/shard-4-001/cores/collection1_shard1_1_replica2/data;done=false>>]
   [junit4]   2> 1820837 INFO  (TEST-ShardSplitTest.test-seed#[9EB7E12EA912CEE6]) [n:127.0.0.1:56346_ c:collection1 s:shard1_1 r:core_node8 x:collection1_shard1_1_replica2] o.a.s.c.CachingDirectoryFactory Closing directory: /home/jenkins/workspace/Lucene-Solr-5.x-Linux/solr/build/solr-core/test/J2/temp/solr.cloud.ShardSplitTest_9EB7E12EA912CEE6-001/shard-4-001/cores/collection1_shard1_1_replica2/data
   [junit4]   2> 1820837 INFO  (TEST-ShardSplitTest.test-seed#[9EB7E12EA912CEE6]) [n:127.0.0.1:56346_ c:collection1 s:shard1_1 r:core_node8 x:collection1_shard1_1_replica2] o.a.s.c.Overseer Overseer (id=95171452330246162-127.0.0.1:56346_-n_0000000004) closing
   [junit4]   2> 1820837 INFO  (OverseerStateUpdate-95171452330246162-127.0.0.1:56346_-n_0000000004) [n:127.0.0.1:56346_    ] o.a.s.c.Overseer Overseer Loop exiting : 127.0.0.1:56346_
   [junit4]   2> 1820838 INFO  (zkCallback-1041-thread-3-processing-n:127.0.0.1:56346_) [n:127.0.0.1:56346_    ] o.a.s.c.c.ZkStateReader A live node change: [WatchedEvent state:SyncConnected type:NodeChildrenChanged path:/live_nodes], has occurred - updating... (live nodes size: [1])
   [junit4]   2> 1820838 WARN  (zkCallback-1041-thread-3-processing-n:127.0.0.1:56346_) [n:127.0.0.1:56346_    ] o.a.s.c.c.ZkStateReader ZooKeeper watch triggered, but Solr cannot talk to ZK: [KeeperErrorCode = Session expired for /live_nodes]
   [junit4]   2> 1820838 INFO  (TEST-ShardSplitTest.test-seed#[9EB7E12EA912CEE6]) [    ] o.e.j.s.ServerConnector Stopped ServerConnector@1ff8f8e6{HTTP/1.1}{127.0.0.1:0}
   [junit4]   2> 1820839 INFO  (TEST-ShardSplitTest.test-seed#[9EB7E12EA912CEE6]) [    ] o.e.j.s.h.ContextHandler Stopped o.e.j.s.ServletContextHandler@28b9abc{/,null,UNAVAILABLE}
   [junit4]   2> 1820839 INFO  (TEST-ShardSplitTest.test-seed#[9EB7E12EA912CEE6]) [n:127.0.0.1:56346_ c:collection1 s:shard1_1 r:core_node8 x:collection1_shard1_1_replica2] o.a.s.c.ZkTestServer connecting to 127.0.0.1:57790 57790
   [junit4]   2> 1820856 INFO  (Thread-3136) [    ] o.a.s.c.ZkTestServer connecting to 127.0.0.1:57790 57790
   [junit4]   2> 1820857 WARN  (Thread-3136) [    ] o.a.s.c.ZkTestServer Watch limit violations: 
   [junit4]   2> Maximum concurrent create/delete watches above limit:
   [junit4]   2> 
   [junit4]   2> 	6	/solr/aliases.json
   [junit4]   2> 	5	/solr/security.json
   [junit4]   2> 	5	/solr/configs/conf1
   [junit4]   2> 
   [junit4]   2> Maximum concurrent data watches above limit:
   [junit4]   2> 
   [junit4]   2> 	6	/solr/clusterstate.json
   [junit4]   2> 	4	/solr/collections/collection1/state.json
   [junit4]   2> 
   [junit4]   2> Maximum concurrent children watches above limit:
   [junit4]   2> 
   [junit4]   2> 	6	/solr/live_nodes
   [junit4]   2> 	6	/solr/collections
   [junit4]   2> 	5	/solr/overseer/queue
   [junit4]   2> 	5	/solr/overseer/collection-queue-work
   [junit4]   2> 
   [junit4]   2> NOTE: reproduce with: ant test  -Dtestcase=ShardSplitTest -Dtests.method=test -Dtests.seed=9EB7E12EA912CEE6 -Dtests.multiplier=3 -Dtests.slow=true -Dtests.locale=sk_SK -Dtests.timezone=Europe/Belfast -Dtests.asserts=true -Dtests.file.encoding=US-ASCII
   [junit4] FAILURE  486s J2 | ShardSplitTest.test <<<
   [junit4]    > Throwable #1: java.lang.AssertionError: There are still nodes recoverying - waited for 330 seconds
   [junit4]    > 	at __randomizedtesting.SeedInfo.seed([9EB7E12EA912CEE6:16E3DEF407EEA31E]:0)
   [junit4]    > 	at org.apache.solr.cloud.AbstractDistribZkTestBase.waitForRecoveriesToFinish(AbstractDistribZkTestBase.java:175)
   [junit4]    > 	at org.apache.solr.cloud.AbstractDistribZkTestBase.waitForRecoveriesToFinish(AbstractDistribZkTestBase.java:136)
   [junit4]    > 	at org.apache.solr.cloud.AbstractDistribZkTestBase.waitForRecoveriesToFinish(AbstractDistribZkTestBase.java:131)
   [junit4]    > 	at org.apache.solr.cloud.AbstractFullDistribZkTestBase.waitForRecoveriesToFinish(AbstractFullDistribZkTestBase.java:825)
   [junit4]    > 	at org.apache.solr.cloud.ShardSplitTest.splitByUniqueKeyTest(ShardSplitTest.java:219)
   [junit4]    > 	at org.apache.solr.cloud.ShardSplitTest.test(ShardSplitTest.java:82)
   [junit4]    > 	at org.apache.solr.BaseDistributedSearchTestCase$ShardsRepeatRule$ShardsFixedStatement.callStatement(BaseDistributedSearchTestCase.java:965)
   [junit4]    > 	at org.apache.solr.BaseDistributedSearchTestCase$ShardsRepeatRule$ShardsStatement.evaluate(BaseDistributedSearchTestCase.java:940)
   [junit4]    > 	at java.lang.Thread.run(Thread.java:745)
   [junit4]   2> 1820858 INFO  (SUITE-ShardSplitTest-seed#[9EB7E12EA912CEE6]-worker) [n:127.0.0.1:56346_ c:collection1 s:shard1_1 r:core_node8 x:collection1_shard1_1_replica2] o.a.s.SolrTestCaseJ4 ###deleteCore
   [junit4]   2> NOTE: leaving temporary files on disk at: /home/jenkins/workspace/Lucene-Solr-5.x-Linux/solr/build/solr-core/test/J2/temp/solr.cloud.ShardSplitTest_9EB7E12EA912CEE6-001
   [junit4]   2> Jan 07, 2016 9:20:02 PM com.carrotsearch.randomizedtesting.ThreadLeakControl checkThreadLeaks
   [junit4]   2> WARNING: Will linger awaiting termination of 3 leaked thread(s).
   [junit4]   2> NOTE: test params are: codec=Asserting(Lucene54): {id=BlockTreeOrds(blocksize=128), n_ti=TestBloomFilteredLucenePostings(BloomFilteringPostingsFormat(Lucene50(blocksize=128))), _version_=TestBloomFilteredLucenePostings(BloomFilteringPostingsFormat(Lucene50(blocksize=128)))}, docValues:{}, sim=DefaultSimilarity, locale=sk_SK, timezone=Europe/Belfast
   [junit4]   2> NOTE: Linux 3.19.0-42-generic amd64/Oracle Corporation 1.7.0_80 (64-bit)/cpus=12,threads=1,free=326395720,total=507707392
   [junit4]   2> NOTE: All tests run in this JVM: [TestTestInjection, TestCopyFieldCollectionResource, DistributedVersionInfoTest, RegexBoostProcessorTest, HdfsDirectoryFactoryTest, TestRestoreCore, SolrTestCaseJ4Test, SearchHandlerTest, TestExactStatsCache, TestFileDictionaryLookup, TestFuzzyAnalyzedSuggestions, LeaderFailoverAfterPartitionTest, QueryParsingTest, DebugComponentTest, SuggesterTest, TestAuthenticationFramework, TestSolrIndexConfig, BasicDistributedZk2Test, CleanupOldIndexTest, StressHdfsTest, TestJmxIntegration, NoCacheHeaderTest, TestDynamicLoading, TestXIncludeConfig, TestRandomForceMergePolicy, RollingRestartTest, TestCharFilters, TestSchemaVersionResource, TestSolrQueryParserResource, SuggesterTSTTest, SortSpecParsingTest, TestElisionMultitermQuery, BadComponentTest, TestMacros, UnloadDistributedZkTest, TestMaxScoreQueryParser, TestSchemaNameResource, OverriddenZkACLAndCredentialsProvidersTest, TestSort, SliceStateTest, FieldMutatingUpdateProcessorTest, TestReload, SolrCoreCheckLockOnStartupTest, TestRuleBasedAuthorizationPlugin, PluginInfoTest, CursorMarkTest, TestInitParams, TestDynamicFieldResource, ZkStateWriterTest, TestCoreDiscovery, TestRecovery, TestRebalanceLeaders, TestOrdValues, TestSolrDeletionPolicy1, DateRangeFieldTest, TestFieldTypeCollectionResource, AnalysisErrorHandlingTest, LeaderElectionTest, TestJmxMonitoredMap, HdfsRecoveryZkTest, TestPostingsSolrHighlighter, PKIAuthenticationIntegrationTest, TestCSVResponseWriter, CoreAdminHandlerTest, PrimitiveFieldTypeTest, TestConfigReload, TestReversedWildcardFilterFactory, SimpleCollectionCreateDeleteTest, ActionThrottleTest, TestShardHandlerFactory, HardAutoCommitTest, DistanceUnitsTest, TestTrieFacet, MigrateRouteKeyTest, TestManagedSynonymFilterFactory, TestSolrXml, TestScoreJoinQPNoScore, DirectUpdateHandlerOptimizeTest, BlockCacheTest, DistributedDebugComponentTest, RemoteQueryErrorTest, BitVectorTest, TriLevelCompositeIdRoutingTest, TestLeaderInitiatedRecoveryThread, TestUtils, CustomCollectionTest, TestStressRecovery, TestConfigSetImmutable, SimpleFacetsTest, SuggestComponentContextFilterQueryTest, HttpPartitionTest, ReplicationFactorTest, RestartWhileUpdatingTest, SSLMigrationTest, SaslZkACLProviderTest, ShardSplitTest]
   [junit4] Completed [562/563 (7!)] on J2 in 487.30s, 1 test, 1 failure <<< FAILURES!

[...truncated 20 lines...]
BUILD FAILED
/home/jenkins/workspace/Lucene-Solr-5.x-Linux/build.xml:794: The following error occurred while executing this line:
/home/jenkins/workspace/Lucene-Solr-5.x-Linux/build.xml:738: The following error occurred while executing this line:
/home/jenkins/workspace/Lucene-Solr-5.x-Linux/build.xml:59: The following error occurred while executing this line:
/home/jenkins/workspace/Lucene-Solr-5.x-Linux/solr/build.xml:233: The following error occurred while executing this line:
/home/jenkins/workspace/Lucene-Solr-5.x-Linux/solr/common-build.xml:526: The following error occurred while executing this line:
/home/jenkins/workspace/Lucene-Solr-5.x-Linux/lucene/common-build.xml:1444: The following error occurred while executing this line:
/home/jenkins/workspace/Lucene-Solr-5.x-Linux/lucene/common-build.xml:1000: There were test failures: 563 suites (7 ignored), 2236 tests, 2 errors, 5 failures, 83 ignored (39 assumptions) [seed: 9EB7E12EA912CEE6]

Total time: 51 minutes 35 seconds
Build step 'Invoke Ant' marked build as failure
Archiving artifacts
[WARNINGS] Skipping publisher since build result is FAILURE
Recording test results
Email was triggered for: Failure - Any
Sending email for trigger: Failure - Any



Mime
View raw message