lucene-dev mailing list archives

Site index · List index
Message view « Date » · « Thread »
Top « Date » · « Thread »
From Policeman Jenkins Server <jenk...@thetaphi.de>
Subject [JENKINS] Lucene-Solr-5.x-MacOSX (64bit/jdk1.8.0) - Build # 2955 - Failure!
Date Mon, 11 Jan 2016 04:37:37 GMT
Build: http://jenkins.thetaphi.de/job/Lucene-Solr-5.x-MacOSX/2955/
Java: 64bit/jdk1.8.0 -XX:-UseCompressedOops -XX:+UseG1GC

1 tests failed.
FAILED:  org.apache.solr.cloud.CollectionsAPIDistributedZkTest.test

Error Message:


Stack Trace:
java.lang.AssertionError
	at __randomizedtesting.SeedInfo.seed([B7837BDDC4FB97A7:3FD744076A07FA5F]:0)
	at org.junit.Assert.fail(Assert.java:92)
	at org.junit.Assert.assertTrue(Assert.java:43)
	at org.junit.Assert.assertNull(Assert.java:551)
	at org.junit.Assert.assertNull(Assert.java:562)
	at org.apache.solr.cloud.CollectionsAPIDistributedZkTest.testNoConfigSetExist(CollectionsAPIDistributedZkTest.java:512)
	at org.apache.solr.cloud.CollectionsAPIDistributedZkTest.test(CollectionsAPIDistributedZkTest.java:159)
	at sun.reflect.NativeMethodAccessorImpl.invoke0(Native Method)
	at sun.reflect.NativeMethodAccessorImpl.invoke(NativeMethodAccessorImpl.java:62)
	at sun.reflect.DelegatingMethodAccessorImpl.invoke(DelegatingMethodAccessorImpl.java:43)
	at java.lang.reflect.Method.invoke(Method.java:497)
	at com.carrotsearch.randomizedtesting.RandomizedRunner.invoke(RandomizedRunner.java:1764)
	at com.carrotsearch.randomizedtesting.RandomizedRunner$8.evaluate(RandomizedRunner.java:871)
	at com.carrotsearch.randomizedtesting.RandomizedRunner$9.evaluate(RandomizedRunner.java:907)
	at com.carrotsearch.randomizedtesting.RandomizedRunner$10.evaluate(RandomizedRunner.java:921)
	at org.apache.solr.BaseDistributedSearchTestCase$ShardsRepeatRule$ShardsFixedStatement.callStatement(BaseDistributedSearchTestCase.java:965)
	at org.apache.solr.BaseDistributedSearchTestCase$ShardsRepeatRule$ShardsStatement.evaluate(BaseDistributedSearchTestCase.java:940)
	at com.carrotsearch.randomizedtesting.rules.SystemPropertiesRestoreRule$1.evaluate(SystemPropertiesRestoreRule.java:57)
	at org.apache.lucene.util.TestRuleSetupTeardownChained$1.evaluate(TestRuleSetupTeardownChained.java:50)
	at org.apache.lucene.util.AbstractBeforeAfterRule$1.evaluate(AbstractBeforeAfterRule.java:46)
	at org.apache.lucene.util.TestRuleThreadAndTestName$1.evaluate(TestRuleThreadAndTestName.java:49)
	at org.apache.lucene.util.TestRuleIgnoreAfterMaxFailures$1.evaluate(TestRuleIgnoreAfterMaxFailures.java:65)
	at org.apache.lucene.util.TestRuleMarkFailure$1.evaluate(TestRuleMarkFailure.java:48)
	at com.carrotsearch.randomizedtesting.rules.StatementAdapter.evaluate(StatementAdapter.java:36)
	at com.carrotsearch.randomizedtesting.ThreadLeakControl$StatementRunner.run(ThreadLeakControl.java:367)
	at com.carrotsearch.randomizedtesting.ThreadLeakControl.forkTimeoutingTask(ThreadLeakControl.java:809)
	at com.carrotsearch.randomizedtesting.ThreadLeakControl$3.evaluate(ThreadLeakControl.java:460)
	at com.carrotsearch.randomizedtesting.RandomizedRunner.runSingleTest(RandomizedRunner.java:880)
	at com.carrotsearch.randomizedtesting.RandomizedRunner$5.evaluate(RandomizedRunner.java:781)
	at com.carrotsearch.randomizedtesting.RandomizedRunner$6.evaluate(RandomizedRunner.java:816)
	at com.carrotsearch.randomizedtesting.RandomizedRunner$7.evaluate(RandomizedRunner.java:827)
	at com.carrotsearch.randomizedtesting.rules.StatementAdapter.evaluate(StatementAdapter.java:36)
	at com.carrotsearch.randomizedtesting.rules.SystemPropertiesRestoreRule$1.evaluate(SystemPropertiesRestoreRule.java:57)
	at org.apache.lucene.util.AbstractBeforeAfterRule$1.evaluate(AbstractBeforeAfterRule.java:46)
	at com.carrotsearch.randomizedtesting.rules.StatementAdapter.evaluate(StatementAdapter.java:36)
	at org.apache.lucene.util.TestRuleStoreClassName$1.evaluate(TestRuleStoreClassName.java:42)
	at com.carrotsearch.randomizedtesting.rules.NoShadowingOrOverridesOnMethodsRule$1.evaluate(NoShadowingOrOverridesOnMethodsRule.java:40)
	at com.carrotsearch.randomizedtesting.rules.NoShadowingOrOverridesOnMethodsRule$1.evaluate(NoShadowingOrOverridesOnMethodsRule.java:40)
	at com.carrotsearch.randomizedtesting.rules.StatementAdapter.evaluate(StatementAdapter.java:36)
	at com.carrotsearch.randomizedtesting.rules.StatementAdapter.evaluate(StatementAdapter.java:36)
	at com.carrotsearch.randomizedtesting.rules.StatementAdapter.evaluate(StatementAdapter.java:36)
	at org.apache.lucene.util.TestRuleAssertionsRequired$1.evaluate(TestRuleAssertionsRequired.java:54)
	at org.apache.lucene.util.TestRuleMarkFailure$1.evaluate(TestRuleMarkFailure.java:48)
	at org.apache.lucene.util.TestRuleIgnoreAfterMaxFailures$1.evaluate(TestRuleIgnoreAfterMaxFailures.java:65)
	at org.apache.lucene.util.TestRuleIgnoreTestSuites$1.evaluate(TestRuleIgnoreTestSuites.java:55)
	at com.carrotsearch.randomizedtesting.rules.StatementAdapter.evaluate(StatementAdapter.java:36)
	at com.carrotsearch.randomizedtesting.ThreadLeakControl$StatementRunner.run(ThreadLeakControl.java:367)
	at java.lang.Thread.run(Thread.java:745)




Build Log:
[...truncated 9921 lines...]
   [junit4] Suite: org.apache.solr.cloud.CollectionsAPIDistributedZkTest
   [junit4]   2> Creating dataDir: /Users/jenkins/workspace/Lucene-Solr-5.x-MacOSX/solr/build/solr-core/test/J1/temp/solr.cloud.CollectionsAPIDistributedZkTest_B7837BDDC4FB97A7-001/init-core-data-001
   [junit4]   2> 202313 INFO  (SUITE-CollectionsAPIDistributedZkTest-seed#[B7837BDDC4FB97A7]-worker) [    ] o.a.s.SolrTestCaseJ4 Randomized ssl (true) and clientAuth (false)
   [junit4]   2> 202314 INFO  (SUITE-CollectionsAPIDistributedZkTest-seed#[B7837BDDC4FB97A7]-worker) [    ] o.a.s.BaseDistributedSearchTestCase Setting hostContext system property: /
   [junit4]   2> 202317 INFO  (TEST-CollectionsAPIDistributedZkTest.test-seed#[B7837BDDC4FB97A7]) [    ] o.a.s.c.ZkTestServer STARTING ZK TEST SERVER
   [junit4]   2> 202318 INFO  (Thread-526) [    ] o.a.s.c.ZkTestServer client port:0.0.0.0/0.0.0.0:0
   [junit4]   2> 202318 INFO  (Thread-526) [    ] o.a.s.c.ZkTestServer Starting server
   [junit4]   2> 202422 INFO  (TEST-CollectionsAPIDistributedZkTest.test-seed#[B7837BDDC4FB97A7]) [    ] o.a.s.c.ZkTestServer start zk server on port:64114
   [junit4]   2> 202422 INFO  (TEST-CollectionsAPIDistributedZkTest.test-seed#[B7837BDDC4FB97A7]) [    ] o.a.s.c.c.SolrZkClient Using default ZkCredentialsProvider
   [junit4]   2> 202424 INFO  (TEST-CollectionsAPIDistributedZkTest.test-seed#[B7837BDDC4FB97A7]) [    ] o.a.s.c.c.ConnectionManager Waiting for client to connect to ZooKeeper
   [junit4]   2> 202431 INFO  (zkCallback-142-thread-1) [    ] o.a.s.c.c.ConnectionManager Watcher org.apache.solr.common.cloud.ConnectionManager@32d8ae7 name:ZooKeeperConnection Watcher:127.0.0.1:64114 got event WatchedEvent state:SyncConnected type:None path:null path:null type:None
   [junit4]   2> 202432 INFO  (TEST-CollectionsAPIDistributedZkTest.test-seed#[B7837BDDC4FB97A7]) [    ] o.a.s.c.c.ConnectionManager Client is connected to ZooKeeper
   [junit4]   2> 202432 INFO  (TEST-CollectionsAPIDistributedZkTest.test-seed#[B7837BDDC4FB97A7]) [    ] o.a.s.c.c.SolrZkClient Using default ZkACLProvider
   [junit4]   2> 202432 INFO  (TEST-CollectionsAPIDistributedZkTest.test-seed#[B7837BDDC4FB97A7]) [    ] o.a.s.c.c.SolrZkClient makePath: /solr
   [junit4]   2> 202437 INFO  (TEST-CollectionsAPIDistributedZkTest.test-seed#[B7837BDDC4FB97A7]) [    ] o.a.s.c.c.SolrZkClient Using default ZkCredentialsProvider
   [junit4]   2> 202438 INFO  (TEST-CollectionsAPIDistributedZkTest.test-seed#[B7837BDDC4FB97A7]) [    ] o.a.s.c.c.ConnectionManager Waiting for client to connect to ZooKeeper
   [junit4]   2> 202440 INFO  (zkCallback-143-thread-1) [    ] o.a.s.c.c.ConnectionManager Watcher org.apache.solr.common.cloud.ConnectionManager@1ca44114 name:ZooKeeperConnection Watcher:127.0.0.1:64114/solr got event WatchedEvent state:SyncConnected type:None path:null path:null type:None
   [junit4]   2> 202440 INFO  (TEST-CollectionsAPIDistributedZkTest.test-seed#[B7837BDDC4FB97A7]) [    ] o.a.s.c.c.ConnectionManager Client is connected to ZooKeeper
   [junit4]   2> 202440 INFO  (TEST-CollectionsAPIDistributedZkTest.test-seed#[B7837BDDC4FB97A7]) [    ] o.a.s.c.c.SolrZkClient Using default ZkACLProvider
   [junit4]   2> 202440 INFO  (TEST-CollectionsAPIDistributedZkTest.test-seed#[B7837BDDC4FB97A7]) [    ] o.a.s.c.c.SolrZkClient makePath: /collections/collection1
   [junit4]   2> 202444 INFO  (TEST-CollectionsAPIDistributedZkTest.test-seed#[B7837BDDC4FB97A7]) [    ] o.a.s.c.c.SolrZkClient makePath: /collections/collection1/shards
   [junit4]   2> 202447 INFO  (TEST-CollectionsAPIDistributedZkTest.test-seed#[B7837BDDC4FB97A7]) [    ] o.a.s.c.c.SolrZkClient makePath: /collections/control_collection
   [junit4]   2> 202450 INFO  (TEST-CollectionsAPIDistributedZkTest.test-seed#[B7837BDDC4FB97A7]) [    ] o.a.s.c.c.SolrZkClient makePath: /collections/control_collection/shards
   [junit4]   2> 202452 INFO  (TEST-CollectionsAPIDistributedZkTest.test-seed#[B7837BDDC4FB97A7]) [    ] o.a.s.c.AbstractZkTestCase put /Users/jenkins/workspace/Lucene-Solr-5.x-MacOSX/solr/core/src/test-files/solr/collection1/conf/solrconfig-tlog.xml to /configs/conf1/solrconfig.xml
   [junit4]   2> 202453 INFO  (TEST-CollectionsAPIDistributedZkTest.test-seed#[B7837BDDC4FB97A7]) [    ] o.a.s.c.c.SolrZkClient makePath: /configs/conf1/solrconfig.xml
   [junit4]   2> 202457 INFO  (TEST-CollectionsAPIDistributedZkTest.test-seed#[B7837BDDC4FB97A7]) [    ] o.a.s.c.AbstractZkTestCase put /Users/jenkins/workspace/Lucene-Solr-5.x-MacOSX/solr/core/src/test-files/solr/collection1/conf/schema.xml to /configs/conf1/schema.xml
   [junit4]   2> 202457 INFO  (TEST-CollectionsAPIDistributedZkTest.test-seed#[B7837BDDC4FB97A7]) [    ] o.a.s.c.c.SolrZkClient makePath: /configs/conf1/schema.xml
   [junit4]   2> 202460 INFO  (TEST-CollectionsAPIDistributedZkTest.test-seed#[B7837BDDC4FB97A7]) [    ] o.a.s.c.AbstractZkTestCase put /Users/jenkins/workspace/Lucene-Solr-5.x-MacOSX/solr/core/src/test-files/solr/collection1/conf/solrconfig.snippet.randomindexconfig.xml to /configs/conf1/solrconfig.snippet.randomindexconfig.xml
   [junit4]   2> 202460 INFO  (TEST-CollectionsAPIDistributedZkTest.test-seed#[B7837BDDC4FB97A7]) [    ] o.a.s.c.c.SolrZkClient makePath: /configs/conf1/solrconfig.snippet.randomindexconfig.xml
   [junit4]   2> 202463 INFO  (TEST-CollectionsAPIDistributedZkTest.test-seed#[B7837BDDC4FB97A7]) [    ] o.a.s.c.AbstractZkTestCase put /Users/jenkins/workspace/Lucene-Solr-5.x-MacOSX/solr/core/src/test-files/solr/collection1/conf/stopwords.txt to /configs/conf1/stopwords.txt
   [junit4]   2> 202463 INFO  (TEST-CollectionsAPIDistributedZkTest.test-seed#[B7837BDDC4FB97A7]) [    ] o.a.s.c.c.SolrZkClient makePath: /configs/conf1/stopwords.txt
   [junit4]   2> 202466 INFO  (TEST-CollectionsAPIDistributedZkTest.test-seed#[B7837BDDC4FB97A7]) [    ] o.a.s.c.AbstractZkTestCase put /Users/jenkins/workspace/Lucene-Solr-5.x-MacOSX/solr/core/src/test-files/solr/collection1/conf/protwords.txt to /configs/conf1/protwords.txt
   [junit4]   2> 202466 INFO  (TEST-CollectionsAPIDistributedZkTest.test-seed#[B7837BDDC4FB97A7]) [    ] o.a.s.c.c.SolrZkClient makePath: /configs/conf1/protwords.txt
   [junit4]   2> 202469 INFO  (TEST-CollectionsAPIDistributedZkTest.test-seed#[B7837BDDC4FB97A7]) [    ] o.a.s.c.AbstractZkTestCase put /Users/jenkins/workspace/Lucene-Solr-5.x-MacOSX/solr/core/src/test-files/solr/collection1/conf/currency.xml to /configs/conf1/currency.xml
   [junit4]   2> 202469 INFO  (TEST-CollectionsAPIDistributedZkTest.test-seed#[B7837BDDC4FB97A7]) [    ] o.a.s.c.c.SolrZkClient makePath: /configs/conf1/currency.xml
   [junit4]   2> 202472 INFO  (TEST-CollectionsAPIDistributedZkTest.test-seed#[B7837BDDC4FB97A7]) [    ] o.a.s.c.AbstractZkTestCase put /Users/jenkins/workspace/Lucene-Solr-5.x-MacOSX/solr/core/src/test-files/solr/collection1/conf/enumsConfig.xml to /configs/conf1/enumsConfig.xml
   [junit4]   2> 202473 INFO  (TEST-CollectionsAPIDistributedZkTest.test-seed#[B7837BDDC4FB97A7]) [    ] o.a.s.c.c.SolrZkClient makePath: /configs/conf1/enumsConfig.xml
   [junit4]   2> 202475 INFO  (TEST-CollectionsAPIDistributedZkTest.test-seed#[B7837BDDC4FB97A7]) [    ] o.a.s.c.AbstractZkTestCase put /Users/jenkins/workspace/Lucene-Solr-5.x-MacOSX/solr/core/src/test-files/solr/collection1/conf/open-exchange-rates.json to /configs/conf1/open-exchange-rates.json
   [junit4]   2> 202475 INFO  (TEST-CollectionsAPIDistributedZkTest.test-seed#[B7837BDDC4FB97A7]) [    ] o.a.s.c.c.SolrZkClient makePath: /configs/conf1/open-exchange-rates.json
   [junit4]   2> 202482 INFO  (TEST-CollectionsAPIDistributedZkTest.test-seed#[B7837BDDC4FB97A7]) [    ] o.a.s.c.AbstractZkTestCase put /Users/jenkins/workspace/Lucene-Solr-5.x-MacOSX/solr/core/src/test-files/solr/collection1/conf/mapping-ISOLatin1Accent.txt to /configs/conf1/mapping-ISOLatin1Accent.txt
   [junit4]   2> 202484 INFO  (TEST-CollectionsAPIDistributedZkTest.test-seed#[B7837BDDC4FB97A7]) [    ] o.a.s.c.c.SolrZkClient makePath: /configs/conf1/mapping-ISOLatin1Accent.txt
   [junit4]   2> 202520 INFO  (TEST-CollectionsAPIDistributedZkTest.test-seed#[B7837BDDC4FB97A7]) [    ] o.a.s.c.AbstractZkTestCase put /Users/jenkins/workspace/Lucene-Solr-5.x-MacOSX/solr/core/src/test-files/solr/collection1/conf/old_synonyms.txt to /configs/conf1/old_synonyms.txt
   [junit4]   2> 202520 INFO  (TEST-CollectionsAPIDistributedZkTest.test-seed#[B7837BDDC4FB97A7]) [    ] o.a.s.c.c.SolrZkClient makePath: /configs/conf1/old_synonyms.txt
   [junit4]   2> 202525 INFO  (TEST-CollectionsAPIDistributedZkTest.test-seed#[B7837BDDC4FB97A7]) [    ] o.a.s.c.AbstractZkTestCase put /Users/jenkins/workspace/Lucene-Solr-5.x-MacOSX/solr/core/src/test-files/solr/collection1/conf/synonyms.txt to /configs/conf1/synonyms.txt
   [junit4]   2> 202526 INFO  (TEST-CollectionsAPIDistributedZkTest.test-seed#[B7837BDDC4FB97A7]) [    ] o.a.s.c.c.SolrZkClient makePath: /configs/conf1/synonyms.txt
   [junit4]   2> 202536 INFO  (TEST-CollectionsAPIDistributedZkTest.test-seed#[B7837BDDC4FB97A7]) [    ] o.a.s.c.c.SolrZkClient Using default ZkCredentialsProvider
   [junit4]   2> 202547 INFO  (TEST-CollectionsAPIDistributedZkTest.test-seed#[B7837BDDC4FB97A7]) [    ] o.a.s.c.c.ConnectionManager Waiting for client to connect to ZooKeeper
   [junit4]   2> 202548 INFO  (zkCallback-144-thread-1) [    ] o.a.s.c.c.ConnectionManager Watcher org.apache.solr.common.cloud.ConnectionManager@40186afb name:ZooKeeperConnection Watcher:127.0.0.1:64114/solr got event WatchedEvent state:SyncConnected type:None path:null path:null type:None
   [junit4]   2> 202548 INFO  (TEST-CollectionsAPIDistributedZkTest.test-seed#[B7837BDDC4FB97A7]) [    ] o.a.s.c.c.ConnectionManager Client is connected to ZooKeeper
   [junit4]   2> 202549 INFO  (TEST-CollectionsAPIDistributedZkTest.test-seed#[B7837BDDC4FB97A7]) [    ] o.a.s.c.c.SolrZkClient Using default ZkACLProvider
   [junit4]   2> 202551 WARN  (NIOServerCxn.Factory:0.0.0.0/0.0.0.0:0) [    ] o.a.z.s.NIOServerCnxn caught end of stream exception
   [junit4]   2> EndOfStreamException: Unable to read additional data from client sessionid 0x1522ece67490002, likely client has closed socket
   [junit4]   2> 	at org.apache.zookeeper.server.NIOServerCnxn.doIO(NIOServerCnxn.java:228)
   [junit4]   2> 	at org.apache.zookeeper.server.NIOServerCnxnFactory.run(NIOServerCnxnFactory.java:208)
   [junit4]   2> 	at java.lang.Thread.run(Thread.java:745)
   [junit4]   2> 202552 INFO  (TEST-CollectionsAPIDistributedZkTest.test-seed#[B7837BDDC4FB97A7]) [    ] o.a.s.c.c.SolrZkClient Using default ZkCredentialsProvider
   [junit4]   2> 202554 INFO  (TEST-CollectionsAPIDistributedZkTest.test-seed#[B7837BDDC4FB97A7]) [    ] o.a.s.c.c.ConnectionManager Waiting for client to connect to ZooKeeper
   [junit4]   2> 202556 INFO  (zkCallback-145-thread-1) [    ] o.a.s.c.c.ConnectionManager Watcher org.apache.solr.common.cloud.ConnectionManager@7e239f29 name:ZooKeeperConnection Watcher:127.0.0.1:64114 got event WatchedEvent state:SyncConnected type:None path:null path:null type:None
   [junit4]   2> 202556 INFO  (TEST-CollectionsAPIDistributedZkTest.test-seed#[B7837BDDC4FB97A7]) [    ] o.a.s.c.c.ConnectionManager Client is connected to ZooKeeper
   [junit4]   2> 202556 INFO  (TEST-CollectionsAPIDistributedZkTest.test-seed#[B7837BDDC4FB97A7]) [    ] o.a.s.c.c.SolrZkClient Using default ZkACLProvider
   [junit4]   2> 202557 INFO  (TEST-CollectionsAPIDistributedZkTest.test-seed#[B7837BDDC4FB97A7]) [    ] o.a.s.c.c.SolrZkClient makePath: /solr
   [junit4]   2> 202561 INFO  (TEST-CollectionsAPIDistributedZkTest.test-seed#[B7837BDDC4FB97A7]) [    ] o.a.s.c.c.SolrZkClient Using default ZkCredentialsProvider
   [junit4]   2> 202561 INFO  (TEST-CollectionsAPIDistributedZkTest.test-seed#[B7837BDDC4FB97A7]) [    ] o.a.s.c.c.ConnectionManager Waiting for client to connect to ZooKeeper
   [junit4]   2> 202564 INFO  (zkCallback-146-thread-1) [    ] o.a.s.c.c.ConnectionManager Watcher org.apache.solr.common.cloud.ConnectionManager@22cc90ed name:ZooKeeperConnection Watcher:127.0.0.1:64114/solr got event WatchedEvent state:SyncConnected type:None path:null path:null type:None
   [junit4]   2> 202564 INFO  (TEST-CollectionsAPIDistributedZkTest.test-seed#[B7837BDDC4FB97A7]) [    ] o.a.s.c.c.ConnectionManager Client is connected to ZooKeeper
   [junit4]   2> 202564 INFO  (TEST-CollectionsAPIDistributedZkTest.test-seed#[B7837BDDC4FB97A7]) [    ] o.a.s.c.c.SolrZkClient Using default ZkACLProvider
   [junit4]   2> 202565 INFO  (TEST-CollectionsAPIDistributedZkTest.test-seed#[B7837BDDC4FB97A7]) [    ] o.a.s.c.AbstractZkTestCase put /Users/jenkins/workspace/Lucene-Solr-5.x-MacOSX/solr/core/src/test-files/solr/collection1/conf/solrconfig-tlog.xml to /configs/conf2/solrconfig.xml
   [junit4]   2> 202566 INFO  (TEST-CollectionsAPIDistributedZkTest.test-seed#[B7837BDDC4FB97A7]) [    ] o.a.s.c.c.SolrZkClient makePath: /configs/conf2/solrconfig.xml
   [junit4]   2> 202571 INFO  (TEST-CollectionsAPIDistributedZkTest.test-seed#[B7837BDDC4FB97A7]) [    ] o.a.s.c.AbstractZkTestCase put /Users/jenkins/workspace/Lucene-Solr-5.x-MacOSX/solr/core/src/test-files/solr/collection1/conf/schema.xml to /configs/conf2/schema.xml
   [junit4]   2> 202571 INFO  (TEST-CollectionsAPIDistributedZkTest.test-seed#[B7837BDDC4FB97A7]) [    ] o.a.s.c.c.SolrZkClient makePath: /configs/conf2/schema.xml
   [junit4]   2> 202575 INFO  (TEST-CollectionsAPIDistributedZkTest.test-seed#[B7837BDDC4FB97A7]) [    ] o.a.s.c.AbstractZkTestCase put /Users/jenkins/workspace/Lucene-Solr-5.x-MacOSX/solr/core/src/test-files/solr/collection1/conf/enumsConfig.xml to /configs/conf2/enumsConfig.xml
   [junit4]   2> 202575 INFO  (TEST-CollectionsAPIDistributedZkTest.test-seed#[B7837BDDC4FB97A7]) [    ] o.a.s.c.c.SolrZkClient makePath: /configs/conf2/enumsConfig.xml
   [junit4]   2> 202582 INFO  (TEST-CollectionsAPIDistributedZkTest.test-seed#[B7837BDDC4FB97A7]) [    ] o.a.s.c.AbstractZkTestCase put /Users/jenkins/workspace/Lucene-Solr-5.x-MacOSX/solr/core/src/test-files/solr/collection1/conf/solrconfig.snippet.randomindexconfig.xml to /configs/conf2/solrconfig.snippet.randomindexconfig.xml
   [junit4]   2> 202582 INFO  (TEST-CollectionsAPIDistributedZkTest.test-seed#[B7837BDDC4FB97A7]) [    ] o.a.s.c.c.SolrZkClient makePath: /configs/conf2/solrconfig.snippet.randomindexconfig.xml
   [junit4]   2> 202586 INFO  (TEST-CollectionsAPIDistributedZkTest.test-seed#[B7837BDDC4FB97A7]) [    ] o.a.s.c.AbstractZkTestCase put /Users/jenkins/workspace/Lucene-Solr-5.x-MacOSX/solr/core/src/test-files/solr/collection1/conf/stopwords.txt to /configs/conf2/stopwords.txt
   [junit4]   2> 202586 INFO  (TEST-CollectionsAPIDistributedZkTest.test-seed#[B7837BDDC4FB97A7]) [    ] o.a.s.c.c.SolrZkClient makePath: /configs/conf2/stopwords.txt
   [junit4]   2> 202591 INFO  (TEST-CollectionsAPIDistributedZkTest.test-seed#[B7837BDDC4FB97A7]) [    ] o.a.s.c.AbstractZkTestCase put /Users/jenkins/workspace/Lucene-Solr-5.x-MacOSX/solr/core/src/test-files/solr/collection1/conf/protwords.txt to /configs/conf2/protwords.txt
   [junit4]   2> 202591 INFO  (TEST-CollectionsAPIDistributedZkTest.test-seed#[B7837BDDC4FB97A7]) [    ] o.a.s.c.c.SolrZkClient makePath: /configs/conf2/protwords.txt
   [junit4]   2> 202595 INFO  (TEST-CollectionsAPIDistributedZkTest.test-seed#[B7837BDDC4FB97A7]) [    ] o.a.s.c.AbstractZkTestCase put /Users/jenkins/workspace/Lucene-Solr-5.x-MacOSX/solr/core/src/test-files/solr/collection1/conf/currency.xml to /configs/conf2/currency.xml
   [junit4]   2> 202595 INFO  (TEST-CollectionsAPIDistributedZkTest.test-seed#[B7837BDDC4FB97A7]) [    ] o.a.s.c.c.SolrZkClient makePath: /configs/conf2/currency.xml
   [junit4]   2> 202598 INFO  (TEST-CollectionsAPIDistributedZkTest.test-seed#[B7837BDDC4FB97A7]) [    ] o.a.s.c.AbstractZkTestCase put /Users/jenkins/workspace/Lucene-Solr-5.x-MacOSX/solr/core/src/test-files/solr/collection1/conf/open-exchange-rates.json to /configs/conf2/open-exchange-rates.json
   [junit4]   2> 202598 INFO  (TEST-CollectionsAPIDistributedZkTest.test-seed#[B7837BDDC4FB97A7]) [    ] o.a.s.c.c.SolrZkClient makePath: /configs/conf2/open-exchange-rates.json
   [junit4]   2> 202601 INFO  (TEST-CollectionsAPIDistributedZkTest.test-seed#[B7837BDDC4FB97A7]) [    ] o.a.s.c.AbstractZkTestCase put /Users/jenkins/workspace/Lucene-Solr-5.x-MacOSX/solr/core/src/test-files/solr/collection1/conf/mapping-ISOLatin1Accent.txt to /configs/conf2/mapping-ISOLatin1Accent.txt
   [junit4]   2> 202602 INFO  (TEST-CollectionsAPIDistributedZkTest.test-seed#[B7837BDDC4FB97A7]) [    ] o.a.s.c.c.SolrZkClient makePath: /configs/conf2/mapping-ISOLatin1Accent.txt
   [junit4]   2> 202605 INFO  (TEST-CollectionsAPIDistributedZkTest.test-seed#[B7837BDDC4FB97A7]) [    ] o.a.s.c.AbstractZkTestCase put /Users/jenkins/workspace/Lucene-Solr-5.x-MacOSX/solr/core/src/test-files/solr/collection1/conf/old_synonyms.txt to /configs/conf2/old_synonyms.txt
   [junit4]   2> 202605 INFO  (TEST-CollectionsAPIDistributedZkTest.test-seed#[B7837BDDC4FB97A7]) [    ] o.a.s.c.c.SolrZkClient makePath: /configs/conf2/old_synonyms.txt
   [junit4]   2> 202608 INFO  (TEST-CollectionsAPIDistributedZkTest.test-seed#[B7837BDDC4FB97A7]) [    ] o.a.s.c.AbstractZkTestCase put /Users/jenkins/workspace/Lucene-Solr-5.x-MacOSX/solr/core/src/test-files/solr/collection1/conf/synonyms.txt to /configs/conf2/synonyms.txt
   [junit4]   2> 202608 INFO  (TEST-CollectionsAPIDistributedZkTest.test-seed#[B7837BDDC4FB97A7]) [    ] o.a.s.c.c.SolrZkClient makePath: /configs/conf2/synonyms.txt
   [junit4]   2> 202612 INFO  (TEST-CollectionsAPIDistributedZkTest.test-seed#[B7837BDDC4FB97A7]) [    ] o.a.s.c.AbstractZkTestCase put /Users/jenkins/workspace/Lucene-Solr-5.x-MacOSX/solr/core/src/test-files/solr/collection1/conf/elevate.xml to /configs/conf2/elevate.xml
   [junit4]   2> 202612 INFO  (TEST-CollectionsAPIDistributedZkTest.test-seed#[B7837BDDC4FB97A7]) [    ] o.a.s.c.c.SolrZkClient makePath: /configs/conf2/elevate.xml
   [junit4]   2> 202896 INFO  (TEST-CollectionsAPIDistributedZkTest.test-seed#[B7837BDDC4FB97A7]) [    ] o.a.s.SolrTestCaseJ4 Writing core.properties file to /Users/jenkins/workspace/Lucene-Solr-5.x-MacOSX/solr/build/solr-core/test/J1/temp/solr.cloud.CollectionsAPIDistributedZkTest_B7837BDDC4FB97A7-001/control-001/cores/collection1
   [junit4]   2> 202951 INFO  (TEST-CollectionsAPIDistributedZkTest.test-seed#[B7837BDDC4FB97A7]) [    ] o.e.j.s.Server jetty-9.2.13.v20150730
   [junit4]   2> 202957 INFO  (TEST-CollectionsAPIDistributedZkTest.test-seed#[B7837BDDC4FB97A7]) [    ] o.e.j.s.h.ContextHandler Started o.e.j.s.ServletContextHandler@72c9d1bb{/,null,AVAILABLE}
   [junit4]   2> 203160 INFO  (TEST-CollectionsAPIDistributedZkTest.test-seed#[B7837BDDC4FB97A7]) [    ] o.e.j.s.ServerConnector Started ServerConnector@472484ef{SSL-http/1.1}{127.0.0.1:64120}
   [junit4]   2> 203161 INFO  (TEST-CollectionsAPIDistributedZkTest.test-seed#[B7837BDDC4FB97A7]) [    ] o.e.j.s.Server Started @207292ms
   [junit4]   2> 203161 INFO  (TEST-CollectionsAPIDistributedZkTest.test-seed#[B7837BDDC4FB97A7]) [    ] o.a.s.c.s.e.JettySolrRunner Jetty properties: {solr.data.dir=/Users/jenkins/workspace/Lucene-Solr-5.x-MacOSX/solr/build/solr-core/test/J1/temp/solr.cloud.CollectionsAPIDistributedZkTest_B7837BDDC4FB97A7-001/tempDir-001/control/data, hostContext=/, hostPort=64120, coreRootDirectory=/Users/jenkins/workspace/Lucene-Solr-5.x-MacOSX/solr/build/solr-core/test/J1/../../../../../../../../../Users/jenkins/workspace/Lucene-Solr-5.x-MacOSX/solr/build/solr-core/test/J1/temp/solr.cloud.CollectionsAPIDistributedZkTest_B7837BDDC4FB97A7-001/control-001/cores}
   [junit4]   2> 203161 INFO  (TEST-CollectionsAPIDistributedZkTest.test-seed#[B7837BDDC4FB97A7]) [    ] o.a.s.s.SolrDispatchFilter SolrDispatchFilter.init(): sun.misc.Launcher$AppClassLoader@74a14482
   [junit4]   2> 203161 INFO  (TEST-CollectionsAPIDistributedZkTest.test-seed#[B7837BDDC4FB97A7]) [    ] o.a.s.c.SolrResourceLoader new SolrResourceLoader for directory: '/Users/jenkins/workspace/Lucene-Solr-5.x-MacOSX/solr/build/solr-core/test/J1/temp/solr.cloud.CollectionsAPIDistributedZkTest_B7837BDDC4FB97A7-001/control-001'
   [junit4]   2> 203161 INFO  (TEST-CollectionsAPIDistributedZkTest.test-seed#[B7837BDDC4FB97A7]) [    ] o.a.s.c.SolrResourceLoader JNDI not configured for solr (NoInitialContextEx)
   [junit4]   2> 203161 INFO  (TEST-CollectionsAPIDistributedZkTest.test-seed#[B7837BDDC4FB97A7]) [    ] o.a.s.c.SolrResourceLoader solr home defaulted to 'solr/' (could not find system property or JNDI)
   [junit4]   2> 203163 INFO  (TEST-CollectionsAPIDistributedZkTest.test-seed#[B7837BDDC4FB97A7]) [    ] o.a.s.c.c.SolrZkClient Using default ZkCredentialsProvider
   [junit4]   2> 203164 INFO  (TEST-CollectionsAPIDistributedZkTest.test-seed#[B7837BDDC4FB97A7]) [    ] o.a.s.c.c.ConnectionManager Waiting for client to connect to ZooKeeper
   [junit4]   2> 203166 INFO  (zkCallback-147-thread-1) [    ] o.a.s.c.c.ConnectionManager Watcher org.apache.solr.common.cloud.ConnectionManager@3e2d4a48 name:ZooKeeperConnection Watcher:127.0.0.1:64114/solr got event WatchedEvent state:SyncConnected type:None path:null path:null type:None
   [junit4]   2> 203166 INFO  (TEST-CollectionsAPIDistributedZkTest.test-seed#[B7837BDDC4FB97A7]) [    ] o.a.s.c.c.ConnectionManager Client is connected to ZooKeeper
   [junit4]   2> 203166 INFO  (TEST-CollectionsAPIDistributedZkTest.test-seed#[B7837BDDC4FB97A7]) [    ] o.a.s.c.c.SolrZkClient Using default ZkACLProvider
   [junit4]   2> 203168 INFO  (TEST-CollectionsAPIDistributedZkTest.test-seed#[B7837BDDC4FB97A7]) [    ] o.a.s.s.SolrDispatchFilter Loading solr.xml from SolrHome (not found in ZooKeeper)
   [junit4]   2> 203168 INFO  (TEST-CollectionsAPIDistributedZkTest.test-seed#[B7837BDDC4FB97A7]) [    ] o.a.s.c.SolrXmlConfig Loading container configuration from /Users/jenkins/workspace/Lucene-Solr-5.x-MacOSX/solr/build/solr-core/test/J1/temp/solr.cloud.CollectionsAPIDistributedZkTest_B7837BDDC4FB97A7-001/control-001/solr.xml
   [junit4]   2> 203177 INFO  (TEST-CollectionsAPIDistributedZkTest.test-seed#[B7837BDDC4FB97A7]) [    ] o.a.s.c.CorePropertiesLocator Config-defined core root directory: /Users/jenkins/workspace/Lucene-Solr-5.x-MacOSX/solr/build/solr-core/test/J1/../../../../../../../../../Users/jenkins/workspace/Lucene-Solr-5.x-MacOSX/solr/build/solr-core/test/J1/temp/solr.cloud.CollectionsAPIDistributedZkTest_B7837BDDC4FB97A7-001/control-001/cores
   [junit4]   2> 203177 INFO  (TEST-CollectionsAPIDistributedZkTest.test-seed#[B7837BDDC4FB97A7]) [    ] o.a.s.c.CoreContainer New CoreContainer 1688075934
   [junit4]   2> 203177 INFO  (TEST-CollectionsAPIDistributedZkTest.test-seed#[B7837BDDC4FB97A7]) [    ] o.a.s.c.CoreContainer Loading cores into CoreContainer [instanceDir=/Users/jenkins/workspace/Lucene-Solr-5.x-MacOSX/solr/build/solr-core/test/J1/temp/solr.cloud.CollectionsAPIDistributedZkTest_B7837BDDC4FB97A7-001/control-001]
   [junit4]   2> 203177 WARN  (TEST-CollectionsAPIDistributedZkTest.test-seed#[B7837BDDC4FB97A7]) [    ] o.a.s.c.CoreContainer Couldn't add files from /Users/jenkins/workspace/Lucene-Solr-5.x-MacOSX/solr/build/solr-core/test/J1/temp/solr.cloud.CollectionsAPIDistributedZkTest_B7837BDDC4FB97A7-001/control-001/lib to classpath: /Users/jenkins/workspace/Lucene-Solr-5.x-MacOSX/solr/build/solr-core/test/J1/temp/solr.cloud.CollectionsAPIDistributedZkTest_B7837BDDC4FB97A7-001/control-001/lib
   [junit4]   2> 203177 INFO  (TEST-CollectionsAPIDistributedZkTest.test-seed#[B7837BDDC4FB97A7]) [    ] o.a.s.h.c.HttpShardHandlerFactory created with socketTimeout : 90000,urlScheme : ,connTimeout : 15000,maxConnectionsPerHost : 20,maxConnections : 10000,corePoolSize : 0,maximumPoolSize : 2147483647,maxThreadIdleTime : 5,sizeOfQueue : -1,fairnessPolicy : false,useRetries : false,
   [junit4]   2> 203182 INFO  (TEST-CollectionsAPIDistributedZkTest.test-seed#[B7837BDDC4FB97A7]) [    ] o.a.s.u.UpdateShardHandler Creating UpdateShardHandler HTTP client with params: socketTimeout=340000&connTimeout=45000&retry=true
   [junit4]   2> 203185 INFO  (TEST-CollectionsAPIDistributedZkTest.test-seed#[B7837BDDC4FB97A7]) [    ] o.a.s.l.LogWatcher SLF4J impl is org.slf4j.impl.Log4jLoggerFactory
   [junit4]   2> 203185 INFO  (TEST-CollectionsAPIDistributedZkTest.test-seed#[B7837BDDC4FB97A7]) [    ] o.a.s.l.LogWatcher Registering Log Listener [Log4j (org.slf4j.impl.Log4jLoggerFactory)]
   [junit4]   2> 203185 INFO  (TEST-CollectionsAPIDistributedZkTest.test-seed#[B7837BDDC4FB97A7]) [    ] o.a.s.c.ZkContainer Zookeeper client=127.0.0.1:64114/solr
   [junit4]   2> 203185 INFO  (TEST-CollectionsAPIDistributedZkTest.test-seed#[B7837BDDC4FB97A7]) [    ] o.a.s.c.ZkController zkHost includes chroot
   [junit4]   2> 203185 INFO  (TEST-CollectionsAPIDistributedZkTest.test-seed#[B7837BDDC4FB97A7]) [    ] o.a.s.c.c.SolrZkClient Using default ZkCredentialsProvider
   [junit4]   2> 203186 INFO  (TEST-CollectionsAPIDistributedZkTest.test-seed#[B7837BDDC4FB97A7]) [    ] o.a.s.c.c.ConnectionManager Waiting for client to connect to ZooKeeper
   [junit4]   2> 203189 INFO  (zkCallback-149-thread-1) [    ] o.a.s.c.c.ConnectionManager Watcher org.apache.solr.common.cloud.ConnectionManager@52cd54b name:ZooKeeperConnection Watcher:127.0.0.1:64114 got event WatchedEvent state:SyncConnected type:None path:null path:null type:None
   [junit4]   2> 203189 INFO  (TEST-CollectionsAPIDistributedZkTest.test-seed#[B7837BDDC4FB97A7]) [    ] o.a.s.c.c.ConnectionManager Client is connected to ZooKeeper
   [junit4]   2> 203189 INFO  (TEST-CollectionsAPIDistributedZkTest.test-seed#[B7837BDDC4FB97A7]) [    ] o.a.s.c.c.SolrZkClient Using default ZkACLProvider
   [junit4]   2> 203196 INFO  (TEST-CollectionsAPIDistributedZkTest.test-seed#[B7837BDDC4FB97A7]) [n:127.0.0.1:64120_    ] o.a.s.c.c.ConnectionManager Waiting for client to connect to ZooKeeper
   [junit4]   2> 203198 INFO  (zkCallback-150-thread-1-processing-n:127.0.0.1:64120_) [n:127.0.0.1:64120_    ] o.a.s.c.c.ConnectionManager Watcher org.apache.solr.common.cloud.ConnectionManager@41e61b8d name:ZooKeeperConnection Watcher:127.0.0.1:64114/solr got event WatchedEvent state:SyncConnected type:None path:null path:null type:None
   [junit4]   2> 203199 INFO  (TEST-CollectionsAPIDistributedZkTest.test-seed#[B7837BDDC4FB97A7]) [n:127.0.0.1:64120_    ] o.a.s.c.c.ConnectionManager Client is connected to ZooKeeper
   [junit4]   2> 203201 INFO  (TEST-CollectionsAPIDistributedZkTest.test-seed#[B7837BDDC4FB97A7]) [n:127.0.0.1:64120_    ] o.a.s.c.c.SolrZkClient makePath: /overseer/queue
   [junit4]   2> 203209 INFO  (TEST-CollectionsAPIDistributedZkTest.test-seed#[B7837BDDC4FB97A7]) [n:127.0.0.1:64120_    ] o.a.s.c.c.SolrZkClient makePath: /overseer/collection-queue-work
   [junit4]   2> 203218 INFO  (TEST-CollectionsAPIDistributedZkTest.test-seed#[B7837BDDC4FB97A7]) [n:127.0.0.1:64120_    ] o.a.s.c.c.SolrZkClient makePath: /overseer/collection-map-running
   [junit4]   2> 203224 INFO  (TEST-CollectionsAPIDistributedZkTest.test-seed#[B7837BDDC4FB97A7]) [n:127.0.0.1:64120_    ] o.a.s.c.c.SolrZkClient makePath: /overseer/collection-map-completed
   [junit4]   2> 203233 INFO  (TEST-CollectionsAPIDistributedZkTest.test-seed#[B7837BDDC4FB97A7]) [n:127.0.0.1:64120_    ] o.a.s.c.c.SolrZkClient makePath: /overseer/collection-map-failure
   [junit4]   2> 203240 INFO  (TEST-CollectionsAPIDistributedZkTest.test-seed#[B7837BDDC4FB97A7]) [n:127.0.0.1:64120_    ] o.a.s.c.c.SolrZkClient makePath: /live_nodes
   [junit4]   2> 203244 INFO  (TEST-CollectionsAPIDistributedZkTest.test-seed#[B7837BDDC4FB97A7]) [n:127.0.0.1:64120_    ] o.a.s.c.c.SolrZkClient makePath: /aliases.json
   [junit4]   2> 203248 INFO  (TEST-CollectionsAPIDistributedZkTest.test-seed#[B7837BDDC4FB97A7]) [n:127.0.0.1:64120_    ] o.a.s.c.c.SolrZkClient makePath: /clusterstate.json
   [junit4]   2> 203251 INFO  (TEST-CollectionsAPIDistributedZkTest.test-seed#[B7837BDDC4FB97A7]) [n:127.0.0.1:64120_    ] o.a.s.c.c.SolrZkClient makePath: /security.json
   [junit4]   2> 203253 INFO  (TEST-CollectionsAPIDistributedZkTest.test-seed#[B7837BDDC4FB97A7]) [n:127.0.0.1:64120_    ] o.a.s.c.ZkController Register node as live in ZooKeeper:/live_nodes/127.0.0.1:64120_
   [junit4]   2> 203254 INFO  (TEST-CollectionsAPIDistributedZkTest.test-seed#[B7837BDDC4FB97A7]) [n:127.0.0.1:64120_    ] o.a.s.c.c.SolrZkClient makePath: /live_nodes/127.0.0.1:64120_
   [junit4]   2> 203258 INFO  (TEST-CollectionsAPIDistributedZkTest.test-seed#[B7837BDDC4FB97A7]) [n:127.0.0.1:64120_    ] o.a.s.c.c.SolrZkClient makePath: /overseer_elect
   [junit4]   2> 203261 INFO  (TEST-CollectionsAPIDistributedZkTest.test-seed#[B7837BDDC4FB97A7]) [n:127.0.0.1:64120_    ] o.a.s.c.c.SolrZkClient makePath: /overseer_elect/election
   [junit4]   2> 203268 INFO  (TEST-CollectionsAPIDistributedZkTest.test-seed#[B7837BDDC4FB97A7]) [n:127.0.0.1:64120_    ] o.a.s.c.Overseer Overseer (id=null) closing
   [junit4]   2> 203269 INFO  (TEST-CollectionsAPIDistributedZkTest.test-seed#[B7837BDDC4FB97A7]) [n:127.0.0.1:64120_    ] o.a.s.c.LeaderElector Joined leadership election with path: /overseer_elect/election/95190006159179783-127.0.0.1:64120_-n_0000000000
   [junit4]   2> 203270 INFO  (TEST-CollectionsAPIDistributedZkTest.test-seed#[B7837BDDC4FB97A7]) [n:127.0.0.1:64120_    ] o.a.s.c.OverseerElectionContext I am going to be the leader 127.0.0.1:64120_
   [junit4]   2> 203270 INFO  (TEST-CollectionsAPIDistributedZkTest.test-seed#[B7837BDDC4FB97A7]) [n:127.0.0.1:64120_    ] o.a.s.c.c.SolrZkClient makePath: /overseer_elect/leader
   [junit4]   2> 203273 INFO  (TEST-CollectionsAPIDistributedZkTest.test-seed#[B7837BDDC4FB97A7]) [n:127.0.0.1:64120_    ] o.a.s.c.Overseer Overseer (id=95190006159179783-127.0.0.1:64120_-n_0000000000) starting
   [junit4]   2> 203278 INFO  (TEST-CollectionsAPIDistributedZkTest.test-seed#[B7837BDDC4FB97A7]) [n:127.0.0.1:64120_    ] o.a.s.c.c.SolrZkClient makePath: /overseer/queue-work
   [junit4]   2> 203293 INFO  (TEST-CollectionsAPIDistributedZkTest.test-seed#[B7837BDDC4FB97A7]) [n:127.0.0.1:64120_    ] o.a.s.c.OverseerAutoReplicaFailoverThread Starting OverseerAutoReplicaFailoverThread autoReplicaFailoverWorkLoopDelay=10000 autoReplicaFailoverWaitAfterExpiration=10000 autoReplicaFailoverBadNodeExpiration=60000
   [junit4]   2> 203295 INFO  (OverseerCollectionConfigSetProcessor-95190006159179783-127.0.0.1:64120_-n_0000000000) [n:127.0.0.1:64120_    ] o.a.s.c.OverseerTaskProcessor Process current queue of overseer operations
   [junit4]   2> 203295 INFO  (OverseerStateUpdate-95190006159179783-127.0.0.1:64120_-n_0000000000) [n:127.0.0.1:64120_    ] o.a.s.c.Overseer Starting to work on the main queue
   [junit4]   2> 203296 INFO  (TEST-CollectionsAPIDistributedZkTest.test-seed#[B7837BDDC4FB97A7]) [n:127.0.0.1:64120_    ] o.a.s.c.c.ZkStateReader Updating cluster state from ZooKeeper... 
   [junit4]   2> 203335 INFO  (TEST-CollectionsAPIDistributedZkTest.test-seed#[B7837BDDC4FB97A7]) [n:127.0.0.1:64120_    ] o.a.s.c.CoreContainer Security conf doesn't exist. Skipping setup for authorization module.
   [junit4]   2> 203335 INFO  (TEST-CollectionsAPIDistributedZkTest.test-seed#[B7837BDDC4FB97A7]) [n:127.0.0.1:64120_    ] o.a.s.c.CoreContainer No authentication plugin used.
   [junit4]   2> 203341 INFO  (TEST-CollectionsAPIDistributedZkTest.test-seed#[B7837BDDC4FB97A7]) [n:127.0.0.1:64120_    ] o.a.s.c.CorePropertiesLocator Looking for core definitions underneath /Users/jenkins/workspace/Lucene-Solr-5.x-MacOSX/solr/build/solr-core/test/J1/../../../../../../../../../Users/jenkins/workspace/Lucene-Solr-5.x-MacOSX/solr/build/solr-core/test/J1/temp/solr.cloud.CollectionsAPIDistributedZkTest_B7837BDDC4FB97A7-001/control-001/cores
   [junit4]   2> 203344 INFO  (TEST-CollectionsAPIDistributedZkTest.test-seed#[B7837BDDC4FB97A7]) [n:127.0.0.1:64120_    ] o.a.s.c.CoreDescriptor Created CoreDescriptor: {name=collection1, config=solrconfig.xml, transient=false, schema=schema.xml, loadOnStartup=true, configSetProperties=configsetprops.json, collection=control_collection, coreNodeName=, dataDir=data/, shard=}
   [junit4]   2> 203344 INFO  (TEST-CollectionsAPIDistributedZkTest.test-seed#[B7837BDDC4FB97A7]) [n:127.0.0.1:64120_    ] o.a.s.c.CorePropertiesLocator Found core collection1 in /Users/jenkins/workspace/Lucene-Solr-5.x-MacOSX/solr/build/solr-core/test/J1/../../../../../../../../../Users/jenkins/workspace/Lucene-Solr-5.x-MacOSX/solr/build/solr-core/test/J1/temp/solr.cloud.CollectionsAPIDistributedZkTest_B7837BDDC4FB97A7-001/control-001/cores/collection1
   [junit4]   2> 203344 INFO  (TEST-CollectionsAPIDistributedZkTest.test-seed#[B7837BDDC4FB97A7]) [n:127.0.0.1:64120_    ] o.a.s.c.CorePropertiesLocator Found 1 core definitions
   [junit4]   2> 203346 INFO  (TEST-CollectionsAPIDistributedZkTest.test-seed#[B7837BDDC4FB97A7]) [n:127.0.0.1:64120_    ] o.a.s.s.SolrDispatchFilter user.dir=/Users/jenkins/workspace/Lucene-Solr-5.x-MacOSX/solr/build/solr-core/test/J1
   [junit4]   2> 203347 INFO  (TEST-CollectionsAPIDistributedZkTest.test-seed#[B7837BDDC4FB97A7]) [n:127.0.0.1:64120_    ] o.a.s.s.SolrDispatchFilter SolrDispatchFilter.init() done
   [junit4]   2> 203347 INFO  (coreLoadExecutor-758-thread-1-processing-n:127.0.0.1:64120_) [n:127.0.0.1:64120_ c:control_collection   x:collection1] o.a.s.c.ZkController publishing state=down
   [junit4]   2> 203347 INFO  (coreLoadExecutor-758-thread-1-processing-n:127.0.0.1:64120_) [n:127.0.0.1:64120_ c:control_collection   x:collection1] o.a.s.c.ZkController numShards not found on descriptor - reading it from system property
   [junit4]   2> 203351 INFO  (OverseerStateUpdate-95190006159179783-127.0.0.1:64120_-n_0000000000) [n:127.0.0.1:64120_    ] o.a.s.c.Overseer processMessage: queueSize: 1, message = {
   [junit4]   2>   "core":"collection1",
   [junit4]   2>   "roles":null,
   [junit4]   2>   "base_url":"https://127.0.0.1:64120",
   [junit4]   2>   "node_name":"127.0.0.1:64120_",
   [junit4]   2>   "numShards":"1",
   [junit4]   2>   "state":"down",
   [junit4]   2>   "shard":null,
   [junit4]   2>   "collection":"control_collection",
   [junit4]   2>   "operation":"state"} current state version: 0
   [junit4]   2> 203352 INFO  (coreLoadExecutor-758-thread-1-processing-n:127.0.0.1:64120_) [n:127.0.0.1:64120_ c:control_collection   x:collection1] o.a.s.c.ZkController look for our core node name
   [junit4]   2> 203353 INFO  (OverseerStateUpdate-95190006159179783-127.0.0.1:64120_-n_0000000000) [n:127.0.0.1:64120_    ] o.a.s.c.o.ReplicaMutator Update state numShards=1 message={
   [junit4]   2>   "core":"collection1",
   [junit4]   2>   "roles":null,
   [junit4]   2>   "base_url":"https://127.0.0.1:64120",
   [junit4]   2>   "node_name":"127.0.0.1:64120_",
   [junit4]   2>   "numShards":"1",
   [junit4]   2>   "state":"down",
   [junit4]   2>   "shard":null,
   [junit4]   2>   "collection":"control_collection",
   [junit4]   2>   "operation":"state"}
   [junit4]   2> 203353 INFO  (OverseerStateUpdate-95190006159179783-127.0.0.1:64120_-n_0000000000) [n:127.0.0.1:64120_    ] o.a.s.c.o.ClusterStateMutator building a new cName: control_collection
   [junit4]   2> 203355 INFO  (OverseerStateUpdate-95190006159179783-127.0.0.1:64120_-n_0000000000) [n:127.0.0.1:64120_    ] o.a.s.c.o.ReplicaMutator Assigning new node to shard shard=shard1
   [junit4]   2> 203358 INFO  (zkCallback-150-thread-1-processing-n:127.0.0.1:64120_) [n:127.0.0.1:64120_    ] o.a.s.c.c.ZkStateReader A cluster state change: [WatchedEvent state:SyncConnected type:NodeDataChanged path:/clusterstate.json], has occurred - updating... (live nodes size: [1])
   [junit4]   2> 204354 INFO  (coreLoadExecutor-758-thread-1-processing-n:127.0.0.1:64120_) [n:127.0.0.1:64120_ c:control_collection   x:collection1] o.a.s.c.ZkController waiting to find shard id in clusterstate for collection1
   [junit4]   2> 204354 INFO  (coreLoadExecutor-758-thread-1-processing-n:127.0.0.1:64120_) [n:127.0.0.1:64120_ c:control_collection   x:collection1] o.a.s.c.ZkController Check for collection zkNode:control_collection
   [junit4]   2> 204355 INFO  (coreLoadExecutor-758-thread-1-processing-n:127.0.0.1:64120_) [n:127.0.0.1:64120_ c:control_collection   x:collection1] o.a.s.c.ZkController Collection zkNode exists
   [junit4]   2> 204355 INFO  (coreLoadExecutor-758-thread-1-processing-n:127.0.0.1:64120_) [n:127.0.0.1:64120_ c:control_collection   x:collection1] o.a.s.c.c.ZkStateReader Load collection config from: [/collections/control_collection]
   [junit4]   2> 204357 INFO  (coreLoadExecutor-758-thread-1-processing-n:127.0.0.1:64120_) [n:127.0.0.1:64120_ c:control_collection   x:collection1] o.a.s.c.c.ZkStateReader path=[/collections/control_collection] [configName]=[conf1] specified config exists in ZooKeeper
   [junit4]   2> 204357 INFO  (coreLoadExecutor-758-thread-1-processing-n:127.0.0.1:64120_) [n:127.0.0.1:64120_ c:control_collection   x:collection1] o.a.s.c.SolrResourceLoader new SolrResourceLoader for directory: '/Users/jenkins/workspace/Lucene-Solr-5.x-MacOSX/solr/build/solr-core/test/J1/temp/solr.cloud.CollectionsAPIDistributedZkTest_B7837BDDC4FB97A7-001/control-001/cores/collection1'
   [junit4]   2> 204357 INFO  (coreLoadExecutor-758-thread-1-processing-n:127.0.0.1:64120_) [n:127.0.0.1:64120_ c:control_collection   x:collection1] o.a.s.c.SolrResourceLoader JNDI not configured for solr (NoInitialContextEx)
   [junit4]   2> 204357 INFO  (coreLoadExecutor-758-thread-1-processing-n:127.0.0.1:64120_) [n:127.0.0.1:64120_ c:control_collection   x:collection1] o.a.s.c.SolrResourceLoader solr home defaulted to 'solr/' (could not find system property or JNDI)
   [junit4]   2> 204360 INFO  (coreLoadExecutor-758-thread-1-processing-n:127.0.0.1:64120_) [n:127.0.0.1:64120_ c:control_collection   x:collection1] o.a.s.c.Config loaded config solrconfig.xml with version 0 
   [junit4]   2> 204371 INFO  (coreLoadExecutor-758-thread-1-processing-n:127.0.0.1:64120_) [n:127.0.0.1:64120_ c:control_collection   x:collection1] o.a.s.c.SolrConfig current version of requestparams : -1
   [junit4]   2> 204407 INFO  (coreLoadExecutor-758-thread-1-processing-n:127.0.0.1:64120_) [n:127.0.0.1:64120_ c:control_collection   x:collection1] o.a.s.c.SolrConfig Using Lucene MatchVersion: 5.5.0
   [junit4]   2> 204414 INFO  (coreLoadExecutor-758-thread-1-processing-n:127.0.0.1:64120_) [n:127.0.0.1:64120_ c:control_collection   x:collection1] o.a.s.c.SolrConfig Loaded SolrConfig: solrconfig.xml
   [junit4]   2> 204423 INFO  (coreLoadExecutor-758-thread-1-processing-n:127.0.0.1:64120_) [n:127.0.0.1:64120_ c:control_collection   x:collection1] o.a.s.s.IndexSchema [collection1] Schema name=test
   [junit4]   2> 204544 INFO  (coreLoadExecutor-758-thread-1-processing-n:127.0.0.1:64120_) [n:127.0.0.1:64120_ c:control_collection   x:collection1] o.a.s.s.OpenExchangeRatesOrgProvider Initialized with rates=open-exchange-rates.json, refreshInterval=1440.
   [junit4]   2> 204553 INFO  (coreLoadExecutor-758-thread-1-processing-n:127.0.0.1:64120_) [n:127.0.0.1:64120_ c:control_collection   x:collection1] o.a.s.s.IndexSchema default search field in schema is text
   [junit4]   2> 204553 INFO  (coreLoadExecutor-758-thread-1-processing-n:127.0.0.1:64120_) [n:127.0.0.1:64120_ c:control_collection   x:collection1] o.a.s.s.IndexSchema unique key field: id
   [junit4]   2> 204576 INFO  (coreLoadExecutor-758-thread-1-processing-n:127.0.0.1:64120_) [n:127.0.0.1:64120_ c:control_collection   x:collection1] o.a.s.s.FileExchangeRateProvider Reloading exchange rates from file currency.xml
   [junit4]   2> 204581 INFO  (coreLoadExecutor-758-thread-1-processing-n:127.0.0.1:64120_) [n:127.0.0.1:64120_ c:control_collection   x:collection1] o.a.s.s.FileExchangeRateProvider Reloading exchange rates from file currency.xml
   [junit4]   2> 204585 INFO  (coreLoadExecutor-758-thread-1-processing-n:127.0.0.1:64120_) [n:127.0.0.1:64120_ c:control_collection   x:collection1] o.a.s.s.OpenExchangeRatesOrgProvider Reloading exchange rates from open-exchange-rates.json
   [junit4]   2> 204587 INFO  (coreLoadExecutor-758-thread-1-processing-n:127.0.0.1:64120_) [n:127.0.0.1:64120_ c:control_collection   x:collection1] o.a.s.s.OpenExchangeRatesOrgProvider Reloading exchange rates from open-exchange-rates.json
   [junit4]   2> 204592 INFO  (coreLoadExecutor-758-thread-1-processing-n:127.0.0.1:64120_) [n:127.0.0.1:64120_ c:control_collection   x:collection1] o.a.s.c.ConfigSetProperties Did not find ConfigSet properties, assuming default properties: Can't find resource 'configsetprops.json' in classpath or '/configs/conf1', cwd=/Users/jenkins/workspace/Lucene-Solr-5.x-MacOSX/solr/build/solr-core/test/J1
   [junit4]   2> 204592 INFO  (coreLoadExecutor-758-thread-1-processing-n:127.0.0.1:64120_) [n:127.0.0.1:64120_ c:control_collection   x:collection1] o.a.s.c.CoreContainer Creating SolrCore 'collection1' using configuration from collection control_collection
   [junit4]   2> 204592 INFO  (coreLoadExecutor-758-thread-1-processing-n:127.0.0.1:64120_) [n:127.0.0.1:64120_ c:control_collection s:shard1 r:core_node1 x:collection1] o.a.s.c.SolrCore org.apache.solr.core.MockDirectoryFactory
   [junit4]   2> 204593 INFO  (coreLoadExecutor-758-thread-1-processing-n:127.0.0.1:64120_) [n:127.0.0.1:64120_ c:control_collection s:shard1 r:core_node1 x:collection1] o.a.s.c.SolrCore [[collection1] ] Opening new SolrCore at [/Users/jenkins/workspace/Lucene-Solr-5.x-MacOSX/solr/build/solr-core/test/J1/temp/solr.cloud.CollectionsAPIDistributedZkTest_B7837BDDC4FB97A7-001/control-001/cores/collection1], dataDir=[/Users/jenkins/workspace/Lucene-Solr-5.x-MacOSX/solr/build/solr-core/test/J1/../../../../../../../../../Users/jenkins/workspace/Lucene-Solr-5.x-MacOSX/solr/build/solr-core/test/J1/temp/solr.cloud.CollectionsAPIDistributedZkTest_B7837BDDC4FB97A7-001/control-001/cores/collection1/data/]
   [junit4]   2> 204593 INFO  (coreLoadExecutor-758-thread-1-processing-n:127.0.0.1:64120_) [n:127.0.0.1:64120_ c:control_collection s:shard1 r:core_node1 x:collection1] o.a.s.c.JmxMonitoredMap JMX monitoring is enabled. Adding Solr mbeans to JMX Server: com.sun.jmx.mbeanserver.JmxMBeanServer@6247400d
   [junit4]   2> 204594 INFO  (coreLoadExecutor-758-thread-1-processing-n:127.0.0.1:64120_) [n:127.0.0.1:64120_ c:control_collection s:shard1 r:core_node1 x:collection1] o.a.s.c.CachingDirectoryFactory return new directory for /Users/jenkins/workspace/Lucene-Solr-5.x-MacOSX/solr/build/solr-core/test/J1/../../../../../../../../../Users/jenkins/workspace/Lucene-Solr-5.x-MacOSX/solr/build/solr-core/test/J1/temp/solr.cloud.CollectionsAPIDistributedZkTest_B7837BDDC4FB97A7-001/control-001/cores/collection1/data
   [junit4]   2> 204594 INFO  (coreLoadExecutor-758-thread-1-processing-n:127.0.0.1:64120_) [n:127.0.0.1:64120_ c:control_collection s:shard1 r:core_node1 x:collection1] o.a.s.c.SolrCore New index directory detected: old=null new=/Users/jenkins/workspace/Lucene-Solr-5.x-MacOSX/solr/build/solr-core/test/J1/../../../../../../../../../Users/jenkins/workspace/Lucene-Solr-5.x-MacOSX/solr/build/solr-core/test/J1/temp/solr.cloud.CollectionsAPIDistributedZkTest_B7837BDDC4FB97A7-001/control-001/cores/collection1/data/index/
   [junit4]   2> 204594 WARN  (coreLoadExecutor-758-thread-1-processing-n:127.0.0.1:64120_) [n:127.0.0.1:64120_ c:control_collection s:shard1 r:core_node1 x:collection1] o.a.s.c.SolrCore [collection1] Solr index directory '/Users/jenkins/workspace/Lucene-Solr-5.x-MacOSX/solr/build/solr-core/test/J1/../../../../../../../../../Users/jenkins/workspace/Lucene-Solr-5.x-MacOSX/solr/build/solr-core/test/J1/temp/solr.cloud.CollectionsAPIDistributedZkTest_B7837BDDC4FB97A7-001/control-001/cores/collection1/data/index' doesn't exist. Creating new index...
   [junit4]   2> 204594 INFO  (coreLoadExecutor-758-thread-1-processing-n:127.0.0.1:64120_) [n:127.0.0.1:64120_ c:control_collection s:shard1 r:core_node1 x:collection1] o.a.s.c.CachingDirectoryFactory return new directory for /Users/jenkins/workspace/Lucene-Solr-5.x-MacOSX/solr/build/solr-core/test/J1/../../../../../../../../../Users/jenkins/workspace/Lucene-Solr-5.x-MacOSX/solr/build/solr-core/test/J1/temp/solr.cloud.CollectionsAPIDistributedZkTest_B7837BDDC4FB97A7-001/control-001/cores/collection1/data/index
   [junit4]   2> 204595 INFO  (coreLoadExecutor-758-thread-1-processing-n:127.0.0.1:64120_) [n:127.0.0.1:64120_ c:control_collection s:shard1 r:core_node1 x:collection1] o.a.s.u.RandomMergePolicy RandomMergePolicy wrapping class org.apache.lucene.index.TieredMergePolicy: [TieredMergePolicy: maxMergeAtOnce=41, maxMergeAtOnceExplicit=47, maxMergedSegmentMB=32.171875, floorSegmentMB=0.4873046875, forceMergeDeletesPctAllowed=3.362707567366771, segmentsPerTier=35.0, maxCFSSegmentSizeMB=8.796093022207999E12, noCFSRatio=0.19963547898720188
   [junit4]   2> 204595 INFO  (coreLoadExecutor-758-thread-1-processing-n:127.0.0.1:64120_) [n:127.0.0.1:64120_ c:control_collection s:shard1 r:core_node1 x:collection1] o.a.s.c.SolrDeletionPolicy SolrDeletionPolicy.onCommit: commits: num=1
   [junit4]   2> 	commit{dir=MockDirectoryWrapper(RAMDirectory@678d4c8b lockFactory=org.apache.lucene.store.SingleInstanceLockFactory@937b655),segFN=segments_1,generation=1}
   [junit4]   2> 204595 INFO  (coreLoadExecutor-758-thread-1-processing-n:127.0.0.1:64120_) [n:127.0.0.1:64120_ c:control_collection s:shard1 r:core_node1 x:collection1] o.a.s.c.SolrDeletionPolicy newest commit generation = 1
   [junit4]   2> 204596 INFO  (OldIndexDirectoryCleanupThreadForCore-collection1) [n:127.0.0.1:64120_ c:control_collection s:shard1 r:core_node1 x:collection1] o.a.s.c.SolrCore Looking for old index directories to cleanup for core collection1 in /Users/jenkins/workspace/Lucene-Solr-5.x-MacOSX/solr/build/solr-core/test/J1/../../../../../../../../../Users/jenkins/workspace/Lucene-Solr-5.x-MacOSX/solr/build/solr-core/test/J1/temp/solr.cloud.CollectionsAPIDistributedZkTest_B7837BDDC4FB97A7-001/control-001/cores/collection1/data/
   [junit4]   2> 204597 WARN  (OldIndexDirectoryCleanupThreadForCore-collection1) [n:127.0.0.1:64120_ c:control_collection s:shard1 r:core_node1 x:collection1] o.a.s.c.DirectoryFactory /Users/jenkins/workspace/Lucene-Solr-5.x-MacOSX/solr/build/solr-core/test/J1/../../../../../../../../../Users/jenkins/workspace/Lucene-Solr-5.x-MacOSX/solr/build/solr-core/test/J1/temp/solr.cloud.CollectionsAPIDistributedZkTest_B7837BDDC4FB97A7-001/control-001/cores/collection1/data/ does not point to a valid data directory; skipping clean-up of old index directories.
   [junit4]   2> 204603 INFO  (coreLoadExecutor-758-thread-1-processing-n:127.0.0.1:64120_) [n:127.0.0.1:64120_ c:control_collection s:shard1 r:core_node1 x:collection1] o.a.s.u.p.UpdateRequestProcessorChain creating updateRequestProcessorChain "nodistrib"
   [junit4]   2> 204603 INFO  (coreLoadExecutor-758-thread-1-processing-n:127.0.0.1:64120_) [n:127.0.0.1:64120_ c:control_collection s:shard1 r:core_node1 x:collection1] o.a.s.u.p.UpdateRequestProcessorChain creating updateRequestProcessorChain "dedupe"
   [junit4]   2> 204604 INFO  (coreLoadExecutor-758-thread-1-processing-n:127.0.0.1:64120_) [n:127.0.0.1:64120_ c:control_collection s:shard1 r:core_node1 x:collection1] o.a.s.u.p.UpdateRequestProcessorChain inserting DistributedUpdateProcessorFactory into updateRequestProcessorChain "dedupe"
   [junit4]   2> 204604 INFO  (coreLoadExecutor-758-thread-1-processing-n:127.0.0.1:64120_) [n:127.0.0.1:64120_ c:control_collection s:shard1 r:core_node1 x:collection1] o.a.s.u.p.UpdateRequestProcessorChain creating updateRequestProcessorChain "stored_sig"
   [junit4]   2> 204604 INFO  (coreLoadExecutor-758-thread-1-processing-n:127.0.0.1:64120_) [n:127.0.0.1:64120_ c:control_collection s:shard1 r:core_node1 x:collection1] o.a.s.u.p.UpdateRequestProcessorChain inserting DistributedUpdateProcessorFactory into updateRequestProcessorChain "stored_sig"
   [junit4]   2> 204604 INFO  (coreLoadExecutor-758-thread-1-processing-n:127.0.0.1:64120_) [n:127.0.0.1:64120_ c:control_collection s:shard1 r:core_node1 x:collection1] o.a.s.u.p.UpdateRequestProcessorChain creating updateRequestProcessorChain "distrib-dup-test-chain-explicit"
   [junit4]   2> 204604 INFO  (coreLoadExecutor-758-thread-1-processing-n:127.0.0.1:64120_) [n:127.0.0.1:64120_ c:control_collection s:shard1 r:core_node1 x:collection1] o.a.s.u.p.UpdateRequestProcessorChain creating updateRequestProcessorChain "distrib-dup-test-chain-implicit"
   [junit4]   2> 204604 INFO  (coreLoadExecutor-758-thread-1-processing-n:127.0.0.1:64120_) [n:127.0.0.1:64120_ c:control_collection s:shard1 r:core_node1 x:collection1] o.a.s.u.p.UpdateRequestProcessorChain inserting DistributedUpdateProcessorFactory into updateRequestProcessorChain "distrib-dup-test-chain-implicit"
   [junit4]   2> 204604 INFO  (coreLoadExecutor-758-thread-1-processing-n:127.0.0.1:64120_) [n:127.0.0.1:64120_ c:control_collection s:shard1 r:core_node1 x:collection1] o.a.s.c.SolrCore no updateRequestProcessorChain defined as default, creating implicit default
   [junit4]   2> 204604 WARN  (coreLoadExecutor-758-thread-1-processing-n:127.0.0.1:64120_) [n:127.0.0.1:64120_ c:control_collection s:shard1 r:core_node1 x:collection1] o.a.s.c.RequestHandlers INVALID paramSet a in requestHandler {type = requestHandler,name = /dump,class = DumpRequestHandler,args = {defaults={a=A,b=B}}}
   [junit4]   2> 204610 INFO  (coreLoadExecutor-758-thread-1-processing-n:127.0.0.1:64120_) [n:127.0.0.1:64120_ c:control_collection s:shard1 r:core_node1 x:collection1] o.a.s.h.l.XMLLoader xsltCacheLifetimeSeconds=60
   [junit4]   2> 204611 INFO  (coreLoadExecutor-758-thread-1-processing-n:127.0.0.1:64120_) [n:127.0.0.1:64120_ c:control_collection s:shard1 r:core_node1 x:collection1] o.a.s.h.l.XMLLoader xsltCacheLifetimeSeconds=60
   [junit4]   2> 204612 INFO  (coreLoadExecutor-758-thread-1-processing-n:127.0.0.1:64120_) [n:127.0.0.1:64120_ c:control_collection s:shard1 r:core_node1 x:collection1] o.a.s.h.l.XMLLoader xsltCacheLifetimeSeconds=60
   [junit4]   2> 204613 INFO  (coreLoadExecutor-758-thread-1-processing-n:127.0.0.1:64120_) [n:127.0.0.1:64120_ c:control_collection s:shard1 r:core_node1 x:collection1] o.a.s.h.l.XMLLoader xsltCacheLifetimeSeconds=60
   [junit4]   2> 204619 INFO  (coreLoadExecutor-758-thread-1-processing-n:127.0.0.1:64120_) [n:127.0.0.1:64120_ c:control_collection s:shard1 r:core_node1 x:collection1] o.a.s.c.RequestHandlers Registered paths: /admin/mbeans,standard,/dump,/update/csv,/update/json/docs,/admin/luke,/admin/segments,/get,/admin/system,/replication,/admin/properties,/config,/schema,/admin/plugins,/admin/logging,/update/json,/admin/threads,/admin/ping,/update,/admin/file
   [junit4]   2> 204620 INFO  (coreLoadExecutor-758-thread-1-processing-n:127.0.0.1:64120_) [n:127.0.0.1:64120_ c:control_collection s:shard1 r:core_node1 x:collection1] o.a.s.c.SolrCore Using default statsCache cache: org.apache.solr.search.stats.LocalStatsCache
   [junit4]   2> 204621 INFO  (coreLoadExecutor-758-thread-1-processing-n:127.0.0.1:64120_) [n:127.0.0.1:64120_ c:control_collection s:shard1 r:core_node1 x:collection1] o.a.s.u.UpdateHandler Using UpdateLog implementation: org.apache.solr.update.UpdateLog
   [junit4]   2> 204621 INFO  (coreLoadExecutor-758-thread-1-processing-n:127.0.0.1:64120_) [n:127.0.0.1:64120_ c:control_collection s:shard1 r:core_node1 x:collection1] o.a.s.u.UpdateLog Initializing UpdateLog: dataDir= defaultSyncLevel=FLUSH numRecordsToKeep=100 maxNumLogsToKeep=10 numVersionBuckets=65536
   [junit4]   2> 204624 INFO  (coreLoadExecutor-758-thread-1-processing-n:127.0.0.1:64120_) [n:127.0.0.1:64120_ c:control_collection s:shard1 r:core_node1 x:collection1] o.a.s.u.CommitTracker Hard AutoCommit: disabled
   [junit4]   2> 204624 INFO  (coreLoadExecutor-758-thread-1-processing-n:127.0.0.1:64120_) [n:127.0.0.1:64120_ c:control_collection s:shard1 r:core_node1 x:collection1] o.a.s.u.CommitTracker Soft AutoCommit: disabled
   [junit4]   2> 204624 INFO  (coreLoadExecutor-758-thread-1-processing-n:127.0.0.1:64120_) [n:127.0.0.1:64120_ c:control_collection s:shard1 r:core_node1 x:collection1] o.a.s.u.RandomMergePolicy RandomMergePolicy wrapping class org.apache.lucene.index.LogDocMergePolicy: [LogDocMergePolicy: minMergeSize=1000, mergeFactor=46, maxMergeSize=9223372036854775807, maxMergeSizeForForcedMerge=9223372036854775807, calibrateSizeByDeletes=true, maxMergeDocs=2147483647, maxCFSSegmentSizeMB=8.796093022207999E12, noCFSRatio=0.0]
   [junit4]   2> 204625 INFO  (coreLoadExecutor-758-thread-1-processing-n:127.0.0.1:64120_) [n:127.0.0.1:64120_ c:control_collection s:shard1 r:core_node1 x:collection1] o.a.s.c.SolrDeletionPolicy SolrDeletionPolicy.onInit: commits: num=1
   [junit4]   2> 	commit{dir=MockDirectoryWrapper(RAMDirectory@678d4c8b lockFactory=org.apache.lucene.store.SingleInstanceLockFactory@937b655),segFN=segments_1,generation=1}
   [junit4]   2> 204625 INFO  (coreLoadExecutor-758-thread-1-processing-n:127.0.0.1:64120_) [n:127.0.0.1:64120_ c:control_collection s:shard1 r:core_node1 x:collection1] o.a.s.c.SolrDeletionPolicy newest commit generation = 1
   [junit4]   2> 204625 INFO  (coreLoadExecutor-758-thread-1-processing-n:127.0.0.1:64120_) [n:127.0.0.1:64120_ c:control_collection s:shard1 r:core_node1 x:collection1] o.a.s.s.SolrIndexSearcher Opening Searcher@2af3a9de[collection1] main
   [junit4]   2> 204625 INFO  (coreLoadExecutor-758-thread-1-processing-n:127.0.0.1:64120_) [n:127.0.0.1:64120_ c:control_collection s:shard1 r:core_node1 x:collection1] o.a.s.c.c.ZkStateReader Load collection config from: [/collections/control_collection]
   [junit4]   2> 204628 INFO  (coreLoadExecutor-758-thread-1-processing-n:127.0.0.1:64120_) [n:127.0.0.1:64120_ c:control_collection s:shard1 r:core_node1 x:collection1] o.a.s.c.c.ZkStateReader path=[/collections/control_collection] [configName]=[conf1] specified config exists in ZooKeeper
   [junit4]   2> 204628 INFO  (coreLoadExecutor-758-thread-1-processing-n:127.0.0.1:64120_) [n:127.0.0.1:64120_ c:control_collection s:shard1 r:core_node1 x:collection1] o.a.s.r.ManagedResourceStorage Setting up ZooKeeper-based storage for the RestManager with znodeBase: /configs/conf1
   [junit4]   2> 204629 INFO  (coreLoadExecutor-758-thread-1-processing-n:127.0.0.1:64120_) [n:127.0.0.1:64120_ c:control_collection s:shard1 r:core_node1 x:collection1] o.a.s.r.ManagedResourceStorage Configured ZooKeeperStorageIO with znodeBase: /configs/conf1
   [junit4]   2> 204629 INFO  (coreLoadExecutor-758-thread-1-processing-n:127.0.0.1:64120_) [n:127.0.0.1:64120_ c:control_collection s:shard1 r:core_node1 x:collection1] o.a.s.r.RestManager Initializing RestManager with initArgs: {}
   [junit4]   2> 204630 INFO  (coreLoadExecutor-758-thread-1-processing-n:127.0.0.1:64120_) [n:127.0.0.1:64120_ c:control_collection s:shard1 r:core_node1 x:collection1] o.a.s.r.ManagedResourceStorage Reading _rest_managed.json using ZooKeeperStorageIO:path=/configs/conf1
   [junit4]   2> 204631 INFO  (coreLoadExecutor-758-thread-1-processing-n:127.0.0.1:64120_) [n:127.0.0.1:64120_ c:control_collection s:shard1 r:core_node1 x:collection1] o.a.s.r.ManagedResourceStorage No data found for znode /configs/conf1/_rest_managed.json
   [junit4]   2> 204631 INFO  (coreLoadExecutor-758-thread-1-processing-n:127.0.0.1:64120_) [n:127.0.0.1:64120_ c:control_collection s:shard1 r:core_node1 x:collection1] o.a.s.r.ManagedResourceStorage Loaded null at path _rest_managed.json using ZooKeeperStorageIO:path=/configs/conf1
   [junit4]   2> 204631 INFO  (coreLoadExecutor-758-thread-1-processing-n:127.0.0.1:64120_) [n:127.0.0.1:64120_ c:control_collection s:shard1 r:core_node1 x:collection1] o.a.s.r.RestManager Initializing 0 registered ManagedResources
   [junit4]   2> 204631 INFO  (coreLoadExecutor-758-thread-1-processing-n:127.0.0.1:64120_) [n:127.0.0.1:64120_ c:control_collection s:shard1 r:core_node1 x:collection1] o.a.s.h.ReplicationHandler Commits will be reserved for  10000
   [junit4]   2> 204631 INFO  (searcherExecutor-759-thread-1-processing-n:127.0.0.1:64120_ x:collection1 s:shard1 c:control_collection r:core_node1) [n:127.0.0.1:64120_ c:control_collection s:shard1 r:core_node1 x:collection1] o.a.s.c.SolrCore [collection1] Registered new searcher Searcher@2af3a9de[collection1] main{ExitableDirectoryReader(UninvertingDirectoryReader())}
   [junit4]   2> 204632 INFO  (coreLoadExecutor-758-thread-1-processing-n:127.0.0.1:64120_) [n:127.0.0.1:64120_ c:control_collection s:shard1 r:core_node1 x:collection1] o.a.s.u.UpdateLog Looking up max value of version field to seed version buckets
   [junit4]   2> 204632 INFO  (coreLoadExecutor-758-thread-1-processing-n:127.0.0.1:64120_) [n:127.0.0.1:64120_ c:control_collection s:shard1 r:core_node1 x:collection1] o.a.s.u.VersionInfo Refreshing highest value of _version_ for 65536 version buckets from index
   [junit4]   2> 204632 INFO  (coreLoadExecutor-758-thread-1-processing-n:127.0.0.1:64120_) [n:127.0.0.1:64120_ c:control_collection s:shard1 r:core_node1 x:collection1] o.a.s.u.VersionInfo No terms found for _version_, cannot seed version bucket highest value from index
   [junit4]   2> 204632 INFO  (coreLoadExecutor-758-thread-1-processing-n:127.0.0.1:64120_) [n:127.0.0.1:64120_ c:control_collection s:shard1 r:core_node1 x:collection1] o.a.s.u.UpdateLog Could not find max version in index or recent updates, using new clock 1523040100966989824
   [junit4]   2> 204633 INFO  (coreLoadExecutor-758-thread-1-processing-n:127.0.0.1:64120_) [n:127.0.0.1:64120_ c:control_collection s:shard1 r:core_node1 x:collection1] o.a.s.u.UpdateLog Took 1.0ms to seed version buckets with highest version 1523040100966989824
   [junit4]   2> 204634 INFO  (coreLoadExecutor-758-thread-1-processing-n:127.0.0.1:64120_) [n:127.0.0.1:64120_ c:control_collection s:shard1 r:core_node1 x:collection1] o.a.s.c.ZkController watch zkdir /configs/conf1
   [junit4]   2> 204635 INFO  (coreLoadExecutor-758-thread-1-processing-n:127.0.0.1:64120_) [n:127.0.0.1:64120_ c:control_collection s:shard1 r:core_node1 x:collection1] o.a.s.c.CoreContainer registering core: collection1
   [junit4]   2> 204635 INFO  (coreZkRegister-752-thread-1-processing-n:127.0.0.1:64120_ x:collection1 s:shard1 c:control_collection r:core_node1) [n:127.0.0.1:64120_ c:control_collection s:shard1 r:core_node1 x:collection1] o.a.s.c.ZkController Register replica - core:collection1 address:https://127.0.0.1:64120 collection:control_collection shard:shard1
   [junit4]   2> 204637 INFO  (coreZkRegister-752-thread-1-processing-n:127.0.0.1:64120_ x:collection1 s:shard1 c:control_collection r:core_node1) [n:127.0.0.1:64120_ c:control_collection s:shard1 r:core_node1 x:collection1] o.a.s.c.c.SolrZkClient makePath: /collections/control_collection/leader_elect/shard1/election
   [junit4]   2> 204646 INFO  (coreZkRegister-752-thread-1-processing-n:127.0.0.1:64120_ x:collection1 s:shard1 c:control_collection r:core_node1) [n:127.0.0.1:64120_ c:control_collection s:shard1 r:core_node1 x:collection1] o.a.s.c.LeaderElector Joined leadership election with path: /collections/control_collection/leader_elect/shard1/election/95190006159179783-core_node1-n_0000000000
   [junit4]   2> 204647 INFO  (coreZkRegister-752-thread-1-processing-n:127.0.0.1:64120_ x:collection1 s:shard1 c:control_collection r:core_node1) [n:127.0.0.1:64120_ c:control_collection s:shard1 r:core_node1 x:collection1] o.a.s.c.ShardLeaderElectionContext Running the leader process for shard=shard1 and weAreReplacement=false and leaderVoteWait=180000
   [junit4]   2> 204652 INFO  (coreZkRegister-752-thread-1-processing-n:127.0.0.1:64120_ x:collection1 s:shard1 c:control_collection r:core_node1) [n:127.0.0.1:64120_ c:control_collection s:shard1 r:core_node1 x:collection1] o.a.s.c.ShardLeaderElectionContext Enough replicas found to continue.
   [junit4]   2> 204652 INFO  (coreZkRegister-752-thread-1-processing-n:127.0.0.1:64120_ x:collection1 s:shard1 c:control_collection r:core_node1) [n:127.0.0.1:64120_ c:control_collection s:shard1 r:core_node1 x:collection1] o.a.s.c.ShardLeaderElectionContext I may be the new leader - try and sync
   [junit4]   2> 204652 INFO  (coreZkRegister-752-thread-1-processing-n:127.0.0.1:64120_ x:collection1 s:shard1 c:control_collection r:core_node1) [n:127.0.0.1:64120_ c:control_collection s:shard1 r:core_node1 x:collection1] o.a.s.c.SyncStrategy Sync replicas to https://127.0.0.1:64120/collection1/
   [junit4]   2> 204652 INFO  (coreZkRegister-752-thread-1-processing-n:127.0.0.1:64120_ x:collection1 s:shard1 c:control_collection r:core_node1) [n:127.0.0.1:64120_ c:control_collection s:shard1 r:core_node1 x:collection1] o.a.s.c.SyncStrategy Sync Success - now sync replicas to me
   [junit4]   2> 204652 INFO  (coreZkRegister-752-thread-1-processing-n:127.0.0.1:64120_ x:collection1 s:shard1 c:control_collection r:core_node1) [n:127.0.0.1:64120_ c:control_collection s:shard1 r:core_node1 x:collection1] o.a.s.c.SyncStrategy https://127.0.0.1:64120/collection1/ has no replicas
   [junit4]   2> 204653 INFO  (OverseerStateUpdate-95190006159179783-127.0.0.1:64120_-n_0000000000) [n:127.0.0.1:64120_    ] o.a.s.c.Overseer processMessage: queueSize: 1, message = {
   [junit4]   2>   "operation":"leader",
   [junit4]   2>   "shard":"shard1",
   [junit4]   2>   "collection":"control_collection"} current state version: 1
   [junit4]   2> 204654 INFO  (coreZkRegister-752-thread-1-processing-n:127.0.0.1:64120_ x:collection1 s:shard1 c:control_collection r:core_node1) [n:127.0.0.1:64120_ c:control_collection s:shard1 r:core_node1 x:collection1] o.a.s.c.c.SolrZkClient makePath: /collections/control_collection/leaders/shard1
   [junit4]   2> 204659 INFO  (coreZkRegister-752-thread-1-processing-n:127.0.0.1:64120_ x:collection1 s:shard1 c:control_collection r:core_node1) [n:127.0.0.1:64120_ c:control_collection s:shard1 r:core_node1 x:collection1] o.a.s.c.ShardLeaderElectionContextBase Creating leader registration node
   [junit4]   2> 204668 INFO  (coreZkRegister-752-thread-1-processing-n:127.0.0.1:64120_ x:collection1 s:shard1 c:control_collection r:core_node1) [n:127.0.0.1:64120_ c:control_collection s:shard1 r:core_node1 x:collection1] o.a.s.c.ShardLeaderElectionContext I am the new leader: https://127.0.0.1:64120/collection1/ shard1
   [junit4]   2> 204670 INFO  (OverseerStateUpdate-95190006159179783-127.0.0.1:64120_-n_0000000000) [n:127.0.0.1:64120_    ] o.a.s.c.Overseer processMessage: queueSize: 1, message = {
   [junit4]   2>   "operation":"leader",
   [junit4]   2>   "shard":"shard1",
   [junit4]   2>   "collection":"control_collection",
   [junit4]   2>   "base_url":"https://127.0.0.1:64120",
   [junit4]   2>   "core":"collection1",
   [junit4]   2>   "state":"active"} current state version: 1
   [junit4]   2> 204775 INFO  (zkCallback-150-thread-1-processing-n:127.0.0.1:64120_) [n:127.0.0.1:64120_    ] o.a.s.c.c.ZkStateReader A cluster state change: [WatchedEvent state:SyncConnected type:NodeDataChanged path:/clusterstate.json], has occurred - updating... (live nodes size: [1])
   [junit4]   2> 204823 INFO  (coreZkRegister-752-thread-1-processing-n:127.0.0.1:64120_ x:collection1 s:shard1 c:control_collection r:core_node1) [n:127.0.0.1:64120_ c:control_collection s:shard1 r:core_node1 x:collection1] o.a.s.c.ZkController We are https://127.0.0.1:64120/collection1/ and leader is https://127.0.0.1:64120/collection1/
   [junit4]   2> 204823 INFO  (coreZkRegister-752-thread-1-processing-n:127.0.0.1:64120_ x:collection1 s:shard1 c:control_collection r:core_node1) [n:127.0.0.1:64120_ c:control_collection s:shard1 r:core_node1 x:collection1] o.a.s.c.ZkController No LogReplay needed for core=collection1 baseURL=https://127.0.0.1:64120
   [junit4]   2> 204824 INFO  (coreZkRegister-752-thread-1-processing-n:127.0.0.1:64120_ x:collection1 s:shard1 c:control_collection r:core_node1) [n:127.0.0.1:64120_ c:control_collection s:shard1 r:core_node1 x:collection1] o.a.s.c.ZkController I am the leader, no recovery necessary
   [junit4]   2> 204824 INFO  (coreZkRegister-752-thread-1-processing-n:127.0.0.1:64120_ x:collection1 s:shard1 c:control_collection r:core_node1) [n:127.0.0.1:64120_ c:control_collection s:shard1 r:core_node1 x:collection1] o.a.s.c.ZkController publishing state=active
   [junit4]   2> 204824 INFO  (coreZkRegister-752-thread-1-processing-n:127.0.0.1:64120_ x:collection1 s:shard1 c:control_collection r:core_node1) [n:127.0.0.1:64120_ c:control_collection s:shard1 r:core_node1 x:collection1] o.a.s.c.ZkController numShards not found on descriptor - reading it from system property
   [junit4]   2> 204829 INFO  (OverseerStateUpdate-95190006159179783-127.0.0.1:64120_-n_0000000000) [n:127.0.0.1:64120_    ] o.a.s.c.Overseer processMessage: queueSize: 1, message = {
   [junit4]   2>   "core":"collection1",
   [junit4]   2>   "core_node_name":"core_node1",
   [junit4]   2>   "roles":null,
   [junit4]   2>   "base_url":"https://127.0.0.1:64120",
   [junit4]   2>   "node_name":"127.0.0.1:64120_",
   [junit4]   2>   "numShards":"1",
   [junit4]   2>   "state":"active",
   [junit4]   2>   "shard":"shard1",
   [junit4]   2>   "collection":"control_collection",
   [junit4]   2>   "operation":"state"} current state version: 2
   [junit4]   2> 204834 INFO  (OverseerStateUpdate-95190006159179783-127.0.0.1:64120_-n_0000000000) [n:127.0.0.1:64120_    ] o.a.s.c.o.ReplicaMutator Update state numShards=1 message={
   [junit4]   2>   "core":"collection1",
   [junit4]   2>   "core_node_name":"core_node1",
   [junit4]   2>   "roles":null,
   [junit4]   2>   "base_url":"https://127.0.0.1:64120",
   [junit4]   2>   "node_name":"127.0.0.1:64120_",
   [junit4]   2>   "numShards":"1",
   [junit4]   2>   "state":"active",
   [junit4]   2>   "shard":"shard1",
   [junit4]   2>   "collection":"control_collection",
   [junit4]   2>   "operation":"state"}
   [junit4]   2> 204861 INFO  (TEST-CollectionsAPIDistributedZkTest.test-seed#[B7837BDDC4FB97A7]) [    ] o.a.s.c.c.SolrZkClient Using default ZkCredentialsProvider
   [junit4]   2> 204862 INFO  (TEST-CollectionsAPIDistributedZkTest.test-seed#[B7837BDDC4FB97A7]) [    ] o.a.s.c.c.ConnectionManager Waiting for client to connect to ZooKeeper
   [junit4]   2> 204865 INFO  (zkCallback-152-thread-1) [    ] o.a.s.c.c.ConnectionManager Watcher org.apache.solr.common.cloud.ConnectionManager@531535a1 name:ZooKeeperConnection Watcher:127.0.0.1:64114/solr got event WatchedEvent state:SyncConnected type:None path:null path:null type:None
   [junit4]   2> 204865 INFO  (TEST-CollectionsAPIDistributedZkTest.test-seed#[B7837BDDC4FB97A7]) [    ] o.a.s.c.c.ConnectionManager Client is connected to ZooKeeper
   [junit4]   2> 204865 INFO  (TEST-CollectionsAPIDistributedZkTest.test-seed#[B7837BDDC4FB97A7]) [    ] o.a.s.c.c.SolrZkClient Using default ZkACLProvider
   [junit4]   2> 204865 INFO  (TEST-CollectionsAPIDistributedZkTest.test-seed#[B7837BDDC4FB97A7]) [    ] o.a.s.c.c.ZkStateReader Updating cluster state from ZooKeeper... 
   [junit4]   2> 204877 INFO  (TEST-CollectionsAPIDistributedZkTest.test-seed#[B7837BDDC4FB97A7]) [    ] o.a.s.c.ChaosMonkey monkey: init - expire sessions:false cause connection loss:false
   [junit4]   2> 204877 INFO  (TEST-CollectionsAPIDistributedZkTest.test-seed#[B7837BDDC4FB97A7]) [    ] o.a.s.c.AbstractFullDistribZkTestBase Creating collection1 with stateFormat=2
   [junit4]   2> 204877 INFO  (TEST-CollectionsAPIDistributedZkTest.test-seed#[B7837BDDC4FB97A7]) [    ] o.a.s.c.c.SolrZkClient Using default ZkCredentialsProvider
   [junit4]   2> 204883 INFO  (TEST-CollectionsAPIDistributedZkTest.test-seed#[B7837BDDC4FB97A7]) [    ] o.a.s.c.c.ConnectionManager Waiting for client to connect to ZooKeeper
   [junit4]   2> 204887 INFO  (zkCallback-153-thread-1) [    ] o.a.s.c.c.ConnectionManager Watcher org.apache.solr.common.cloud.ConnectionManager@49608112 name:ZooKeeperConnection Watcher:127.0.0.1:64114/solr got event WatchedEvent state:SyncConnected type:None path:null path:null type:None
   [junit4]   2> 204888 INFO  (TEST-CollectionsAPIDistributedZkTest.test-seed#[B7837BDDC4FB97A7]) [    ] o.a.s.c.c.ConnectionManager Client is connected to ZooKeeper
   [junit4]   2> 204888 INFO  (TEST-CollectionsAPIDistributedZkTest.test-seed#[B7837BDDC4FB97A7]) [    ] o.a.s.c.c.SolrZkClient Using default ZkACLProvider
   [junit4]   2> 204896 INFO  (OverseerStateUpdate-95190006159179783-127.0.0.1:64120_-n_0000000000) [n:127.0.0.1:64120_    ] o.a.s.c.Overseer processMessage: queueSize: 1, message = {
   [junit4]   2>   "operation":"create",
   [junit4]   2>   "name":"collection1",
   [junit4]   2>   "numShards":"2",
   [junit4]   2>   "stateFormat":"2"} current state version: 2
   [junit4]   2> 204896 INFO  (OverseerStateUpdate-95190006159179783-127.0.0.1:64120_-n_0000000000) [n:127.0.0.1:64120_    ] o.a.s.c.o.ClusterStateMutator building a new cName: collection1
   [junit4]   2> 204897 INFO  (zkCallback-150-thread-1-processing-n:127.0.0.1:64120_) [n:127.0.0.1:64120_    ] o.a.s.c.c.ZkStateReader A cluster state change: [WatchedEvent state:SyncConnected type:NodeDataChanged path:/clusterstate.json], has occurred - updating... (live nodes size: [1])
   [junit4]   2> 204898 INFO  (zkCallback-152-thread-1) [    ] o.a.s.c.c.ZkStateReader A cluster state change: [WatchedEvent state:SyncConnected type:NodeDataChanged path:/clusterstate.json], has occurred - updating... (live nodes size: [1])
   [junit4]   2> 205007 INFO  (OverseerStateUpdate-95190006159179783-127.0.0.1:64120_-n_0000000000) [n:127.0.0.1:64120_    ] o.a.s.c.o.ZkStateWriter going to create_collection /collections/collection1/state.json
   [junit4]   2> 205228 INFO  (TEST-CollectionsAPIDistributedZkTest.test-seed#[B7837BDDC4FB97A7]) [    ] o.a.s.SolrTestCaseJ4 Writing core.properties file to /Users/jenkins/workspace/Lucene-Solr-5.x-MacOSX/solr/build/solr-core/test/J1/temp/solr.cloud.CollectionsAPIDistributedZkTest_B7837BDDC4FB97A7-001/shard-1-001/cores/collection1
   [junit4]   2> 205230 INFO  (TEST-CollectionsAPIDistributedZkTest.test-seed#[B7837BDDC4FB97A7]) [    ] o.a.s.c.AbstractFullDistribZkTestBase create jetty 1 in directory /Users/jenkins/workspace/Lucene-Solr-5.x-MacOSX/solr/build/solr-core/test/J1/temp/solr.cloud.CollectionsAPIDistributedZkTest_B7837BDDC4FB97A7-001/shard-1-001
   [junit4]   2> 205231 INFO  (TEST-CollectionsAPIDistributedZkTest.test-seed#[B7837BDDC4FB97A7]) [    ] o.e.j.s.Server jetty-9.2.13.v20150730
   [junit4]   2> 205235 INFO  (TEST-CollectionsAPIDistributedZkTest.test-seed#[B7837BDDC4FB97A7]) [    ] o.e.j.s.h.ContextHandler Started o.e.j.s.ServletContextHandler@472dd4c5{/,null,AVAILABLE}
   [junit4]   2> 205243 INFO  (TEST-CollectionsAPIDistributedZkTest.test-seed#[B7837BDDC4FB97A7]) [    ] o.e.j.s.ServerConnector Started ServerConnector@10342ea2{SSL-http/1.1}{127.0.0.1:64126}
   [junit4]   2> 205243 INFO  (TEST-CollectionsAPIDistributedZkTest.test-seed#[B7837BDDC4FB97A7]) [    ] o.e.j.s.Server Started @209374ms
   [junit4]   2> 205243 INFO  (TEST-CollectionsAPIDistributedZkTest.test-seed#[B7837BDDC4FB97A7]) [    ] o.a.s.c.s.e.JettySolrRunner Jetty properties: {solr.data.dir=/Users/jenkins/workspace/Lucene-Solr-5.x-MacOSX/solr/build/solr-core/test/J1/temp/solr.cloud.CollectionsAPIDistributedZkTest_B7837BDDC4FB97A7-001/tempDir-001/jetty1, solrconfig=solrconfig.xml, hostContext=/, hostPort=64126, coreRootDirectory=/Users/jenkins/workspace/Lucene-Solr-5.x-MacOSX/solr/build/solr-core/test/J1/../../../../../../../../../Users/jenkins/workspace/Lucene-Solr-5.x-MacOSX/solr/build/solr-core/test/J1/temp/solr.cloud.CollectionsAPIDistributedZkTest_B7837BDDC4FB97A7-001/shard-1-001/cores}
   [junit4]   2> 205243 INFO  (TEST-CollectionsAPIDistributedZkTest.test-seed#[B7837BDDC4FB97A7]) [    ] o.a.s.s.SolrDispatchFilter SolrDispatchFilter.init(): sun.misc.Launcher$AppClassLoader@74a14482
   [junit4]   2> 205244 INFO  (TEST-CollectionsAPIDistributedZkTest.test-seed#[B7837BDDC4FB97A7]) [    ] o.a.s.c.SolrResourceLoader new SolrResourceLoader for directory: '/Users/jenkins/workspace/Lucene-Solr-5.x-MacOSX/solr/build/solr-core/test/J1/temp/solr.cloud.CollectionsAPIDistributedZkTest_B7837BDDC4FB97A7-001/shard-1-001'
   [junit4]   2> 205244 INFO  (TEST-CollectionsAPIDistributedZkTest.test-seed#[B7837BDDC4FB97A7]) [    ] o.a.s.c.SolrResourceLoader JNDI not configured for solr (NoInitialContextEx)
   [junit4]   2> 205244 INFO  (TEST-CollectionsAPIDistributedZkTest.test-seed#[B7837BDDC4FB97A7]) [    ] o.a.s.c.SolrResourceLoader solr home defaulted to 'solr/' (could not find system property or JNDI)
   [junit4]   2> 205244 INFO  (TEST-CollectionsAPIDistributedZkTest.test-seed#[B7837BDDC4FB97A7]) [    ] o.a.s.c.c.SolrZkClient Using default ZkCredentialsProvider
   [junit4]   2> 205245 INFO  (TEST-CollectionsAPIDistributedZkTest.test-seed#[B7837BDDC4FB97A7]) [    ] o.a.s.c.c.ConnectionManager Waiting for client to connect to ZooKeeper
   [junit4]   2> 205248 INFO  (zkCallback-154-thread-1) [    ] o.a.s.c.c.ConnectionManager Watcher org.apache.solr.common.cloud.ConnectionManager@4525cbe9 name:ZooKeeperConnection Watcher:127.0.0.1:64114/solr got event WatchedEvent state:SyncConnected type:None path:null path:null type:None
   [junit4]   2> 205248 INFO  (TEST-CollectionsAPIDistributedZkTest.test-seed#[B7837BDDC4FB97A7]) [    ] o.a.s.c.c.ConnectionManager Client is connected to ZooKeeper
   [junit4]   2> 205249 INFO  (TEST-CollectionsAPIDistributedZkTest.test-seed#[B7837BDDC4FB97A7]) [    ] o.a.s.c.c.SolrZkClient Using default ZkACLProvider
   [junit4]   2> 205252 INFO  (TEST-CollectionsAPIDistributedZkTest.test-seed#[B7837BDDC4FB97A7]) [    ] o.a.s.s.SolrDispatchFilter Loading solr.xml from SolrHome (not found in ZooKeeper)
   [junit4]   2> 205252 INFO  (TEST-CollectionsAPIDistributedZkTest.test-seed#[B7837BDDC4FB97A7]) [    ] o.a.s.c.SolrXmlConfig Loading container configuration from /Users/jenkins/workspace/Lucene-Solr-5.x-MacOSX/solr/build/solr-core/test/J1/temp/solr.cloud.CollectionsAPIDistributedZkTest_B7837BDDC4FB97A7-001/shard-1-001/solr.xml
   [junit4]   2> 205261 INFO  (TEST-CollectionsAPIDistributedZkTest.test-seed#[B7837BDDC4FB97A7]) [    ] o.a.s.c.CorePropertiesLocator Config-defined core root directory: /Users/jenkins/workspace/Lucene-Solr-5.x-MacOSX/solr/build/solr-core/test/J1/../../../../../../../../../Users/jenkins/workspace/Lucene-Solr-5.x-MacOSX/solr/build/solr-core/test/J1/temp/solr.cloud.CollectionsAPIDistributedZkTest_B7837BDDC4FB97A7-001/shard-1-001/cores
   [junit4]   2> 205261 INFO  (TEST-CollectionsAPIDistributedZkTest.test-seed#[B7837BDDC4FB97A7]) [    ] o.a.s.c.CoreContainer New CoreContainer 1157880774
   [junit4]   2> 205261 INFO  (TEST-CollectionsAPIDistributedZkTest.test-seed#[B7837BDDC4FB97A7]) [    ] o.a.s.c.CoreContainer Loading cores into CoreContainer [instanceDir=/Users/jenkins/workspace/Lucene-Solr-5.x-MacOSX/solr/build/solr-core/test/J1/temp/solr.cloud.CollectionsAPIDistributedZkTest_B7837BDDC4FB97A7-001/shard-1-001]
   [junit4]   2> 205261 WARN  (TEST-CollectionsAPIDistributedZkTest.test-seed#[B7837BDDC4FB97A7]) [    ] o.a.s.c.CoreContainer Couldn't add files from /Users/jenkins/workspace/Lucene-Solr-5.x-MacOSX/solr/build/solr-core/test/J1/temp/solr.cloud.CollectionsAPIDistributedZkTest_B7837BDDC4FB97A7-001/shard-1-001/lib to classpath: /Users/jenkins/workspace/Lucene-Solr-5.x-MacOSX/solr/build/solr-core/test/J1/temp/solr.cloud.CollectionsAPIDistributedZkTest_B7837BDDC4FB97A7-001/shard-1-001/lib
   [junit4]   2> 205261 INFO  (TEST-CollectionsAPIDistributedZkTest.test-seed#[B7837BDDC4FB97A7]) [    ] o.a.s.h.c.HttpShardHandlerFactory created with socketTimeout : 90000,urlScheme : ,connTimeout : 15000,maxConnectionsPerHost : 20,maxConnections : 10000,corePoolSize : 0,maximumPoolSize : 2147483647,maxThreadIdleTime : 5,sizeOfQueue : -1,fairnessPolicy : false,useRetries : false,
   [junit4]   2> 205266 INFO  (TEST-CollectionsAPIDistributedZkTest.test-seed#[B7837BDDC4FB97A7]) [    ] o.a.s.u.UpdateShardHandler Creating UpdateShardHandler HTTP client with params: socketTimeout=340000&connTimeout=45000&retry=true
   [junit4]   2> 205267 INFO  (TEST-CollectionsAPIDistributedZkTest.test-seed#[B7837BDDC4FB97A7]) [    ] o.a.s.l.LogWatcher SLF4J impl is org.slf4j.impl.Log4jLoggerFactory
   [junit4]   2> 205267 INFO  (TEST-CollectionsAPIDistributedZkTest.test-seed#[B7837BDDC4FB97A7]) [    ] o.a.s.l.LogWatcher Registering Log Listener [Log4j (org.slf4j.impl.Log4jLoggerFactory)]
   [junit4]   2> 205267 INFO  (TEST-CollectionsAPIDistributedZkTest.test-seed#[B7837BDDC4FB97A7]) [    ] o.a.s.c.ZkContainer Zookeeper client=127.0.0.1:64114/solr
   [junit4]   2> 205267 INFO  (TEST-CollectionsAPIDistributedZkTest.test-seed#[B7837BDDC4FB97A7]) [    ] o.a.s.c.ZkController zkHost includes chroot
   [junit4]   2> 205267 INFO  (TEST-CollectionsAPIDistributedZkTest.test-seed#[B7837BDDC4FB97A7]) [    ] o.a.s.c.c.SolrZkClient Using default ZkCredentialsProvider
   [junit4]   2> 205268 INFO  (TEST-CollectionsAPIDistributedZkTest.test-seed#[B7837BDDC4FB97A7]) [    ] o.a.s.c.c.ConnectionManager Waiting for client to connect to ZooKeeper
   [junit4]   2> 205271 INFO  (zkCallback-156-thread-1) [    ] o.a.s.c.c.ConnectionManager Watcher org.apache.solr.common.cloud.ConnectionManager@3c2b6f00 name:ZooKeeperConnection Watcher:127.0.0.1:64114 got event WatchedEvent state:SyncConnected type:None path:null path:null type:None
   [junit4]   2> 205271 INFO  (TEST-CollectionsAPIDistributedZkTest.test-seed#[B7837BDDC4FB97A7]) [    ] o.a.s.c.c.ConnectionManager Client is connected to ZooKeeper
   [junit4]   2> 205272 INFO  (TEST-CollectionsAPIDistributedZkTest.test-seed#[B7837BDDC4FB97A7]) [    ] o.a.s.c.c.SolrZkClient Using default ZkACLProvider
   [junit4]   2> 205284 INFO  (TEST-CollectionsAPIDistributedZkTest.test-seed#[B7837BDDC4FB97A7]) [n:127.0.0.1:64126_    ] o.a.s.c.c.ConnectionManager Waiting for client to connect to ZooKeeper
   [junit4]   2> 205290 INFO  (zkCallback-157-thread-1-processing-n:127.0.0.1:64126_) [n:127.0.0.1:64126_    ] o.a.s.c.c.ConnectionManager Watcher org.apache.solr.common.cloud.ConnectionManager@7b0c7739 name:ZooKeeperConnection Watcher:127.0.0.1:64114/solr got event WatchedEvent state:SyncConnected type:None path:null path:null type:None
   [junit4]   2> 205290 INFO  (TEST-CollectionsAPIDistributedZkTest.test-seed#[B7837BDDC4FB97A7]) [n:127.0.0.1:64126_    ] o.a.s.c.c.ConnectionManager Client is connected to ZooKeeper
   [junit4]   2> 205312 INFO  (TEST-CollectionsAPIDistributedZkTest.test-seed#[B7837BDDC4FB97A7]) [n:127.0.0.1:64126_    ] o.a.s.c.c.ZkStateReader Updating cluster state from ZooKeeper... 
   [junit4]   2> 206331 INFO  (TEST-CollectionsAPIDistributedZkTest.test-seed#[B7837BDDC4FB97A7]) [n:127.0.0.1:64126_    ] o.a.s.c.ZkController Register node as live in ZooKeeper:/live_nodes/127.0.0.1:64126_
   [junit4]   2> 206332 INFO  (TEST-CollectionsAPIDistributedZkTest.test-seed#[B7837BDDC4FB97A7]) [n:127.0.0.1:64126_    ] o.a.s.c.c.SolrZkClient makePath: /live_nodes/127.0.0.1:64126_
   [junit4]   2> 206334 INFO  (zkCallback-157-thread-1-processing-n:127.0.0.1:64126_) [n:127.0.0.1:64126_    ] o.a.s.c.c.ZkStateReader A live node change: [WatchedEvent state:SyncConnected type:NodeChildrenChanged path:/live_nodes], has occurred - updating... (live nodes size: [1])
   [junit4]   2> 206334 INFO  (zkCallback-150-thread-1-processing-n:127.0.0.1:64120_) [n:127.0.0.1:64120_    ] o.a.s.c.c.ZkStateReader A live node change: [WatchedEvent state:SyncConnected type:NodeChildrenChanged path:/live_nodes], has occurred - updating... (live nodes size: [1])
   [junit4]   2> 206334 INFO  (zkCallback-152-thread-1) [    ] o.a.s.c.c.ZkStateReader A live node change: [WatchedEvent state:SyncConnected type:NodeChildrenChanged path:/live_nodes], has occurred - updating... (live nodes size: [1])
   [junit4]   2> 206337 INFO  (TEST-CollectionsAPIDistributedZkTest.test-seed#[B7837BDDC4FB97A7]) [n:127.0.0.1:64126_    ] o.a.s.c.Overseer Overseer (id=null) closing
   [junit4]   2> 206338 INFO  (TEST-CollectionsAPIDistributedZkTest.test-seed#[B7837BDDC4FB97A7]) [n:127.0.0.1:64126_    ] o.a.s.c.LeaderElector Joined leadership election with path: /overseer_elect/election/95190006159179788-127.0.0.1:64126_-n_0000000001
   [junit4]   2> 206339 INFO  (TEST-CollectionsAPIDistributedZkTest.test-seed#[B7837BDDC4FB97A7]) [n:127.0.0.1:64126_    ] o.a.s.c.LeaderElector Watching path /overseer_elect/election/95190006159179783-127.0.0.1:64120_-n_0000000000 to know if I could be the leader
   [junit4]   2> 206360 INFO  (TEST-CollectionsAPIDistributedZkTest.test-seed#[B7837BDDC4FB97A7]) [n:127.0.0.1:64126_    ] o.a.s.c.CoreContainer Security conf doesn't exist. Skipping setup for authorization module.
   [junit4]   2> 206360 INFO  (TEST-CollectionsAPIDistributedZkTest.test-seed#[B7837BDDC4FB97A7]) [n:127.0.0.1:64126_    ] o.a.s.c.CoreContainer No authentication plugin used.
   [junit4]   2> 206365 INFO  (TEST-CollectionsAPIDistributedZkTest.test-seed#[B7837BDDC4FB97A7]) [n:127.0.0.1:64126_    ] o.a.s.c.CorePropertiesLocator Looking for core definitions underneath /Users/jenkins/workspace/Lucene-Solr-5.x-MacOSX/solr/build/solr-core/test/J1/../../../../../../../../../Users/jenkins/workspace/Lucene-Solr-5.x-MacOSX/solr/build/solr-core/test/J1/temp/solr.cloud.CollectionsAPIDistributedZkTest_B7837BDDC4FB97A7-001/shard-1-001/cores
   [junit4]   2> 206367 INFO  (TEST-CollectionsAPIDistributedZkTest.test-seed#[B7837BDDC4FB97A7]) [n:127.0.0.1:64126_    ] o.a.s.c.CoreDescriptor Created CoreDescriptor: {name=collection1, config=solrconfig.xml, transient=false, schema=schema.xml, loadOnStartup=true, configSetProperties=configsetprops.json, collection=collection1, coreNodeName=, dataDir=data/, shard=}
   [junit4]   2> 206367 INFO  (TEST-CollectionsAPIDistributedZkTest.test-seed#[B7837BDDC4FB97A7]) [n:127.0.0.1:64126_    ] o.a.s.c.CorePropertiesLocator Found core collection1 in /Users/jenkins/workspace/Lucene-Solr-5.x-MacOSX/solr/build/solr-core/test/J1/../../../../../../../../../Users/jenkins/workspace/Lucene-Solr-5.x-MacOSX/solr/build/solr-core/test/J1/temp/solr.cloud.CollectionsAPIDistributedZkTest_B7837BDDC4FB97A7-001/shard-1-001/cores/collection1
   [junit4]   2> 206367 INFO  (TEST-CollectionsAPIDistributedZkTest.test-seed#[B7837BDDC4FB97A7]) [n:127.0.0.1:64126_    ] o.a.s.c.CorePropertiesLocator Found 1 core definitions
   [junit4]   2> 206369 INFO  (TEST-CollectionsAPIDistributedZkTest.test-seed#[B7837BDDC4FB97A7]) [n:127.0.0.1:64126_    ] o.a.s.s.SolrDispatchFilter user.dir=/Users/jenkins/workspace/Lucene-Solr-5.x-MacOSX/solr/build/solr-core/test/J1
   [junit4]   2> 206369 INFO  (TEST-CollectionsAPIDistributedZkTest.test-seed#[B7837BDDC4FB97A7]) [n:127.0.0.1:64126_    ] o.a.s.s.SolrDispatchFilter SolrDispatchFilter.init() done
   [junit4]   2> 206370 INFO  (coreLoadExecutor-769-thread-1-processing-n:127.0.0.1:64126_) [n:127.0.0.1:64126_ c:collection1   x:collection1] o.a.s.c.ZkController publishing state=down
   [junit4]   2> 206370 INFO  (coreLoadExecutor-769-thread-1-processing-n:127.0.0.1:64126_) [n:127.0.0.1:64126_ c:collection1   x:collection1] o.a.s.c.ZkController numShards not found on descriptor - reading it from system property
   [junit4]   2> 206373 INFO  (coreLoadExecutor-769-thread-1-processing-n:127.0.0.1:64126_) [n:127.0.0.1:64126_ c:collection1   x:collection1] o.a.s.c.ZkController Registering watch for collection collection1
   [junit4]   2> 206373 INFO  (coreLoadExecutor-769-thread-1-processing-n:127.0.0.1:64126_) [n:127.0.0.1:64126_ c:collection1   x:collection1] o.a.s.c.c.ZkStateReader addZkWatch [collection1]
   [junit4]   2> 206374 INFO  (coreLoadExecutor-769-thread-1-processing-n:127.0.0.1:64126_) [n:127.0.0.1:64126_ c:collection1   x:collection1] o.a.s.c.c.ZkStateReader Add data for [collection1] ver [0]
   [junit4]   2> 206374 INFO  (coreLoadExecutor-769-thread-1-processing-n:127.0.0.1:64126_) [n:127.0.0.1:64126_ c:collection1   x:collection1] o.a.s.c.ZkController look for our core node name
   [junit4]   2> 206375 INFO  (OverseerStateUpdate-95190006159179783-127.0.0.1:64120_-n_0000000000) [n:127.0.0.1:64120_    ] o.a.s.c.Overseer processMessage: queueSize: 1, message = {
   [junit4]   2>   "core":"collection1",
   [junit4]   2>   "roles":null,
   [junit4]   2>   "base_url":"https://127.0.0.1:64126",
   [junit4]   2>   "node_name":"127.0.0.1:64126_",
   [junit4]   2>   "numShards":"2",
   [junit4]   2>   "state":"down",
   [junit4]   2>   "shard":null,
   [junit4]   2>   "collection":"collection1",
   [junit4]   2>   "operation":"state"} current state version: 3
   [junit4]   2> 206377 INFO  (OverseerStateUpdate-95190006159179783-127.0.0.1:64120_-n_0000000000) [n:127.0.0.1:64120_    ] o.a.s.c.o.ReplicaMutator Update state numShards=2 message={
   [junit4]   2>   "core":"collection1",
   [junit4]   2>   "roles":null,
   [junit4]   2>   "base_url":"https://127.0.0.1:64126",
   [junit4]   2>   "node_name":"127.0.0.1:64126_",
   [junit4]   2>   "numShards":"2",
   [junit4]   2>   "state":"down",
   [junit4]   2>   "shard":null,
   [junit4]   2>   "collection":"collection1",
   [junit4]   2>   "operation":"state"}
   [junit4]   2> 206377 INFO  (OverseerStateUpdate-95190006159179783-127.0.0.1:64120_-n_0000000000) [n:127.0.0.1:64120_    ] o.a.s.c.o.ReplicaMutator Collection already

[...truncated too long message...]

/J1/temp/solr.cloud.CollectionsAPIDistributedZkTest_B7837BDDC4FB97A7-001/shard-4-001/cores/collection1/data
   [junit4]   2> 233813 INFO  (zkCallback-170-thread-2-processing-n:127.0.0.1:64145_) [n:127.0.0.1:64145_ c:collection1 s:shard1 r:core_node4 x:collection1] o.a.s.c.CachingDirectoryFactory looking to close /Users/jenkins/workspace/Lucene-Solr-5.x-MacOSX/solr/build/solr-core/test/J1/../../../../../../../../../Users/jenkins/workspace/Lucene-Solr-5.x-MacOSX/solr/build/solr-core/test/J1/temp/solr.cloud.CollectionsAPIDistributedZkTest_B7837BDDC4FB97A7-001/shard-4-001/cores/collection1/data/index [CachedDir<<refCount=0;path=/Users/jenkins/workspace/Lucene-Solr-5.x-MacOSX/solr/build/solr-core/test/J1/../../../../../../../../../Users/jenkins/workspace/Lucene-Solr-5.x-MacOSX/solr/build/solr-core/test/J1/temp/solr.cloud.CollectionsAPIDistributedZkTest_B7837BDDC4FB97A7-001/shard-4-001/cores/collection1/data/index;done=false>>]
   [junit4]   2> 233814 INFO  (zkCallback-170-thread-2-processing-n:127.0.0.1:64145_) [n:127.0.0.1:64145_ c:collection1 s:shard1 r:core_node4 x:collection1] o.a.s.c.CachingDirectoryFactory Closing directory: /Users/jenkins/workspace/Lucene-Solr-5.x-MacOSX/solr/build/solr-core/test/J1/../../../../../../../../../Users/jenkins/workspace/Lucene-Solr-5.x-MacOSX/solr/build/solr-core/test/J1/temp/solr.cloud.CollectionsAPIDistributedZkTest_B7837BDDC4FB97A7-001/shard-4-001/cores/collection1/data/index
   [junit4]   2> 233814 INFO  (zkCallback-170-thread-2-processing-n:127.0.0.1:64145_) [n:127.0.0.1:64145_ c:collection1 s:shard1 r:core_node4 x:collection1] o.a.s.c.ShardLeaderElectionContextBase No version found for ephemeral leader parent node, won't remove previous leader registration.
   [junit4]   2> 233814 INFO  (zkCallback-170-thread-2-processing-n:127.0.0.1:64145_) [n:127.0.0.1:64145_ c:collection1 s:shard1 r:core_node4 x:collection1] o.a.s.c.ElectionContext Canceling election /collections/collection1/leader_elect/shard1/election/95190006159179797-core_node4-n_0000000001
   [junit4]   2> 233814 WARN  (zkCallback-170-thread-2-processing-n:127.0.0.1:64145_) [n:127.0.0.1:64145_ c:collection1 s:shard1 r:core_node4 x:collection1] o.a.s.c.LeaderElector 
   [junit4]   2> org.apache.zookeeper.KeeperException$SessionExpiredException: KeeperErrorCode = Session expired for /collections/collection1/leader_elect/shard1/election/95190006159179797-core_node4-n_0000000001
   [junit4]   2> 	at org.apache.zookeeper.KeeperException.create(KeeperException.java:127)
   [junit4]   2> 	at org.apache.zookeeper.KeeperException.create(KeeperException.java:51)
   [junit4]   2> 	at org.apache.zookeeper.ZooKeeper.delete(ZooKeeper.java:873)
   [junit4]   2> 	at org.apache.solr.common.cloud.SolrZkClient$2.execute(SolrZkClient.java:244)
   [junit4]   2> 	at org.apache.solr.common.cloud.SolrZkClient$2.execute(SolrZkClient.java:241)
   [junit4]   2> 	at org.apache.solr.common.cloud.ZkCmdExecutor.retryOperation(ZkCmdExecutor.java:61)
   [junit4]   2> 	at org.apache.solr.common.cloud.SolrZkClient.delete(SolrZkClient.java:241)
   [junit4]   2> 	at org.apache.solr.cloud.ElectionContext.cancelElection(ElectionContext.java:87)
   [junit4]   2> 	at org.apache.solr.cloud.ShardLeaderElectionContextBase.cancelElection(ElectionContext.java:167)
   [junit4]   2> 	at org.apache.solr.cloud.ShardLeaderElectionContext.cancelElection(ElectionContext.java:269)
   [junit4]   2> 	at org.apache.solr.cloud.ShardLeaderElectionContext.runLeaderProcess(ElectionContext.java:445)
   [junit4]   2> 	at org.apache.solr.cloud.LeaderElector.runIamLeaderProcess(LeaderElector.java:198)
   [junit4]   2> 	at org.apache.solr.cloud.LeaderElector.checkIfIamLeader(LeaderElector.java:158)
   [junit4]   2> 	at org.apache.solr.cloud.LeaderElector.access$200(LeaderElector.java:59)
   [junit4]   2> 	at org.apache.solr.cloud.LeaderElector$ElectionWatcher.process(LeaderElector.java:389)
   [junit4]   2> 	at org.apache.solr.common.cloud.SolrZkClient$3$1.run(SolrZkClient.java:264)
   [junit4]   2> 	at java.util.concurrent.Executors$RunnableAdapter.call(Executors.java:511)
   [junit4]   2> 	at java.util.concurrent.FutureTask.run(FutureTask.java:266)
   [junit4]   2> 	at org.apache.solr.common.util.ExecutorUtil$MDCAwareThreadPoolExecutor$1.run(ExecutorUtil.java:232)
   [junit4]   2> 	at java.util.concurrent.ThreadPoolExecutor.runWorker(ThreadPoolExecutor.java:1142)
   [junit4]   2> 	at java.util.concurrent.ThreadPoolExecutor$Worker.run(ThreadPoolExecutor.java:617)
   [junit4]   2> 	at java.lang.Thread.run(Thread.java:745)
   [junit4]   2> 233816 INFO  (TEST-CollectionsAPIDistributedZkTest.test-seed#[B7837BDDC4FB97A7]) [    ] o.e.j.s.ServerConnector Stopped ServerConnector@499df53e{SSL-http/1.1}{127.0.0.1:0}
   [junit4]   2> 233816 INFO  (TEST-CollectionsAPIDistributedZkTest.test-seed#[B7837BDDC4FB97A7]) [    ] o.e.j.s.h.ContextHandler Stopped o.e.j.s.ServletContextHandler@29747cda{/,null,UNAVAILABLE}
   [junit4]   2> 233819 INFO  (TEST-CollectionsAPIDistributedZkTest.test-seed#[B7837BDDC4FB97A7]) [n:127.0.0.1:64145_ c:collection1 s:shard1 r:core_node4 x:collection1] o.a.s.c.ZkTestServer connecting to 127.0.0.1:64114 64114
   [junit4]   2> 233822 INFO  (Thread-526) [    ] o.a.s.c.ZkTestServer connecting to 127.0.0.1:64114 64114
   [junit4]   2> 236631 WARN  (Thread-526) [    ] o.a.s.c.ZkTestServer Watch limit violations: 
   [junit4]   2> Maximum concurrent create/delete watches above limit:
   [junit4]   2> 
   [junit4]   2> 	7	/solr/aliases.json
   [junit4]   2> 	5	/solr/security.json
   [junit4]   2> 	5	/solr/configs/conf1
   [junit4]   2> 
   [junit4]   2> Maximum concurrent data watches above limit:
   [junit4]   2> 
   [junit4]   2> 	7	/solr/clusterstate.json
   [junit4]   2> 	4	/solr/collections/nodes_used_collection/state.json
   [junit4]   2> 	4	/solr/collections/collection1/state.json
   [junit4]   2> 
   [junit4]   2> Maximum concurrent children watches above limit:
   [junit4]   2> 
   [junit4]   2> 	7	/solr/live_nodes
   [junit4]   2> 	7	/solr/collections
   [junit4]   2> 	3	/solr/overseer/queue
   [junit4]   2> 	3	/solr/overseer/collection-queue-work
   [junit4]   2> 
   [junit4]   2> NOTE: reproduce with: ant test  -Dtestcase=CollectionsAPIDistributedZkTest -Dtests.method=test -Dtests.seed=B7837BDDC4FB97A7 -Dtests.slow=true -Dtests.locale=de_CH -Dtests.timezone=Asia/Thimbu -Dtests.asserts=true -Dtests.file.encoding=UTF-8
   [junit4] FAILURE 34.3s J1 | CollectionsAPIDistributedZkTest.test <<<
   [junit4]    > Throwable #1: java.lang.AssertionError
   [junit4]    > 	at __randomizedtesting.SeedInfo.seed([B7837BDDC4FB97A7:3FD744076A07FA5F]:0)
   [junit4]    > 	at org.apache.solr.cloud.CollectionsAPIDistributedZkTest.testNoConfigSetExist(CollectionsAPIDistributedZkTest.java:512)
   [junit4]    > 	at org.apache.solr.cloud.CollectionsAPIDistributedZkTest.test(CollectionsAPIDistributedZkTest.java:159)
   [junit4]    > 	at org.apache.solr.BaseDistributedSearchTestCase$ShardsRepeatRule$ShardsFixedStatement.callStatement(BaseDistributedSearchTestCase.java:965)
   [junit4]    > 	at org.apache.solr.BaseDistributedSearchTestCase$ShardsRepeatRule$ShardsStatement.evaluate(BaseDistributedSearchTestCase.java:940)
   [junit4]    > 	at java.lang.Thread.run(Thread.java:745)
   [junit4]   2> 236638 INFO  (SUITE-CollectionsAPIDistributedZkTest-seed#[B7837BDDC4FB97A7]-worker) [n:127.0.0.1:64145_ c:collection1 s:shard1 r:core_node4 x:collection1] o.a.s.SolrTestCaseJ4 ###deleteCore
   [junit4]   2> NOTE: leaving temporary files on disk at: /Users/jenkins/workspace/Lucene-Solr-5.x-MacOSX/solr/build/solr-core/test/J1/temp/solr.cloud.CollectionsAPIDistributedZkTest_B7837BDDC4FB97A7-001
   [junit4]   2> NOTE: test params are: codec=Asserting(Lucene54): {}, docValues:{}, sim=RandomSimilarityProvider(queryNorm=true,coord=crazy): {}, locale=de_CH, timezone=Asia/Thimbu
   [junit4]   2> NOTE: Mac OS X 10.8.5 x86_64/Oracle Corporation 1.8.0_66 (64-bit)/cpus=3,threads=1,free=114529528,total=364904448
   [junit4]   2> NOTE: All tests run in this JVM: [DateMathParserTest, TestEmbeddedSolrServerConstructors, TestDynamicFieldResource, TermVectorComponentDistributedTest, ExitableDirectoryReaderTest, VMParamsZkACLAndCredentialsProvidersTest, TestChildDocTransformer, DistribJoinFromCollectionTest, TermVectorComponentTest, AutoCommitTest, AsyncMigrateRouteKeyTest, DistanceFunctionTest, TestExpandComponent, TestIndexSearcher, TestStressUserVersions, TestImplicitCoreProperties, TestReversedWildcardFilterFactory, SpatialRPTFieldTypeTest, TestFastOutputStream, OpenCloseCoreStressTest, DistributedFacetPivotSmallTest, AddBlockUpdateTest, FileBasedSpellCheckerTest, CollectionsAPIDistributedZkTest]
   [junit4] Completed [53/563 (1!)] on J1 in 34.36s, 1 test, 1 failure <<< FAILURES!

[...truncated 1603 lines...]
BUILD FAILED
/Users/jenkins/workspace/Lucene-Solr-5.x-MacOSX/build.xml:794: The following error occurred while executing this line:
/Users/jenkins/workspace/Lucene-Solr-5.x-MacOSX/build.xml:738: The following error occurred while executing this line:
/Users/jenkins/workspace/Lucene-Solr-5.x-MacOSX/build.xml:59: The following error occurred while executing this line:
/Users/jenkins/workspace/Lucene-Solr-5.x-MacOSX/solr/build.xml:233: The following error occurred while executing this line:
/Users/jenkins/workspace/Lucene-Solr-5.x-MacOSX/solr/common-build.xml:526: The following error occurred while executing this line:
/Users/jenkins/workspace/Lucene-Solr-5.x-MacOSX/lucene/common-build.xml:1444: The following error occurred while executing this line:
/Users/jenkins/workspace/Lucene-Solr-5.x-MacOSX/lucene/common-build.xml:1000: There were test failures: 563 suites (7 ignored), 2236 tests, 1 failure, 88 ignored (38 assumptions) [seed: B7837BDDC4FB97A7]

Total time: 72 minutes 21 seconds
Build step 'Invoke Ant' marked build as failure
Archiving artifacts
[WARNINGS] Skipping publisher since build result is FAILURE
Recording test results
Email was triggered for: Failure - Any
Sending email for trigger: Failure - Any



Mime
View raw message