lucene-dev mailing list archives

Site index · List index
Message view « Date » · « Thread »
Top « Date » · « Thread »
From Policeman Jenkins Server <jenk...@thetaphi.de>
Subject [JENKINS-EA] Lucene-Solr-trunk-Linux (32bit/jdk-9-ea+95) - Build # 15533 - Still Failing!
Date Tue, 12 Jan 2016 21:28:52 GMT
Build: http://jenkins.thetaphi.de/job/Lucene-Solr-trunk-Linux/15533/
Java: 32bit/jdk-9-ea+95 -client -XX:+UseConcMarkSweepGC -XX:-CompactStrings

1 tests failed.
FAILED:  org.apache.solr.cloud.HttpPartitionTest.test

Error Message:
Didn't see all replicas for shard shard1 in c8n_1x2 come up within 30000 ms! ClusterState: {   "collection1":{     "replicationFactor":"1",     "shards":{       "shard1":{         "range":"80000000-ffffffff",         "state":"active",         "replicas":{"core_node2":{             "core":"collection1",             "base_url":"http://127.0.0.1:40091/kaz",             "node_name":"127.0.0.1:40091_kaz",             "state":"active",             "leader":"true"}}},       "shard2":{         "range":"0-7fffffff",         "state":"active",         "replicas":{           "core_node1":{             "core":"collection1",             "base_url":"http://127.0.0.1:38156/kaz",             "node_name":"127.0.0.1:38156_kaz",             "state":"active",             "leader":"true"},           "core_node3":{             "core":"collection1",             "base_url":"http://127.0.0.1:46552/kaz",             "node_name":"127.0.0.1:46552_kaz",             "state":"active"}}}},     "router":{"name":"compositeId"},     "maxShardsPerNode":"1",     "autoAddReplicas":"false",     "autoCreated":"true"},   "control_collection":{     "replicationFactor":"1",     "shards":{"shard1":{         "range":"80000000-7fffffff",         "state":"active",         "replicas":{"core_node1":{             "core":"collection1",             "base_url":"http://127.0.0.1:37334/kaz",             "node_name":"127.0.0.1:37334_kaz",             "state":"active",             "leader":"true"}}}},     "router":{"name":"compositeId"},     "maxShardsPerNode":"1",     "autoAddReplicas":"false",     "autoCreated":"true"},   "c8n_1x2":{     "replicationFactor":"2",     "shards":{"shard1":{         "range":"80000000-7fffffff",         "state":"active",         "replicas":{           "core_node1":{             "core":"c8n_1x2_shard1_replica2",             "base_url":"http://127.0.0.1:46552/kaz",             "node_name":"127.0.0.1:46552_kaz",             "state":"active",             "leader":"true"},           "core_node2":{             "core":"c8n_1x2_shard1_replica1",             "base_url":"http://127.0.0.1:37334/kaz",             "node_name":"127.0.0.1:37334_kaz",             "state":"recovering"}}}},     "router":{"name":"compositeId"},     "maxShardsPerNode":"1",     "autoAddReplicas":"false"},   "collMinRf_1x3":{     "replicationFactor":"3",     "shards":{"shard1":{         "range":"80000000-7fffffff",         "state":"active",         "replicas":{           "core_node1":{             "core":"collMinRf_1x3_shard1_replica1",             "base_url":"http://127.0.0.1:46552/kaz",             "node_name":"127.0.0.1:46552_kaz",             "state":"active"},           "core_node2":{             "core":"collMinRf_1x3_shard1_replica3",             "base_url":"http://127.0.0.1:37334/kaz",             "node_name":"127.0.0.1:37334_kaz",             "state":"active"},           "core_node3":{             "core":"collMinRf_1x3_shard1_replica2",             "base_url":"http://127.0.0.1:40091/kaz",             "node_name":"127.0.0.1:40091_kaz",             "state":"active",             "leader":"true"}}}},     "router":{"name":"compositeId"},     "maxShardsPerNode":"1",     "autoAddReplicas":"false"}}

Stack Trace:
java.lang.AssertionError: Didn't see all replicas for shard shard1 in c8n_1x2 come up within 30000 ms! ClusterState: {
  "collection1":{
    "replicationFactor":"1",
    "shards":{
      "shard1":{
        "range":"80000000-ffffffff",
        "state":"active",
        "replicas":{"core_node2":{
            "core":"collection1",
            "base_url":"http://127.0.0.1:40091/kaz",
            "node_name":"127.0.0.1:40091_kaz",
            "state":"active",
            "leader":"true"}}},
      "shard2":{
        "range":"0-7fffffff",
        "state":"active",
        "replicas":{
          "core_node1":{
            "core":"collection1",
            "base_url":"http://127.0.0.1:38156/kaz",
            "node_name":"127.0.0.1:38156_kaz",
            "state":"active",
            "leader":"true"},
          "core_node3":{
            "core":"collection1",
            "base_url":"http://127.0.0.1:46552/kaz",
            "node_name":"127.0.0.1:46552_kaz",
            "state":"active"}}}},
    "router":{"name":"compositeId"},
    "maxShardsPerNode":"1",
    "autoAddReplicas":"false",
    "autoCreated":"true"},
  "control_collection":{
    "replicationFactor":"1",
    "shards":{"shard1":{
        "range":"80000000-7fffffff",
        "state":"active",
        "replicas":{"core_node1":{
            "core":"collection1",
            "base_url":"http://127.0.0.1:37334/kaz",
            "node_name":"127.0.0.1:37334_kaz",
            "state":"active",
            "leader":"true"}}}},
    "router":{"name":"compositeId"},
    "maxShardsPerNode":"1",
    "autoAddReplicas":"false",
    "autoCreated":"true"},
  "c8n_1x2":{
    "replicationFactor":"2",
    "shards":{"shard1":{
        "range":"80000000-7fffffff",
        "state":"active",
        "replicas":{
          "core_node1":{
            "core":"c8n_1x2_shard1_replica2",
            "base_url":"http://127.0.0.1:46552/kaz",
            "node_name":"127.0.0.1:46552_kaz",
            "state":"active",
            "leader":"true"},
          "core_node2":{
            "core":"c8n_1x2_shard1_replica1",
            "base_url":"http://127.0.0.1:37334/kaz",
            "node_name":"127.0.0.1:37334_kaz",
            "state":"recovering"}}}},
    "router":{"name":"compositeId"},
    "maxShardsPerNode":"1",
    "autoAddReplicas":"false"},
  "collMinRf_1x3":{
    "replicationFactor":"3",
    "shards":{"shard1":{
        "range":"80000000-7fffffff",
        "state":"active",
        "replicas":{
          "core_node1":{
            "core":"collMinRf_1x3_shard1_replica1",
            "base_url":"http://127.0.0.1:46552/kaz",
            "node_name":"127.0.0.1:46552_kaz",
            "state":"active"},
          "core_node2":{
            "core":"collMinRf_1x3_shard1_replica3",
            "base_url":"http://127.0.0.1:37334/kaz",
            "node_name":"127.0.0.1:37334_kaz",
            "state":"active"},
          "core_node3":{
            "core":"collMinRf_1x3_shard1_replica2",
            "base_url":"http://127.0.0.1:40091/kaz",
            "node_name":"127.0.0.1:40091_kaz",
            "state":"active",
            "leader":"true"}}}},
    "router":{"name":"compositeId"},
    "maxShardsPerNode":"1",
    "autoAddReplicas":"false"}}
	at __randomizedtesting.SeedInfo.seed([55A3FF52B71EECCA:DDF7C08819E28132]:0)
	at org.junit.Assert.fail(Assert.java:93)
	at org.apache.solr.cloud.AbstractFullDistribZkTestBase.ensureAllReplicasAreActive(AbstractFullDistribZkTestBase.java:1864)
	at org.apache.solr.cloud.HttpPartitionTest.testRf2(HttpPartitionTest.java:349)
	at org.apache.solr.cloud.HttpPartitionTest.test(HttpPartitionTest.java:109)
	at sun.reflect.NativeMethodAccessorImpl.invoke0(Native Method)
	at sun.reflect.NativeMethodAccessorImpl.invoke(NativeMethodAccessorImpl.java:62)
	at sun.reflect.DelegatingMethodAccessorImpl.invoke(DelegatingMethodAccessorImpl.java:43)
	at java.lang.reflect.Method.invoke(Method.java:520)
	at com.carrotsearch.randomizedtesting.RandomizedRunner.invoke(RandomizedRunner.java:1764)
	at com.carrotsearch.randomizedtesting.RandomizedRunner$8.evaluate(RandomizedRunner.java:871)
	at com.carrotsearch.randomizedtesting.RandomizedRunner$9.evaluate(RandomizedRunner.java:907)
	at com.carrotsearch.randomizedtesting.RandomizedRunner$10.evaluate(RandomizedRunner.java:921)
	at org.apache.solr.BaseDistributedSearchTestCase$ShardsRepeatRule$ShardsFixedStatement.callStatement(BaseDistributedSearchTestCase.java:965)
	at org.apache.solr.BaseDistributedSearchTestCase$ShardsRepeatRule$ShardsStatement.evaluate(BaseDistributedSearchTestCase.java:940)
	at com.carrotsearch.randomizedtesting.rules.SystemPropertiesRestoreRule$1.evaluate(SystemPropertiesRestoreRule.java:57)
	at org.apache.lucene.util.TestRuleSetupTeardownChained$1.evaluate(TestRuleSetupTeardownChained.java:50)
	at org.apache.lucene.util.AbstractBeforeAfterRule$1.evaluate(AbstractBeforeAfterRule.java:46)
	at org.apache.lucene.util.TestRuleThreadAndTestName$1.evaluate(TestRuleThreadAndTestName.java:49)
	at org.apache.lucene.util.TestRuleIgnoreAfterMaxFailures$1.evaluate(TestRuleIgnoreAfterMaxFailures.java:65)
	at org.apache.lucene.util.TestRuleMarkFailure$1.evaluate(TestRuleMarkFailure.java:48)
	at com.carrotsearch.randomizedtesting.rules.StatementAdapter.evaluate(StatementAdapter.java:36)
	at com.carrotsearch.randomizedtesting.ThreadLeakControl$StatementRunner.run(ThreadLeakControl.java:367)
	at com.carrotsearch.randomizedtesting.ThreadLeakControl.forkTimeoutingTask(ThreadLeakControl.java:809)
	at com.carrotsearch.randomizedtesting.ThreadLeakControl$3.evaluate(ThreadLeakControl.java:460)
	at com.carrotsearch.randomizedtesting.RandomizedRunner.runSingleTest(RandomizedRunner.java:880)
	at com.carrotsearch.randomizedtesting.RandomizedRunner$5.evaluate(RandomizedRunner.java:781)
	at com.carrotsearch.randomizedtesting.RandomizedRunner$6.evaluate(RandomizedRunner.java:816)
	at com.carrotsearch.randomizedtesting.RandomizedRunner$7.evaluate(RandomizedRunner.java:827)
	at com.carrotsearch.randomizedtesting.rules.StatementAdapter.evaluate(StatementAdapter.java:36)
	at com.carrotsearch.randomizedtesting.rules.SystemPropertiesRestoreRule$1.evaluate(SystemPropertiesRestoreRule.java:57)
	at org.apache.lucene.util.AbstractBeforeAfterRule$1.evaluate(AbstractBeforeAfterRule.java:46)
	at com.carrotsearch.randomizedtesting.rules.StatementAdapter.evaluate(StatementAdapter.java:36)
	at org.apache.lucene.util.TestRuleStoreClassName$1.evaluate(TestRuleStoreClassName.java:42)
	at com.carrotsearch.randomizedtesting.rules.NoShadowingOrOverridesOnMethodsRule$1.evaluate(NoShadowingOrOverridesOnMethodsRule.java:40)
	at com.carrotsearch.randomizedtesting.rules.NoShadowingOrOverridesOnMethodsRule$1.evaluate(NoShadowingOrOverridesOnMethodsRule.java:40)
	at com.carrotsearch.randomizedtesting.rules.StatementAdapter.evaluate(StatementAdapter.java:36)
	at com.carrotsearch.randomizedtesting.rules.StatementAdapter.evaluate(StatementAdapter.java:36)
	at com.carrotsearch.randomizedtesting.rules.StatementAdapter.evaluate(StatementAdapter.java:36)
	at org.apache.lucene.util.TestRuleAssertionsRequired$1.evaluate(TestRuleAssertionsRequired.java:54)
	at org.apache.lucene.util.TestRuleMarkFailure$1.evaluate(TestRuleMarkFailure.java:48)
	at org.apache.lucene.util.TestRuleIgnoreAfterMaxFailures$1.evaluate(TestRuleIgnoreAfterMaxFailures.java:65)
	at org.apache.lucene.util.TestRuleIgnoreTestSuites$1.evaluate(TestRuleIgnoreTestSuites.java:55)
	at com.carrotsearch.randomizedtesting.rules.StatementAdapter.evaluate(StatementAdapter.java:36)
	at com.carrotsearch.randomizedtesting.ThreadLeakControl$StatementRunner.run(ThreadLeakControl.java:367)
	at java.lang.Thread.run(Thread.java:747)




Build Log:
[...truncated 10756 lines...]
   [junit4] Suite: org.apache.solr.cloud.HttpPartitionTest
   [junit4]   2> Creating dataDir: /home/jenkins/workspace/Lucene-Solr-trunk-Linux/solr/build/solr-core/test/J1/temp/solr.cloud.HttpPartitionTest_55A3FF52B71EECCA-001/init-core-data-001
   [junit4]   2> 1260534 INFO  (SUITE-HttpPartitionTest-seed#[55A3FF52B71EECCA]-worker) [    ] o.a.s.BaseDistributedSearchTestCase Setting hostContext system property: /kaz/
   [junit4]   2> 1260537 INFO  (TEST-HttpPartitionTest.test-seed#[55A3FF52B71EECCA]) [    ] o.a.s.c.ZkTestServer STARTING ZK TEST SERVER
   [junit4]   2> 1260537 INFO  (Thread-3538) [    ] o.a.s.c.ZkTestServer client port:0.0.0.0/0.0.0.0:0
   [junit4]   2> 1260537 INFO  (Thread-3538) [    ] o.a.s.c.ZkTestServer Starting server
   [junit4]   2> 1260637 INFO  (TEST-HttpPartitionTest.test-seed#[55A3FF52B71EECCA]) [    ] o.a.s.c.ZkTestServer start zk server on port:57330
   [junit4]   2> 1260638 INFO  (TEST-HttpPartitionTest.test-seed#[55A3FF52B71EECCA]) [    ] o.a.s.c.c.SolrZkClient Using default ZkCredentialsProvider
   [junit4]   2> 1260638 INFO  (TEST-HttpPartitionTest.test-seed#[55A3FF52B71EECCA]) [    ] o.a.s.c.c.ConnectionManager Waiting for client to connect to ZooKeeper
   [junit4]   2> 1260639 INFO  (zkCallback-1512-thread-1) [    ] o.a.s.c.c.ConnectionManager Watcher org.apache.solr.common.cloud.ConnectionManager@1475038 name:ZooKeeperConnection Watcher:127.0.0.1:57330 got event WatchedEvent state:SyncConnected type:None path:null path:null type:None
   [junit4]   2> 1260640 INFO  (TEST-HttpPartitionTest.test-seed#[55A3FF52B71EECCA]) [    ] o.a.s.c.c.ConnectionManager Client is connected to ZooKeeper
   [junit4]   2> 1260640 INFO  (TEST-HttpPartitionTest.test-seed#[55A3FF52B71EECCA]) [    ] o.a.s.c.c.SolrZkClient Using default ZkACLProvider
   [junit4]   2> 1260640 INFO  (TEST-HttpPartitionTest.test-seed#[55A3FF52B71EECCA]) [    ] o.a.s.c.c.SolrZkClient makePath: /solr
   [junit4]   2> 1260641 INFO  (TEST-HttpPartitionTest.test-seed#[55A3FF52B71EECCA]) [    ] o.a.s.c.c.SolrZkClient Using default ZkCredentialsProvider
   [junit4]   2> 1260641 INFO  (TEST-HttpPartitionTest.test-seed#[55A3FF52B71EECCA]) [    ] o.a.s.c.c.ConnectionManager Waiting for client to connect to ZooKeeper
   [junit4]   2> 1260642 INFO  (zkCallback-1513-thread-1) [    ] o.a.s.c.c.ConnectionManager Watcher org.apache.solr.common.cloud.ConnectionManager@c08d07 name:ZooKeeperConnection Watcher:127.0.0.1:57330/solr got event WatchedEvent state:SyncConnected type:None path:null path:null type:None
   [junit4]   2> 1260642 INFO  (TEST-HttpPartitionTest.test-seed#[55A3FF52B71EECCA]) [    ] o.a.s.c.c.ConnectionManager Client is connected to ZooKeeper
   [junit4]   2> 1260642 INFO  (TEST-HttpPartitionTest.test-seed#[55A3FF52B71EECCA]) [    ] o.a.s.c.c.SolrZkClient Using default ZkACLProvider
   [junit4]   2> 1260642 INFO  (TEST-HttpPartitionTest.test-seed#[55A3FF52B71EECCA]) [    ] o.a.s.c.c.SolrZkClient makePath: /collections/collection1
   [junit4]   2> 1260643 INFO  (TEST-HttpPartitionTest.test-seed#[55A3FF52B71EECCA]) [    ] o.a.s.c.c.SolrZkClient makePath: /collections/collection1/shards
   [junit4]   2> 1260645 INFO  (TEST-HttpPartitionTest.test-seed#[55A3FF52B71EECCA]) [    ] o.a.s.c.c.SolrZkClient makePath: /collections/control_collection
   [junit4]   2> 1260645 INFO  (TEST-HttpPartitionTest.test-seed#[55A3FF52B71EECCA]) [    ] o.a.s.c.c.SolrZkClient makePath: /collections/control_collection/shards
   [junit4]   2> 1260646 INFO  (TEST-HttpPartitionTest.test-seed#[55A3FF52B71EECCA]) [    ] o.a.s.c.AbstractZkTestCase put /home/jenkins/workspace/Lucene-Solr-trunk-Linux/solr/core/src/test-files/solr/collection1/conf/solrconfig-tlog.xml to /configs/conf1/solrconfig.xml
   [junit4]   2> 1260646 INFO  (TEST-HttpPartitionTest.test-seed#[55A3FF52B71EECCA]) [    ] o.a.s.c.c.SolrZkClient makePath: /configs/conf1/solrconfig.xml
   [junit4]   2> 1260647 INFO  (TEST-HttpPartitionTest.test-seed#[55A3FF52B71EECCA]) [    ] o.a.s.c.AbstractZkTestCase put /home/jenkins/workspace/Lucene-Solr-trunk-Linux/solr/core/src/test-files/solr/collection1/conf/schema.xml to /configs/conf1/schema.xml
   [junit4]   2> 1260648 INFO  (TEST-HttpPartitionTest.test-seed#[55A3FF52B71EECCA]) [    ] o.a.s.c.c.SolrZkClient makePath: /configs/conf1/schema.xml
   [junit4]   2> 1260649 INFO  (TEST-HttpPartitionTest.test-seed#[55A3FF52B71EECCA]) [    ] o.a.s.c.AbstractZkTestCase put /home/jenkins/workspace/Lucene-Solr-trunk-Linux/solr/core/src/test-files/solr/collection1/conf/solrconfig.snippet.randomindexconfig.xml to /configs/conf1/solrconfig.snippet.randomindexconfig.xml
   [junit4]   2> 1260649 INFO  (TEST-HttpPartitionTest.test-seed#[55A3FF52B71EECCA]) [    ] o.a.s.c.c.SolrZkClient makePath: /configs/conf1/solrconfig.snippet.randomindexconfig.xml
   [junit4]   2> 1260650 INFO  (TEST-HttpPartitionTest.test-seed#[55A3FF52B71EECCA]) [    ] o.a.s.c.AbstractZkTestCase put /home/jenkins/workspace/Lucene-Solr-trunk-Linux/solr/core/src/test-files/solr/collection1/conf/stopwords.txt to /configs/conf1/stopwords.txt
   [junit4]   2> 1260650 INFO  (TEST-HttpPartitionTest.test-seed#[55A3FF52B71EECCA]) [    ] o.a.s.c.c.SolrZkClient makePath: /configs/conf1/stopwords.txt
   [junit4]   2> 1260651 INFO  (TEST-HttpPartitionTest.test-seed#[55A3FF52B71EECCA]) [    ] o.a.s.c.AbstractZkTestCase put /home/jenkins/workspace/Lucene-Solr-trunk-Linux/solr/core/src/test-files/solr/collection1/conf/protwords.txt to /configs/conf1/protwords.txt
   [junit4]   2> 1260651 INFO  (TEST-HttpPartitionTest.test-seed#[55A3FF52B71EECCA]) [    ] o.a.s.c.c.SolrZkClient makePath: /configs/conf1/protwords.txt
   [junit4]   2> 1260651 INFO  (TEST-HttpPartitionTest.test-seed#[55A3FF52B71EECCA]) [    ] o.a.s.c.AbstractZkTestCase put /home/jenkins/workspace/Lucene-Solr-trunk-Linux/solr/core/src/test-files/solr/collection1/conf/currency.xml to /configs/conf1/currency.xml
   [junit4]   2> 1260652 INFO  (TEST-HttpPartitionTest.test-seed#[55A3FF52B71EECCA]) [    ] o.a.s.c.c.SolrZkClient makePath: /configs/conf1/currency.xml
   [junit4]   2> 1260653 INFO  (TEST-HttpPartitionTest.test-seed#[55A3FF52B71EECCA]) [    ] o.a.s.c.AbstractZkTestCase put /home/jenkins/workspace/Lucene-Solr-trunk-Linux/solr/core/src/test-files/solr/collection1/conf/enumsConfig.xml to /configs/conf1/enumsConfig.xml
   [junit4]   2> 1260653 INFO  (TEST-HttpPartitionTest.test-seed#[55A3FF52B71EECCA]) [    ] o.a.s.c.c.SolrZkClient makePath: /configs/conf1/enumsConfig.xml
   [junit4]   2> 1260653 INFO  (TEST-HttpPartitionTest.test-seed#[55A3FF52B71EECCA]) [    ] o.a.s.c.AbstractZkTestCase put /home/jenkins/workspace/Lucene-Solr-trunk-Linux/solr/core/src/test-files/solr/collection1/conf/open-exchange-rates.json to /configs/conf1/open-exchange-rates.json
   [junit4]   2> 1260654 INFO  (TEST-HttpPartitionTest.test-seed#[55A3FF52B71EECCA]) [    ] o.a.s.c.c.SolrZkClient makePath: /configs/conf1/open-exchange-rates.json
   [junit4]   2> 1260654 INFO  (TEST-HttpPartitionTest.test-seed#[55A3FF52B71EECCA]) [    ] o.a.s.c.AbstractZkTestCase put /home/jenkins/workspace/Lucene-Solr-trunk-Linux/solr/core/src/test-files/solr/collection1/conf/mapping-ISOLatin1Accent.txt to /configs/conf1/mapping-ISOLatin1Accent.txt
   [junit4]   2> 1260654 INFO  (TEST-HttpPartitionTest.test-seed#[55A3FF52B71EECCA]) [    ] o.a.s.c.c.SolrZkClient makePath: /configs/conf1/mapping-ISOLatin1Accent.txt
   [junit4]   2> 1260655 INFO  (TEST-HttpPartitionTest.test-seed#[55A3FF52B71EECCA]) [    ] o.a.s.c.AbstractZkTestCase put /home/jenkins/workspace/Lucene-Solr-trunk-Linux/solr/core/src/test-files/solr/collection1/conf/old_synonyms.txt to /configs/conf1/old_synonyms.txt
   [junit4]   2> 1260655 INFO  (TEST-HttpPartitionTest.test-seed#[55A3FF52B71EECCA]) [    ] o.a.s.c.c.SolrZkClient makePath: /configs/conf1/old_synonyms.txt
   [junit4]   2> 1260657 INFO  (TEST-HttpPartitionTest.test-seed#[55A3FF52B71EECCA]) [    ] o.a.s.c.AbstractZkTestCase put /home/jenkins/workspace/Lucene-Solr-trunk-Linux/solr/core/src/test-files/solr/collection1/conf/synonyms.txt to /configs/conf1/synonyms.txt
   [junit4]   2> 1260657 INFO  (TEST-HttpPartitionTest.test-seed#[55A3FF52B71EECCA]) [    ] o.a.s.c.c.SolrZkClient makePath: /configs/conf1/synonyms.txt
   [junit4]   2> 1260721 INFO  (TEST-HttpPartitionTest.test-seed#[55A3FF52B71EECCA]) [    ] o.a.s.SolrTestCaseJ4 Writing core.properties file to /home/jenkins/workspace/Lucene-Solr-trunk-Linux/solr/build/solr-core/test/J1/temp/solr.cloud.HttpPartitionTest_55A3FF52B71EECCA-001/control-001/cores/collection1
   [junit4]   2> 1260723 INFO  (TEST-HttpPartitionTest.test-seed#[55A3FF52B71EECCA]) [    ] o.e.j.s.Server jetty-9.2.13.v20150730
   [junit4]   2> 1260725 INFO  (TEST-HttpPartitionTest.test-seed#[55A3FF52B71EECCA]) [    ] o.e.j.s.h.ContextHandler Started o.e.j.s.ServletContextHandler@6c47cc{/kaz,null,AVAILABLE}
   [junit4]   2> 1260726 INFO  (TEST-HttpPartitionTest.test-seed#[55A3FF52B71EECCA]) [    ] o.e.j.s.ServerConnector Started ServerConnector@1897b31{HTTP/1.1}{127.0.0.1:43025}
   [junit4]   2> 1260727 INFO  (TEST-HttpPartitionTest.test-seed#[55A3FF52B71EECCA]) [    ] o.e.j.s.Server Started @1261999ms
   [junit4]   2> 1260727 INFO  (TEST-HttpPartitionTest.test-seed#[55A3FF52B71EECCA]) [    ] o.a.s.c.s.e.JettySolrRunner Jetty properties: {solr.data.dir=/home/jenkins/workspace/Lucene-Solr-trunk-Linux/solr/build/solr-core/test/J1/temp/solr.cloud.HttpPartitionTest_55A3FF52B71EECCA-001/tempDir-001/control/data, hostContext=/kaz, hostPort=37334, coreRootDirectory=/home/jenkins/workspace/Lucene-Solr-trunk-Linux/solr/build/solr-core/test/J1/temp/solr.cloud.HttpPartitionTest_55A3FF52B71EECCA-001/control-001/cores}
   [junit4]   2> 1260727 INFO  (TEST-HttpPartitionTest.test-seed#[55A3FF52B71EECCA]) [    ] o.a.s.s.SolrDispatchFilter SolrDispatchFilter.init(): sun.misc.Launcher$AppClassLoader@1521cc1
   [junit4]   2> 1260727 INFO  (TEST-HttpPartitionTest.test-seed#[55A3FF52B71EECCA]) [    ] o.a.s.c.SolrResourceLoader new SolrResourceLoader for directory: '/home/jenkins/workspace/Lucene-Solr-trunk-Linux/solr/build/solr-core/test/J1/temp/solr.cloud.HttpPartitionTest_55A3FF52B71EECCA-001/control-001'
   [junit4]   2> 1260727 INFO  (TEST-HttpPartitionTest.test-seed#[55A3FF52B71EECCA]) [    ] o.a.s.c.SolrResourceLoader JNDI not configured for solr (NoInitialContextEx)
   [junit4]   2> 1260727 INFO  (TEST-HttpPartitionTest.test-seed#[55A3FF52B71EECCA]) [    ] o.a.s.c.SolrResourceLoader solr home defaulted to 'solr/' (could not find system property or JNDI)
   [junit4]   2> 1260727 INFO  (TEST-HttpPartitionTest.test-seed#[55A3FF52B71EECCA]) [    ] o.a.s.c.c.SolrZkClient Using default ZkCredentialsProvider
   [junit4]   2> 1260728 INFO  (TEST-HttpPartitionTest.test-seed#[55A3FF52B71EECCA]) [    ] o.a.s.c.c.ConnectionManager Waiting for client to connect to ZooKeeper
   [junit4]   2> 1260729 INFO  (zkCallback-1514-thread-1) [    ] o.a.s.c.c.ConnectionManager Watcher org.apache.solr.common.cloud.ConnectionManager@163dafc name:ZooKeeperConnection Watcher:127.0.0.1:57330/solr got event WatchedEvent state:SyncConnected type:None path:null path:null type:None
   [junit4]   2> 1260729 INFO  (TEST-HttpPartitionTest.test-seed#[55A3FF52B71EECCA]) [    ] o.a.s.c.c.ConnectionManager Client is connected to ZooKeeper
   [junit4]   2> 1260729 INFO  (TEST-HttpPartitionTest.test-seed#[55A3FF52B71EECCA]) [    ] o.a.s.c.c.SolrZkClient Using default ZkACLProvider
   [junit4]   2> 1260730 INFO  (TEST-HttpPartitionTest.test-seed#[55A3FF52B71EECCA]) [    ] o.a.s.s.SolrDispatchFilter Loading solr.xml from SolrHome (not found in ZooKeeper)
   [junit4]   2> 1260730 INFO  (TEST-HttpPartitionTest.test-seed#[55A3FF52B71EECCA]) [    ] o.a.s.c.SolrXmlConfig Loading container configuration from /home/jenkins/workspace/Lucene-Solr-trunk-Linux/solr/build/solr-core/test/J1/temp/solr.cloud.HttpPartitionTest_55A3FF52B71EECCA-001/control-001/solr.xml
   [junit4]   2> 1260734 INFO  (TEST-HttpPartitionTest.test-seed#[55A3FF52B71EECCA]) [    ] o.a.s.c.CorePropertiesLocator Config-defined core root directory: /home/jenkins/workspace/Lucene-Solr-trunk-Linux/solr/build/solr-core/test/J1/temp/solr.cloud.HttpPartitionTest_55A3FF52B71EECCA-001/control-001/cores
   [junit4]   2> 1260734 INFO  (TEST-HttpPartitionTest.test-seed#[55A3FF52B71EECCA]) [    ] o.a.s.c.CoreContainer New CoreContainer 3542910
   [junit4]   2> 1260734 INFO  (TEST-HttpPartitionTest.test-seed#[55A3FF52B71EECCA]) [    ] o.a.s.c.CoreContainer Loading cores into CoreContainer [instanceDir=/home/jenkins/workspace/Lucene-Solr-trunk-Linux/solr/build/solr-core/test/J1/temp/solr.cloud.HttpPartitionTest_55A3FF52B71EECCA-001/control-001]
   [junit4]   2> 1260734 WARN  (TEST-HttpPartitionTest.test-seed#[55A3FF52B71EECCA]) [    ] o.a.s.c.CoreContainer Couldn't add files from /home/jenkins/workspace/Lucene-Solr-trunk-Linux/solr/build/solr-core/test/J1/temp/solr.cloud.HttpPartitionTest_55A3FF52B71EECCA-001/control-001/lib to classpath: /home/jenkins/workspace/Lucene-Solr-trunk-Linux/solr/build/solr-core/test/J1/temp/solr.cloud.HttpPartitionTest_55A3FF52B71EECCA-001/control-001/lib
   [junit4]   2> 1260735 INFO  (TEST-HttpPartitionTest.test-seed#[55A3FF52B71EECCA]) [    ] o.a.s.h.c.HttpShardHandlerFactory created with socketTimeout : 90000,urlScheme : ,connTimeout : 15000,maxConnectionsPerHost : 20,maxConnections : 10000,corePoolSize : 0,maximumPoolSize : 2147483647,maxThreadIdleTime : 5,sizeOfQueue : -1,fairnessPolicy : false,useRetries : false,
   [junit4]   2> 1260736 INFO  (TEST-HttpPartitionTest.test-seed#[55A3FF52B71EECCA]) [    ] o.a.s.u.UpdateShardHandler Creating UpdateShardHandler HTTP client with params: socketTimeout=340000&connTimeout=45000&retry=true
   [junit4]   2> 1260736 INFO  (TEST-HttpPartitionTest.test-seed#[55A3FF52B71EECCA]) [    ] o.a.s.l.LogWatcher SLF4J impl is org.slf4j.impl.Log4jLoggerFactory
   [junit4]   2> 1260736 INFO  (TEST-HttpPartitionTest.test-seed#[55A3FF52B71EECCA]) [    ] o.a.s.l.LogWatcher Registering Log Listener [Log4j (org.slf4j.impl.Log4jLoggerFactory)]
   [junit4]   2> 1260736 INFO  (TEST-HttpPartitionTest.test-seed#[55A3FF52B71EECCA]) [    ] o.a.s.c.ZkContainer Zookeeper client=127.0.0.1:57330/solr
   [junit4]   2> 1260736 INFO  (TEST-HttpPartitionTest.test-seed#[55A3FF52B71EECCA]) [    ] o.a.s.c.ZkController zkHost includes chroot
   [junit4]   2> 1260736 INFO  (TEST-HttpPartitionTest.test-seed#[55A3FF52B71EECCA]) [    ] o.a.s.c.c.SolrZkClient Using default ZkCredentialsProvider
   [junit4]   2> 1260737 INFO  (TEST-HttpPartitionTest.test-seed#[55A3FF52B71EECCA]) [    ] o.a.s.c.c.ConnectionManager Waiting for client to connect to ZooKeeper
   [junit4]   2> 1260738 INFO  (zkCallback-1517-thread-1) [    ] o.a.s.c.c.ConnectionManager Watcher org.apache.solr.common.cloud.ConnectionManager@687074 name:ZooKeeperConnection Watcher:127.0.0.1:57330 got event WatchedEvent state:SyncConnected type:None path:null path:null type:None
   [junit4]   2> 1260738 INFO  (TEST-HttpPartitionTest.test-seed#[55A3FF52B71EECCA]) [    ] o.a.s.c.c.ConnectionManager Client is connected to ZooKeeper
   [junit4]   2> 1260738 INFO  (TEST-HttpPartitionTest.test-seed#[55A3FF52B71EECCA]) [    ] o.a.s.c.c.SolrZkClient Using default ZkACLProvider
   [junit4]   2> 1260739 INFO  (TEST-HttpPartitionTest.test-seed#[55A3FF52B71EECCA]) [    ] o.a.s.c.c.ConnectionManager Waiting for client to connect to ZooKeeper
   [junit4]   2> 1260740 INFO  (zkCallback-1518-thread-1) [    ] o.a.s.c.c.ConnectionManager Watcher org.apache.solr.common.cloud.ConnectionManager@150c92d name:ZooKeeperConnection Watcher:127.0.0.1:57330/solr got event WatchedEvent state:SyncConnected type:None path:null path:null type:None
   [junit4]   2> 1260740 INFO  (TEST-HttpPartitionTest.test-seed#[55A3FF52B71EECCA]) [    ] o.a.s.c.c.ConnectionManager Client is connected to ZooKeeper
   [junit4]   2> 1260741 INFO  (TEST-HttpPartitionTest.test-seed#[55A3FF52B71EECCA]) [    ] o.a.s.c.c.SolrZkClient makePath: /overseer/queue
   [junit4]   2> 1260742 INFO  (TEST-HttpPartitionTest.test-seed#[55A3FF52B71EECCA]) [    ] o.a.s.c.c.SolrZkClient makePath: /overseer/collection-queue-work
   [junit4]   2> 1260743 INFO  (TEST-HttpPartitionTest.test-seed#[55A3FF52B71EECCA]) [    ] o.a.s.c.c.SolrZkClient makePath: /overseer/collection-map-running
   [junit4]   2> 1260744 INFO  (TEST-HttpPartitionTest.test-seed#[55A3FF52B71EECCA]) [    ] o.a.s.c.c.SolrZkClient makePath: /overseer/collection-map-completed
   [junit4]   2> 1260745 INFO  (TEST-HttpPartitionTest.test-seed#[55A3FF52B71EECCA]) [    ] o.a.s.c.c.SolrZkClient makePath: /overseer/collection-map-failure
   [junit4]   2> 1260746 INFO  (TEST-HttpPartitionTest.test-seed#[55A3FF52B71EECCA]) [    ] o.a.s.c.c.SolrZkClient makePath: /live_nodes
   [junit4]   2> 1260747 INFO  (TEST-HttpPartitionTest.test-seed#[55A3FF52B71EECCA]) [    ] o.a.s.c.c.SolrZkClient makePath: /aliases.json
   [junit4]   2> 1260747 INFO  (TEST-HttpPartitionTest.test-seed#[55A3FF52B71EECCA]) [    ] o.a.s.c.c.SolrZkClient makePath: /clusterstate.json
   [junit4]   2> 1260748 INFO  (TEST-HttpPartitionTest.test-seed#[55A3FF52B71EECCA]) [    ] o.a.s.c.c.SolrZkClient makePath: /security.json
   [junit4]   2> 1260748 INFO  (TEST-HttpPartitionTest.test-seed#[55A3FF52B71EECCA]) [    ] o.a.s.c.ZkController Register node as live in ZooKeeper:/live_nodes/127.0.0.1:37334_kaz
   [junit4]   2> 1260749 INFO  (TEST-HttpPartitionTest.test-seed#[55A3FF52B71EECCA]) [    ] o.a.s.c.c.SolrZkClient makePath: /live_nodes/127.0.0.1:37334_kaz
   [junit4]   2> 1260749 INFO  (TEST-HttpPartitionTest.test-seed#[55A3FF52B71EECCA]) [    ] o.a.s.c.c.SolrZkClient makePath: /overseer_elect
   [junit4]   2> 1260750 INFO  (TEST-HttpPartitionTest.test-seed#[55A3FF52B71EECCA]) [    ] o.a.s.c.c.SolrZkClient makePath: /overseer_elect/election
   [junit4]   2> 1260750 INFO  (TEST-HttpPartitionTest.test-seed#[55A3FF52B71EECCA]) [    ] o.a.s.c.Overseer Overseer (id=null) closing
   [junit4]   2> 1260751 INFO  (TEST-HttpPartitionTest.test-seed#[55A3FF52B71EECCA]) [    ] o.a.s.c.LeaderElector Joined leadership election with path: /overseer_elect/election/95199799752589316-127.0.0.1:37334_kaz-n_0000000000
   [junit4]   2> 1260751 INFO  (TEST-HttpPartitionTest.test-seed#[55A3FF52B71EECCA]) [    ] o.a.s.c.OverseerElectionContext I am going to be the leader 127.0.0.1:37334_kaz
   [junit4]   2> 1260751 INFO  (TEST-HttpPartitionTest.test-seed#[55A3FF52B71EECCA]) [    ] o.a.s.c.c.SolrZkClient makePath: /overseer_elect/leader
   [junit4]   2> 1260751 INFO  (TEST-HttpPartitionTest.test-seed#[55A3FF52B71EECCA]) [    ] o.a.s.c.Overseer Overseer (id=95199799752589316-127.0.0.1:37334_kaz-n_0000000000) starting
   [junit4]   2> 1260753 INFO  (TEST-HttpPartitionTest.test-seed#[55A3FF52B71EECCA]) [    ] o.a.s.c.c.SolrZkClient makePath: /overseer/queue-work
   [junit4]   2> 1260756 INFO  (TEST-HttpPartitionTest.test-seed#[55A3FF52B71EECCA]) [    ] o.a.s.c.OverseerAutoReplicaFailoverThread Starting OverseerAutoReplicaFailoverThread autoReplicaFailoverWorkLoopDelay=10000 autoReplicaFailoverWaitAfterExpiration=30000 autoReplicaFailoverBadNodeExpiration=60000
   [junit4]   2> 1260756 INFO  (OverseerCollectionConfigSetProcessor-95199799752589316-127.0.0.1:37334_kaz-n_0000000000) [    ] o.a.s.c.OverseerTaskProcessor Process current queue of overseer operations
   [junit4]   2> 1260756 INFO  (TEST-HttpPartitionTest.test-seed#[55A3FF52B71EECCA]) [    ] o.a.s.c.c.ZkStateReader Updating cluster state from ZooKeeper... 
   [junit4]   2> 1260757 INFO  (OverseerStateUpdate-95199799752589316-127.0.0.1:37334_kaz-n_0000000000) [    ] o.a.s.c.Overseer Starting to work on the main queue
   [junit4]   2> 1260798 INFO  (TEST-HttpPartitionTest.test-seed#[55A3FF52B71EECCA]) [    ] o.a.s.c.CoreContainer Security conf doesn't exist. Skipping setup for authorization module.
   [junit4]   2> 1260798 INFO  (TEST-HttpPartitionTest.test-seed#[55A3FF52B71EECCA]) [    ] o.a.s.c.CoreContainer No authentication plugin used.
   [junit4]   2> 1260799 INFO  (TEST-HttpPartitionTest.test-seed#[55A3FF52B71EECCA]) [    ] o.a.s.c.CorePropertiesLocator Looking for core definitions underneath /home/jenkins/workspace/Lucene-Solr-trunk-Linux/solr/build/solr-core/test/J1/temp/solr.cloud.HttpPartitionTest_55A3FF52B71EECCA-001/control-001/cores
   [junit4]   2> 1260799 INFO  (TEST-HttpPartitionTest.test-seed#[55A3FF52B71EECCA]) [    ] o.a.s.c.CoreDescriptor Created CoreDescriptor: {name=collection1, config=solrconfig.xml, transient=false, schema=schema.xml, loadOnStartup=true, configSetProperties=configsetprops.json, collection=control_collection, coreNodeName=, dataDir=data/, shard=}
   [junit4]   2> 1260800 INFO  (TEST-HttpPartitionTest.test-seed#[55A3FF52B71EECCA]) [    ] o.a.s.c.CorePropertiesLocator Found core collection1 in /home/jenkins/workspace/Lucene-Solr-trunk-Linux/solr/build/solr-core/test/J1/temp/solr.cloud.HttpPartitionTest_55A3FF52B71EECCA-001/control-001/cores/collection1
   [junit4]   2> 1260800 INFO  (TEST-HttpPartitionTest.test-seed#[55A3FF52B71EECCA]) [    ] o.a.s.c.CorePropertiesLocator Found 1 core definitions
   [junit4]   2> 1260800 INFO  (TEST-HttpPartitionTest.test-seed#[55A3FF52B71EECCA]) [    ] o.a.s.s.SolrDispatchFilter user.dir=/home/jenkins/workspace/Lucene-Solr-trunk-Linux/solr/build/solr-core/test/J1
   [junit4]   2> 1260800 INFO  (TEST-HttpPartitionTest.test-seed#[55A3FF52B71EECCA]) [    ] o.a.s.s.SolrDispatchFilter SolrDispatchFilter.init() done
   [junit4]   2> 1260800 INFO  (coreLoadExecutor-3724-thread-1) [    ] o.a.s.c.ZkController publishing state=down
   [junit4]   2> 1260801 INFO  (coreLoadExecutor-3724-thread-1) [    ] o.a.s.c.ZkController numShards not found on descriptor - reading it from system property
   [junit4]   2> 1260802 INFO  (OverseerStateUpdate-95199799752589316-127.0.0.1:37334_kaz-n_0000000000) [    ] o.a.s.c.Overseer processMessage: queueSize: 1, message = {
   [junit4]   2>   "core":"collection1",
   [junit4]   2>   "roles":null,
   [junit4]   2>   "base_url":"http://127.0.0.1:37334/kaz",
   [junit4]   2>   "node_name":"127.0.0.1:37334_kaz",
   [junit4]   2>   "numShards":"1",
   [junit4]   2>   "state":"down",
   [junit4]   2>   "shard":null,
   [junit4]   2>   "collection":"control_collection",
   [junit4]   2>   "operation":"state"} current state version: 0
   [junit4]   2> 1260802 INFO  (coreLoadExecutor-3724-thread-1) [    ] o.a.s.c.ZkController look for our core node name
   [junit4]   2> 1260802 INFO  (OverseerStateUpdate-95199799752589316-127.0.0.1:37334_kaz-n_0000000000) [    ] o.a.s.c.o.ReplicaMutator Update state numShards=1 message={
   [junit4]   2>   "core":"collection1",
   [junit4]   2>   "roles":null,
   [junit4]   2>   "base_url":"http://127.0.0.1:37334/kaz",
   [junit4]   2>   "node_name":"127.0.0.1:37334_kaz",
   [junit4]   2>   "numShards":"1",
   [junit4]   2>   "state":"down",
   [junit4]   2>   "shard":null,
   [junit4]   2>   "collection":"control_collection",
   [junit4]   2>   "operation":"state"}
   [junit4]   2> 1260802 INFO  (OverseerStateUpdate-95199799752589316-127.0.0.1:37334_kaz-n_0000000000) [    ] o.a.s.c.o.ClusterStateMutator building a new cName: control_collection
   [junit4]   2> 1260802 INFO  (OverseerStateUpdate-95199799752589316-127.0.0.1:37334_kaz-n_0000000000) [    ] o.a.s.c.o.ReplicaMutator Assigning new node to shard shard=shard1
   [junit4]   2> 1260804 INFO  (zkCallback-1518-thread-1) [    ] o.a.s.c.c.ZkStateReader A cluster state change: [WatchedEvent state:SyncConnected type:NodeDataChanged path:/clusterstate.json], has occurred - updating... (live nodes size: [1])
   [junit4]   2> 1261802 INFO  (coreLoadExecutor-3724-thread-1) [    ] o.a.s.c.ZkController waiting to find shard id in clusterstate for collection1
   [junit4]   2> 1261802 INFO  (coreLoadExecutor-3724-thread-1) [    ] o.a.s.c.ZkController Check for collection zkNode:control_collection
   [junit4]   2> 1261802 INFO  (coreLoadExecutor-3724-thread-1) [    ] o.a.s.c.ZkController Collection zkNode exists
   [junit4]   2> 1261802 INFO  (coreLoadExecutor-3724-thread-1) [    ] o.a.s.c.c.ZkStateReader Load collection config from: [/collections/control_collection]
   [junit4]   2> 1261803 INFO  (coreLoadExecutor-3724-thread-1) [    ] o.a.s.c.c.ZkStateReader path=[/collections/control_collection] [configName]=[conf1] specified config exists in ZooKeeper
   [junit4]   2> 1261803 INFO  (coreLoadExecutor-3724-thread-1) [    ] o.a.s.c.SolrResourceLoader new SolrResourceLoader for directory: '/home/jenkins/workspace/Lucene-Solr-trunk-Linux/solr/build/solr-core/test/J1/temp/solr.cloud.HttpPartitionTest_55A3FF52B71EECCA-001/control-001/cores/collection1'
   [junit4]   2> 1261803 INFO  (coreLoadExecutor-3724-thread-1) [    ] o.a.s.c.SolrResourceLoader JNDI not configured for solr (NoInitialContextEx)
   [junit4]   2> 1261803 INFO  (coreLoadExecutor-3724-thread-1) [    ] o.a.s.c.SolrResourceLoader solr home defaulted to 'solr/' (could not find system property or JNDI)
   [junit4]   2> 1261809 INFO  (coreLoadExecutor-3724-thread-1) [    ] o.a.s.c.Config loaded config solrconfig.xml with version 0 
   [junit4]   2> 1261815 INFO  (coreLoadExecutor-3724-thread-1) [    ] o.a.s.c.SolrConfig current version of requestparams : -1
   [junit4]   2> 1261823 INFO  (coreLoadExecutor-3724-thread-1) [    ] o.a.s.c.SolrConfig Using Lucene MatchVersion: 6.0.0
   [junit4]   2> 1261836 INFO  (coreLoadExecutor-3724-thread-1) [    ] o.a.s.c.SolrConfig Loaded SolrConfig: solrconfig.xml
   [junit4]   2> 1261847 INFO  (coreLoadExecutor-3724-thread-1) [    ] o.a.s.s.IndexSchema [collection1] Schema name=test
   [junit4]   2> 1262025 INFO  (coreLoadExecutor-3724-thread-1) [    ] o.a.s.s.OpenExchangeRatesOrgProvider Initialized with rates=open-exchange-rates.json, refreshInterval=1440.
   [junit4]   2> 1262034 INFO  (coreLoadExecutor-3724-thread-1) [    ] o.a.s.s.IndexSchema default search field in schema is text
   [junit4]   2> 1262035 INFO  (coreLoadExecutor-3724-thread-1) [    ] o.a.s.s.IndexSchema unique key field: id
   [junit4]   2> 1262046 INFO  (coreLoadExecutor-3724-thread-1) [    ] o.a.s.s.FileExchangeRateProvider Reloading exchange rates from file currency.xml
   [junit4]   2> 1262049 INFO  (coreLoadExecutor-3724-thread-1) [    ] o.a.s.s.FileExchangeRateProvider Reloading exchange rates from file currency.xml
   [junit4]   2> 1262051 INFO  (coreLoadExecutor-3724-thread-1) [    ] o.a.s.s.OpenExchangeRatesOrgProvider Reloading exchange rates from open-exchange-rates.json
   [junit4]   2> 1262051 INFO  (coreLoadExecutor-3724-thread-1) [    ] o.a.s.s.OpenExchangeRatesOrgProvider Reloading exchange rates from open-exchange-rates.json
   [junit4]   2> 1262053 INFO  (coreLoadExecutor-3724-thread-1) [    ] o.a.s.c.ConfigSetProperties Did not find ConfigSet properties, assuming default properties: Can't find resource 'configsetprops.json' in classpath or '/configs/conf1', cwd=/home/jenkins/workspace/Lucene-Solr-trunk-Linux/solr/build/solr-core/test/J1
   [junit4]   2> 1262053 INFO  (coreLoadExecutor-3724-thread-1) [    ] o.a.s.c.CoreContainer Creating SolrCore 'collection1' using configuration from collection control_collection
   [junit4]   2> 1262053 INFO  (coreLoadExecutor-3724-thread-1) [    ] o.a.s.c.SolrCore org.apache.solr.core.MockDirectoryFactory
   [junit4]   2> 1262053 INFO  (coreLoadExecutor-3724-thread-1) [    ] o.a.s.c.SolrCore [[collection1] ] Opening new SolrCore at [/home/jenkins/workspace/Lucene-Solr-trunk-Linux/solr/build/solr-core/test/J1/temp/solr.cloud.HttpPartitionTest_55A3FF52B71EECCA-001/control-001/cores/collection1], dataDir=[/home/jenkins/workspace/Lucene-Solr-trunk-Linux/solr/build/solr-core/test/J1/temp/solr.cloud.HttpPartitionTest_55A3FF52B71EECCA-001/control-001/cores/collection1/data/]
   [junit4]   2> 1262053 INFO  (coreLoadExecutor-3724-thread-1) [    ] o.a.s.c.JmxMonitoredMap JMX monitoring is enabled. Adding Solr mbeans to JMX Server: com.sun.jmx.mbeanserver.JmxMBeanServer@1ce15ad
   [junit4]   2> 1262054 INFO  (coreLoadExecutor-3724-thread-1) [    ] o.a.s.c.CachingDirectoryFactory return new directory for /home/jenkins/workspace/Lucene-Solr-trunk-Linux/solr/build/solr-core/test/J1/temp/solr.cloud.HttpPartitionTest_55A3FF52B71EECCA-001/control-001/cores/collection1/data
   [junit4]   2> 1262054 INFO  (coreLoadExecutor-3724-thread-1) [    ] o.a.s.c.SolrCore New index directory detected: old=null new=/home/jenkins/workspace/Lucene-Solr-trunk-Linux/solr/build/solr-core/test/J1/temp/solr.cloud.HttpPartitionTest_55A3FF52B71EECCA-001/control-001/cores/collection1/data/index/
   [junit4]   2> 1262054 WARN  (coreLoadExecutor-3724-thread-1) [    ] o.a.s.c.SolrCore [collection1] Solr index directory '/home/jenkins/workspace/Lucene-Solr-trunk-Linux/solr/build/solr-core/test/J1/temp/solr.cloud.HttpPartitionTest_55A3FF52B71EECCA-001/control-001/cores/collection1/data/index' doesn't exist. Creating new index...
   [junit4]   2> 1262054 INFO  (coreLoadExecutor-3724-thread-1) [    ] o.a.s.c.CachingDirectoryFactory return new directory for /home/jenkins/workspace/Lucene-Solr-trunk-Linux/solr/build/solr-core/test/J1/temp/solr.cloud.HttpPartitionTest_55A3FF52B71EECCA-001/control-001/cores/collection1/data/index
   [junit4]   2> 1262054 INFO  (coreLoadExecutor-3724-thread-1) [    ] o.a.s.u.RandomMergePolicy RandomMergePolicy wrapping class org.apache.lucene.index.TieredMergePolicy: [TieredMergePolicy: maxMergeAtOnce=33, maxMergeAtOnceExplicit=24, maxMergedSegmentMB=71.30078125, floorSegmentMB=1.2470703125, forceMergeDeletesPctAllowed=20.930580111635933, segmentsPerTier=24.0, maxCFSSegmentSizeMB=8.796093022207999E12, noCFSRatio=0.0
   [junit4]   2> 1262055 INFO  (coreLoadExecutor-3724-thread-1) [    ] o.a.s.c.SolrDeletionPolicy SolrDeletionPolicy.onCommit: commits: num=1
   [junit4]   2> 	commit{dir=MockDirectoryWrapper(RAMDirectory@9061a2 lockFactory=org.apache.lucene.store.SingleInstanceLockFactory@bd0839),segFN=segments_1,generation=1}
   [junit4]   2> 1262055 INFO  (coreLoadExecutor-3724-thread-1) [    ] o.a.s.c.SolrDeletionPolicy newest commit generation = 1
   [junit4]   2> 1262055 INFO  (OldIndexDirectoryCleanupThreadForCore-collection1) [    ] o.a.s.c.SolrCore Looking for old index directories to cleanup for core collection1 in /home/jenkins/workspace/Lucene-Solr-trunk-Linux/solr/build/solr-core/test/J1/temp/solr.cloud.HttpPartitionTest_55A3FF52B71EECCA-001/control-001/cores/collection1/data/
   [junit4]   2> 1262055 WARN  (OldIndexDirectoryCleanupThreadForCore-collection1) [    ] o.a.s.c.DirectoryFactory /home/jenkins/workspace/Lucene-Solr-trunk-Linux/solr/build/solr-core/test/J1/temp/solr.cloud.HttpPartitionTest_55A3FF52B71EECCA-001/control-001/cores/collection1/data/ does not point to a valid data directory; skipping clean-up of old index directories.
   [junit4]   2> 1262058 INFO  (coreLoadExecutor-3724-thread-1) [    ] o.a.s.u.p.UpdateRequestProcessorChain creating updateRequestProcessorChain "nodistrib"
   [junit4]   2> 1262058 INFO  (coreLoadExecutor-3724-thread-1) [    ] o.a.s.u.p.UpdateRequestProcessorChain creating updateRequestProcessorChain "dedupe"
   [junit4]   2> 1262058 INFO  (coreLoadExecutor-3724-thread-1) [    ] o.a.s.u.p.UpdateRequestProcessorChain inserting DistributedUpdateProcessorFactory into updateRequestProcessorChain "dedupe"
   [junit4]   2> 1262058 INFO  (coreLoadExecutor-3724-thread-1) [    ] o.a.s.u.p.UpdateRequestProcessorChain creating updateRequestProcessorChain "stored_sig"
   [junit4]   2> 1262059 INFO  (coreLoadExecutor-3724-thread-1) [    ] o.a.s.u.p.UpdateRequestProcessorChain inserting DistributedUpdateProcessorFactory into updateRequestProcessorChain "stored_sig"
   [junit4]   2> 1262059 INFO  (coreLoadExecutor-3724-thread-1) [    ] o.a.s.u.p.UpdateRequestProcessorChain creating updateRequestProcessorChain "distrib-dup-test-chain-explicit"
   [junit4]   2> 1262059 INFO  (coreLoadExecutor-3724-thread-1) [    ] o.a.s.u.p.UpdateRequestProcessorChain creating updateRequestProcessorChain "distrib-dup-test-chain-implicit"
   [junit4]   2> 1262059 INFO  (coreLoadExecutor-3724-thread-1) [    ] o.a.s.u.p.UpdateRequestProcessorChain inserting DistributedUpdateProcessorFactory into updateRequestProcessorChain "distrib-dup-test-chain-implicit"
   [junit4]   2> 1262059 INFO  (coreLoadExecutor-3724-thread-1) [    ] o.a.s.c.SolrCore no updateRequestProcessorChain defined as default, creating implicit default
   [junit4]   2> 1262059 WARN  (coreLoadExecutor-3724-thread-1) [    ] o.a.s.c.RequestHandlers INVALID paramSet a in requestHandler {type = requestHandler,name = /dump,class = DumpRequestHandler,args = {defaults={a=A,b=B}}}
   [junit4]   2> 1262062 INFO  (coreLoadExecutor-3724-thread-1) [    ] o.a.s.h.l.XMLLoader xsltCacheLifetimeSeconds=60
   [junit4]   2> 1262063 INFO  (coreLoadExecutor-3724-thread-1) [    ] o.a.s.h.l.XMLLoader xsltCacheLifetimeSeconds=60
   [junit4]   2> 1262064 INFO  (coreLoadExecutor-3724-thread-1) [    ] o.a.s.h.l.XMLLoader xsltCacheLifetimeSeconds=60
   [junit4]   2> 1262065 INFO  (coreLoadExecutor-3724-thread-1) [    ] o.a.s.h.l.XMLLoader xsltCacheLifetimeSeconds=60
   [junit4]   2> 1262069 INFO  (coreLoadExecutor-3724-thread-1) [    ] o.a.s.c.RequestHandlers Registered paths: /admin/mbeans,standard,/dump,/update/csv,/sql,/update/json/docs,/admin/luke,/export,/admin/segments,/get,/admin/system,/replication,/admin/properties,/config,/stream,/schema,/admin/plugins,/admin/logging,/update/json,/admin/threads,/admin/ping,/update,/admin/file
   [junit4]   2> 1262069 INFO  (coreLoadExecutor-3724-thread-1) [    ] o.a.s.c.SolrCore Using default statsCache cache: org.apache.solr.search.stats.LocalStatsCache
   [junit4]   2> 1262069 INFO  (coreLoadExecutor-3724-thread-1) [    ] o.a.s.u.UpdateHandler Using UpdateLog implementation: org.apache.solr.update.UpdateLog
   [junit4]   2> 1262070 INFO  (coreLoadExecutor-3724-thread-1) [    ] o.a.s.u.UpdateLog Initializing UpdateLog: dataDir= defaultSyncLevel=FLUSH numRecordsToKeep=100 maxNumLogsToKeep=10 numVersionBuckets=65536
   [junit4]   2> 1262070 INFO  (coreLoadExecutor-3724-thread-1) [    ] o.a.s.u.CommitTracker Hard AutoCommit: disabled
   [junit4]   2> 1262070 INFO  (coreLoadExecutor-3724-thread-1) [    ] o.a.s.u.CommitTracker Soft AutoCommit: disabled
   [junit4]   2> 1262071 INFO  (coreLoadExecutor-3724-thread-1) [    ] o.a.s.u.RandomMergePolicy RandomMergePolicy wrapping class org.apache.lucene.index.TieredMergePolicy: [TieredMergePolicy: maxMergeAtOnce=7, maxMergeAtOnceExplicit=7, maxMergedSegmentMB=32.2001953125, floorSegmentMB=1.7021484375, forceMergeDeletesPctAllowed=14.903192181119335, segmentsPerTier=42.0, maxCFSSegmentSizeMB=8.796093022207999E12, noCFSRatio=0.20266580963695313
   [junit4]   2> 1262071 INFO  (coreLoadExecutor-3724-thread-1) [    ] o.a.s.c.SolrDeletionPolicy SolrDeletionPolicy.onInit: commits: num=1
   [junit4]   2> 	commit{dir=MockDirectoryWrapper(RAMDirectory@9061a2 lockFactory=org.apache.lucene.store.SingleInstanceLockFactory@bd0839),segFN=segments_1,generation=1}
   [junit4]   2> 1262071 INFO  (coreLoadExecutor-3724-thread-1) [    ] o.a.s.c.SolrDeletionPolicy newest commit generation = 1
   [junit4]   2> 1262071 INFO  (coreLoadExecutor-3724-thread-1) [    ] o.a.s.s.SolrIndexSearcher Opening [Searcher@22b627[collection1] main]
   [junit4]   2> 1262071 INFO  (coreLoadExecutor-3724-thread-1) [    ] o.a.s.c.c.ZkStateReader Load collection config from: [/collections/control_collection]
   [junit4]   2> 1262072 INFO  (coreLoadExecutor-3724-thread-1) [    ] o.a.s.c.c.ZkStateReader path=[/collections/control_collection] [configName]=[conf1] specified config exists in ZooKeeper
   [junit4]   2> 1262072 INFO  (coreLoadExecutor-3724-thread-1) [    ] o.a.s.r.ManagedResourceStorage Setting up ZooKeeper-based storage for the RestManager with znodeBase: /configs/conf1
   [junit4]   2> 1262073 INFO  (coreLoadExecutor-3724-thread-1) [    ] o.a.s.r.ManagedResourceStorage Configured ZooKeeperStorageIO with znodeBase: /configs/conf1
   [junit4]   2> 1262073 INFO  (coreLoadExecutor-3724-thread-1) [    ] o.a.s.r.RestManager Initializing RestManager with initArgs: {}
   [junit4]   2> 1262073 INFO  (coreLoadExecutor-3724-thread-1) [    ] o.a.s.r.ManagedResourceStorage Reading _rest_managed.json using ZooKeeperStorageIO:path=/configs/conf1
   [junit4]   2> 1262073 INFO  (coreLoadExecutor-3724-thread-1) [    ] o.a.s.r.ManagedResourceStorage No data found for znode /configs/conf1/_rest_managed.json
   [junit4]   2> 1262073 INFO  (coreLoadExecutor-3724-thread-1) [    ] o.a.s.r.ManagedResourceStorage Loaded null at path _rest_managed.json using ZooKeeperStorageIO:path=/configs/conf1
   [junit4]   2> 1262074 INFO  (coreLoadExecutor-3724-thread-1) [    ] o.a.s.r.RestManager Initializing 0 registered ManagedResources
   [junit4]   2> 1262074 INFO  (coreLoadExecutor-3724-thread-1) [    ] o.a.s.h.ReplicationHandler Commits will be reserved for  10000
   [junit4]   2> 1262074 INFO  (searcherExecutor-3725-thread-1) [    ] o.a.s.c.SolrCore [collection1] Registered new searcher Searcher@22b627[collection1] main{ExitableDirectoryReader(UninvertingDirectoryReader())}
   [junit4]   2> 1262074 INFO  (coreLoadExecutor-3724-thread-1) [    ] o.a.s.u.UpdateLog Looking up max value of version field to seed version buckets
   [junit4]   2> 1262074 INFO  (coreLoadExecutor-3724-thread-1) [    ] o.a.s.u.VersionInfo Refreshing highest value of _version_ for 65536 version buckets from index
   [junit4]   2> 1262074 INFO  (coreLoadExecutor-3724-thread-1) [    ] o.a.s.u.VersionInfo No terms found for _version_, cannot seed version bucket highest value from index
   [junit4]   2> 1262074 INFO  (coreLoadExecutor-3724-thread-1) [    ] o.a.s.u.UpdateLog Could not find max version in index or recent updates, using new clock 1523196797652041728
   [junit4]   2> 1262076 INFO  (coreLoadExecutor-3724-thread-1) [    ] o.a.s.u.UpdateLog Took 1.0ms to seed version buckets with highest version 1523196797652041728
   [junit4]   2> 1262076 INFO  (coreLoadExecutor-3724-thread-1) [    ] o.a.s.c.ZkController watch zkdir /configs/conf1
   [junit4]   2> 1262076 INFO  (coreLoadExecutor-3724-thread-1) [    ] o.a.s.c.CoreContainer registering core: collection1
   [junit4]   2> 1262077 INFO  (coreZkRegister-3718-thread-1) [    ] o.a.s.c.ZkController Register replica - core:collection1 address:http://127.0.0.1:37334/kaz collection:control_collection shard:shard1
   [junit4]   2> 1262077 INFO  (coreZkRegister-3718-thread-1) [    ] o.a.s.c.c.SolrZkClient makePath: /collections/control_collection/leader_elect/shard1/election
   [junit4]   2> 1262079 INFO  (coreZkRegister-3718-thread-1) [    ] o.a.s.c.LeaderElector Joined leadership election with path: /collections/control_collection/leader_elect/shard1/election/95199799752589316-core_node1-n_0000000000
   [junit4]   2> 1262079 INFO  (coreZkRegister-3718-thread-1) [    ] o.a.s.c.ShardLeaderElectionContext Running the leader process for shard=shard1 and weAreReplacement=false and leaderVoteWait=10000
   [junit4]   2> 1262081 INFO  (coreZkRegister-3718-thread-1) [    ] o.a.s.c.ShardLeaderElectionContext Enough replicas found to continue.
   [junit4]   2> 1262081 INFO  (coreZkRegister-3718-thread-1) [    ] o.a.s.c.ShardLeaderElectionContext I may be the new leader - try and sync
   [junit4]   2> 1262081 INFO  (coreZkRegister-3718-thread-1) [    ] o.a.s.c.SyncStrategy Sync replicas to http://127.0.0.1:37334/kaz/collection1/
   [junit4]   2> 1262081 INFO  (OverseerStateUpdate-95199799752589316-127.0.0.1:37334_kaz-n_0000000000) [    ] o.a.s.c.Overseer processMessage: queueSize: 1, message = {
   [junit4]   2>   "operation":"leader",
   [junit4]   2>   "shard":"shard1",
   [junit4]   2>   "collection":"control_collection"} current state version: 1
   [junit4]   2> 1262081 INFO  (coreZkRegister-3718-thread-1) [    ] o.a.s.c.SyncStrategy Sync Success - now sync replicas to me
   [junit4]   2> 1262082 INFO  (coreZkRegister-3718-thread-1) [    ] o.a.s.c.SyncStrategy http://127.0.0.1:37334/kaz/collection1/ has no replicas
   [junit4]   2> 1262082 INFO  (coreZkRegister-3718-thread-1) [    ] o.a.s.c.c.SolrZkClient makePath: /collections/control_collection/leaders/shard1
   [junit4]   2> 1262085 INFO  (coreZkRegister-3718-thread-1) [    ] o.a.s.c.ShardLeaderElectionContextBase Creating leader registration node
   [junit4]   2> 1262087 INFO  (coreZkRegister-3718-thread-1) [    ] o.a.s.c.ShardLeaderElectionContext I am the new leader: http://127.0.0.1:37334/kaz/collection1/ shard1
   [junit4]   2> 1262087 INFO  (OverseerStateUpdate-95199799752589316-127.0.0.1:37334_kaz-n_0000000000) [    ] o.a.s.c.Overseer processMessage: queueSize: 1, message = {
   [junit4]   2>   "operation":"leader",
   [junit4]   2>   "shard":"shard1",
   [junit4]   2>   "collection":"control_collection",
   [junit4]   2>   "base_url":"http://127.0.0.1:37334/kaz",
   [junit4]   2>   "core":"collection1",
   [junit4]   2>   "state":"active"} current state version: 1
   [junit4]   2> 1262189 INFO  (zkCallback-1518-thread-1) [    ] o.a.s.c.c.ZkStateReader A cluster state change: [WatchedEvent state:SyncConnected type:NodeDataChanged path:/clusterstate.json], has occurred - updating... (live nodes size: [1])
   [junit4]   2> 1262237 INFO  (coreZkRegister-3718-thread-1) [    ] o.a.s.c.ZkController We are http://127.0.0.1:37334/kaz/collection1/ and leader is http://127.0.0.1:37334/kaz/collection1/
   [junit4]   2> 1262237 INFO  (coreZkRegister-3718-thread-1) [    ] o.a.s.c.ZkController No LogReplay needed for core=collection1 baseURL=http://127.0.0.1:37334/kaz
   [junit4]   2> 1262237 INFO  (coreZkRegister-3718-thread-1) [    ] o.a.s.c.ZkController I am the leader, no recovery necessary
   [junit4]   2> 1262238 INFO  (coreZkRegister-3718-thread-1) [    ] o.a.s.c.ZkController publishing state=active
   [junit4]   2> 1262238 INFO  (coreZkRegister-3718-thread-1) [    ] o.a.s.c.ZkController numShards not found on descriptor - reading it from system property
   [junit4]   2> 1262239 INFO  (OverseerStateUpdate-95199799752589316-127.0.0.1:37334_kaz-n_0000000000) [    ] o.a.s.c.Overseer processMessage: queueSize: 1, message = {
   [junit4]   2>   "core":"collection1",
   [junit4]   2>   "core_node_name":"core_node1",
   [junit4]   2>   "roles":null,
   [junit4]   2>   "base_url":"http://127.0.0.1:37334/kaz",
   [junit4]   2>   "node_name":"127.0.0.1:37334_kaz",
   [junit4]   2>   "numShards":"1",
   [junit4]   2>   "state":"active",
   [junit4]   2>   "shard":"shard1",
   [junit4]   2>   "collection":"control_collection",
   [junit4]   2>   "operation":"state"} current state version: 2
   [junit4]   2> 1262239 INFO  (OverseerStateUpdate-95199799752589316-127.0.0.1:37334_kaz-n_0000000000) [    ] o.a.s.c.o.ReplicaMutator Update state numShards=1 message={
   [junit4]   2>   "core":"collection1",
   [junit4]   2>   "core_node_name":"core_node1",
   [junit4]   2>   "roles":null,
   [junit4]   2>   "base_url":"http://127.0.0.1:37334/kaz",
   [junit4]   2>   "node_name":"127.0.0.1:37334_kaz",
   [junit4]   2>   "numShards":"1",
   [junit4]   2>   "state":"active",
   [junit4]   2>   "shard":"shard1",
   [junit4]   2>   "collection":"control_collection",
   [junit4]   2>   "operation":"state"}
   [junit4]   2> 1262303 INFO  (TEST-HttpPartitionTest.test-seed#[55A3FF52B71EECCA]) [    ] o.a.s.c.c.SolrZkClient Using default ZkCredentialsProvider
   [junit4]   2> 1262303 INFO  (TEST-HttpPartitionTest.test-seed#[55A3FF52B71EECCA]) [    ] o.a.s.c.c.ConnectionManager Waiting for client to connect to ZooKeeper
   [junit4]   2> 1262304 INFO  (zkCallback-1520-thread-1) [    ] o.a.s.c.c.ConnectionManager Watcher org.apache.solr.common.cloud.ConnectionManager@674e10 name:ZooKeeperConnection Watcher:127.0.0.1:57330/solr got event WatchedEvent state:SyncConnected type:None path:null path:null type:None
   [junit4]   2> 1262304 INFO  (TEST-HttpPartitionTest.test-seed#[55A3FF52B71EECCA]) [    ] o.a.s.c.c.ConnectionManager Client is connected to ZooKeeper
   [junit4]   2> 1262304 INFO  (TEST-HttpPartitionTest.test-seed#[55A3FF52B71EECCA]) [    ] o.a.s.c.c.SolrZkClient Using default ZkACLProvider
   [junit4]   2> 1262304 INFO  (TEST-HttpPartitionTest.test-seed#[55A3FF52B71EECCA]) [    ] o.a.s.c.c.ZkStateReader Updating cluster state from ZooKeeper... 
   [junit4]   2> 1262305 INFO  (TEST-HttpPartitionTest.test-seed#[55A3FF52B71EECCA]) [    ] o.a.s.c.ChaosMonkey monkey: init - expire sessions:false cause connection loss:false
   [junit4]   2> 1262341 INFO  (zkCallback-1520-thread-1) [    ] o.a.s.c.c.ZkStateReader A cluster state change: [WatchedEvent state:SyncConnected type:NodeDataChanged path:/clusterstate.json], has occurred - updating... (live nodes size: [1])
   [junit4]   2> 1262341 INFO  (zkCallback-1518-thread-2) [    ] o.a.s.c.c.ZkStateReader A cluster state change: [WatchedEvent state:SyncConnected type:NodeDataChanged path:/clusterstate.json], has occurred - updating... (live nodes size: [1])
   [junit4]   2> 1262370 INFO  (TEST-HttpPartitionTest.test-seed#[55A3FF52B71EECCA]) [    ] o.a.s.SolrTestCaseJ4 Writing core.properties file to /home/jenkins/workspace/Lucene-Solr-trunk-Linux/solr/build/solr-core/test/J1/temp/solr.cloud.HttpPartitionTest_55A3FF52B71EECCA-001/shard-1-001/cores/collection1
   [junit4]   2> 1262371 INFO  (TEST-HttpPartitionTest.test-seed#[55A3FF52B71EECCA]) [    ] o.a.s.c.AbstractFullDistribZkTestBase create jetty 1 in directory /home/jenkins/workspace/Lucene-Solr-trunk-Linux/solr/build/solr-core/test/J1/temp/solr.cloud.HttpPartitionTest_55A3FF52B71EECCA-001/shard-1-001
   [junit4]   2> 1262371 INFO  (TEST-HttpPartitionTest.test-seed#[55A3FF52B71EECCA]) [    ] o.e.j.s.Server jetty-9.2.13.v20150730
   [junit4]   2> 1262373 INFO  (TEST-HttpPartitionTest.test-seed#[55A3FF52B71EECCA]) [    ] o.e.j.s.h.ContextHandler Started o.e.j.s.ServletContextHandler@d4ad94{/kaz,null,AVAILABLE}
   [junit4]   2> 1262373 INFO  (TEST-HttpPartitionTest.test-seed#[55A3FF52B71EECCA]) [    ] o.e.j.s.ServerConnector Started ServerConnector@1f6a883{HTTP/1.1}{127.0.0.1:51692}
   [junit4]   2> 1262373 INFO  (TEST-HttpPartitionTest.test-seed#[55A3FF52B71EECCA]) [    ] o.e.j.s.Server Started @1263645ms
   [junit4]   2> 1262373 INFO  (TEST-HttpPartitionTest.test-seed#[55A3FF52B71EECCA]) [    ] o.a.s.c.s.e.JettySolrRunner Jetty properties: {solr.data.dir=/home/jenkins/workspace/Lucene-Solr-trunk-Linux/solr/build/solr-core/test/J1/temp/solr.cloud.HttpPartitionTest_55A3FF52B71EECCA-001/tempDir-001/jetty1, solrconfig=solrconfig.xml, hostContext=/kaz, hostPort=38156, coreRootDirectory=/home/jenkins/workspace/Lucene-Solr-trunk-Linux/solr/build/solr-core/test/J1/temp/solr.cloud.HttpPartitionTest_55A3FF52B71EECCA-001/shard-1-001/cores}
   [junit4]   2> 1262373 INFO  (TEST-HttpPartitionTest.test-seed#[55A3FF52B71EECCA]) [    ] o.a.s.s.SolrDispatchFilter SolrDispatchFilter.init(): sun.misc.Launcher$AppClassLoader@1521cc1
   [junit4]   2> 1262373 INFO  (TEST-HttpPartitionTest.test-seed#[55A3FF52B71EECCA]) [    ] o.a.s.c.SolrResourceLoader new SolrResourceLoader for directory: '/home/jenkins/workspace/Lucene-Solr-trunk-Linux/solr/build/solr-core/test/J1/temp/solr.cloud.HttpPartitionTest_55A3FF52B71EECCA-001/shard-1-001'
   [junit4]   2> 1262374 INFO  (TEST-HttpPartitionTest.test-seed#[55A3FF52B71EECCA]) [    ] o.a.s.c.SolrResourceLoader JNDI not configured for solr (NoInitialContextEx)
   [junit4]   2> 1262374 INFO  (TEST-HttpPartitionTest.test-seed#[55A3FF52B71EECCA]) [    ] o.a.s.c.SolrResourceLoader solr home defaulted to 'solr/' (could not find system property or JNDI)
   [junit4]   2> 1262374 INFO  (TEST-HttpPartitionTest.test-seed#[55A3FF52B71EECCA]) [    ] o.a.s.c.c.SolrZkClient Using default ZkCredentialsProvider
   [junit4]   2> 1262374 INFO  (TEST-HttpPartitionTest.test-seed#[55A3FF52B71EECCA]) [    ] o.a.s.c.c.ConnectionManager Waiting for client to connect to ZooKeeper
   [junit4]   2> 1262375 INFO  (zkCallback-1521-thread-1) [    ] o.a.s.c.c.ConnectionManager Watcher org.apache.solr.common.cloud.ConnectionManager@270ddf name:ZooKeeperConnection Watcher:127.0.0.1:57330/solr got event WatchedEvent state:SyncConnected type:None path:null path:null type:None
   [junit4]   2> 1262375 INFO  (TEST-HttpPartitionTest.test-seed#[55A3FF52B71EECCA]) [    ] o.a.s.c.c.ConnectionManager Client is connected to ZooKeeper
   [junit4]   2> 1262375 INFO  (TEST-HttpPartitionTest.test-seed#[55A3FF52B71EECCA]) [    ] o.a.s.c.c.SolrZkClient Using default ZkACLProvider
   [junit4]   2> 1262376 INFO  (TEST-HttpPartitionTest.test-seed#[55A3FF52B71EECCA]) [    ] o.a.s.s.SolrDispatchFilter Loading solr.xml from SolrHome (not found in ZooKeeper)
   [junit4]   2> 1262376 INFO  (TEST-HttpPartitionTest.test-seed#[55A3FF52B71EECCA]) [    ] o.a.s.c.SolrXmlConfig Loading container configuration from /home/jenkins/workspace/Lucene-Solr-trunk-Linux/solr/build/solr-core/test/J1/temp/solr.cloud.HttpPartitionTest_55A3FF52B71EECCA-001/shard-1-001/solr.xml
   [junit4]   2> 1262385 INFO  (TEST-HttpPartitionTest.test-seed#[55A3FF52B71EECCA]) [    ] o.a.s.c.CorePropertiesLocator Config-defined core root directory: /home/jenkins/workspace/Lucene-Solr-trunk-Linux/solr/build/solr-core/test/J1/temp/solr.cloud.HttpPartitionTest_55A3FF52B71EECCA-001/shard-1-001/cores
   [junit4]   2> 1262385 INFO  (TEST-HttpPartitionTest.test-seed#[55A3FF52B71EECCA]) [    ] o.a.s.c.CoreContainer New CoreContainer 28219503
   [junit4]   2> 1262385 INFO  (TEST-HttpPartitionTest.test-seed#[55A3FF52B71EECCA]) [    ] o.a.s.c.CoreContainer Loading cores into CoreContainer [instanceDir=/home/jenkins/workspace/Lucene-Solr-trunk-Linux/solr/build/solr-core/test/J1/temp/solr.cloud.HttpPartitionTest_55A3FF52B71EECCA-001/shard-1-001]
   [junit4]   2> 1262386 WARN  (TEST-HttpPartitionTest.test-seed#[55A3FF52B71EECCA]) [    ] o.a.s.c.CoreContainer Couldn't add files from /home/jenkins/workspace/Lucene-Solr-trunk-Linux/solr/build/solr-core/test/J1/temp/solr.cloud.HttpPartitionTest_55A3FF52B71EECCA-001/shard-1-001/lib to classpath: /home/jenkins/workspace/Lucene-Solr-trunk-Linux/solr/build/solr-core/test/J1/temp/solr.cloud.HttpPartitionTest_55A3FF52B71EECCA-001/shard-1-001/lib
   [junit4]   2> 1262386 INFO  (TEST-HttpPartitionTest.test-seed#[55A3FF52B71EECCA]) [    ] o.a.s.h.c.HttpShardHandlerFactory created with socketTimeout : 90000,urlScheme : ,connTimeout : 15000,maxConnectionsPerHost : 20,maxConnections : 10000,corePoolSize : 0,maximumPoolSize : 2147483647,maxThreadIdleTime : 5,sizeOfQueue : -1,fairnessPolicy : false,useRetries : false,
   [junit4]   2> 1262387 INFO  (TEST-HttpPartitionTest.test-seed#[55A3FF52B71EECCA]) [    ] o.a.s.u.UpdateShardHandler Creating UpdateShardHandler HTTP client with params: socketTimeout=340000&connTimeout=45000&retry=true
   [junit4]   2> 1262387 INFO  (TEST-HttpPartitionTest.test-seed#[55A3FF52B71EECCA]) [    ] o.a.s.l.LogWatcher SLF4J impl is org.slf4j.impl.Log4jLoggerFactory
   [junit4]   2> 1262387 INFO  (TEST-HttpPartitionTest.test-seed#[55A3FF52B71EECCA]) [    ] o.a.s.l.LogWatcher Registering Log Listener [Log4j (org.slf4j.impl.Log4jLoggerFactory)]
   [junit4]   2> 1262387 INFO  (TEST-HttpPartitionTest.test-seed#[55A3FF52B71EECCA]) [    ] o.a.s.c.ZkContainer Zookeeper client=127.0.0.1:57330/solr
   [junit4]   2> 1262387 INFO  (TEST-HttpPartitionTest.test-seed#[55A3FF52B71EECCA]) [    ] o.a.s.c.ZkController zkHost includes chroot
   [junit4]   2> 1262387 INFO  (TEST-HttpPartitionTest.test-seed#[55A3FF52B71EECCA]) [    ] o.a.s.c.c.SolrZkClient Using default ZkCredentialsProvider
   [junit4]   2> 1262388 INFO  (TEST-HttpPartitionTest.test-seed#[55A3FF52B71EECCA]) [    ] o.a.s.c.c.ConnectionManager Waiting for client to connect to ZooKeeper
   [junit4]   2> 1262389 INFO  (zkCallback-1524-thread-1) [    ] o.a.s.c.c.ConnectionManager Watcher org.apache.solr.common.cloud.ConnectionManager@e1787a name:ZooKeeperConnection Watcher:127.0.0.1:57330 got event WatchedEvent state:SyncConnected type:None path:null path:null type:None
   [junit4]   2> 1262389 INFO  (TEST-HttpPartitionTest.test-seed#[55A3FF52B71EECCA]) [    ] o.a.s.c.c.ConnectionManager Client is connected to ZooKeeper
   [junit4]   2> 1262389 INFO  (TEST-HttpPartitionTest.test-seed#[55A3FF52B71EECCA]) [    ] o.a.s.c.c.SolrZkClient Using default ZkACLProvider
   [junit4]   2> 1262390 INFO  (TEST-HttpPartitionTest.test-seed#[55A3FF52B71EECCA]) [    ] o.a.s.c.c.ConnectionManager Waiting for client to connect to ZooKeeper
   [junit4]   2> 1262391 INFO  (zkCallback-1525-thread-1) [    ] o.a.s.c.c.ConnectionManager Watcher org.apache.solr.common.cloud.ConnectionManager@20e3f2 name:ZooKeeperConnection Watcher:127.0.0.1:57330/solr got event WatchedEvent state:SyncConnected type:None path:null path:null type:None
   [junit4]   2> 1262391 INFO  (TEST-HttpPartitionTest.test-seed#[55A3FF52B71EECCA]) [    ] o.a.s.c.c.ConnectionManager Client is connected to ZooKeeper
   [junit4]   2> 1262394 INFO  (TEST-HttpPartitionTest.test-seed#[55A3FF52B71EECCA]) [    ] o.a.s.c.c.ZkStateReader Updating cluster state from ZooKeeper... 
   [junit4]   2> 1263396 INFO  (TEST-HttpPartitionTest.test-seed#[55A3FF52B71EECCA]) [    ] o.a.s.c.ZkController Register node as live in ZooKeeper:/live_nodes/127.0.0.1:38156_kaz
   [junit4]   2> 1263397 INFO  (TEST-HttpPartitionTest.test-seed#[55A3FF52B71EECCA]) [    ] o.a.s.c.c.SolrZkClient makePath: /live_nodes/127.0.0.1:38156_kaz
   [junit4]   2> 1263397 INFO  (zkCallback-1525-thread-1) [    ] o.a.s.c.c.ZkStateReader A live node change: [WatchedEvent state:SyncConnected type:NodeChildrenChanged path:/live_nodes], has occurred - updating... (live nodes size: [1])
   [junit4]   2> 1263397 INFO  (zkCallback-1518-thread-2) [    ] o.a.s.c.c.ZkStateReader A live node change: [WatchedEvent state:SyncConnected type:NodeChildrenChanged path:/live_nodes], has occurred - updating... (live nodes size: [1])
   [junit4]   2> 1263397 INFO  (zkCallback-1520-thread-1) [    ] o.a.s.c.c.ZkStateReader A live node change: [WatchedEvent state:SyncConnected type:NodeChildrenChanged path:/live_nodes], has occurred - updating... (live nodes size: [1])
   [junit4]   2> 1263398 INFO  (TEST-HttpPartitionTest.test-seed#[55A3FF52B71EECCA]) [    ] o.a.s.c.Overseer Overseer (id=null) closing
   [junit4]   2> 1263398 INFO  (TEST-HttpPartitionTest.test-seed#[55A3FF52B71EECCA]) [    ] o.a.s.c.LeaderElector Joined leadership election with path: /overseer_elect/election/95199799752589320-127.0.0.1:38156_kaz-n_0000000001
   [junit4]   2> 1263398 INFO  (TEST-HttpPartitionTest.test-seed#[55A3FF52B71EECCA]) [    ] o.a.s.c.LeaderElector Watching path /overseer_elect/election/95199799752589316-127.0.0.1:37334_kaz-n_0000000000 to know if I could be the leader
   [junit4]   2> 1263445 INFO  (TEST-HttpPartitionTest.test-seed#[55A3FF52B71EECCA]) [    ] o.a.s.c.CoreContainer Security conf doesn't exist. Skipping setup for authorization module.
   [junit4]   2> 1263445 INFO  (TEST-HttpPartitionTest.test-seed#[55A3FF52B71EECCA]) [    ] o.a.s.c.CoreContainer No authentication plugin used.
   [junit4]   2> 1263446 INFO  (TEST-HttpPartitionTest.test-seed#[55A3FF52B71EECCA]) [    ] o.a.s.c.CorePropertiesLocator Looking for core definitions underneath /home/jenkins/workspace/Lucene-Solr-trunk-Linux/solr/build/solr-core/test/J1/temp/solr.cloud.HttpPartitionTest_55A3FF52B71EECCA-001/shard-1-001/cores
   [junit4]   2> 1263446 INFO  (TEST-HttpPartitionTest.test-seed#[55A3FF52B71EECCA]) [    ] o.a.s.c.CoreDescriptor Created CoreDescriptor: {name=collection1, config=solrconfig.xml, transient=false, schema=schema.xml, loadOnStartup=true, configSetProperties=configsetprops.json, collection=collection1, coreNodeName=, dataDir=data/, shard=}
   [junit4]   2> 1263446 INFO  (TEST-HttpPartitionTest.test-seed#[55A3FF52B71EECCA]) [    ] o.a.s.c.CorePropertiesLocator Found core collection1 in /home/jenkins/workspace/Lucene-Solr-trunk-Linux/solr/build/solr-core/test/J1/temp/solr.cloud.HttpPartitionTest_55A3FF52B71EECCA-001/shard-1-001/cores/collection1
   [junit4]   2> 1263446 INFO  (TEST-HttpPartitionTest.test-seed#[55A3FF52B71EECCA]) [    ] o.a.s.c.CorePropertiesLocator Found 1 core definitions
   [junit4]   2> 1263447 INFO  (TEST-HttpPartitionTest.test-seed#[55A3FF52B71EECCA]) [    ] o.a.s.s.SolrDispatchFilter user.dir=/home/jenkins/workspace/Lucene-Solr-trunk-Linux/solr/build/solr-core/test/J1
   [junit4]   2> 1263447 INFO  (TEST-HttpPartitionTest.test-seed#[55A3FF52B71EECCA]) [    ] o.a.s.s.SolrDispatchFilter SolrDispatchFilter.init() done
   [junit4]   2> 1263447 INFO  (coreLoadExecutor-3735-thread-1) [    ] o.a.s.c.ZkController publishing state=down
   [junit4]   2> 1263447 INFO  (coreLoadExecutor-3735-thread-1) [    ] o.a.s.c.ZkController numShards not found on descriptor - reading it from system property
   [junit4]   2> 1263448 INFO  (coreLoadExecutor-3735-thread-1) [    ] o.a.s.c.ZkController look for our core node name
   [junit4]   2> 1263448 INFO  (OverseerStateUpdate-95199799752589316-127.0.0.1:37334_kaz-n_0000000000) [    ] o.a.s.c.Overseer processMessage: queueSize: 1, message = {
   [junit4]   2>   "core":"collection1",
   [junit4]   2>   "roles":null,
   [junit4]   2>   "base_url":"http://127.0.0.1:38156/kaz",
   [junit4]   2>   "node_name":"127.0.0.1:38156_kaz",
   [junit4]   2>   "numShards":"2",
   [junit4]   2>   "state":"down",
   [junit4]   2>   "shard":null,
   [junit4]   2>   "collection":"collection1",
   [junit4]   2>   "operation":"state"} current state version: 3
   [junit4]   2> 1263448 INFO  (OverseerStateUpdate-95199799752589316-127.0.0.1:37334_kaz-n_0000000000) [    ] o.a.s.c.o.ReplicaMutator Update state numShards=2 message={
   [junit4]   2>   "core":"collection1",
   [junit4]   2>   "roles":null,
   [junit4]   2>   "base_url":"http://127.0.0.1:38156/kaz",
   [junit4]   2>   "node_name":"127.0.0.1:38156_kaz",
   [junit4]   2>   "numShards":"2",
   [junit4]   2>   "state":"down",
   [junit4]   2>   "shard":null,
   [junit4]   2>   "collection":"collection1",
   [junit4]   2>   "operation":"state"}
   [junit4]   2> 1263448 INFO  (OverseerStateUpdate-95199799752589316-127.0.0.1:37334_kaz-n_0000000000) [    ] o.a.s.c.o.ClusterStateMutator building a new cName: collection1
   [junit4]   2> 1263448 INFO  (OverseerStateUpdate-95199799752589316-127.0.0.1:37334_kaz-n_0000000000) [    ] o.a.s.c.o.ReplicaMutator Assigning new node to shard shard=shard2
   [junit4]   2> 1263550 INFO  (zkCallback-1518-thread-2) [    ] o.a.s.c.c.ZkStateReader A cluster state change: [WatchedEvent state:SyncConnected type:NodeDataChanged path:/clusterstate.json], has occurred - updating... (live nodes size: [2])
   [junit4]   2> 1263550 INFO  (zkCallback-1525-thread-1) [    ] o.a.s.c.c.ZkStateReader A cluster state change: [WatchedEvent state:SyncConnected type:NodeDataChanged path:/clusterstate.json], has occurred - updating... (live nodes size: [2])
   [junit4]   2> 1263550 INFO  (zkCallback-1520-thread-1) [    ] o.a.s.c.c.ZkStateReader A cluster state change: [WatchedEvent state:SyncConnected type:NodeDataChanged path:/clusterstate.json], has occurred - updating... (live nodes size: [2])
   [junit4]   2> 1264448 INFO  (coreLoadExecutor-3735-thread-1) [    ] o.a.s.c.ZkController waiting to find shard id in clusterstate for collection1
   [junit4]   2> 1264448 INFO  (coreLoadExecutor-3735-thread-1) [    ] o.a.s.c.ZkController Check for collection zkNode:collection1
   [junit4]   2> 1264449 INFO  (coreLoadExecutor-3735-thread-1) [    ] o.a.s.c.ZkController Collection zkNode exists
   [junit4]   2> 1264449 INFO  (coreLoadExecutor-3735-thread-1) [    ] o.a.s.c.c.ZkStateReader Load collection config from: [/collections/collection1]
   [junit4]   2> 1264449 INFO  (coreLoadExecutor-3735-thread-1) [    ] o.a.s.c.c.ZkStateReader path=[/collections/collection1] [configName]=[conf1] specified config exists in ZooKeeper
   [junit4]   2> 1264449 INFO  (coreLoadExecutor-3735-thread-1) [    ] o.a.s.c.SolrResourceLoader new SolrResourceLoader for directory: '/home/jenkins/workspace/Lucene-Solr-trunk-Linux/solr/build/solr-core/test/J1/temp/solr.cloud.HttpPartitionTest_55A3FF52B71EECCA-001/shard-1-001/cores/collection1'
   [junit4]   2> 1264449 INFO  (coreLoadExecutor-3735-thread-1) [    ] o.a.s.c.SolrResourceLoader JNDI not configured for solr (NoInitialContextEx)
   [junit4]   2> 1264449 INFO  (coreLoadExecutor-3735-thread-1) [    ] o.a.s.c.SolrResourceLoader solr home defaulted to 'solr/' (could not find system property or JNDI)
   [junit4]   2> 1264450 INFO  (coreLoadExecutor-3735-thread-1) [    ] o.a.s.c.Config loaded config solrconfig.xml with version 0 
   [junit4]   2> 1264456 INFO  (coreLoadExecutor-3735-thread-1) [    ] o.a.s.c.SolrConfig current version of requestparams : -1
   [junit4]   2> 1264462 INFO  (coreLoadExecutor-3735-thread-1) [    ] o.a.s.c.SolrConfig Using Lucene MatchVersion: 6.0.0
   [junit4]   2> 1264472 INFO  (coreLoadExecutor-3735-thread-1) [    ] o.a.s.c.SolrConfig Loaded SolrConfig: solrconfig.xml
   [junit4]   2> 1264479 INFO  (coreLoadExecutor-3735-thread-1) [    ] o.a.s.s.IndexSchema [collection1] Schema name=test
   [junit4]   2> 1264572 INFO  (coreLoadExecutor-3735-thread-1) [    ] o.a.s.s.OpenExchangeRatesOrgProvider Initialized with rates=open-exchange-rates.json, refreshInterval=1440.
   [junit4]   2> 1264577 INFO  (coreLoadExecutor-3735-thread-1) [    ] o.a.s.s.IndexSchema default search field in schema is text
   [junit4]   2> 1264578 INFO  (coreLoadExecutor-3735-thread-1) [    ] o.a.s.s.IndexSchema unique key field: id
   [junit4]   2> 1264583 INFO  (coreLoadExecutor-3735-thread-1) [    ] o.a.s.s.FileExchangeRateProvider Reloading exchange rates from file currency.xml
   [junit4]   2> 1264585 INFO  (coreLoadExecutor-3735-thread-1) [    ] o.a.s.s.FileExchangeRateProvider Reloading exchange rates from file currency.xml
   [junit4]   2> 1264586 INFO  (coreLoadExecutor-3735-thread-1) [    ] o.a.s.s.OpenExchangeRatesOrgProvider Reloading exchange rates from open-exchange-rates.json
   [junit4]   2> 1264587 INFO  (coreLoadExecutor-3735-thread-1) [    ] o.a.s.s.OpenExchangeRatesOrgProvider Reloading exchange rates from open-exchange-rates.json
   [junit4]   2> 1264588 INFO  (coreLoadExecutor-3735-thread-1) [    ] o.a.s.c.ConfigSetProperties Did not find ConfigSet properties, assuming default properties: Can't find resource 'configsetprops.json' in classpath or '/configs/conf1', cwd=/home/jenkins/workspace/Lucene-Solr-trunk-Linux/solr/build/solr-core/test/J1
   [junit4]   2> 1264588 INFO  (coreLoadExecutor-3735-thread-1) [    ] o.a.s.c.CoreContainer Creating SolrCore 'collection1' using configuration from collection collection1
   [junit4]   2> 1264588 INFO  (coreLoadExecutor-3735-thread-1) [    ] o.a.s.c.SolrCore org.apache.solr.core.MockDirectoryFactory
   [junit4]   2> 1264588 INFO  (coreLoadExecutor-3735-thread-1) [    ] o.a.s.c.SolrCore [[collection1] ] Opening new SolrCore at [/home/jenkins/workspace/Lucene-Solr-trunk-Linux/solr/build/solr-core/test/J1/temp/solr.cloud.HttpPartitionTest_55A3FF52B71EECCA-001/shard-1-001/cores/collection1], dataDir=[/home/jenkins/workspace/Lucene-Solr-trunk-Linux/solr/build/solr-core/test/J1/temp/solr.cloud.HttpPartitionTest_55A3FF52B71EECCA-001/shard-1-001/cores/collection1/data/]
   [junit4]   2> 1264588 INFO  (coreLoadExecutor-3735-thread-1) [    ] o.a.s.c.JmxMonitoredMap JMX monitoring is enabled. Adding Solr mbeans to JMX Server: com.sun.jmx.mbeanserver.JmxMBeanServer@1ce15ad
   [junit4]   2> 1264589 INFO  (coreLoadExecutor-3735-thread-1) [    ] o.a.s.c.CachingDirectoryFactory return new directory for /home/jenkins/workspace/Lucene-Solr-trunk-Linux/solr/build/solr-core/test/J1/temp/solr.cloud.HttpPartitionTest_55A3FF52B71EECCA-001/shard-1-001/cores/collection1/data
   [junit4]   2> 1264589 INFO  (coreLoadExecutor-3735-thread-1) [    ] o.a.s.c.SolrCore New index directory detected: old=null new=/home/jenkins/workspace/Lucene-Solr-trunk-Linux/solr/build/solr-core/test/J1/temp/solr.cloud.HttpPartitionTest_55A3FF52B71EECCA-001/shard-1-001/cores/collection1/data/index/
   [junit4]   2> 1264589 WARN  (coreLoadExecutor-3735-thread-1) [    ] o.a.s.c.SolrCore [collection1] Solr index directory '/home/jenkins/workspace/Lucene-Solr-trunk-Linux/solr/build/solr-core/test/J1/temp/solr.cloud.HttpPartitionTest_55A3FF52B71EECCA-001/shard-1-001/cores/collection1/data/index' doesn't exist. Creating new index...
   [junit4]   2> 1264589 INFO  (coreLoadExecutor-3735-thread-1) [    ] o.a.s.c.CachingDirectoryFactory return new directory for /home/jenkins/workspace/Lucene-Solr-trunk-Linux/solr/build/solr-core/test/J1/temp/solr.cloud.HttpPartitionTest_55A3FF52B71EECCA-001/shard-1-001/cores/collection1/data/index
   [junit4]   2> 1264589 INFO  (coreLoadExecutor-3735-thread-1) [    ] o.a.s.u.RandomMergePolicy RandomMergePolicy wrapping class org.apache.lucene.index.TieredMergePolicy: [TieredMergePolicy: maxMergeAtOnce=33, maxMergeAtOnceExplicit=24, maxMergedSegmentMB=71.30078125, floorSegmentMB=1.2470703125, forceMergeDeletesPctAllowed=20.930580111635933, segmentsPerTier=24.0, maxCFSSegmentSizeMB=8.796093022207999E12, noCFSRatio=0.0
   [junit4]   2> 1264589 INFO  (coreLoadExecutor-3735-thread-1) [    ] o.a.s.c.SolrDeletionPolicy SolrDeletionPolicy.onCommit: commits: num=1
   [junit4]   2> 	commit{dir=MockDirectoryWrapper(RAMDirectory@13b9d0 lockFactory=org.apache.lucene.store.SingleInstanceLockFactory@1facc5d),segFN=segments_1,generation=1}
   [junit4]   2> 1264590 INFO  (coreLoadExecutor-3735-thread-1) [    ] o.a.s.c.SolrDeletionPolicy newest commit generation = 1
   [junit4]   2> 1264590 INFO  (OldIndexDirectoryCleanupThreadForCore-collection1) [    ] o.a.s.c.SolrCore Looking for old index directories to cleanup for core collection1 in /home/jenkins/workspace/Lucene-Solr-trunk-Linux/solr/build/solr-core/test/J1/temp/solr.cloud.HttpPartitionTest_55A3FF52B71EECCA-001/shard-1-001/cores/collection1/data/
   [junit4]   2> 1264590 WARN  (OldIndexDirectoryCleanupThreadForCore-collection1) [    ] o.a.s.c.DirectoryFactory /home/jenkins/workspace/Lucene-Solr-trunk-Linux/solr/build/solr-core/test/J1/temp/solr.cloud.HttpPartitionTest_55A3FF52B71EECCA-001/shard-1-001/cores/collection1/data/ does not point to a valid data directory; skipping clean-up of old index directories.
   [junit4]   2> 1264593 INFO  (coreLoadExecutor-3735-thread-1) [    ] o.a.s.u.p.UpdateRequestProcessorChain creating updateRequestProcessorChain "nodistrib"
   [junit4]   2> 1264593 INFO  (coreLoadExecutor-3735-thread-1) [    ] o.a.s.u.p.UpdateRequestProcessorChain creating updateRequestProcessorChain "dedupe"
   [junit4]   2> 1264593 INFO  (coreLoadExecutor-3735-thread-1) [    ] o.a.s.u.p.UpdateRequestProcessorChain inserting DistributedUpdateProcessorFactory into updateRequestProcessorChain "dedupe"
   [junit4]   2> 1264593 INFO  (coreLoadExecutor-3735-thread-1) [    ] o.a.s.u.p.UpdateRequestProcessorChain creating updateRequestProcessorChain "stored_sig"
   [junit4]   2> 1264593 INFO  (coreLoadExecutor-3735-thread-1) [    ] o.a.s.u.p.UpdateRequestProcessorChain inserting DistributedUpdateProcessorFactory into updateRequestProcessorChain "stored_sig"
   [junit4]   2> 1264593 INFO  (coreLoadExecutor-3735-thread-1) [    ] o.a.s.u.p.UpdateRequestProcessorChain creating updateRequestProcessorChain "distrib-dup-test-chain-explicit"
   [junit4]   2> 1264593 INFO  (coreLoadExecutor-3735-thread-1) [    ] o.a.s.u.p.UpdateRequestProcessorChain creating updateRequestProcessorChain "distrib-dup-test-chain-implicit"
   [junit4]   2> 1264594 INFO  (coreLoadExecutor-3735-thread-1) [    ] o.a.s.u.p.UpdateRequestProcessorChain inserting DistributedUpdateProcessorFactory into updateRequestProcessorChain "distrib-dup-test-chain-implicit"
   [junit4]   2> 1264594 INFO  (coreLoadExecutor-3735-thread-1) [    ] o.a.s.c.SolrCore no updateRequestProcessorChain defined as default, creating implicit default
   [junit4]   2> 1264594 WARN  (coreLoadExecutor-3735-thread-1) [    ] o.a.s.c.RequestHandlers INVALID paramSet a in requestHandler {type = requestHandler,name = /dump,class = DumpRequestHandler,args = {defaults={a=A,b=B}}}
   [junit4]   2> 1264595 INFO  (coreLoadExecutor-3735-thread-1) [    ] o.a.s.h.l.XMLLoader xsltCacheLifetimeSeconds=60
   [junit4]   2> 1264596 INFO  (coreLoadExecutor-3735-thread-1) [    ] o.a.s.h.l.XMLLoader xsltCacheLifetimeSeconds=60
   [junit4]   2> 1264597 INFO  (coreLoadExecutor-3735-thread-1) [    ] o.a.s.h.l.XMLLoader xsltCacheLifetimeSeconds=60
   [junit4]   2> 1264598 INFO  (coreLoadExecutor-3735-thread-1) [    ] o.a.s.h.l.XMLLoader xsltCacheLifetimeSeconds=60
   [junit4]   2> 1264602 INFO  (coreLoadExecutor-3735-thread-1) [    ] o.a.s.c.RequestHandlers Registered paths: /admin/mbeans,standard,/dump,/update/csv,/sql,/update/json/docs,/admin/luke,/export,/admin/segments,/get,/admin/system,/replication,/admin/properties,/config,/stream,/schema,/admin/plugins,/admin/logging,/update/json,/admin/threads,/admin/ping,/update,/admin/file
   [junit4]   2> 1264602 INFO  (coreLoadExecutor-3735-thread-1) [    ] o.a.s.c.SolrCore Using default statsCache cache: org.apache.solr.search.stats.LocalStatsCache
   [junit4]   2> 1264602 INFO  (coreLoadExecutor-3735-thread-1) [    ] o.a.s.u.UpdateHandler Using UpdateLog implementation: org.apache.solr.update.UpdateLog
   [junit4]   2> 1264602 INFO  (coreLoadExecutor-3735-thread-1) [    ] o.a.s.u.UpdateLog Initializing UpdateLog: dataDir= defaultSyncLevel=FLUSH numRecordsToKeep=100 maxNumLogsToKeep=10 numVersionBuckets=65536
   [junit4]   2> 1264603 INFO  (coreLoadExecutor-3735-thread-1) [    ] o.a.s.u.CommitTracker Hard AutoCommit: disabled
   [junit4]   2> 1264603 INFO  (coreLoadExecutor-3735-thread-1) [    ] o.a.s.u.CommitTracker Soft AutoCommit: disabled
   [junit4]   2> 1264604 INFO  (coreLoadExecutor-3735-thread-1) [    ] o.a.s.u.RandomMergePolicy RandomMergePolicy wrapping class org.apache.lucene.index.TieredMergePolicy: [TieredMergePolicy: maxMergeAtOnce=7, maxMergeAtOnceExplicit=7, maxMergedSegmentMB=32.2001953125, floorSegmentMB=1.7021484375, forceMergeDeletesPctAllowed=14.903192181119335, segmentsPerTier=42.0, maxCFSSegmentSizeMB=8.796093022207999E12, noCFSRatio=0.20266580963695313
   [junit4]   2> 1264604 INFO  (coreLoadExecutor-3735-thread-1) [    ] o.a.s.c.SolrDeletionPolicy SolrDeletionPolicy.onInit: commits: num=1
   [junit4]   2> 	commit{dir=MockDirectoryWrapper(RAMDirectory@13b9d0 lockFactory=org.apache.lucene.store.SingleInstanceLockFactory@1facc5d),segFN=segments_1,generation=1}
   [junit4]   2> 1264604 INFO  (coreLoadExecutor-3735-thread-1) [    ] o.a.s.c.SolrDeletionPolicy newest commit generation = 1
   [junit4]   2> 1264604 INFO  (coreLoadExecutor-3735-thread-1) [    ] o.a.s.s.SolrIndexSearcher Opening [Searcher@2c447e[collection1] main]
   [junit4]   2> 1264605 INFO  (coreLoadExecutor-3735-thread-1) [    ] o.a.s.c.c.ZkStateReader Load collection config from: [/collections/collection1]
   [junit4]   2> 1264605 INFO  (coreLoadExecutor-3735-thread-1) [    ] o.a.s.c.c.ZkStateReader path=[/collections/collection1] [configName]=[conf1] specified config exists in ZooKeeper
   [junit4]   2> 1264605 INFO  (coreLoadExecutor-3735-thread-1) [    ] o.a.s.r.ManagedResourceStorage Setting up ZooKeeper-based storage for the RestManager with znodeBase: /configs/conf1
   [junit4]   2> 1264605 INFO  (coreLoadExecutor-3735-thread-1) [    ] o.a.s.r.ManagedResourceStorage Configured ZooKeeperStorageIO with znodeBase: /configs/conf1
   [junit4]   2> 1264605 INFO  (coreLoadExecutor-3735-thread-1) [    ] o.a.s.r.RestManager Initializing RestManager with initArgs: {}
   [junit4]   2> 1264605 INFO  (coreLoadExecutor-3735-thread-1) [    ] o.a.s.r.ManagedResourceStorage Reading _rest_managed.json using ZooKeeperStorageIO:path=/configs/conf1
   [junit4]   2> 1264605 INFO  (coreLoadExecutor-3735-thread-1) [    ] o.a.s.r.ManagedResourceStorage No data found for znode /configs/conf1/_rest_managed.json
   [junit4]   2> 1264605 INFO  (coreLoadExecutor-3735-thread-1) [    ] o.a.s.r.ManagedResourceStorage Loaded null at path _rest_managed.json using ZooKeeperStorageIO:path=/configs/conf1
   [junit4]   2> 1264606 INFO  (coreLoadExecutor-3735-thread-1) [    ] o.a.s.r.RestManager Initializing 0 registered ManagedResources
   [junit4]   2> 1264606 INFO  (coreLoadExecutor-3735-thread-1) [    ] o.a.s.h.ReplicationHandler Commits will be reserved for  10000
   [junit4]   2> 1264606 INFO  (searcherExecutor-3736-thread-1) [    ] o.a.s.c.SolrCore [collection1] Registered new searcher Searcher@2c447e[collection1] main{ExitableDirectoryReader(UninvertingDirectoryReader())}
   [junit4]   2> 1264606 INFO  (coreLoadExecutor-3735-thread-1) [    ] o.a.s.u.UpdateLog Looking up max value of version field to seed version buckets
   [junit4]   2> 1264606 INFO  (coreLoadExecutor-3735-thread-1) [    ] o.a.s.u.VersionInfo Refreshing highest value of _version_ for 65536 version buckets from index
   [junit4]   2> 1264606 INFO  (coreLoadExecutor-3735-thread-1) [    ] o.a.s.u.VersionInfo No terms found for _version_, cannot seed version bucket highest value from index
   [junit4]   2> 1264606 INFO  (coreLoadExecutor-3735-thread-1) [    ] o.a.s.u.UpdateLog Could not find max version in index or recent updates, using new clock 1523196800307036160
   [junit4]   2> 1264608 INFO  (coreLoadExecutor-3735-thread-1) [    ] o.a.s.u.UpdateLog Took 1.0ms to seed version buckets with highest version 1523196800307036160
   [junit4]   2> 1264608 INFO  (coreLoadExecutor-3735-thread-1) [    ] o.a.s.c.ZkController watch zkdir /configs/conf1
   [junit4]   2> 1264609 INFO  (coreLoadExecutor-3735-thread-1) [    ] o.a.s.c.CoreContainer registering core: collection1
   [junit4]   2> 1264609 INFO  (coreZkRegister-3730-thread-1) [    ] o.a.s.c.ZkController Register replica - core:collection1 address:http://127.0.0.1:38156/kaz collection:collection1 shard:shard2
   [junit4]   2> 1264609 INFO  (coreZkRegister-3730-thread-1) [    ] o.a.s.c.c.SolrZkClient makePath: /collections/collection1/leader_elect/shard2/election
   [junit4]   2> 1264611 INFO  (coreZkRegister-3730-thread-1) [    ] o.a.s.c.LeaderElector Joined leadership election with path: /collections/collection1/leader_elect/shard2/election/95199799752589320-core_node1-n_0000000000
   [junit4]   2> 1264611 INFO  (coreZkRegister-3730-thread-1) [    ] o.a.s.c.ShardLeaderElectionContext Running the leader process for shard=shard2 and weAreReplacement=false and leaderVoteWait=10000
   [junit4]   2> 1264612 INFO  (coreZkRegister-3730-thread-1) [    ] o.a.s.c.ShardLeaderElectionContext Enough replicas found to continue.
   [junit4]   2> 1264612 INFO  (coreZkRegister-3730-thread-1) [    ] o.a.s.c.ShardLeaderElectionContext I may be the new leader - try and sync
   [junit4]   2> 1264612 INFO  (coreZkRegister-3730-thread-1) [    ] o.a.s.c.SyncStrategy Sync replicas to http://127.0.0.1:38156/kaz/collection1/
   [junit4]   2> 1264612 INFO  (coreZkRegister-3730-thread-1) [    ] o.a.s.c.SyncStrategy Sync Success - now sync replicas to me
   [junit4]   2> 1264612 INFO  (coreZkRegister-3730-thread-1) [    ] o.a.s.c.SyncStrategy http://127.0.0.1:38156/kaz/collection1/ has no replicas
   [junit4]   2> 1264612 INFO  (OverseerStateUpdate-95199799752589316-127.0.0.1:37334_kaz-n_0000000000) [    ] o.a.s.c.Overseer processMessage: queueSize: 1, message = {
   [junit4]   2>   "operation":"leader",
   [junit4]   2>   "shard":"shard2",
   [junit4]   2>   "collection":"collection1"} current state version: 4
   [junit4]   2> 1264613 INFO  (coreZkRegister-3730-thread-1) [    ] o.a.s.c.c.SolrZkClient makePath: /collections/collection1/leaders/shard2
   [junit4]   2> 1264614 INFO  (coreZkRegister-3730-thread-1) [    ] o.a.s.c.ShardLeaderElectionContextBase Creating leader registration node
   [junit4]   2> 1264615 INFO  (coreZkRegister-3730-thread-1) [    ] o.a.s.c.ShardLeaderElectionContext I am the new leader: http://127.0.0.1:38156/kaz/collection1/ shard2
   [junit4]   2> 1264615 INFO  (OverseerStateUpdate-95199799752589316-127.0.0.1:37334_kaz-n_0000000000) [    ] o.a.s.c.Overseer processMessage: queueSize: 1, message = {
   [junit4]   2>   "operation":"leader",
   [junit4]   2>   "shard":"shard2",
   [junit4]   2>   "collection":"collection1",
   [junit4]   2>   "base_url":"http://127.0.0.1:38156/kaz",
   [junit4]   2>   "core":"collection1",
   [junit4]   2>   "state":"active"} current state version: 4
   [junit4]   2> 1264717 INFO  (zkCallback-1518-thread-2) [    ] o.a.s.c.c.ZkStateReader A cluster state change: [WatchedEvent state:SyncConnected type:NodeDataChanged path:/clusterstate.json], has occurred - updating... (live nodes size: [2])
   [junit4]   2> 1264717 INFO  (zkCallback-1520-thread-1) [    ] o.a.s.c.c.ZkStateReader A cluster state change: [WatchedEvent state:SyncConnected type:NodeDataChanged path:/clusterstate.json], has occurred - updating... (live nodes size: [2])
   [junit4]   2> 1264717 INFO  (zkCallback-1525-thread-1) [    ] o.a.s.c.c.ZkStateReader A cluster state change: [WatchedEvent state:SyncConnected type:NodeDataChanged path:/clusterstate.json], has occurred - updating... (live nodes size: [2])
   [junit4]   2> 1264765 INFO  (coreZkRegister-3730-thread-1) [    ] o.a.s.c.ZkController We are http://127.0.0.1:38156/kaz/collection1/ and leader is http://127.0.0.1:38156/kaz/collection1/
   [junit4]   2> 1264765 INFO  (coreZkRegister-3730-thread-1) [    ] o.a.s.c.ZkController No LogReplay needed for core=collection1 baseURL=http://127.0.0.1:38156/kaz
   [junit4]   2> 1264765 INFO  (coreZkRegister-3730-thread-1) [    ] o.a.s.c.ZkController I am the leader, no recovery necessary
   [junit4]   2> 1264765 INFO  (coreZkRegister-3730-thread-1) [    ] o.a.s.c.ZkController publishing state=active
   [junit4]   2> 1264765 INFO  (coreZkRegister-3730-thread-1) [    ] o.a.s.c.ZkController numShards not found on descriptor - reading it from system property
   [junit4]   2> 1264766 INFO  (OverseerStateUpdate-95199799752589316-127.0.0.1:37334_kaz-n_0000000000) [    ] o.a.s.c.Overseer processMessage: queueSize: 1, message = {
   [junit4]   2>   "core":"collection1",
   [junit4]   2>   "core_node_name":"core_node1",
   [junit4]   2>   "roles":null,
   [junit4]   2>   "base_url":"http://127.0.0.1:38156/kaz",
   [junit4]   2>   "node_name":"127.0.0.1:38156_kaz",
   [junit4]   2>   "numShards":"2",
   [junit4]   2>   "state":"active",
   [junit4]   2>   "shard":"shard2",
   [junit4]   2>   "collection":"collection1",
   [junit4]   2>   "operation":"state"} current state version: 5
   [junit4]   2> 1264767 INFO  (OverseerStateUpdate-95199799752589316-127.0.0.1:37334_kaz-n_0000000000) [    ] o.a.s.c.o.ReplicaMutator Update state numShards=2 message={
   [junit4]   2>   "core":"collection1",
   [junit4]   2>   "core_node_name":"core_node1",
   [junit4]   2>   "roles":null,
   [junit4]   2>   "base_url":"http://127.0.0.1:38156/kaz",
   [junit4]   2>   "node_name":"127.0.0.1:38156_kaz",
   [junit4]   2>   "numShards":"2",
   [junit4]   2>   "state":"active",
   [junit4]   2>   "shard":"shard2",
   [j

[...truncated too long message...]

collection1",
   [junit4]    >             "base_url":"http://127.0.0.1:38156/kaz",
   [junit4]    >             "node_name":"127.0.0.1:38156_kaz",
   [junit4]    >             "state":"active",
   [junit4]    >             "leader":"true"},
   [junit4]    >           "core_node3":{
   [junit4]    >             "core":"collection1",
   [junit4]    >             "base_url":"http://127.0.0.1:46552/kaz",
   [junit4]    >             "node_name":"127.0.0.1:46552_kaz",
   [junit4]    >             "state":"active"}}}},
   [junit4]    >     "router":{"name":"compositeId"},
   [junit4]    >     "maxShardsPerNode":"1",
   [junit4]    >     "autoAddReplicas":"false",
   [junit4]    >     "autoCreated":"true"},
   [junit4]    >   "control_collection":{
   [junit4]    >     "replicationFactor":"1",
   [junit4]    >     "shards":{"shard1":{
   [junit4]    >         "range":"80000000-7fffffff",
   [junit4]    >         "state":"active",
   [junit4]    >         "replicas":{"core_node1":{
   [junit4]    >             "core":"collection1",
   [junit4]    >             "base_url":"http://127.0.0.1:37334/kaz",
   [junit4]    >             "node_name":"127.0.0.1:37334_kaz",
   [junit4]    >             "state":"active",
   [junit4]    >             "leader":"true"}}}},
   [junit4]    >     "router":{"name":"compositeId"},
   [junit4]    >     "maxShardsPerNode":"1",
   [junit4]    >     "autoAddReplicas":"false",
   [junit4]    >     "autoCreated":"true"},
   [junit4]    >   "c8n_1x2":{
   [junit4]    >     "replicationFactor":"2",
   [junit4]    >     "shards":{"shard1":{
   [junit4]    >         "range":"80000000-7fffffff",
   [junit4]    >         "state":"active",
   [junit4]    >         "replicas":{
   [junit4]    >           "core_node1":{
   [junit4]    >             "core":"c8n_1x2_shard1_replica2",
   [junit4]    >             "base_url":"http://127.0.0.1:46552/kaz",
   [junit4]    >             "node_name":"127.0.0.1:46552_kaz",
   [junit4]    >             "state":"active",
   [junit4]    >             "leader":"true"},
   [junit4]    >           "core_node2":{
   [junit4]    >             "core":"c8n_1x2_shard1_replica1",
   [junit4]    >             "base_url":"http://127.0.0.1:37334/kaz",
   [junit4]    >             "node_name":"127.0.0.1:37334_kaz",
   [junit4]    >             "state":"recovering"}}}},
   [junit4]    >     "router":{"name":"compositeId"},
   [junit4]    >     "maxShardsPerNode":"1",
   [junit4]    >     "autoAddReplicas":"false"},
   [junit4]    >   "collMinRf_1x3":{
   [junit4]    >     "replicationFactor":"3",
   [junit4]    >     "shards":{"shard1":{
   [junit4]    >         "range":"80000000-7fffffff",
   [junit4]    >         "state":"active",
   [junit4]    >         "replicas":{
   [junit4]    >           "core_node1":{
   [junit4]    >             "core":"collMinRf_1x3_shard1_replica1",
   [junit4]    >             "base_url":"http://127.0.0.1:46552/kaz",
   [junit4]    >             "node_name":"127.0.0.1:46552_kaz",
   [junit4]    >             "state":"active"},
   [junit4]    >           "core_node2":{
   [junit4]    >             "core":"collMinRf_1x3_shard1_replica3",
   [junit4]    >             "base_url":"http://127.0.0.1:37334/kaz",
   [junit4]    >             "node_name":"127.0.0.1:37334_kaz",
   [junit4]    >             "state":"active"},
   [junit4]    >           "core_node3":{
   [junit4]    >             "core":"collMinRf_1x3_shard1_replica2",
   [junit4]    >             "base_url":"http://127.0.0.1:40091/kaz",
   [junit4]    >             "node_name":"127.0.0.1:40091_kaz",
   [junit4]    >             "state":"active",
   [junit4]    >             "leader":"true"}}}},
   [junit4]    >     "router":{"name":"compositeId"},
   [junit4]    >     "maxShardsPerNode":"1",
   [junit4]    >     "autoAddReplicas":"false"}}
   [junit4]    > 	at __randomizedtesting.SeedInfo.seed([55A3FF52B71EECCA:DDF7C08819E28132]:0)
   [junit4]    > 	at org.apache.solr.cloud.AbstractFullDistribZkTestBase.ensureAllReplicasAreActive(AbstractFullDistribZkTestBase.java:1864)
   [junit4]    > 	at org.apache.solr.cloud.HttpPartitionTest.testRf2(HttpPartitionTest.java:349)
   [junit4]    > 	at org.apache.solr.cloud.HttpPartitionTest.test(HttpPartitionTest.java:109)
   [junit4]    > 	at org.apache.solr.BaseDistributedSearchTestCase$ShardsRepeatRule$ShardsFixedStatement.callStatement(BaseDistributedSearchTestCase.java:965)
   [junit4]    > 	at org.apache.solr.BaseDistributedSearchTestCase$ShardsRepeatRule$ShardsStatement.evaluate(BaseDistributedSearchTestCase.java:940)
   [junit4]    > 	at java.lang.Thread.run(Thread.java:747)
   [junit4]   2> 1400017 INFO  (SUITE-HttpPartitionTest-seed#[55A3FF52B71EECCA]-worker) [    ] o.a.s.SolrTestCaseJ4 ###deleteCore
   [junit4]   2> NOTE: leaving temporary files on disk at: /home/jenkins/workspace/Lucene-Solr-trunk-Linux/solr/build/solr-core/test/J1/temp/solr.cloud.HttpPartitionTest_55A3FF52B71EECCA-001
   [junit4]   2> Jan 12, 2016 9:23:22 PM com.carrotsearch.randomizedtesting.ThreadLeakControl checkThreadLeaks
   [junit4]   2> WARNING: Will linger awaiting termination of 1 leaked thread(s).
   [junit4]   2> NOTE: test params are: codec=Asserting(Lucene60): {range_facet_l_dv=PostingsFormat(name=LuceneVarGapDocFreqInterval), _version_=PostingsFormat(name=Memory doPackFST= false), multiDefault=Lucene50(blocksize=128), a_t=Lucene50(blocksize=128), intDefault=PostingsFormat(name=Memory doPackFST= false), id=PostingsFormat(name=LuceneVarGapDocFreqInterval), range_facet_i_dv=Lucene50(blocksize=128), text=PostingsFormat(name=LuceneFixedGap), range_facet_l=Lucene50(blocksize=128), timestamp=Lucene50(blocksize=128)}, docValues:{range_facet_l_dv=DocValuesFormat(name=Memory), range_facet_i_dv=DocValuesFormat(name=Lucene54), timestamp=DocValuesFormat(name=Lucene54)}, sim=RandomSimilarityProvider(queryNorm=false,coord=no): {}, locale=zh, timezone=Asia/Vladivostok
   [junit4]   2> NOTE: Linux 3.19.0-42-generic i386/Oracle Corporation 9-ea (32-bit)/cpus=12,threads=1,free=105489512,total=518979584
   [junit4]   2> NOTE: All tests run in this JVM: [SoftAutoCommitTest, AnalyticsMergeStrategyTest, TestCursorMarkWithoutUniqueKey, NumericFieldsTest, CdcrReplicationHandlerTest, DistributedExpandComponentTest, TermVectorComponentTest, TestDFRSimilarityFactory, HdfsBasicDistributedZk2Test, DocValuesTest, TestFieldTypeResource, ClusterStateUpdateTest, TestBlendedInfixSuggestions, TestLFUCache, TestSolrDynamicMBean, ConnectionManagerTest, DistributedFacetPivotSmallAdvancedTest, SpellCheckComponentTest, TestReqParamsAPI, TestEmbeddedSolrServerConstructors, TestBinaryResponseWriter, MinimalSchemaTest, OutOfBoxZkACLAndCredentialsProvidersTest, TestManagedResource, TestQueryUtils, SpellPossibilityIteratorTest, TestObjectReleaseTracker, BigEndianAscendingWordDeserializerTest, SortByFunctionTest, TestMiniSolrCloudClusterBase, TestQuerySenderListener, DistributedMLTComponentTest, TestFilteredDocIdSet, TestHdfsUpdateLog, OpenExchangeRatesOrgProviderTest, TestLeaderElectionZkExpiry, TestCloudSchemaless, RestartWhileUpdatingTest, TestUniqueKeyFieldResource, CollectionsAPIDistributedZkTest, TestBulkSchemaConcurrent, TestFieldCollectionResource, TestQueryTypes, IndexBasedSpellCheckerTest, TestHashPartitioner, BadCopyFieldTest, DeleteLastCustomShardedReplicaTest, TestConfigSetsAPIExclusivity, DistributedQueryComponentCustomSortTest, SolrPluginUtilsTest, SpatialFilterTest, SpellingQueryConverterTest, TestChildDocTransformer, MergeStrategyTest, TermsComponentTest, WordBreakSolrSpellCheckerTest, TestSurroundQueryParser, TestManagedSchemaFieldTypeResource, TestSystemIdResolver, TestReloadDeadlock, TestSolrCloudWithKerberosAlt, TestConfigOverlay, ShardRoutingCustomTest, DOMUtilTest, TestRawTransformer, CSVRequestHandlerTest, AtomicUpdatesTest, DistanceFunctionTest, SuggestComponentTest, TestSortByMinMaxFunction, TestRandomMergePolicy, MultiTermTest, DistribCursorPagingTest, DistributedIntervalFacetingTest, SolrCmdDistributorTest, TestDefaultSearchFieldResource, SchemaVersionSpecificBehaviorTest, TestPivotHelperCode, TestNamedUpdateProcessors, ShardRoutingTest, TestRequestForwarding, CollectionReloadTest, TestLMJelinekMercerSimilarityFactory, BlockJoinFacetRandomTest, DistributedTermsComponentTest, TestComplexPhraseQParserPlugin, DistributedQueueTest, TestAddFieldRealTimeGet, LoggingHandlerTest, AddBlockUpdateTest, TestSolrConfigHandlerCloud, BasicDistributedZkTest, ChaosMonkeySafeLeaderTest, BasicDistributedZk2Test, SyncSliceTest, BasicZkTest, TestRandomFaceting, LeaderElectionTest, ZkCLITest, TestDistributedSearch, ConnectionReuseTest, CollectionTooManyReplicasTest, HttpPartitionTest]
   [junit4] Completed [444/576 (1!)] on J1 in 140.02s, 1 test, 1 failure <<< FAILURES!

[...truncated 426 lines...]
BUILD FAILED
/home/jenkins/workspace/Lucene-Solr-trunk-Linux/build.xml:784: The following error occurred while executing this line:
/home/jenkins/workspace/Lucene-Solr-trunk-Linux/build.xml:728: The following error occurred while executing this line:
/home/jenkins/workspace/Lucene-Solr-trunk-Linux/build.xml:59: The following error occurred while executing this line:
/home/jenkins/workspace/Lucene-Solr-trunk-Linux/solr/build.xml:233: The following error occurred while executing this line:
/home/jenkins/workspace/Lucene-Solr-trunk-Linux/solr/common-build.xml:522: The following error occurred while executing this line:
/home/jenkins/workspace/Lucene-Solr-trunk-Linux/lucene/common-build.xml:1424: The following error occurred while executing this line:
/home/jenkins/workspace/Lucene-Solr-trunk-Linux/lucene/common-build.xml:981: There were test failures: 576 suites (8 ignored), 2305 tests, 1 failure, 115 ignored (70 assumptions) [seed: 55A3FF52B71EECCA]

Total time: 51 minutes 41 seconds
Build step 'Invoke Ant' marked build as failure
Archiving artifacts
[WARNINGS] Skipping publisher since build result is FAILURE
Recording test results
Email was triggered for: Failure - Any
Sending email for trigger: Failure - Any



Mime
View raw message