lucene-dev mailing list archives

Site index · List index
Message view « Date » · « Thread »
Top « Date » · « Thread »
From Policeman Jenkins Server <jenk...@thetaphi.de>
Subject [JENKINS-EA] Lucene-Solr-trunk-Linux (64bit/jdk-9-ea+102) - Build # 15720 - Failure!
Date Sun, 31 Jan 2016 19:26:46 GMT
Build: http://jenkins.thetaphi.de/job/Lucene-Solr-trunk-Linux/15720/
Java: 64bit/jdk-9-ea+102 -XX:-UseCompressedOops -XX:+UseParallelGC -XX:-CompactStrings

1 tests failed.
FAILED:  org.apache.solr.handler.PingRequestHandlerTest.testPingInClusterWithNoHealthCheck

Error Message:
No live SolrServers available to handle this request:[http://127.0.0.1:40454/solr/testSolrCloudCollection]

Stack Trace:
org.apache.solr.client.solrj.SolrServerException: No live SolrServers available to handle this request:[http://127.0.0.1:40454/solr/testSolrCloudCollection]
	at __randomizedtesting.SeedInfo.seed([81CBBD914B3EF598:6F180341CED2CF7C]:0)
	at org.apache.solr.client.solrj.impl.LBHttpSolrClient.request(LBHttpSolrClient.java:352)
	at org.apache.solr.client.solrj.impl.CloudSolrClient.sendRequest(CloudSolrClient.java:1100)
	at org.apache.solr.client.solrj.impl.CloudSolrClient.requestWithRetryOnStaleState(CloudSolrClient.java:871)
	at org.apache.solr.client.solrj.impl.CloudSolrClient.request(CloudSolrClient.java:807)
	at org.apache.solr.client.solrj.SolrRequest.process(SolrRequest.java:150)
	at org.apache.solr.handler.PingRequestHandlerTest.testPingInClusterWithNoHealthCheck(PingRequestHandlerTest.java:200)
	at sun.reflect.NativeMethodAccessorImpl.invoke0(Native Method)
	at sun.reflect.NativeMethodAccessorImpl.invoke(NativeMethodAccessorImpl.java:62)
	at sun.reflect.DelegatingMethodAccessorImpl.invoke(DelegatingMethodAccessorImpl.java:43)
	at java.lang.reflect.Method.invoke(Method.java:520)
	at com.carrotsearch.randomizedtesting.RandomizedRunner.invoke(RandomizedRunner.java:1764)
	at com.carrotsearch.randomizedtesting.RandomizedRunner$8.evaluate(RandomizedRunner.java:871)
	at com.carrotsearch.randomizedtesting.RandomizedRunner$9.evaluate(RandomizedRunner.java:907)
	at com.carrotsearch.randomizedtesting.RandomizedRunner$10.evaluate(RandomizedRunner.java:921)
	at com.carrotsearch.randomizedtesting.rules.SystemPropertiesRestoreRule$1.evaluate(SystemPropertiesRestoreRule.java:57)
	at org.apache.lucene.util.TestRuleSetupTeardownChained$1.evaluate(TestRuleSetupTeardownChained.java:50)
	at org.apache.lucene.util.AbstractBeforeAfterRule$1.evaluate(AbstractBeforeAfterRule.java:46)
	at org.apache.lucene.util.TestRuleThreadAndTestName$1.evaluate(TestRuleThreadAndTestName.java:49)
	at org.apache.lucene.util.TestRuleIgnoreAfterMaxFailures$1.evaluate(TestRuleIgnoreAfterMaxFailures.java:65)
	at org.apache.lucene.util.TestRuleMarkFailure$1.evaluate(TestRuleMarkFailure.java:48)
	at com.carrotsearch.randomizedtesting.rules.StatementAdapter.evaluate(StatementAdapter.java:36)
	at com.carrotsearch.randomizedtesting.ThreadLeakControl$StatementRunner.run(ThreadLeakControl.java:367)
	at com.carrotsearch.randomizedtesting.ThreadLeakControl.forkTimeoutingTask(ThreadLeakControl.java:809)
	at com.carrotsearch.randomizedtesting.ThreadLeakControl$3.evaluate(ThreadLeakControl.java:460)
	at com.carrotsearch.randomizedtesting.RandomizedRunner.runSingleTest(RandomizedRunner.java:880)
	at com.carrotsearch.randomizedtesting.RandomizedRunner$5.evaluate(RandomizedRunner.java:781)
	at com.carrotsearch.randomizedtesting.RandomizedRunner$6.evaluate(RandomizedRunner.java:816)
	at com.carrotsearch.randomizedtesting.RandomizedRunner$7.evaluate(RandomizedRunner.java:827)
	at com.carrotsearch.randomizedtesting.rules.StatementAdapter.evaluate(StatementAdapter.java:36)
	at com.carrotsearch.randomizedtesting.rules.SystemPropertiesRestoreRule$1.evaluate(SystemPropertiesRestoreRule.java:57)
	at org.apache.lucene.util.AbstractBeforeAfterRule$1.evaluate(AbstractBeforeAfterRule.java:46)
	at com.carrotsearch.randomizedtesting.rules.StatementAdapter.evaluate(StatementAdapter.java:36)
	at org.apache.lucene.util.TestRuleStoreClassName$1.evaluate(TestRuleStoreClassName.java:42)
	at com.carrotsearch.randomizedtesting.rules.NoShadowingOrOverridesOnMethodsRule$1.evaluate(NoShadowingOrOverridesOnMethodsRule.java:40)
	at com.carrotsearch.randomizedtesting.rules.NoShadowingOrOverridesOnMethodsRule$1.evaluate(NoShadowingOrOverridesOnMethodsRule.java:40)
	at com.carrotsearch.randomizedtesting.rules.StatementAdapter.evaluate(StatementAdapter.java:36)
	at com.carrotsearch.randomizedtesting.rules.StatementAdapter.evaluate(StatementAdapter.java:36)
	at com.carrotsearch.randomizedtesting.rules.StatementAdapter.evaluate(StatementAdapter.java:36)
	at org.apache.lucene.util.TestRuleAssertionsRequired$1.evaluate(TestRuleAssertionsRequired.java:54)
	at org.apache.lucene.util.TestRuleMarkFailure$1.evaluate(TestRuleMarkFailure.java:48)
	at org.apache.lucene.util.TestRuleIgnoreAfterMaxFailures$1.evaluate(TestRuleIgnoreAfterMaxFailures.java:65)
	at org.apache.lucene.util.TestRuleIgnoreTestSuites$1.evaluate(TestRuleIgnoreTestSuites.java:55)
	at com.carrotsearch.randomizedtesting.rules.StatementAdapter.evaluate(StatementAdapter.java:36)
	at com.carrotsearch.randomizedtesting.ThreadLeakControl$StatementRunner.run(ThreadLeakControl.java:367)
	at java.lang.Thread.run(Thread.java:804)
Caused by: org.apache.solr.client.solrj.impl.HttpSolrClient$RemoteSolrException: Error from server at http://127.0.0.1:40454/solr/testSolrCloudCollection: Ping query caused exception: no servers hosting shard: shard1
	at org.apache.solr.client.solrj.impl.HttpSolrClient.executeMethod(HttpSolrClient.java:576)
	at org.apache.solr.client.solrj.impl.HttpSolrClient.request(HttpSolrClient.java:240)
	at org.apache.solr.client.solrj.impl.HttpSolrClient.request(HttpSolrClient.java:229)
	at org.apache.solr.client.solrj.impl.LBHttpSolrClient.doRequest(LBHttpSolrClient.java:372)
	at org.apache.solr.client.solrj.impl.LBHttpSolrClient.request(LBHttpSolrClient.java:325)
	... 44 more




Build Log:
[...truncated 11365 lines...]
   [junit4] Suite: org.apache.solr.handler.PingRequestHandlerTest
   [junit4]   2> Creating dataDir: /home/jenkins/workspace/Lucene-Solr-trunk-Linux/solr/build/solr-core/test/J0/temp/solr.handler.PingRequestHandlerTest_81CBBD914B3EF598-001/init-core-data-001
   [junit4]   2> 956792 INFO  (SUITE-PingRequestHandlerTest-seed#[81CBBD914B3EF598]-worker) [    ] o.a.s.SolrTestCaseJ4 Randomized ssl (false) and clientAuth (false)
   [junit4]   2> 956793 INFO  (SUITE-PingRequestHandlerTest-seed#[81CBBD914B3EF598]-worker) [    ] o.a.s.SolrTestCaseJ4 ####initCore
   [junit4]   2> 956793 INFO  (SUITE-PingRequestHandlerTest-seed#[81CBBD914B3EF598]-worker) [    ] o.a.s.c.SolrResourceLoader new SolrResourceLoader for directory: '/home/jenkins/workspace/Lucene-Solr-trunk-Linux/solr/core/src/test-files/solr/collection1'
   [junit4]   2> 956793 INFO  (SUITE-PingRequestHandlerTest-seed#[81CBBD914B3EF598]-worker) [    ] o.a.s.c.SolrResourceLoader JNDI not configured for solr (NoInitialContextEx)
   [junit4]   2> 956793 INFO  (SUITE-PingRequestHandlerTest-seed#[81CBBD914B3EF598]-worker) [    ] o.a.s.c.SolrResourceLoader using system property solr.solr.home: /home/jenkins/workspace/Lucene-Solr-trunk-Linux/solr/core/src/test-files/solr
   [junit4]   2> 956793 INFO  (SUITE-PingRequestHandlerTest-seed#[81CBBD914B3EF598]-worker) [    ] o.a.s.c.SolrResourceLoader Adding 'file:/home/jenkins/workspace/Lucene-Solr-trunk-Linux/solr/core/src/test-files/solr/collection1/lib/classes/' to classloader
   [junit4]   2> 956793 INFO  (SUITE-PingRequestHandlerTest-seed#[81CBBD914B3EF598]-worker) [    ] o.a.s.c.SolrResourceLoader Adding 'file:/home/jenkins/workspace/Lucene-Solr-trunk-Linux/solr/core/src/test-files/solr/collection1/lib/README' to classloader
   [junit4]   2> 956807 INFO  (SUITE-PingRequestHandlerTest-seed#[81CBBD914B3EF598]-worker) [    ] o.a.s.c.SolrConfig current version of requestparams : -1
   [junit4]   2> 956824 INFO  (SUITE-PingRequestHandlerTest-seed#[81CBBD914B3EF598]-worker) [    ] o.a.s.c.SolrConfig Using Lucene MatchVersion: 6.0.0
   [junit4]   2> 956838 INFO  (SUITE-PingRequestHandlerTest-seed#[81CBBD914B3EF598]-worker) [    ] o.a.s.c.SolrConfig Loaded SolrConfig: solrconfig.xml
   [junit4]   2> 956842 INFO  (SUITE-PingRequestHandlerTest-seed#[81CBBD914B3EF598]-worker) [    ] o.a.s.s.IndexSchema [null] Schema name=test
   [junit4]   2> 956914 INFO  (SUITE-PingRequestHandlerTest-seed#[81CBBD914B3EF598]-worker) [    ] o.a.s.s.OpenExchangeRatesOrgProvider Initialized with rates=open-exchange-rates.json, refreshInterval=1440.
   [junit4]   2> 956919 INFO  (SUITE-PingRequestHandlerTest-seed#[81CBBD914B3EF598]-worker) [    ] o.a.s.s.IndexSchema default search field in schema is text
   [junit4]   2> 956920 INFO  (SUITE-PingRequestHandlerTest-seed#[81CBBD914B3EF598]-worker) [    ] o.a.s.s.IndexSchema unique key field: id
   [junit4]   2> 956924 INFO  (SUITE-PingRequestHandlerTest-seed#[81CBBD914B3EF598]-worker) [    ] o.a.s.s.FileExchangeRateProvider Reloading exchange rates from file currency.xml
   [junit4]   2> 956925 INFO  (SUITE-PingRequestHandlerTest-seed#[81CBBD914B3EF598]-worker) [    ] o.a.s.s.FileExchangeRateProvider Reloading exchange rates from file currency.xml
   [junit4]   2> 956926 INFO  (SUITE-PingRequestHandlerTest-seed#[81CBBD914B3EF598]-worker) [    ] o.a.s.s.OpenExchangeRatesOrgProvider Reloading exchange rates from open-exchange-rates.json
   [junit4]   2> 956926 INFO  (SUITE-PingRequestHandlerTest-seed#[81CBBD914B3EF598]-worker) [    ] o.a.s.s.OpenExchangeRatesOrgProvider Reloading exchange rates from open-exchange-rates.json
   [junit4]   2> 956926 INFO  (SUITE-PingRequestHandlerTest-seed#[81CBBD914B3EF598]-worker) [    ] o.a.s.c.SolrResourceLoader JNDI not configured for solr (NoInitialContextEx)
   [junit4]   2> 956927 INFO  (SUITE-PingRequestHandlerTest-seed#[81CBBD914B3EF598]-worker) [    ] o.a.s.c.SolrResourceLoader using system property solr.solr.home: /home/jenkins/workspace/Lucene-Solr-trunk-Linux/solr/core/src/test-files/solr
   [junit4]   2> 956927 INFO  (SUITE-PingRequestHandlerTest-seed#[81CBBD914B3EF598]-worker) [    ] o.a.s.c.SolrResourceLoader new SolrResourceLoader for directory: '/home/jenkins/workspace/Lucene-Solr-trunk-Linux/solr/core/src/test-files/solr'
   [junit4]   2> 956927 INFO  (SUITE-PingRequestHandlerTest-seed#[81CBBD914B3EF598]-worker) [    ] o.a.s.c.SolrResourceLoader JNDI not configured for solr (NoInitialContextEx)
   [junit4]   2> 956927 INFO  (SUITE-PingRequestHandlerTest-seed#[81CBBD914B3EF598]-worker) [    ] o.a.s.c.SolrResourceLoader using system property solr.solr.home: /home/jenkins/workspace/Lucene-Solr-trunk-Linux/solr/core/src/test-files/solr
   [junit4]   2> 956927 INFO  (SUITE-PingRequestHandlerTest-seed#[81CBBD914B3EF598]-worker) [    ] o.a.s.c.CoreContainer New CoreContainer 225640179
   [junit4]   2> 956927 INFO  (SUITE-PingRequestHandlerTest-seed#[81CBBD914B3EF598]-worker) [    ] o.a.s.c.CoreContainer Loading cores into CoreContainer [instanceDir=/home/jenkins/workspace/Lucene-Solr-trunk-Linux/solr/core/src/test-files/solr]
   [junit4]   2> 956927 WARN  (SUITE-PingRequestHandlerTest-seed#[81CBBD914B3EF598]-worker) [    ] o.a.s.c.CoreContainer Couldn't add files from /home/jenkins/workspace/Lucene-Solr-trunk-Linux/solr/core/src/test-files/solr/lib to classpath: /home/jenkins/workspace/Lucene-Solr-trunk-Linux/solr/core/src/test-files/solr/lib
   [junit4]   2> 956927 INFO  (SUITE-PingRequestHandlerTest-seed#[81CBBD914B3EF598]-worker) [    ] o.a.s.h.c.HttpShardHandlerFactory created with socketTimeout : 600000,connTimeout : 60000,maxConnectionsPerHost : 20,maxConnections : 10000,corePoolSize : 0,maximumPoolSize : 2147483647,maxThreadIdleTime : 5,sizeOfQueue : -1,fairnessPolicy : false,useRetries : false,
   [junit4]   2> 956932 INFO  (SUITE-PingRequestHandlerTest-seed#[81CBBD914B3EF598]-worker) [    ] o.a.s.u.UpdateShardHandler Creating UpdateShardHandler HTTP client with params: socketTimeout=30000&connTimeout=30000&retry=true
   [junit4]   2> 956933 INFO  (SUITE-PingRequestHandlerTest-seed#[81CBBD914B3EF598]-worker) [    ] o.a.s.l.LogWatcher SLF4J impl is org.slf4j.impl.Log4jLoggerFactory
   [junit4]   2> 956933 INFO  (SUITE-PingRequestHandlerTest-seed#[81CBBD914B3EF598]-worker) [    ] o.a.s.l.LogWatcher Registering Log Listener [Log4j (org.slf4j.impl.Log4jLoggerFactory)]
   [junit4]   2> 956933 INFO  (SUITE-PingRequestHandlerTest-seed#[81CBBD914B3EF598]-worker) [    ] o.a.s.c.CoreContainer Security conf doesn't exist. Skipping setup for authorization module.
   [junit4]   2> 956933 INFO  (SUITE-PingRequestHandlerTest-seed#[81CBBD914B3EF598]-worker) [    ] o.a.s.c.CoreContainer No authentication plugin used.
   [junit4]   2> 956933 INFO  (SUITE-PingRequestHandlerTest-seed#[81CBBD914B3EF598]-worker) [    ] o.a.s.c.CoreDescriptor Created CoreDescriptor: {name=collection1, config=solrconfig.xml, transient=false, schema=schema.xml, loadOnStartup=true, configSetProperties=configsetprops.json, collection=collection1, dataDir=/home/jenkins/workspace/Lucene-Solr-trunk-Linux/solr/build/solr-core/test/J0/temp/solr.handler.PingRequestHandlerTest_81CBBD914B3EF598-001/init-core-data-001, shard=shard1}
   [junit4]   2> 956934 INFO  (coreLoadExecutor-4417-thread-1) [    ] o.a.s.c.SolrResourceLoader new SolrResourceLoader for directory: '/home/jenkins/workspace/Lucene-Solr-trunk-Linux/solr/core/src/test-files/solr/collection1'
   [junit4]   2> 956934 INFO  (coreLoadExecutor-4417-thread-1) [    ] o.a.s.c.SolrResourceLoader JNDI not configured for solr (NoInitialContextEx)
   [junit4]   2> 956934 INFO  (coreLoadExecutor-4417-thread-1) [    ] o.a.s.c.SolrResourceLoader using system property solr.solr.home: /home/jenkins/workspace/Lucene-Solr-trunk-Linux/solr/core/src/test-files/solr
   [junit4]   2> 956934 INFO  (coreLoadExecutor-4417-thread-1) [    ] o.a.s.c.SolrResourceLoader Adding 'file:/home/jenkins/workspace/Lucene-Solr-trunk-Linux/solr/core/src/test-files/solr/collection1/lib/classes/' to classloader
   [junit4]   2> 956934 INFO  (coreLoadExecutor-4417-thread-1) [    ] o.a.s.c.SolrResourceLoader Adding 'file:/home/jenkins/workspace/Lucene-Solr-trunk-Linux/solr/core/src/test-files/solr/collection1/lib/README' to classloader
   [junit4]   2> 956952 INFO  (coreLoadExecutor-4417-thread-1) [    ] o.a.s.c.SolrConfig current version of requestparams : -1
   [junit4]   2> 956959 INFO  (coreLoadExecutor-4417-thread-1) [    ] o.a.s.c.SolrConfig Using Lucene MatchVersion: 6.0.0
   [junit4]   2> 956977 INFO  (coreLoadExecutor-4417-thread-1) [    ] o.a.s.c.SolrConfig Loaded SolrConfig: solrconfig.xml
   [junit4]   2> 956981 INFO  (coreLoadExecutor-4417-thread-1) [    ] o.a.s.s.IndexSchema [collection1] Schema name=test
   [junit4]   2> 957068 INFO  (coreLoadExecutor-4417-thread-1) [    ] o.a.s.s.OpenExchangeRatesOrgProvider Initialized with rates=open-exchange-rates.json, refreshInterval=1440.
   [junit4]   2> 957072 INFO  (coreLoadExecutor-4417-thread-1) [    ] o.a.s.s.IndexSchema default search field in schema is text
   [junit4]   2> 957073 INFO  (coreLoadExecutor-4417-thread-1) [    ] o.a.s.s.IndexSchema unique key field: id
   [junit4]   2> 957075 INFO  (coreLoadExecutor-4417-thread-1) [    ] o.a.s.s.FileExchangeRateProvider Reloading exchange rates from file currency.xml
   [junit4]   2> 957076 INFO  (coreLoadExecutor-4417-thread-1) [    ] o.a.s.s.FileExchangeRateProvider Reloading exchange rates from file currency.xml
   [junit4]   2> 957077 INFO  (coreLoadExecutor-4417-thread-1) [    ] o.a.s.s.OpenExchangeRatesOrgProvider Reloading exchange rates from open-exchange-rates.json
   [junit4]   2> 957077 INFO  (coreLoadExecutor-4417-thread-1) [    ] o.a.s.s.OpenExchangeRatesOrgProvider Reloading exchange rates from open-exchange-rates.json
   [junit4]   2> 957078 INFO  (coreLoadExecutor-4417-thread-1) [    ] o.a.s.c.ConfigSetProperties Did not find ConfigSet properties, assuming default properties: Can't find resource 'configsetprops.json' in classpath or '/home/jenkins/workspace/Lucene-Solr-trunk-Linux/solr/core/src/test-files/solr/collection1'
   [junit4]   2> 957078 INFO  (coreLoadExecutor-4417-thread-1) [    ] o.a.s.c.CoreContainer Creating SolrCore 'collection1' using configuration from instancedir /home/jenkins/workspace/Lucene-Solr-trunk-Linux/solr/core/src/test-files/solr/collection1
   [junit4]   2> 957079 INFO  (coreLoadExecutor-4417-thread-1) [    ] o.a.s.c.SolrCore org.apache.solr.core.MockDirectoryFactory
   [junit4]   2> 957079 INFO  (coreLoadExecutor-4417-thread-1) [    ] o.a.s.c.SolrCore [[collection1] ] Opening new SolrCore at [/home/jenkins/workspace/Lucene-Solr-trunk-Linux/solr/core/src/test-files/solr/collection1], dataDir=[/home/jenkins/workspace/Lucene-Solr-trunk-Linux/solr/build/solr-core/test/J0/temp/solr.handler.PingRequestHandlerTest_81CBBD914B3EF598-001/init-core-data-001/]
   [junit4]   2> 957079 INFO  (coreLoadExecutor-4417-thread-1) [    ] o.a.s.c.JmxMonitoredMap JMX monitoring is enabled. Adding Solr mbeans to JMX Server: com.sun.jmx.mbeanserver.JmxMBeanServer@2be29402
   [junit4]   2> 957079 INFO  (coreLoadExecutor-4417-thread-1) [    ] o.a.s.c.CachingDirectoryFactory return new directory for /home/jenkins/workspace/Lucene-Solr-trunk-Linux/solr/build/solr-core/test/J0/temp/solr.handler.PingRequestHandlerTest_81CBBD914B3EF598-001/init-core-data-001
   [junit4]   2> 957079 INFO  (coreLoadExecutor-4417-thread-1) [    ] o.a.s.c.SolrCore New index directory detected: old=null new=/home/jenkins/workspace/Lucene-Solr-trunk-Linux/solr/build/solr-core/test/J0/temp/solr.handler.PingRequestHandlerTest_81CBBD914B3EF598-001/init-core-data-001/index/
   [junit4]   2> 957079 WARN  (coreLoadExecutor-4417-thread-1) [    ] o.a.s.c.SolrCore [collection1] Solr index directory '/home/jenkins/workspace/Lucene-Solr-trunk-Linux/solr/build/solr-core/test/J0/temp/solr.handler.PingRequestHandlerTest_81CBBD914B3EF598-001/init-core-data-001/index' doesn't exist. Creating new index...
   [junit4]   2> 957079 INFO  (coreLoadExecutor-4417-thread-1) [    ] o.a.s.c.CachingDirectoryFactory return new directory for /home/jenkins/workspace/Lucene-Solr-trunk-Linux/solr/build/solr-core/test/J0/temp/solr.handler.PingRequestHandlerTest_81CBBD914B3EF598-001/init-core-data-001/index
   [junit4]   2> 957080 INFO  (coreLoadExecutor-4417-thread-1) [    ] o.a.s.u.RandomMergePolicy RandomMergePolicy wrapping class org.apache.lucene.index.AlcoholicMergePolicy: [AlcoholicMergePolicy: minMergeSize=0, mergeFactor=10, maxMergeSize=2132084136, maxMergeSizeForForcedMerge=9223372036854775807, calibrateSizeByDeletes=true, maxMergeDocs=2147483647, maxCFSSegmentSizeMB=8.796093022207999E12, noCFSRatio=0.1]
   [junit4]   2> 957080 INFO  (coreLoadExecutor-4417-thread-1) [    ] o.a.s.c.SolrDeletionPolicy SolrDeletionPolicy.onCommit: commits: num=1
   [junit4]   2> 	commit{dir=MockDirectoryWrapper(RAMDirectory@6d698f15 lockFactory=org.apache.lucene.store.SingleInstanceLockFactory@224fc841),segFN=segments_1,generation=1}
   [junit4]   2> 957080 INFO  (coreLoadExecutor-4417-thread-1) [    ] o.a.s.c.SolrDeletionPolicy newest commit generation = 1
   [junit4]   2> 957080 INFO  (OldIndexDirectoryCleanupThreadForCore-collection1) [    ] o.a.s.c.SolrCore Looking for old index directories to cleanup for core collection1 in /home/jenkins/workspace/Lucene-Solr-trunk-Linux/solr/build/solr-core/test/J0/temp/solr.handler.PingRequestHandlerTest_81CBBD914B3EF598-001/init-core-data-001/
   [junit4]   2> 957082 INFO  (coreLoadExecutor-4417-thread-1) [    ] o.a.s.u.p.UpdateRequestProcessorChain creating updateRequestProcessorChain "dedupe"
   [junit4]   2> 957082 INFO  (coreLoadExecutor-4417-thread-1) [    ] o.a.s.u.p.UpdateRequestProcessorChain inserting DistributedUpdateProcessorFactory into updateRequestProcessorChain "dedupe"
   [junit4]   2> 957082 INFO  (coreLoadExecutor-4417-thread-1) [    ] o.a.s.u.p.UpdateRequestProcessorChain creating updateRequestProcessorChain "dedupe-allfields"
   [junit4]   2> 957082 INFO  (coreLoadExecutor-4417-thread-1) [    ] o.a.s.u.p.UpdateRequestProcessorChain inserting DistributedUpdateProcessorFactory into updateRequestProcessorChain "dedupe-allfields"
   [junit4]   2> 957082 INFO  (coreLoadExecutor-4417-thread-1) [    ] o.a.s.u.p.UpdateRequestProcessorChain creating updateRequestProcessorChain "stored_sig"
   [junit4]   2> 957083 INFO  (coreLoadExecutor-4417-thread-1) [    ] o.a.s.u.p.UpdateRequestProcessorChain inserting DistributedUpdateProcessorFactory into updateRequestProcessorChain "stored_sig"
   [junit4]   2> 957083 INFO  (coreLoadExecutor-4417-thread-1) [    ] o.a.s.u.p.UpdateRequestProcessorChain creating updateRequestProcessorChain "uniq-fields"
   [junit4]   2> 957083 INFO  (coreLoadExecutor-4417-thread-1) [    ] o.a.s.u.p.UpdateRequestProcessorChain inserting DistributedUpdateProcessorFactory into updateRequestProcessorChain "uniq-fields"
   [junit4]   2> 957083 INFO  (coreLoadExecutor-4417-thread-1) [    ] o.a.s.u.p.UpdateRequestProcessorChain creating updateRequestProcessorChain "distrib-dup-test-chain-explicit"
   [junit4]   2> 957083 INFO  (coreLoadExecutor-4417-thread-1) [    ] o.a.s.u.p.UpdateRequestProcessorChain creating updateRequestProcessorChain "distrib-dup-test-chain-implicit"
   [junit4]   2> 957083 INFO  (coreLoadExecutor-4417-thread-1) [    ] o.a.s.u.p.UpdateRequestProcessorChain inserting DistributedUpdateProcessorFactory into updateRequestProcessorChain "distrib-dup-test-chain-implicit"
   [junit4]   2> 957083 INFO  (coreLoadExecutor-4417-thread-1) [    ] o.a.s.c.SolrCore no updateRequestProcessorChain defined as default, creating implicit default
   [junit4]   2> 957084 INFO  (coreLoadExecutor-4417-thread-1) [    ] o.a.s.h.l.XMLLoader xsltCacheLifetimeSeconds=60
   [junit4]   2> 957084 INFO  (coreLoadExecutor-4417-thread-1) [    ] o.a.s.h.l.XMLLoader xsltCacheLifetimeSeconds=60
   [junit4]   2> 957085 INFO  (coreLoadExecutor-4417-thread-1) [    ] o.a.s.h.l.XMLLoader xsltCacheLifetimeSeconds=60
   [junit4]   2> 957085 INFO  (coreLoadExecutor-4417-thread-1) [    ] o.a.s.h.l.XMLLoader xsltCacheLifetimeSeconds=60
   [junit4]   2> 957087 INFO  (coreLoadExecutor-4417-thread-1) [    ] o.a.s.c.PluginBag requestHandler : 'lazy' created with startup=lazy 
   [junit4]   2> 957088 INFO  (coreLoadExecutor-4417-thread-1) [    ] o.a.s.c.RequestHandlers Registered paths: /admin/mbeans,standard,spellCheckCompRH,lazy,/update/json/docs,/admin/luke,/export,spellCheckWithWordbreak_Direct,tvrh,/get,/admin/properties,/update/json,mltrh,/admin/threads,/search-facet-def,/update/csv,/sql,/search-facet-invariants,/admin/segments,spellCheckCompRH1,/mlt,/admin/system,/replication,dismax,defaults,/config,/stream,/schema,/admin/plugins,/admin/logging,spellCheckWithWordbreak,mock,/admin/ping,/update,/admin/file,/terms,spellCheckCompRH_Direct,/debug/dump
   [junit4]   2> 957088 WARN  (coreLoadExecutor-4417-thread-1) [    ] o.a.s.c.SolrCore solrconfig.xml uses deprecated <admin/gettableFiles>, Please update your config to use the ShowFileRequestHandler.
   [junit4]   2> 957088 INFO  (coreLoadExecutor-4417-thread-1) [    ] o.a.s.c.SolrCore Using default statsCache cache: org.apache.solr.search.stats.LocalStatsCache
   [junit4]   2> 957089 INFO  (coreLoadExecutor-4417-thread-1) [    ] o.a.s.u.UpdateHandler Using UpdateLog implementation: org.apache.solr.update.UpdateLog
   [junit4]   2> 957089 INFO  (coreLoadExecutor-4417-thread-1) [    ] o.a.s.u.UpdateLog Initializing UpdateLog: dataDir= defaultSyncLevel=FLUSH numRecordsToKeep=100 maxNumLogsToKeep=10 numVersionBuckets=65536
   [junit4]   2> 957089 INFO  (coreLoadExecutor-4417-thread-1) [    ] o.a.s.u.CommitTracker Hard AutoCommit: disabled
   [junit4]   2> 957089 INFO  (coreLoadExecutor-4417-thread-1) [    ] o.a.s.u.CommitTracker Soft AutoCommit: disabled
   [junit4]   2> 957089 INFO  (coreLoadExecutor-4417-thread-1) [    ] o.a.s.u.RandomMergePolicy RandomMergePolicy wrapping class org.apache.lucene.index.LogDocMergePolicy: [LogDocMergePolicy: minMergeSize=1000, mergeFactor=21, maxMergeSize=9223372036854775807, maxMergeSizeForForcedMerge=9223372036854775807, calibrateSizeByDeletes=false, maxMergeDocs=2147483647, maxCFSSegmentSizeMB=8.796093022207999E12, noCFSRatio=1.0]
   [junit4]   2> 957090 INFO  (coreLoadExecutor-4417-thread-1) [    ] o.a.s.c.SolrDeletionPolicy SolrDeletionPolicy.onInit: commits: num=1
   [junit4]   2> 	commit{dir=MockDirectoryWrapper(RAMDirectory@6d698f15 lockFactory=org.apache.lucene.store.SingleInstanceLockFactory@224fc841),segFN=segments_1,generation=1}
   [junit4]   2> 957090 INFO  (coreLoadExecutor-4417-thread-1) [    ] o.a.s.c.SolrDeletionPolicy newest commit generation = 1
   [junit4]   2> 957090 INFO  (coreLoadExecutor-4417-thread-1) [    ] o.a.s.s.SolrIndexSearcher Opening [Searcher@41d42482[collection1] main]
   [junit4]   2> 957090 INFO  (coreLoadExecutor-4417-thread-1) [    ] o.a.s.r.RestManager Initializing RestManager with initArgs: {storageIO=org.apache.solr.rest.ManagedResourceStorage$InMemoryStorageIO}
   [junit4]   2> 957090 INFO  (coreLoadExecutor-4417-thread-1) [    ] o.a.s.r.ManagedResourceStorage Reading _rest_managed.json using InMemoryStorage
   [junit4]   2> 957090 INFO  (coreLoadExecutor-4417-thread-1) [    ] o.a.s.r.RestManager Initializing 0 registered ManagedResources
   [junit4]   2> 957090 INFO  (coreLoadExecutor-4417-thread-1) [    ] o.a.s.h.c.SpellCheckComponent Initializing spell checkers
   [junit4]   2> 957122 INFO  (coreLoadExecutor-4417-thread-1) [    ] o.a.s.s.DirectSolrSpellChecker init: {name=direct,classname=DirectSolrSpellChecker,field=lowerfilt,minQueryLength=3}
   [junit4]   2> 957229 INFO  (coreLoadExecutor-4417-thread-1) [    ] o.a.s.h.ReplicationHandler Commits will be reserved for  10000
   [junit4]   2> 957229 INFO  (searcherExecutor-4418-thread-1) [    ] o.a.s.h.c.SpellCheckComponent Loading spell index for spellchecker: default
   [junit4]   2> 957229 INFO  (searcherExecutor-4418-thread-1) [    ] o.a.s.h.c.SpellCheckComponent Loading spell index for spellchecker: direct
   [junit4]   2> 957229 INFO  (searcherExecutor-4418-thread-1) [    ] o.a.s.h.c.SpellCheckComponent Loading spell index for spellchecker: wordbreak
   [junit4]   2> 957229 INFO  (searcherExecutor-4418-thread-1) [    ] o.a.s.h.c.SpellCheckComponent Loading spell index for spellchecker: multipleFields
   [junit4]   2> 957229 INFO  (coreLoadExecutor-4417-thread-1) [    ] o.a.s.u.UpdateLog Looking up max value of version field to seed version buckets
   [junit4]   2> 957230 INFO  (coreLoadExecutor-4417-thread-1) [    ] o.a.s.u.VersionInfo Refreshing highest value of _version_ for 65536 version buckets from index
   [junit4]   2> 957230 INFO  (coreLoadExecutor-4417-thread-1) [    ] o.a.s.u.VersionInfo No terms found for _version_, cannot seed version bucket highest value from index
   [junit4]   2> 957230 INFO  (coreLoadExecutor-4417-thread-1) [    ] o.a.s.u.UpdateLog Could not find max version in index or recent updates, using new clock 1524910168749375488
   [junit4]   2> 957230 INFO  (searcherExecutor-4418-thread-1) [    ] o.a.s.h.c.SpellCheckComponent Loading spell index for spellchecker: jarowinkler
   [junit4]   2> 957230 INFO  (searcherExecutor-4418-thread-1) [    ] o.a.s.h.c.SpellCheckComponent Loading spell index for spellchecker: external
   [junit4]   2> 957230 INFO  (searcherExecutor-4418-thread-1) [    ] o.a.s.h.c.SpellCheckComponent Loading spell index for spellchecker: freq
   [junit4]   2> 957230 INFO  (searcherExecutor-4418-thread-1) [    ] o.a.s.h.c.SpellCheckComponent Loading spell index for spellchecker: fqcn
   [junit4]   2> 957230 INFO  (searcherExecutor-4418-thread-1) [    ] o.a.s.h.c.SpellCheckComponent Loading spell index for spellchecker: perDict
   [junit4]   2> 957231 INFO  (searcherExecutor-4418-thread-1) [    ] o.a.s.c.SolrCore [collection1] Registered new searcher Searcher@41d42482[collection1] main{ExitableDirectoryReader(UninvertingDirectoryReader())}
   [junit4]   2> 957232 INFO  (coreLoadExecutor-4417-thread-1) [    ] o.a.s.u.UpdateLog Took 2.0ms to seed version buckets with highest version 1524910168749375488
   [junit4]   2> 957232 INFO  (coreLoadExecutor-4417-thread-1) [    ] o.a.s.c.CoreContainer registering core: collection1
   [junit4]   2> 957232 INFO  (SUITE-PingRequestHandlerTest-seed#[81CBBD914B3EF598]-worker) [    ] o.a.s.SolrTestCaseJ4 ####initCore end
   [junit4]   2> 957236 INFO  (TEST-PingRequestHandlerTest.testGettingStatus-seed#[81CBBD914B3EF598]) [    ] o.a.s.SolrTestCaseJ4 ###Starting testGettingStatus
   [junit4]   2> 957239 INFO  (TEST-PingRequestHandlerTest.testGettingStatus-seed#[81CBBD914B3EF598]) [    ] o.a.s.SolrTestCaseJ4 ###Ending testGettingStatus
   [junit4]   2> 957241 INFO  (TEST-PingRequestHandlerTest.testPingInClusterWithNoHealthCheck-seed#[81CBBD914B3EF598]) [    ] o.a.s.SolrTestCaseJ4 ###Starting testPingInClusterWithNoHealthCheck
   [junit4]   2> 957242 INFO  (TEST-PingRequestHandlerTest.testPingInClusterWithNoHealthCheck-seed#[81CBBD914B3EF598]) [    ] o.a.s.c.ZkTestServer STARTING ZK TEST SERVER
   [junit4]   2> 957242 INFO  (Thread-3805) [    ] o.a.s.c.ZkTestServer client port:0.0.0.0/0.0.0.0:0
   [junit4]   2> 957242 INFO  (Thread-3805) [    ] o.a.s.c.ZkTestServer Starting server
   [junit4]   2> 957342 INFO  (TEST-PingRequestHandlerTest.testPingInClusterWithNoHealthCheck-seed#[81CBBD914B3EF598]) [    ] o.a.s.c.ZkTestServer start zk server on port:37192
   [junit4]   2> 957343 INFO  (TEST-PingRequestHandlerTest.testPingInClusterWithNoHealthCheck-seed#[81CBBD914B3EF598]) [    ] o.a.s.c.c.SolrZkClient Using default ZkCredentialsProvider
   [junit4]   2> 957343 INFO  (TEST-PingRequestHandlerTest.testPingInClusterWithNoHealthCheck-seed#[81CBBD914B3EF598]) [    ] o.a.s.c.c.ConnectionManager Waiting for client to connect to ZooKeeper
   [junit4]   2> 957345 INFO  (zkCallback-1314-thread-1) [    ] o.a.s.c.c.ConnectionManager Watcher org.apache.solr.common.cloud.ConnectionManager@eb118dd name:ZooKeeperConnection Watcher:127.0.0.1:37192 got event WatchedEvent state:SyncConnected type:None path:null path:null type:None
   [junit4]   2> 957345 INFO  (TEST-PingRequestHandlerTest.testPingInClusterWithNoHealthCheck-seed#[81CBBD914B3EF598]) [    ] o.a.s.c.c.ConnectionManager Client is connected to ZooKeeper
   [junit4]   2> 957346 INFO  (TEST-PingRequestHandlerTest.testPingInClusterWithNoHealthCheck-seed#[81CBBD914B3EF598]) [    ] o.a.s.c.c.SolrZkClient Using default ZkACLProvider
   [junit4]   2> 957346 INFO  (TEST-PingRequestHandlerTest.testPingInClusterWithNoHealthCheck-seed#[81CBBD914B3EF598]) [    ] o.a.s.c.c.SolrZkClient makePath: /solr/solr.xml
   [junit4]   2> 957348 WARN  (NIOServerCxn.Factory:0.0.0.0/0.0.0.0:0) [    ] o.a.z.s.NIOServerCnxn caught end of stream exception
   [junit4]   2> EndOfStreamException: Unable to read additional data from client sessionid 0x152991b81b90000, likely client has closed socket
   [junit4]   2> 	at org.apache.zookeeper.server.NIOServerCnxn.doIO(NIOServerCnxn.java:228)
   [junit4]   2> 	at org.apache.zookeeper.server.NIOServerCnxnFactory.run(NIOServerCnxnFactory.java:208)
   [junit4]   2> 	at java.lang.Thread.run(Thread.java:804)
   [junit4]   2> 957350 INFO  (jetty-launcher-1313-thread-1) [    ] o.e.j.s.Server jetty-9.2.13.v20150730
   [junit4]   2> 957350 INFO  (jetty-launcher-1313-thread-3) [    ] o.e.j.s.Server jetty-9.2.13.v20150730
   [junit4]   2> 957354 INFO  (jetty-launcher-1313-thread-2) [    ] o.e.j.s.Server jetty-9.2.13.v20150730
   [junit4]   2> 957358 INFO  (jetty-launcher-1313-thread-4) [    ] o.e.j.s.Server jetty-9.2.13.v20150730
   [junit4]   2> 957358 INFO  (jetty-launcher-1313-thread-5) [    ] o.e.j.s.Server jetty-9.2.13.v20150730
   [junit4]   2> 957362 INFO  (jetty-launcher-1313-thread-3) [    ] o.e.j.s.h.ContextHandler Started o.e.j.s.ServletContextHandler@2b899fd4{/solr,null,AVAILABLE}
   [junit4]   2> 957362 INFO  (jetty-launcher-1313-thread-2) [    ] o.e.j.s.h.ContextHandler Started o.e.j.s.ServletContextHandler@1087aa12{/solr,null,AVAILABLE}
   [junit4]   2> 957362 INFO  (jetty-launcher-1313-thread-3) [    ] o.e.j.s.ServerConnector Started ServerConnector@2d6c5a42{HTTP/1.1}{127.0.0.1:?????}
   [junit4]   2> 957362 INFO  (jetty-launcher-1313-thread-3) [    ] o.e.j.s.Server Started @??????ms
   [junit4]   2> 957362 INFO  (jetty-launcher-1313-thread-2) [    ] o.e.j.s.ServerConnector Started ServerConnector@adb0fa9{HTTP/1.1}{127.0.0.1:?????}
   [junit4]   2> 957363 INFO  (jetty-launcher-1313-thread-3) [    ] o.a.s.c.s.e.JettySolrRunner Jetty properties: {hostContext=/solr, hostPort=48781}
   [junit4]   2> 957363 INFO  (jetty-launcher-1313-thread-2) [    ] o.e.j.s.Server Started @??????ms
   [junit4]   2> 957363 INFO  (jetty-launcher-1313-thread-2) [    ] o.a.s.c.s.e.JettySolrRunner Jetty properties: {hostContext=/solr, hostPort=34852}
   [junit4]   2> 957363 INFO  (jetty-launcher-1313-thread-3) [    ] o.a.s.s.SolrDispatchFilter SolrDispatchFilter.init(): sun.misc.Launcher$AppClassLoader@7fbe847c
   [junit4]   2> 957363 INFO  (jetty-launcher-1313-thread-2) [    ] o.a.s.s.SolrDispatchFilter SolrDispatchFilter.init(): sun.misc.Launcher$AppClassLoader@7fbe847c
   [junit4]   2> 957363 INFO  (jetty-launcher-1313-thread-3) [    ] o.a.s.c.SolrResourceLoader new SolrResourceLoader for directory: '/home/jenkins/workspace/Lucene-Solr-trunk-Linux/solr/build/solr-core/test/J0/temp/solr.handler.PingRequestHandlerTest_81CBBD914B3EF598-001/tempDir-001/node3'
   [junit4]   2> 957363 INFO  (jetty-launcher-1313-thread-2) [    ] o.a.s.c.SolrResourceLoader new SolrResourceLoader for directory: '/home/jenkins/workspace/Lucene-Solr-trunk-Linux/solr/build/solr-core/test/J0/temp/solr.handler.PingRequestHandlerTest_81CBBD914B3EF598-001/tempDir-001/node2'
   [junit4]   2> 957363 INFO  (jetty-launcher-1313-thread-3) [    ] o.a.s.c.SolrResourceLoader JNDI not configured for solr (NoInitialContextEx)
   [junit4]   2> 957363 INFO  (jetty-launcher-1313-thread-3) [    ] o.a.s.c.SolrResourceLoader using system property solr.solr.home: /home/jenkins/workspace/Lucene-Solr-trunk-Linux/solr/core/src/test-files/solr
   [junit4]   2> 957363 INFO  (jetty-launcher-1313-thread-3) [    ] o.a.s.c.c.SolrZkClient Using default ZkCredentialsProvider
   [junit4]   2> 957363 INFO  (jetty-launcher-1313-thread-2) [    ] o.a.s.c.SolrResourceLoader JNDI not configured for solr (NoInitialContextEx)
   [junit4]   2> 957364 INFO  (jetty-launcher-1313-thread-3) [    ] o.a.s.c.c.ConnectionManager Waiting for client to connect to ZooKeeper
   [junit4]   2> 957364 INFO  (jetty-launcher-1313-thread-2) [    ] o.a.s.c.SolrResourceLoader using system property solr.solr.home: /home/jenkins/workspace/Lucene-Solr-trunk-Linux/solr/core/src/test-files/solr
   [junit4]   2> 957364 INFO  (jetty-launcher-1313-thread-2) [    ] o.a.s.c.c.SolrZkClient Using default ZkCredentialsProvider
   [junit4]   2> 957364 INFO  (jetty-launcher-1313-thread-2) [    ] o.a.s.c.c.ConnectionManager Waiting for client to connect to ZooKeeper
   [junit4]   2> 957365 INFO  (zkCallback-1315-thread-1) [    ] o.a.s.c.c.ConnectionManager Watcher org.apache.solr.common.cloud.ConnectionManager@f7cd683 name:ZooKeeperConnection Watcher:127.0.0.1:37192/solr got event WatchedEvent state:SyncConnected type:None path:null path:null type:None
   [junit4]   2> 957365 INFO  (jetty-launcher-1313-thread-1) [    ] o.e.j.s.h.ContextHandler Started o.e.j.s.ServletContextHandler@cfc95cb{/solr,null,AVAILABLE}
   [junit4]   2> 957365 INFO  (zkCallback-1316-thread-1) [    ] o.a.s.c.c.ConnectionManager Watcher org.apache.solr.common.cloud.ConnectionManager@71b9ac03 name:ZooKeeperConnection Watcher:127.0.0.1:37192/solr got event WatchedEvent state:SyncConnected type:None path:null path:null type:None
   [junit4]   2> 957365 INFO  (jetty-launcher-1313-thread-3) [    ] o.a.s.c.c.ConnectionManager Client is connected to ZooKeeper
   [junit4]   2> 957365 INFO  (jetty-launcher-1313-thread-1) [    ] o.e.j.s.ServerConnector Started ServerConnector@16dd1ab6{HTTP/1.1}{127.0.0.1:?????}
   [junit4]   2> 957365 INFO  (jetty-launcher-1313-thread-1) [    ] o.e.j.s.Server Started @??????ms
   [junit4]   2> 957365 INFO  (jetty-launcher-1313-thread-3) [    ] o.a.s.c.c.SolrZkClient Using default ZkACLProvider
   [junit4]   2> 957365 INFO  (jetty-launcher-1313-thread-1) [    ] o.a.s.c.s.e.JettySolrRunner Jetty properties: {hostContext=/solr, hostPort=40872}
   [junit4]   2> 957365 INFO  (jetty-launcher-1313-thread-1) [    ] o.a.s.s.SolrDispatchFilter SolrDispatchFilter.init(): sun.misc.Launcher$AppClassLoader@7fbe847c
   [junit4]   2> 957366 INFO  (jetty-launcher-1313-thread-3) [    ] o.a.s.s.SolrDispatchFilter solr.xml found in ZooKeeper. Loading...
   [junit4]   2> 957366 INFO  (jetty-launcher-1313-thread-1) [    ] o.a.s.c.SolrResourceLoader new SolrResourceLoader for directory: '/home/jenkins/workspace/Lucene-Solr-trunk-Linux/solr/build/solr-core/test/J0/temp/solr.handler.PingRequestHandlerTest_81CBBD914B3EF598-001/tempDir-001/node1'
   [junit4]   2> 957366 INFO  (jetty-launcher-1313-thread-1) [    ] o.a.s.c.SolrResourceLoader JNDI not configured for solr (NoInitialContextEx)
   [junit4]   2> 957366 INFO  (jetty-launcher-1313-thread-1) [    ] o.a.s.c.SolrResourceLoader using system property solr.solr.home: /home/jenkins/workspace/Lucene-Solr-trunk-Linux/solr/core/src/test-files/solr
   [junit4]   2> 957366 INFO  (jetty-launcher-1313-thread-1) [    ] o.a.s.c.c.SolrZkClient Using default ZkCredentialsProvider
   [junit4]   2> 957366 INFO  (jetty-launcher-1313-thread-2) [    ] o.a.s.c.c.ConnectionManager Client is connected to ZooKeeper
   [junit4]   2> 957366 INFO  (jetty-launcher-1313-thread-2) [    ] o.a.s.c.c.SolrZkClient Using default ZkACLProvider
   [junit4]   2> 957367 INFO  (jetty-launcher-1313-thread-1) [    ] o.a.s.c.c.ConnectionManager Waiting for client to connect to ZooKeeper
   [junit4]   2> 957367 INFO  (jetty-launcher-1313-thread-5) [    ] o.e.j.s.h.ContextHandler Started o.e.j.s.ServletContextHandler@7af4193e{/solr,null,AVAILABLE}
   [junit4]   2> 957367 INFO  (jetty-launcher-1313-thread-5) [    ] o.e.j.s.ServerConnector Started ServerConnector@e217206{HTTP/1.1}{127.0.0.1:?????}
   [junit4]   2> 957367 INFO  (jetty-launcher-1313-thread-5) [    ] o.e.j.s.Server Started @??????ms
   [junit4]   2> 957367 INFO  (jetty-launcher-1313-thread-5) [    ] o.a.s.c.s.e.JettySolrRunner Jetty properties: {hostContext=/solr, hostPort=54915}
   [junit4]   2> 957367 INFO  (zkCallback-1317-thread-1) [    ] o.a.s.c.c.ConnectionManager Watcher org.apache.solr.common.cloud.ConnectionManager@58693fa0 name:ZooKeeperConnection Watcher:127.0.0.1:37192/solr got event WatchedEvent state:SyncConnected type:None path:null path:null type:None
   [junit4]   2> 957367 INFO  (jetty-launcher-1313-thread-5) [    ] o.a.s.s.SolrDispatchFilter SolrDispatchFilter.init(): sun.misc.Launcher$AppClassLoader@7fbe847c
   [junit4]   2> 957367 INFO  (jetty-launcher-1313-thread-5) [    ] o.a.s.c.SolrResourceLoader new SolrResourceLoader for directory: '/home/jenkins/workspace/Lucene-Solr-trunk-Linux/solr/build/solr-core/test/J0/temp/solr.handler.PingRequestHandlerTest_81CBBD914B3EF598-001/tempDir-001/node5'
   [junit4]   2> 957368 INFO  (jetty-launcher-1313-thread-5) [    ] o.a.s.c.SolrResourceLoader JNDI not configured for solr (NoInitialContextEx)
   [junit4]   2> 957368 INFO  (jetty-launcher-1313-thread-5) [    ] o.a.s.c.SolrResourceLoader using system property solr.solr.home: /home/jenkins/workspace/Lucene-Solr-trunk-Linux/solr/core/src/test-files/solr
   [junit4]   2> 957368 INFO  (jetty-launcher-1313-thread-5) [    ] o.a.s.c.c.SolrZkClient Using default ZkCredentialsProvider
   [junit4]   2> 957368 INFO  (jetty-launcher-1313-thread-1) [    ] o.a.s.c.c.ConnectionManager Client is connected to ZooKeeper
   [junit4]   2> 957368 INFO  (jetty-launcher-1313-thread-1) [    ] o.a.s.c.c.SolrZkClient Using default ZkACLProvider
   [junit4]   2> 957368 INFO  (jetty-launcher-1313-thread-2) [    ] o.a.s.s.SolrDispatchFilter solr.xml found in ZooKeeper. Loading...
   [junit4]   2> 957369 INFO  (jetty-launcher-1313-thread-5) [    ] o.a.s.c.c.ConnectionManager Waiting for client to connect to ZooKeeper
   [junit4]   2> 957369 INFO  (jetty-launcher-1313-thread-4) [    ] o.e.j.s.h.ContextHandler Started o.e.j.s.ServletContextHandler@3075369e{/solr,null,AVAILABLE}
   [junit4]   2> 957369 INFO  (jetty-launcher-1313-thread-4) [    ] o.e.j.s.ServerConnector Started ServerConnector@68411111{HTTP/1.1}{127.0.0.1:?????}
   [junit4]   2> 957369 INFO  (jetty-launcher-1313-thread-4) [    ] o.e.j.s.Server Started @??????ms
   [junit4]   2> 957369 INFO  (jetty-launcher-1313-thread-4) [    ] o.a.s.c.s.e.JettySolrRunner Jetty properties: {hostContext=/solr, hostPort=40454}
   [junit4]   2> 957370 INFO  (jetty-launcher-1313-thread-4) [    ] o.a.s.s.SolrDispatchFilter SolrDispatchFilter.init(): sun.misc.Launcher$AppClassLoader@7fbe847c
   [junit4]   2> 957370 INFO  (jetty-launcher-1313-thread-4) [    ] o.a.s.c.SolrResourceLoader new SolrResourceLoader for directory: '/home/jenkins/workspace/Lucene-Solr-trunk-Linux/solr/build/solr-core/test/J0/temp/solr.handler.PingRequestHandlerTest_81CBBD914B3EF598-001/tempDir-001/node4'
   [junit4]   2> 957370 INFO  (jetty-launcher-1313-thread-4) [    ] o.a.s.c.SolrResourceLoader JNDI not configured for solr (NoInitialContextEx)
   [junit4]   2> 957370 INFO  (jetty-launcher-1313-thread-4) [    ] o.a.s.c.SolrResourceLoader using system property solr.solr.home: /home/jenkins/workspace/Lucene-Solr-trunk-Linux/solr/core/src/test-files/solr
   [junit4]   2> 957370 INFO  (jetty-launcher-1313-thread-4) [    ] o.a.s.c.c.SolrZkClient Using default ZkCredentialsProvider
   [junit4]   2> 957370 WARN  (NIOServerCxn.Factory:0.0.0.0/0.0.0.0:0) [    ] o.a.z.s.NIOServerCnxn caught end of stream exception
   [junit4]   2> EndOfStreamException: Unable to read additional data from client sessionid 0x152991b81b90001, likely client has closed socket
   [junit4]   2> 	at org.apache.zookeeper.server.NIOServerCnxn.doIO(NIOServerCnxn.java:228)
   [junit4]   2> 	at org.apache.zookeeper.server.NIOServerCnxnFactory.run(NIOServerCnxnFactory.java:208)
   [junit4]   2> 	at java.lang.Thread.run(Thread.java:804)
   [junit4]   2> 957370 INFO  (jetty-launcher-1313-thread-1) [    ] o.a.s.s.SolrDispatchFilter solr.xml found in ZooKeeper. Loading...
   [junit4]   2> 957402 INFO  (jetty-launcher-1313-thread-4) [    ] o.a.s.c.c.ConnectionManager Waiting for client to connect to ZooKeeper
   [junit4]   2> 957403 INFO  (jetty-launcher-1313-thread-3) [    ] o.a.s.c.CorePropertiesLocator Config-defined core root directory: /home/jenkins/workspace/Lucene-Solr-trunk-Linux/solr/build/solr-core/test/J0/temp/solr.handler.PingRequestHandlerTest_81CBBD914B3EF598-001/tempDir-001/node3/.
   [junit4]   2> 957403 INFO  (jetty-launcher-1313-thread-3) [    ] o.a.s.c.CoreContainer New CoreContainer 240650386
   [junit4]   2> 957403 INFO  (jetty-launcher-1313-thread-3) [    ] o.a.s.c.CoreContainer Loading cores into CoreContainer [instanceDir=/home/jenkins/workspace/Lucene-Solr-trunk-Linux/solr/build/solr-core/test/J0/temp/solr.handler.PingRequestHandlerTest_81CBBD914B3EF598-001/tempDir-001/node3]
   [junit4]   2> 957403 WARN  (jetty-launcher-1313-thread-3) [    ] o.a.s.c.CoreContainer Couldn't add files from /home/jenkins/workspace/Lucene-Solr-trunk-Linux/solr/build/solr-core/test/J0/temp/solr.handler.PingRequestHandlerTest_81CBBD914B3EF598-001/tempDir-001/node3/lib to classpath: /home/jenkins/workspace/Lucene-Solr-trunk-Linux/solr/build/solr-core/test/J0/temp/solr.handler.PingRequestHandlerTest_81CBBD914B3EF598-001/tempDir-001/node3/lib
   [junit4]   2> 957403 INFO  (zkCallback-1318-thread-1) [    ] o.a.s.c.c.ConnectionManager Watcher org.apache.solr.common.cloud.ConnectionManager@40e2b448 name:ZooKeeperConnection Watcher:127.0.0.1:37192/solr got event WatchedEvent state:SyncConnected type:None path:null path:null type:None
   [junit4]   2> 957404 INFO  (jetty-launcher-1313-thread-3) [    ] o.a.s.h.c.HttpShardHandlerFactory created with socketTimeout : 90000,urlScheme : ,connTimeout : 15000,maxConnectionsPerHost : 20,maxConnections : 10000,corePoolSize : 0,maximumPoolSize : 2147483647,maxThreadIdleTime : 5,sizeOfQueue : -1,fairnessPolicy : false,useRetries : false,
   [junit4]   2> 957404 INFO  (jetty-launcher-1313-thread-5) [    ] o.a.s.c.c.ConnectionManager Client is connected to ZooKeeper
   [junit4]   2> 957404 INFO  (jetty-launcher-1313-thread-5) [    ] o.a.s.c.c.SolrZkClient Using default ZkACLProvider
   [junit4]   2> 957404 INFO  (zkCallback-1319-thread-1) [    ] o.a.s.c.c.ConnectionManager Watcher org.apache.solr.common.cloud.ConnectionManager@2c7cef29 name:ZooKeeperConnection Watcher:127.0.0.1:37192/solr got event WatchedEvent state:SyncConnected type:None path:null path:null type:None
   [junit4]   2> 957404 WARN  (NIOServerCxn.Factory:0.0.0.0/0.0.0.0:0) [    ] o.a.z.s.NIOServerCnxn caught end of stream exception
   [junit4]   2> EndOfStreamException: Unable to read additional data from client sessionid 0x152991b81b90002, likely client has closed socket
   [junit4]   2> 	at org.apache.zookeeper.server.NIOServerCnxn.doIO(NIOServerCnxn.java:228)
   [junit4]   2> 	at org.apache.zookeeper.server.NIOServerCnxnFactory.run(NIOServerCnxnFactory.java:208)
   [junit4]   2> 	at java.lang.Thread.run(Thread.java:804)
   [junit4]   2> 957404 INFO  (jetty-launcher-1313-thread-4) [    ] o.a.s.c.c.ConnectionManager Client is connected to ZooKeeper
   [junit4]   2> 957405 INFO  (jetty-launcher-1313-thread-3) [    ] o.a.s.u.UpdateShardHandler Creating UpdateShardHandler HTTP client with params: socketTimeout=340000&connTimeout=45000&retry=true
   [junit4]   2> 957405 INFO  (jetty-launcher-1313-thread-4) [    ] o.a.s.c.c.SolrZkClient Using default ZkACLProvider
   [junit4]   2> 957405 INFO  (jetty-launcher-1313-thread-3) [    ] o.a.s.l.LogWatcher SLF4J impl is org.slf4j.impl.Log4jLoggerFactory
   [junit4]   2> 957405 INFO  (jetty-launcher-1313-thread-4) [    ] o.a.s.s.SolrDispatchFilter solr.xml found in ZooKeeper. Loading...
   [junit4]   2> 957405 INFO  (jetty-launcher-1313-thread-3) [    ] o.a.s.l.LogWatcher Registering Log Listener [Log4j (org.slf4j.impl.Log4jLoggerFactory)]
   [junit4]   2> 957406 INFO  (jetty-launcher-1313-thread-2) [    ] o.a.s.c.CorePropertiesLocator Config-defined core root directory: /home/jenkins/workspace/Lucene-Solr-trunk-Linux/solr/build/solr-core/test/J0/temp/solr.handler.PingRequestHandlerTest_81CBBD914B3EF598-001/tempDir-001/node2/.
   [junit4]   2> 957406 INFO  (jetty-launcher-1313-thread-3) [    ] o.a.s.c.ZkContainer Zookeeper client=127.0.0.1:37192/solr
   [junit4]   2> 957406 INFO  (jetty-launcher-1313-thread-2) [    ] o.a.s.c.CoreContainer New CoreContainer 1850215152
   [junit4]   2> 957406 INFO  (jetty-launcher-1313-thread-3) [    ] o.a.s.c.ZkController zkHost includes chroot
   [junit4]   2> 957406 INFO  (jetty-launcher-1313-thread-3) [    ] o.a.s.c.c.SolrZkClient Using default ZkCredentialsProvider
   [junit4]   2> 957406 INFO  (jetty-launcher-1313-thread-2) [    ] o.a.s.c.CoreContainer Loading cores into CoreContainer [instanceDir=/home/jenkins/workspace/Lucene-Solr-trunk-Linux/solr/build/solr-core/test/J0/temp/solr.handler.PingRequestHandlerTest_81CBBD914B3EF598-001/tempDir-001/node2]
   [junit4]   2> 957406 WARN  (jetty-launcher-1313-thread-2) [    ] o.a.s.c.CoreContainer Couldn't add files from /home/jenkins/workspace/Lucene-Solr-trunk-Linux/solr/build/solr-core/test/J0/temp/solr.handler.PingRequestHandlerTest_81CBBD914B3EF598-001/tempDir-001/node2/lib to classpath: /home/jenkins/workspace/Lucene-Solr-trunk-Linux/solr/build/solr-core/test/J0/temp/solr.handler.PingRequestHandlerTest_81CBBD914B3EF598-001/tempDir-001/node2/lib
   [junit4]   2> 957407 INFO  (jetty-launcher-1313-thread-2) [    ] o.a.s.h.c.HttpShardHandlerFactory created with socketTimeout : 90000,urlScheme : ,connTimeout : 15000,maxConnectionsPerHost : 20,maxConnections : 10000,corePoolSize : 0,maximumPoolSize : 2147483647,maxThreadIdleTime : 5,sizeOfQueue : -1,fairnessPolicy : false,useRetries : false,
   [junit4]   2> 957407 INFO  (jetty-launcher-1313-thread-2) [    ] o.a.s.u.UpdateShardHandler Creating UpdateShardHandler HTTP client with params: socketTimeout=340000&connTimeout=45000&retry=true
   [junit4]   2> 957408 INFO  (jetty-launcher-1313-thread-2) [    ] o.a.s.l.LogWatcher SLF4J impl is org.slf4j.impl.Log4jLoggerFactory
   [junit4]   2> 957408 INFO  (jetty-launcher-1313-thread-5) [    ] o.a.s.s.SolrDispatchFilter solr.xml found in ZooKeeper. Loading...
   [junit4]   2> 957414 INFO  (jetty-launcher-1313-thread-2) [    ] o.a.s.l.LogWatcher Registering Log Listener [Log4j (org.slf4j.impl.Log4jLoggerFactory)]
   [junit4]   2> 957414 INFO  (jetty-launcher-1313-thread-2) [    ] o.a.s.c.ZkContainer Zookeeper client=127.0.0.1:37192/solr
   [junit4]   2> 957414 INFO  (jetty-launcher-1313-thread-2) [    ] o.a.s.c.ZkController zkHost includes chroot
   [junit4]   2> 957414 INFO  (jetty-launcher-1313-thread-2) [    ] o.a.s.c.c.SolrZkClient Using default ZkCredentialsProvider
   [junit4]   2> 957414 INFO  (jetty-launcher-1313-thread-1) [    ] o.a.s.c.CorePropertiesLocator Config-defined core root directory: /home/jenkins/workspace/Lucene-Solr-trunk-Linux/solr/build/solr-core/test/J0/temp/solr.handler.PingRequestHandlerTest_81CBBD914B3EF598-001/tempDir-001/node1/.
   [junit4]   2> 957414 INFO  (jetty-launcher-1313-thread-1) [    ] o.a.s.c.CoreContainer New CoreContainer 1458898173
   [junit4]   2> 957414 INFO  (jetty-launcher-1313-thread-4) [    ] o.a.s.c.CorePropertiesLocator Config-defined core root directory: /home/jenkins/workspace/Lucene-Solr-trunk-Linux/solr/build/solr-core/test/J0/temp/solr.handler.PingRequestHandlerTest_81CBBD914B3EF598-001/tempDir-001/node4/.
   [junit4]   2> 957414 INFO  (jetty-launcher-1313-thread-2) [    ] o.a.s.c.c.ConnectionManager Waiting for client to connect to ZooKeeper
   [junit4]   2> 957414 INFO  (jetty-launcher-1313-thread-4) [    ] o.a.s.c.CoreContainer New CoreContainer 1963215686
   [junit4]   2> 957414 INFO  (jetty-launcher-1313-thread-1) [    ] o.a.s.c.CoreContainer Loading cores into CoreContainer [instanceDir=/home/jenkins/workspace/Lucene-Solr-trunk-Linux/solr/build/solr-core/test/J0/temp/solr.handler.PingRequestHandlerTest_81CBBD914B3EF598-001/tempDir-001/node1]
   [junit4]   2> 957415 WARN  (jetty-launcher-1313-thread-1) [    ] o.a.s.c.CoreContainer Couldn't add files from /home/jenkins/workspace/Lucene-Solr-trunk-Linux/solr/build/solr-core/test/J0/temp/solr.handler.PingRequestHandlerTest_81CBBD914B3EF598-001/tempDir-001/node1/lib to classpath: /home/jenkins/workspace/Lucene-Solr-trunk-Linux/solr/build/solr-core/test/J0/temp/solr.handler.PingRequestHandlerTest_81CBBD914B3EF598-001/tempDir-001/node1/lib
   [junit4]   2> 957414 INFO  (jetty-launcher-1313-thread-3) [    ] o.a.s.c.c.ConnectionManager Waiting for client to connect to ZooKeeper
   [junit4]   2> 957415 INFO  (jetty-launcher-1313-thread-4) [    ] o.a.s.c.CoreContainer Loading cores into CoreContainer [instanceDir=/home/jenkins/workspace/Lucene-Solr-trunk-Linux/solr/build/solr-core/test/J0/temp/solr.handler.PingRequestHandlerTest_81CBBD914B3EF598-001/tempDir-001/node4]
   [junit4]   2> 957415 INFO  (jetty-launcher-1313-thread-1) [    ] o.a.s.h.c.HttpShardHandlerFactory created with socketTimeout : 90000,urlScheme : ,connTimeout : 15000,maxConnectionsPerHost : 20,maxConnections : 10000,corePoolSize : 0,maximumPoolSize : 2147483647,maxThreadIdleTime : 5,sizeOfQueue : -1,fairnessPolicy : false,useRetries : false,
   [junit4]   2> 957415 WARN  (jetty-launcher-1313-thread-4) [    ] o.a.s.c.CoreContainer Couldn't add files from /home/jenkins/workspace/Lucene-Solr-trunk-Linux/solr/build/solr-core/test/J0/temp/solr.handler.PingRequestHandlerTest_81CBBD914B3EF598-001/tempDir-001/node4/lib to classpath: /home/jenkins/workspace/Lucene-Solr-trunk-Linux/solr/build/solr-core/test/J0/temp/solr.handler.PingRequestHandlerTest_81CBBD914B3EF598-001/tempDir-001/node4/lib
   [junit4]   2> 957415 INFO  (jetty-launcher-1313-thread-4) [    ] o.a.s.h.c.HttpShardHandlerFactory created with socketTimeout : 90000,urlScheme : ,connTimeout : 15000,maxConnectionsPerHost : 20,maxConnections : 10000,corePoolSize : 0,maximumPoolSize : 2147483647,maxThreadIdleTime : 5,sizeOfQueue : -1,fairnessPolicy : false,useRetries : false,
   [junit4]   2> 957416 INFO  (jetty-launcher-1313-thread-1) [    ] o.a.s.u.UpdateShardHandler Creating UpdateShardHandler HTTP client with params: socketTimeout=340000&connTimeout=45000&retry=true
   [junit4]   2> 957416 INFO  (jetty-launcher-1313-thread-4) [    ] o.a.s.u.UpdateShardHandler Creating UpdateShardHandler HTTP client with params: socketTimeout=340000&connTimeout=45000&retry=true
   [junit4]   2> 957416 INFO  (jetty-launcher-1313-thread-1) [    ] o.a.s.l.LogWatcher SLF4J impl is org.slf4j.impl.Log4jLoggerFactory
   [junit4]   2> 957416 INFO  (jetty-launcher-1313-thread-1) [    ] o.a.s.l.LogWatcher Registering Log Listener [Log4j (org.slf4j.impl.Log4jLoggerFactory)]
   [junit4]   2> 957416 INFO  (jetty-launcher-1313-thread-1) [    ] o.a.s.c.ZkContainer Zookeeper client=127.0.0.1:37192/solr
   [junit4]   2> 957416 INFO  (jetty-launcher-1313-thread-1) [    ] o.a.s.c.ZkController zkHost includes chroot
   [junit4]   2> 957416 INFO  (jetty-launcher-1313-thread-1) [    ] o.a.s.c.c.SolrZkClient Using default ZkCredentialsProvider
   [junit4]   2> 957416 INFO  (jetty-launcher-1313-thread-4) [    ] o.a.s.l.LogWatcher SLF4J impl is org.slf4j.impl.Log4jLoggerFactory
   [junit4]   2> 957416 INFO  (jetty-launcher-1313-thread-4) [    ] o.a.s.l.LogWatcher Registering Log Listener [Log4j (org.slf4j.impl.Log4jLoggerFactory)]
   [junit4]   2> 957416 INFO  (zkCallback-1325-thread-1) [    ] o.a.s.c.c.ConnectionManager Watcher org.apache.solr.common.cloud.ConnectionManager@1b9d697b name:ZooKeeperConnection Watcher:127.0.0.1:37192 got event WatchedEvent state:SyncConnected type:None path:null path:null type:None
   [junit4]   2> 957416 INFO  (jetty-launcher-1313-thread-4) [    ] o.a.s.c.ZkContainer Zookeeper client=127.0.0.1:37192/solr
   [junit4]   2> 957416 INFO  (jetty-launcher-1313-thread-4) [    ] o.a.s.c.ZkController zkHost includes chroot
   [junit4]   2> 957416 INFO  (jetty-launcher-1313-thread-4) [    ] o.a.s.c.c.SolrZkClient Using default ZkCredentialsProvider
   [junit4]   2> 957417 INFO  (jetty-launcher-1313-thread-2) [    ] o.a.s.c.c.ConnectionManager Client is connected to ZooKeeper
   [junit4]   2> 957417 INFO  (jetty-launcher-1313-thread-2) [    ] o.a.s.c.c.SolrZkClient Using default ZkACLProvider
   [junit4]   2> 957417 INFO  (jetty-launcher-1313-thread-1) [    ] o.a.s.c.c.ConnectionManager Waiting for client to connect to ZooKeeper
   [junit4]   2> 957417 INFO  (jetty-launcher-1313-thread-4) [    ] o.a.s.c.c.ConnectionManager Waiting for client to connect to ZooKeeper
   [junit4]   2> 957417 INFO  (zkCallback-1322-thread-1) [    ] o.a.s.c.c.ConnectionManager Watcher org.apache.solr.common.cloud.ConnectionManager@7c3abd8e name:ZooKeeperConnection Watcher:127.0.0.1:37192 got event WatchedEvent state:SyncConnected type:None path:null path:null type:None
   [junit4]   2> 957418 INFO  (jetty-launcher-1313-thread-3) [    ] o.a.s.c.c.ConnectionManager Client is connected to ZooKeeper
   [junit4]   2> 957418 INFO  (zkCallback-1331-thread-1) [    ] o.a.s.c.c.ConnectionManager Watcher org.apache.solr.common.cloud.ConnectionManager@52638b55 name:ZooKeeperConnection Watcher:127.0.0.1:37192 got event WatchedEvent state:SyncConnected type:None path:null path:null type:None
   [junit4]   2> 957418 INFO  (jetty-launcher-1313-thread-3) [    ] o.a.s.c.c.SolrZkClient Using default ZkACLProvider
   [junit4]   2> 957418 INFO  (jetty-launcher-1313-thread-4) [    ] o.a.s.c.c.ConnectionManager Client is connected to ZooKeeper
   [junit4]   2> 957418 INFO  (jetty-launcher-1313-thread-4) [    ] o.a.s.c.c.SolrZkClient Using default ZkACLProvider
   [junit4]   2> 957418 INFO  (zkCallback-1330-thread-1) [    ] o.a.s.c.c.ConnectionManager Watcher org.apache.solr.common.cloud.ConnectionManager@3059386d name:ZooKeeperConnection Watcher:127.0.0.1:37192 got event WatchedEvent state:SyncConnected type:None path:null path:null type:None
   [junit4]   2> 957418 INFO  (jetty-launcher-1313-thread-1) [    ] o.a.s.c.c.ConnectionManager Client is connected to ZooKeeper
   [junit4]   2> 957419 INFO  (jetty-launcher-1313-thread-1) [    ] o.a.s.c.c.SolrZkClient Using default ZkACLProvider
   [junit4]   2> 957419 WARN  (NIOServerCxn.Factory:0.0.0.0/0.0.0.0:0) [    ] o.a.z.s.NIOServerCnxn caught end of stream exception
   [junit4]   2> EndOfStreamException: Unable to read additional data from client sessionid 0x152991b81b90008, likely client has closed socket
   [junit4]   2> 	at org.apache.zookeeper.server.NIOServerCnxn.doIO(NIOServerCnxn.java:228)
   [junit4]   2> 	at org.apache.zookeeper.server.NIOServerCnxnFactory.run(NIOServerCnxnFactory.java:208)
   [junit4]   2> 	at java.lang.Thread.run(Thread.java:804)
   [junit4]   2> 957422 INFO  (jetty-launcher-1313-thread-3) [    ] o.a.s.c.c.ConnectionManager Waiting for client to connect to ZooKeeper
   [junit4]   2> 957422 INFO  (jetty-launcher-1313-thread-5) [    ] o.a.s.c.CorePropertiesLocator Config-defined core root directory: /home/jenkins/workspace/Lucene-Solr-trunk-Linux/solr/build/solr-core/test/J0/temp/solr.handler.PingRequestHandlerTest_81CBBD914B3EF598-001/tempDir-001/node5/.
   [junit4]   2> 957422 INFO  (jetty-launcher-1313-thread-5) [    ] o.a.s.c.CoreContainer New CoreContainer 1352567571
   [junit4]   2> 957422 INFO  (jetty-launcher-1313-thread-5) [    ] o.a.s.c.CoreContainer Loading cores into CoreContainer [instanceDir=/home/jenkins/workspace/Lucene-Solr-trunk-Linux/solr/build/solr-core/test/J0/temp/solr.handler.PingRequestHandlerTest_81CBBD914B3EF598-001/tempDir-001/node5]
   [junit4]   2> 957423 WARN  (jetty-launcher-1313-thread-5) [    ] o.a.s.c.CoreContainer Couldn't add files from /home/jenkins/workspace/Lucene-Solr-trunk-Linux/solr/build/solr-core/test/J0/temp/solr.handler.PingRequestHandlerTest_81CBBD914B3EF598-001/tempDir-001/node5/lib to classpath: /home/jenkins/workspace/Lucene-Solr-trunk-Linux/solr/build/solr-core/test/J0/temp/solr.handler.PingRequestHandlerTest_81CBBD914B3EF598-001/tempDir-001/node5/lib
   [junit4]   2> 957423 INFO  (jetty-launcher-1313-thread-5) [    ] o.a.s.h.c.HttpShardHandlerFactory created with socketTimeout : 90000,urlScheme : ,connTimeout : 15000,maxConnectionsPerHost : 20,maxConnections : 10000,corePoolSize : 0,maximumPoolSize : 2147483647,maxThreadIdleTime : 5,sizeOfQueue : -1,fairnessPolicy : false,useRetries : false,
   [junit4]   2> 957424 INFO  (jetty-launcher-1313-thread-5) [    ] o.a.s.u.UpdateShardHandler Creating UpdateShardHandler HTTP client with params: socketTimeout=340000&connTimeout=45000&retry=true
   [junit4]   2> 957424 INFO  (jetty-launcher-1313-thread-5) [    ] o.a.s.l.LogWatcher SLF4J impl is org.slf4j.impl.Log4jLoggerFactory
   [junit4]   2> 957424 INFO  (jetty-launcher-1313-thread-5) [    ] o.a.s.l.LogWatcher Registering Log Listener [Log4j (org.slf4j.impl.Log4jLoggerFactory)]
   [junit4]   2> 957424 INFO  (jetty-launcher-1313-thread-5) [    ] o.a.s.c.ZkContainer Zookeeper client=127.0.0.1:37192/solr
   [junit4]   2> 957424 INFO  (jetty-launcher-1313-thread-5) [    ] o.a.s.c.ZkController zkHost includes chroot
   [junit4]   2> 957424 INFO  (jetty-launcher-1313-thread-5) [    ] o.a.s.c.c.SolrZkClient Using default ZkCredentialsProvider
   [junit4]   2> 957425 INFO  (jetty-launcher-1313-thread-5) [    ] o.a.s.c.c.ConnectionManager Waiting for client to connect to ZooKeeper
   [junit4]   2> 957425 INFO  (jetty-launcher-1313-thread-2) [    ] o.a.s.c.c.ConnectionManager Waiting for client to connect to ZooKeeper
   [junit4]   2> 957425 INFO  (jetty-launcher-1313-thread-4) [    ] o.a.s.c.c.ConnectionManager Waiting for client to connect to ZooKeeper
   [junit4]   2> 957425 INFO  (jetty-launcher-1313-thread-1) [    ] o.a.s.c.c.ConnectionManager Waiting for client to connect to ZooKeeper
   [junit4]   2> 957431 INFO  (zkCallback-1332-thread-1) [    ] o.a.s.c.c.ConnectionManager Watcher org.apache.solr.common.cloud.ConnectionManager@397628cc name:ZooKeeperConnection Watcher:127.0.0.1:37192/solr got event WatchedEvent state:SyncConnected type:None path:null path:null type:None
   [junit4]   2> 957431 INFO  (jetty-launcher-1313-thread-3) [    ] o.a.s.c.c.ConnectionManager Client is connected to ZooKeeper
   [junit4]   2> 957432 INFO  (zkCallback-1333-thread-1) [    ] o.a.s.c.c.ConnectionManager Watcher org.apache.solr.common.cloud.ConnectionManager@6ce4ecdc name:ZooKeeperConnection Watcher:127.0.0.1:37192/solr got event WatchedEvent state:SyncConnected type:None path:null path:null type:None
   [junit4]   2> 957432 INFO  (zkCallback-1338-thread-1) [    ] o.a.s.c.c.ConnectionManager Watcher org.apache.solr.common.cloud.ConnectionManager@68be3228 name:ZooKeeperConnection Watcher:127.0.0.1:37192/solr got event WatchedEvent state:SyncConnected type:None path:null path:null type:None
   [junit4]   2> 957432 INFO  (jetty-launcher-1313-thread-2) [    ] o.a.s.c.c.ConnectionManager Client is connected to ZooKeeper
   [junit4]   2> 957432 INFO  (jetty-launcher-1313-thread-4) [    ] o.a.s.c.c.ConnectionManager Client is connected to ZooKeeper
   [junit4]   2> 957432 INFO  (zkCallback-1336-thread-1) [    ] o.a.s.c.c.ConnectionManager Watcher org.apache.solr.common.cloud.ConnectionManager@7281204f name:ZooKeeperConnection Watcher:127.0.0.1:37192 got event WatchedEvent state:SyncConnected type:None path:null path:null type:None
   [junit4]   2> 957432 INFO  (jetty-launcher-1313-thread-5) [    ] o.a.s.c.c.ConnectionManager Client is connected to ZooKeeper
   [junit4]   2> 957432 INFO  (jetty-launcher-1313-thread-5) [    ] o.a.s.c.c.SolrZkClient Using default ZkACLProvider
   [junit4]   2> 957433 INFO  (zkCallback-1337-thread-1) [    ] o.a.s.c.c.ConnectionManager Watcher org.apache.solr.common.cloud.ConnectionManager@3f32a5a0 name:ZooKeeperConnection Watcher:127.0.0.1:37192/solr got event WatchedEvent state:SyncConnected type:None path:null path:null type:None
   [junit4]   2> 957433 INFO  (jetty-launcher-1313-thread-1) [    ] o.a.s.c.c.ConnectionManager Client is connected to ZooKeeper
   [junit4]   2> 957433 INFO  (jetty-launcher-1313-thread-3) [    ] o.a.s.c.c.SolrZkClient makePath: /overseer/queue
   [junit4]   2> 957433 INFO  (jetty-launcher-1313-thread-4) [    ] o.a.s.c.c.SolrZkClient makePath: /overseer/queue
   [junit4]   2> 957434 INFO  (jetty-launcher-1313-thread-1) [    ] o.a.s.c.c.SolrZkClient makePath: /overseer/queue
   [junit4]   2> 957434 INFO  (jetty-launcher-1313-thread-2) [    ] o.a.s.c.c.SolrZkClient makePath: /overseer/queue
   [junit4]   2> 957434 INFO  (jetty-launcher-1313-thread-5) [    ] o.a.s.c.c.ConnectionManager Waiting for client to connect to ZooKeeper
   [junit4]   2> 957435 INFO  (jetty-launcher-1313-thread-3) [    ] o.a.s.c.c.SolrZkClient makePath: /overseer/collection-queue-work
   [junit4]   2> 957435 INFO  (jetty-launcher-1313-thread-4) [    ] o.a.s.c.c.SolrZkClient makePath: /overseer/collection-queue-work
   [junit4]   2> 957435 INFO  (jetty-launcher-1313-thread-1) [    ] o.a.s.c.c.SolrZkClient makePath: /overseer/collection-queue-work
   [junit4]   2> 957436 INFO  (zkCallback-1339-thread-1) [    ] o.a.s.c.c.ConnectionManager Watcher org.apache.solr.common.cloud.ConnectionManager@63e4f629 name:ZooKeeperConnection Watcher:127.0.0.1:37192/solr got event WatchedEvent state:SyncConnected type:None path:null path:null type:None
   [junit4]   2> 957436 INFO  (jetty-launcher-1313-thread-5) [    ] o.a.s.c.c.ConnectionManager Client is connected to ZooKeeper
   [junit4]   2> 957441 INFO  (jetty-launcher-1313-thread-1) [    ] o.a.s.c.c.SolrZkClient makePath: /overseer/collection-map-running
   [junit4]   2> 957441 INFO  (jetty-launcher-1313-thread-3) [    ] o.a.s.c.c.SolrZkClient makePath: /overseer/collection-map-running
   [junit4]   2> 957442 INFO  (jetty-launcher-1313-thread-4) [    ] o.a.s.c.c.SolrZkClient makePath: /overseer/collection-map-running
   [junit4]   2> 957442 INFO  (jetty-launcher-1313-thread-3) [    ] o.a.s.c.c.SolrZkClient makePath: /overseer/collection-map-completed
   [junit4]   2> 957442 INFO  (jetty-launcher-1313-thread-1) [    ] o.a.s.c.c.SolrZkClient makePath: /overseer/collection-map-completed
   [junit4]   2> 957444 INFO  (jetty-launcher-1313-thread-3) [    ] o.a.s.c.c.SolrZkClient makePath: /overseer/collection-map-failure
   [junit4]   2> 957444 INFO  (jetty-launcher-1313-thread-4) [    ] o.a.s.c.c.SolrZkClient makePath: /overseer/collection-map-failure
   [junit4]   2> 957444 INFO  (jetty-launcher-1313-thread-1) [    ] o.a.s.c.c.SolrZkClient makePath: /overseer/collection-map-failure
   [junit4]   2> 957446 INFO  (jetty-launcher-1313-thread-1) [    ] o.a.s.c.c.SolrZkClient makePath: /live_nodes
   [junit4]   2> 957446 INFO  (jetty-launcher-1313-thread-3) [    ] o.a.s.c.c.SolrZkClient makePath: /live_nodes
   [junit4]   2> 957447 INFO  (jetty-launcher-1313-thread-5) [    ] o.a.s.c.c.SolrZkClient makePath: /live_nodes
   [junit4]   2> 957447 INFO  (jetty-launcher-1313-thread-4) [    ] o.a.s.c.c.SolrZkClient makePath: /live_nodes
   [junit4]   2> 957447 INFO  (jetty-launcher-1313-thread-5) [    ] o.a.s.c.c.SolrZkClient makePath: /collections
   [junit4]   2> 957447 INFO  (jetty-launcher-1313-thread-1) [    ] o.a.s.c.c.SolrZkClient makePath: /collections
   [junit4]   2> 957447 INFO  (jetty-launcher-1313-thread-3) [    ] o.a.s.c.c.SolrZkClient makePath: /collections
   [junit4]   2> 957447 INFO  (jetty-launcher-1313-thread-4) [    ] o.a.s.c.c.SolrZkClient makePath: /collections
   [junit4]   2> 957448 INFO  (jetty-launcher-1313-thread-1) [    ] o.a.s.c.c.SolrZkClient makePath: /aliases.json
   [junit4]   2> 957448 INFO  (jetty-launcher-1313-thread-3) [    ] o.a.s.c.c.SolrZkClient makePath: /aliases.json
   [junit4]   2> 957449 INFO  (jetty-launcher-1313-thread-4) [    ] o.a.s.c.c.SolrZkClient makePath: /aliases.json
   [junit4]   2> 957449 INFO  (jetty-launcher-1313-thread-5) [    ] o.a.s.c.c.SolrZkClient makePath: /aliases.json
   [junit4]   2> 957449 INFO  (jetty-launcher-1313-thread-3) [    ] o.a.s.c.c.SolrZkClient makePath: /clusterstate.json
   [junit4]   2> 957449 INFO  (jetty-launcher-1313-thread-4) [    ] o.a.s.c.c.SolrZkClient makePath: /clusterstate.json
   [junit4]   2> 957449 INFO  (jetty-launcher-1313-thread-5) [    ] o.a.s.c.c.SolrZkClient makePath: /clusterstate.json
   [junit4]   2> 957451 INFO  (jetty-launcher-1313-thread-3) [    ] o.a.s.c.c.SolrZkClient makePath: /security.json
   [junit4]   2> 957451 INFO  (jetty-launcher-1313-thread-5) [    ] o.a.s.c.c.SolrZkClient makePath: /security.json
   [junit4]   2> 957451 INFO  (jetty-launcher-1313-thread-4) [    ] o.a.s.c.c.SolrZkClient makePath: /security.json
   [junit4]   2> 957451 INFO  (jetty-launcher-1313-thread-3) [    ] o.a.s.c.ZkController Register node as live in ZooKeeper:/live_nodes/127.0.0.1:48781_solr
   [junit4]   2> 957452 INFO  (jetty-launcher-1313-thread-5) [    ] o.a.s.c.ZkController Register node as live in ZooKeeper:/live_nodes/127.0.0.1:54915_solr
   [junit4]   2> 957452 INFO  (jetty-launcher-1313-thread-3) [    ] o.a.s.c.c.SolrZkClient makePath: /live_nodes/127.0.0.1:48781_solr
   [junit4]   2> 957452 INFO  (jetty-launcher-1313-thread-4) [    ] o.a.s.c.ZkController Register node as live in ZooKeeper:/live_nodes/127.0.0.1:40454_solr
   [junit4]   2> 957452 INFO  (jetty-launcher-1313-thread-5) [    ] o.a.s.c.c.SolrZkClient makePath: /live_nodes/127.0.0.1:54915_solr
   [junit4]   2> 957453 INFO  (jetty-launcher-1313-thread-2) [    ] o.a.s.c.ZkController Register node as live in ZooKeeper:/live_nodes/127.0.0.1:34852_solr
   [junit4]   2> 957453 INFO  (jetty-launcher-1313-thread-4) [    ] o.a.s.c.c.SolrZkClient makePath: /live_nodes/127.0.0.1:40454_solr
   [junit4]   2> 957453 INFO  (jetty-launcher-1313-thread-2) [    ] o.a.s.c.c.SolrZkClient makePath: /live_nodes/127.0.0.1:34852_solr
   [junit4]   2> 957454 INFO  (jetty-launcher-1313-thread-1) [    ] o.a.s.c.ZkController Register node as live in ZooKeeper:/live_nodes/127.0.0.1:40872_solr
   [junit4]   2> 957454 INFO  (jetty-launcher-1313-thread-3) [    ] o.a.s.c.c.SolrZkClient makePath: /overseer_elect
   [junit4]   2> 957455 INFO  (jetty-launcher-1313-thread-1) [    ] o.a.s.c.c.SolrZkClient makePath: /live_nodes/127.0.0.1:40872_solr
   [junit4]   2> 957455 INFO  (jetty-launcher-1313-thread-4) [    ] o.a.s.c.c.SolrZkClient makePath: /overseer_elect
   [junit4]   2> 957455 INFO  (jetty-launcher-1313-thread-2) [    ] o.a.s.c.c.SolrZkClient makePath: /overseer_elect/election
   [junit4]   2> 957456 INFO  (jetty-launcher-1313-thread-3) [    ] o.a.s.c.c.SolrZkClient makePath: /overseer_elect/election
   [junit4]   2> 957456 INFO  (jetty-launcher-1313-thread-4) [    ] o.a.s.c.c.SolrZkClient makePath: /overseer_elect/election
   [junit4]   2> 957457 INFO  (jetty-launcher-1313-thread-1) [    ] o.a.s.c.c.SolrZkClient makePath: /overseer_elect/election
   [junit4]   2> 957458 INFO  (jetty-launcher-1313-thread-4) [    ] o.a.s.c.Overseer Overseer (id=null) closing
   [junit4]   2> 957458 INFO  (jetty-launcher-1313-thread-3) [    ] o.a.s.c.Overseer Overseer (id=null) closing
   [junit4]   2> 957459 INFO  (jetty-launcher-1313-thread-1) [    ] o.a.s.c.Overseer Overseer (id=null) closing
   [junit4]   2> 957459 INFO  (jetty-launcher-1313-thread-4) [    ] o.a.s.c.LeaderElector Joined leadership election with path: /overseer_elect/election/95306885547753485-127.0.0.1:40454_solr-n_0000000000
   [junit4]   2> 957459 INFO  (jetty-launcher-1313-thread-3) [    ] o.a.s.c.LeaderElector Joined leadership election with path: /overseer_elect/election/95306885547753482-127.0.0.1:48781_solr-n_0000000001
   [junit4]   2> 957459 INFO  (jetty-launcher-1313-thread-2) [    ] o.a.s.c.Overseer Overseer (id=null) closing
   [junit4]   2> 957459 INFO  (jetty-launcher-1313-thread-1) [    ] o.a.s.c.LeaderElector Joined leadership election with path: /overseer_elect/election/95306885547753486-127.0.0.1:40872_solr-n_0000000002
   [junit4]   2> 957460 INFO  (jetty-launcher-1313-thread-3) [    ] o.a.s.c.LeaderElector Watching path /overseer_elect/election/95306885547753485-127.0.0.1:40454_solr-n_0000000000 to know if I could be the leader
   [junit4]   2> 957460 INFO  (jetty-launcher-1313-thread-3) [    ] o.a.s.c.c.ZkStateReader Updating cluster state from ZooKeeper... 
   [junit4]   2> 957460 INFO  (jetty-launcher-1313-thread-5) [    ] o.a.s.c.Overseer Overseer (id=null) closing
   [junit4]   2> 957460 INFO  (jetty-launcher-1313-thread-4) [    ] o.a.s.c.OverseerElectionContext I am going to be the leader 127.0.0.1:40454_solr
   [junit4]   2> 957460 INFO  (jetty-launcher-1313-thread-1) [    ] o.a.s.c.LeaderElector Watching path /overseer_elect/election/95306885547753482-127.0.0.1:48781_solr-n_0000000001 to know if I could be the leader
   [junit4]   2> 957460 INFO  (jetty-launcher-1313-thread-4) [    ] o.a.s.c.c.SolrZkClient makePath: /overseer_elect/leader
   [junit4]   2> 957460 INFO  (jetty-launcher-1313-thread-1) [    ] o.a.s.c.c.ZkStateReader Updating cluster state from ZooKeeper... 
   [junit4]   2> 957461 INFO  (jetty-launcher-1313-thread-5) [    ] o.a.s.c.LeaderElector Joined leadership election with path: /overseer_elect/election/95306885547753487-127.0.0.1:54915_solr-n_0000000004
   [junit4]   2> 957462 INFO  (jetty-launcher-1313-thread-2) [    ] o.a.s.c.LeaderElector Joined leadership election with path: /overseer_elect/election/95306885547753484-127.0.0.1:34852_solr-n_0000000003
   [junit4]   2> 957462 INFO  (jetty-launcher-1313-thread-5) [    ] o.a.s.c.LeaderElector Watching path /overseer_elect/election/95306885547753484-127.0.0.1:34852_solr-n_0000000003 to know if I could be the leader
   [junit4]   2> 957462 INFO  (jetty-launcher-1313-thread-5) [    ] o.a.s.c.c.ZkStateReader Updating cluster state from ZooKeeper... 
   [junit4]   2> 957468 INFO  (jetty-launcher-1313-thread-3) [    ] o.a.s.c.CoreContainer Security conf doesn't exist. Skipping setup for authorization module.
   [junit4]   2> 957468 INFO  (jetty-launcher-1313-thread-3) [    ] o.a.s.c.CoreContainer No authentication plugin used.
   [junit4]   2> 957468 INFO  (jetty-launcher-1313-thread-3) [    ] o.a.s.c.CorePropertiesLocator Looking for core definitions underneath /home/jenkins/workspace/Lucene-Solr-trunk-Linux/solr/build/solr-core/test/J0/temp/solr.handler.PingRequestHandlerTest_81CBBD914B3EF598-001/tempDir-001/node3/.
   [junit4]   2> 957468 INFO  (jetty-launcher-1313-thread-3) [    ] o.a.s.c.CorePropertiesLocator Found 0 core definitions
   [junit4]   2> 957469 INFO  (jetty-launcher-1313-thread-4) [    ] o.a.s.c.Overseer Overseer (id=95306885547753485-127.0.0.1:40454_solr-n_0000000000) starting
   [junit4]   2> 957471 INFO  (jetty-launcher-1313-thread-2) [    ] o.a.s.c.LeaderElector Watching path /overseer_elect/election/95306885547753486-127.0.0.1:40872_solr-n_0000000002 to know if I could be the leader
   [junit4]   2> 957472 INFO  (jetty-launcher-1313-thread-2) [    ] o.a.s.c.c.ZkStateReader Updating cluster state from ZooKeeper... 
   [junit4]   2> 957472 INFO  (jetty-launcher-1313-thread-3) [    ] o.a.s.s.SolrDispatchFilter user.dir=/home/jenkins/workspace/Lucene-Solr-trunk-Linux/solr/build/solr-core/test/J0
   [junit4]   2> 957472 INFO  (jetty-launcher-1313-thread-3) [    ] o.a.s.s.SolrDispatchFilter SolrDispatchFilter.init() done
   [junit4]   2> 957473 INFO  (jetty-launcher-1313-thread-4) [    ] o.a.s.c.c.SolrZkClient makePath: /overseer/queue-work
   [junit4]   2> 957478 INFO  (jetty-launcher-1313-thread-4) [    ] o.a.s.c.OverseerAutoReplicaFailoverThread Starting OverseerAutoReplicaFailoverThread autoReplicaFailoverWorkLoopDelay=10000 autoReplicaFailoverWaitAfterExpiration=30000 autoReplicaFailoverBadNodeExpiration=60000
   [junit4]   2> 957479 INFO  (OverseerCollectionConfigSetProcessor-95306885547753485-127.0.0.1:40454_solr-n_0000000000) [    ] o.a.s.c.OverseerTaskProcessor Process current queue of overseer operations
   [junit4]   2> 957479 INFO  (jetty-launcher-1313-thread-4) [    ] o.a.s.c.c.ZkStateReader Updating cluster state from ZooKeeper... 
   [junit4]   2> 957479 INFO  (OverseerStateUpdate-95306885547753485-127.0.0.1:40454_solr-n_0000000000) [    ] o.a.s.c.Overseer Starting to work on the main queue
   [junit4]   2> 957482 INFO  (jetty-launcher-1313-thread-1) [    ] o.a.s.c.CoreContainer Security conf doesn't exist. Skipping setup for authorization module.
   [junit4]   2> 957482 INFO  (jetty-launcher-1313-thread-1) [    ] o.a.s.c.CoreContainer No authentication plugin used.
   [junit4]   2> 957482 INFO  (jetty-launcher-1313-thread-1) [    ] o.a.s.c.CorePropertiesLocator Looking for core definitions underneath /home/jenkins/workspace/Lucene-Solr-trunk-Linux/solr/build/solr-core/test/J0/temp/solr.handler.PingRequestHandlerTest_81CBBD914B3EF598-001/tempDir-001/node1/.
   [junit4]   2> 957483 INFO  (jetty-launcher-1313-thread-1) [    ] o.a.s.c.CorePropertiesLocator Found 0 core definitions
   [junit4]   2> 957487 INFO  (jetty-launcher-1313-thread-1) [    ] o.a.s.s.SolrDispatchFilter user.dir=/home/jenkins/workspace/Lucene-Solr-trunk-Linux/solr/build/solr-core/test/J0
   [junit4]   2> 957487 INFO  (jetty-launcher-1313-thread-1) [    ] o.a.s.s.SolrDispatchFilter SolrDispatchFilter.init() done
   [junit4]   2> 957490 INFO  (jetty-launcher-1313-thread-5) [    ] o.a.s.c.CoreContainer Security conf doesn't exist. Skipping setup for authorization module.
   [junit4]   2> 957490 INFO  (jetty-launcher-1313-thread-5) [    ] o.a.s.c.CoreContainer No authentication plugin used.
   [junit4]   2> 957490 INFO  (jetty-launcher-1313-thread-4) [    ] o.a.s.c.CoreContainer Security conf doesn't exist. Skipping setup for authorization module.
   [junit4]   2> 957490 INFO  (jetty-launcher-1313-thread-4) [    ] o.a.s.c.CoreContainer No authentication plugin used.
   [junit4]   2> 957490 INFO  (jetty-launcher-1313-thread-5) [    ] o.a.s.c.CorePropertiesLocator Looking for core definitions underneath /home/jenkins/workspace/Lucene-Solr-trunk-Linux/solr/build/solr-core/test/J0/temp/solr.handler.PingRequestHandlerTest_81CBBD914B3EF598-001/tempDir-001/node5/.
   [junit4]   2> 957490 INFO  (jetty-launcher-1313-thread-5) [    ] o.a.s.c.CorePropertiesLocator Found 0 core definitions
   [junit4]   2> 957491 INFO  (jetty-launcher-1313-thread-4) [    ] o.a.s.c.CorePropertiesLocator Looking for core definitions underneath /home/jenkins/workspace/Lucene-Solr-trunk-Linux/solr/build/solr-core/test/J0/temp/solr.handler.PingRequestHandlerTest_81CBBD914B3EF598-001/tempDir-001/node4/.
   [junit4]   2> 957491 INFO  (jetty-launcher-1313-thread-4) [    ] o.a.s.c.CorePropertiesLocator Found 0 core definitions
   [junit4]   2> 957492 INFO  (jetty-launcher-1313-thread-5) [    ] o.a.s.s.SolrDispatchFilter user.dir=/home/jenkins/workspace/Lucene-Solr-trunk-Linux/solr/build/solr-core/test/J0
   [junit4]   2> 957492 INFO  (jetty-launcher-1313-thread-5) [    ] o.a.s.s.SolrDispatchFilter SolrDispatchFilter.init() done
   [junit4]   2> 957492 INFO  (jetty-launcher-1313-thread-4) [    ] o.a.s.s.SolrDispatchFilter user.dir=/home/jenkins/workspace/Lucene-Solr-trunk-Linux/solr/build/solr-core/test/J0
   [junit4]   2> 957492 INFO  (jetty-launcher-1313-thread-4) [    ] o.a.s.s.SolrDispatchFilter SolrDispatchFilter.init() done
   [junit4]   2> 957504 INFO  (jetty-launcher-1313-thread-2) [    ] o.a.s.c.CoreContainer Security conf doesn't exist. Skipping setup for authorization module.
   [junit4]   2> 957504 INFO  (jetty-launcher-1313-thread-2) [    ] o.a.s.c.CoreContainer No authentication plugin used.
   [junit4]   2> 957504 INFO  (jetty-launcher-1313-thread-2) [    ] o.a.s.c.CorePropertiesLocator Looking for core definitions underneath /home/jenkins/workspace/Lucene-Solr-trunk-Linux/solr/build/solr-core/test/J0/temp/solr.handler.PingRequestHandlerTest_81CBBD914B3EF598-001/tempDir-001/node2/.
   [junit4]   2> 957504 INFO  (jetty-launcher-1313-thread-2) [    ] o.a.s.c.CorePropertiesLocator Found 0 core definitions
   [junit4]   2> 957506 INFO  (jetty-launcher-1313-thread-2) [    ] o.a.s.s.SolrDispatchFilter user.dir=/home/jenkins/workspace/Lucene-Solr-trunk-Linux/solr/build/solr-core/test/J0
   [junit4]   2> 957506 INFO  (jetty-launcher-1313-thread-2) [    ] o.a.s.s.SolrDispatchFilter SolrDispatchFilter.init() done
   [junit4]   2> 957507 INFO  (TEST-PingRequestHandlerTest.testPingInClusterWithNoHealthCheck-seed#[81CBBD914B3EF598]) [    ] o.a.s.c.c.SolrZkClient Using default ZkCredentialsProvider
   [junit4]   2> 957520 INFO  (TEST-PingRequestHandlerTest.testPingInClusterWithNoHealthCheck-seed#[81CBBD914B3EF598]) [    ] o.a.s.c.c.ConnectionManager Waiting for client to connect to ZooKeeper
   [junit4]   2> 957521 INFO  (zkCallback-1340-thread-1) [    ] o.a.s.c.c.ConnectionManager Watcher org.apache.solr.common.cloud.ConnectionManager@31631efb name:ZooKeeperConnection Watcher:127.0.0.1:37192 got event WatchedEvent state:SyncConnected type:None path:null path:null type:None
   [junit4]   2> 957521 INFO  (TEST-PingRequestHandlerTest.testPingInClusterWithNoHealthCheck-seed#[81CBBD914B3EF598]) [    ] o.a.s.c.c.ConnectionManager Client is connected to ZooKeeper
   [junit4]   2> 957521 INFO  (TEST-PingRequestHandlerTest.testPingInClusterWithNoHealthCheck-seed#[81CBBD914B3EF598]) [    ] o.a.s.c.c.SolrZkClient Using default ZkACLProvider
   [junit4]   2> 957522 INFO  (TEST-PingRequestHandlerTest.testPingInClusterWithNoHealthCheck-seed#[81CBBD914B3EF598]) [    ] o.a.s.c.c.SolrZkClient Using default ZkCredentialsProvider
   [junit4]   2> 957523 INFO  (TEST-PingRequestHandlerTest.testPingInClusterWithNoHealthCheck-seed#[81CBBD914B3EF598]) [    ] o.a.s.c.c.ConnectionManager Waiting for client to connect to ZooKeeper
   [junit4]   2> 957524 INFO  (zkCallback-1342-thread-1) [    ] o.a.s.c.c.ConnectionManager Watcher org.apache.solr.common.cloud.ConnectionManager@4da1b00c name:ZooKeeperConnection Watcher:127.0.0.1:37192/solr got event WatchedEvent state:SyncConnected type:None path:null path:null type:None
   [junit4]   2> 957524 INFO  (TEST-PingRequestHandlerTest.testPingInClusterWithNoHealthCheck-seed#[81CBBD914B3EF598]) [    ] o.a.s.c.c.ConnectionManager Client is connected to ZooKeeper
   [junit4]   2> 957524 INFO  (TEST-PingRequestHandlerTest.testPingInClusterWithNoHealthCheck-seed#[81CBBD914B3EF598]) [    ] o.a.s.c.c.SolrZkClient Using default ZkACLProvider
   [junit4]   2> 957525 INFO  (TEST-PingRequestHandlerTest.testPingInClusterWithNoHealthCheck-seed#[81CBBD914B3EF598]) [    ] o.a.s.c.c.SolrZkClient makePath: /configs/solrCloudCollectionConfig/protwords.txt
   [junit4]   2> 957526 INFO  (TEST-PingRequestHandlerTest.testPingInClusterWithNoHealthCheck-seed#[81CBBD914B3EF598]) [    ] o.a.s.c.c.SolrZkClient makePath: /configs/solrCloudCollectionConfig/solrconfig-delaying-component.xml
   [junit4]   2> 957527 INFO  (TEST-PingRequestHandlerTest.testPingInClusterWithNoHealthCheck-seed#[81CBBD914B3EF598]) [    ] o.a.s.c.c.SolrZkClient makePath: /configs/solrCloudCollectionConfig/bad_solrconfig.xml
   [junit4]   2> 957528 INFO  (TEST-PingRequestHandlerTest.testPingInClusterWithNoHealthCheck-seed#[81CBBD914B3EF598]) [    ] o.a.s.c.c.SolrZkClient makePath: /configs/solrCloudCollectionConfig/solrconfig-nocache.xml
   [junit4]   2> 957528 INFO  (TEST-PingRequestHandlerTest.testPingInClusterWithNoHealthCheck-seed#[81CBBD914B3EF598]) [    ] o.a.s.c.c.SolrZkClient makePath: /configs/solrCloudCollectionConfig/solrconfig-implicitproperties.xml
   [junit4]   2> 957529 INFO  (TEST-PingRequestHandlerTest.testPingInClusterWithNoHealthCheck-seed#[81CBBD914B3EF598]) [    ] o.a.s.c.c.SolrZkClient makePath: /configs/solrCloudCollectionConfig/solrconfig-mergepolicy-legacy.xml
   [junit4]   2> 957530 INFO  (TEST-PingRequestHandlerTest.testPingInClusterWithNoHealthCheck-seed#[81CBBD914B3EF598]) [    ] o.a.s.c.c.SolrZkClient makePath: /configs/solrCloudCollectionConfig/bad-schema-uniquekey-uses-default.xml
   [junit4]   2> 957531 INFO  (TEST-PingRequestHandlerTest.testPingInClusterWithNoHealthCheck-seed#[81CBBD914B3EF598]) [    ] o.a.s.c.c.SolrZkClient makePath: /configs/solrCloudCollectionConfig/bad-schema-sim-default-has-no-explicit-sim.xml
   [junit4]   2> 957531 INFO  (TEST-PingRequestHandlerTest.testPingInClusterWithNoHealthCheck-seed#[81CBBD914B3EF598]) [    ] o.a.s.c.c.SolrZkClient makePath: /configs/solrCloudCollectionConfig/bad-schema-uniquekey-multivalued.xml
   [junit4]   2> 957532 INFO  (TEST-PingRequestHandlerTest.testPingInClusterWithNoHealthCheck-seed#[81CBBD914B3EF598]) [    ] o.a.s.c.c.SolrZkClient makePath: /configs/solrCloudCollectionConfig/analyzingInfixSuggest.txt
   [junit4]   2> 957533 INFO  (TEST-PingRequestHandlerTest.testPingInClusterWithNoHealthCheck-seed#[81CBBD914B3EF598]) [    ] o.a.s.c.c.SolrZkClient makePath: /configs/solrCloudCollectionConfig/missleading.extension.updateprocessor.js.txt
   [junit4]   2> 957533 INFO  (TEST-PingRequestHandlerTest.testPingInClusterWithNoHealthCheck-seed#[81CBBD914B3EF598]) [    ] o.a.s.c.c.SolrZkClient makePath: /configs/solrCloudCollectionConfig/bad-schema-multiple-asterisk-copyfield-source-should-fail-test.xml
   [junit4]   2> 957544 INFO  (TEST-PingRequestHandlerTest.testPingInClusterWithNoHealthCheck-seed#[81CBBD914B3EF598]) [    ] o.a.s.c.c.SolrZkClient makePath: /configs/solrCloudCollectionConfig/schema-replication2.xml
   [junit4]   2> 957544 INFO  (TEST-PingRequestHandlerTest.testPingInClusterWithNoHealthCheck-seed#[81CBBD914B3EF598]) [    ] o.a.s.c.c.SolrZkClient makePath: /configs/solrCloudCollectionConfig/solrconfig-infostream-logging.xml
   [junit4]   2> 957545 INFO  (TEST-PingRequestHandlerTest.testPingInClusterWithNoHealthCheck-seed#[81CBBD914B3EF598]) [    ] o.a.s.c.c.SolrZkClient makePath: /configs/solrCloudCollectionConfig/solrconfig-collapseqparser.xml
   [junit4]   2> 957546 INFO  (TEST-PingRequestHandlerTest.testPingInClusterWithNoHealthCheck-seed#[81CBBD914B3EF598]) [    ] o.a.s.c.c.SolrZkClient makePath: /configs/solrCloudCollectionConfig/bad-schema-currency-ft-bogus-code-in-xml.xml
   [junit4]   2> 957565 INFO  (TEST-PingRequestHandlerTest.testPingInClusterWithNoHealthCheck-seed#[81CBBD914B3EF598]) [    ] o.a.s.c.c.SolrZkClient makePath: /configs/solrCloudCollectionConfig/old_synonyms.txt
   [junit4]   2> 957566 INFO  (TEST-PingRequestHandlerTest.testPingInClusterWithNoHealthCheck-seed#[81CBBD914B3EF598]) [    ] o.a.s.c.c.SolrZkClient makePath: /configs/solrCloudCollectionConfig/enumsConfig.xml
   [junit4]   2> 957567 INFO  (TEST-PingRequestHandlerTest.testPingInClusterWithNoHealthCheck-seed#[81CBBD914B3EF598]) [    ] o.a.s.c.c.SolrZkClient makePath: /configs/solrCloudCollectionConfig/solrconfig-script-updateprocessor.xml
   [junit4]   2> 957567 INFO  (TEST-PingRequestHandlerTest.testPingInClusterWithNoHealthCheck-seed#[81CBBD914B3EF598]) [    ] o.a.s.c.c.SolrZkClient makePath: /configs/solrCloudCollectionConfig/schema-add-schema-fields-update-processor.xml
   [junit4]   2> 957568 INFO  (TEST-PingRequestHandlerTest.testPingInClusterWithNoHealthCheck-seed#[81CBBD914B3EF598]) [    ] o.a.s.c.c.SolrZkClient makePath: /configs/solrCloudCollectionConfig/bad-schema-sweetspot-both-tf.xml
   [junit4]   2> 957568 INFO  (TEST-PingRequestHandlerTest.testPingInClusterWithNoHealthCheck-seed#[81CBBD914B3EF598]) [    ] o.a.s.c.c.SolrZkClient makePath: /configs/solrCloudCollectionConfig/schema-phrasesuggest.xml
   [junit4]   2> 957569 INFO  (TEST-PingRequestHandlerTest.testPingInClusterWithNoHealthCheck-seed#[81CBBD914B3EF598]) [    ] o.a.s.c.c.SolrZkClient makePath: /configs/solrCloudCollectionConfig/solrconfig.xml
   [junit4]   2> 957570 INFO  (TEST-PingRequestHandlerTest.testPingInClusterWithNoHealthCheck-seed#[81CBBD914B3EF598]) [    ] o.a.s.c.c.SolrZkClient makePath: /configs/solrCloudCollectionConfig/solrconfig-delpolicy1.xml
   [junit4]   2> 957571 INFO  (TEST-PingRequestHandlerTest.testPingInClusterWithNoHealthCheck-seed#[81CBBD914B3EF598]) [    ] o.a.s.c.c.SolrZkClient makePath: /configs/solrCloudCollectionConfig/schema-sim.xml
   [junit4]   2> 957571 INFO  (TEST-PingRequestHandlerTest.testPingInClusterWithNoHealthCheck-seed#[81CBBD914B3EF598]) [    ] o.a.s.c.c.SolrZkClient makePath: /configs/solrCloudCollectionConfig/schema15.xml
   [junit4]   2> 957572 INFO  (TEST-PingRequestHandlerTest.testPingInClusterWithNoHealthCheck-seed#[81CBBD914B3EF598]) [    ] o.a.s.c.c.SolrZkClient makePath: /configs/solrCloudCollectionConfig/schema-sql.xml
   [junit4]   2> 957573 INFO  (TEST-PingRequestHandlerTest.testPingInClusterWithNoHealthCheck-seed#[81CBBD914B3EF598]) [    ] o.a.s.c.c.SolrZkClient makePath: /configs/solrCloudCollectionConfig/bad-schema-misplaced-asterisk-copyfield-source-should-fail-test.xml
   [junit4]   2> 957574 INFO  (TEST-PingRequestHandlerTest.testPingInClusterWithNoHealthCheck-seed#[81CBBD914B3EF598]) [    ] o.a.s.c.c.SolrZkClient makePath: /configs/solrCloudCollectionConfig/stemdict.txt
   [junit4]   2> 957575 INFO  (TEST-PingRequestHandlerTest.testPingInClusterWithNoHealthCheck-seed#[81CBBD914B3EF598]) [    ] o.a.s.c.c.SolrZkClient makePath: /configs/solrCloudCollectionConfig/hunspell-test.aff
   [junit4]   2> 957575 INFO  (TEST-PingRequestHandlerTest.testPingInClusterWithNoHealthCheck-seed#[81CBBD914B3EF598]) [    ] o.a.s.c.c.SolrZkClient makePath: /configs/solrCloudCollectionConfig/solrconfig-sql.xml
   [junit4]   2> 957576 INFO  (TEST-PingRequestHandlerTest.testPingInClusterWithNoHealthCheck-seed#[81CBBD914B3EF598]) [    ] o.a.s.c.c.SolrZkClient makePath: /configs/solrCloudCollectionConfig/solrconfig-spatial.xml
   [junit4]   2> 957577 INFO  (TEST-PingRequestHandlerTest.testPingInClusterWithNoHealthCheck-seed#[81CBBD914B3EF598]) [    ] o.a.s.c.c.SolrZkClient makePath: /configs/solrCloudCollectionConfig/solrconfig-slave1.xml
   [junit4]   2> 957578 INFO  (TEST-PingRequestHandlerTest.testPingInClusterWithNoHealthCheck-seed#[81CBBD914B3EF598]) [    ] o.a.s.c.c.SolrZkClient makePath: /configs/solrCloudCollectionConfig/bad-schema-dup-fieldType.xml
   [junit4]   2> 957587 INFO  (TEST-PingRequestHandlerTest.testPingInClusterWithNoHealthCheck-seed#[81CBBD914B3EF598]) [    ] o.a.s.c.c.SolrZkClient makePath: /configs/solrCloudCollectionConfig/bad-schema-external-filefield.xml
   [junit4]   2> 957588 INFO  (TEST-PingRequestHandlerTest.testPingInClusterWithNoHealthCheck-seed#[81CBBD914B3EF598]) [    ] o.a.s.c.c.SolrZkClient makePath: /configs/solrCloudCollectionConfig/solrconfig-query-parser-init.xml
   [junit4]   2> 957588 INFO  (TEST-PingRequestHandlerTest.testPingInClusterWithNoHealthCheck-seed#[81CBBD914B3EF598]) [    ] o.a.s.c.c.SolrZkClient makePath: /configs/solrCloudCollectionConfig/bad-solrconfig-nrtmode.xml
   [junit4]   2> 957589 INFO  (TEST-PingRequestHandlerTest.testPingInClusterWithNoHealthCheck-seed#[81CBBD914B3EF598]) [    ] o.a.s.c.c.SolrZkClient makePath: /configs/solrCloudCollectionConfig/schema-complex-phrase.xml
   [junit4]   2> 957596 INFO  (TEST-PingRequestHandlerTest.testPingInClusterWithNoHealthCheck-seed#[81CBBD914B3EF598]) [    ] o.a.s.c.c.SolrZkClient makePath: /configs/solrCloudCollectionConfig/conditional.updateprocessor.js
   [junit4]   2> 957598 INFO  (TEST-PingRequestHandlerTest.testPingInClusterWithNoHealthCheck-seed#[81CBBD914B3EF598]) [    ] o.a.s.c.c.SolrZkClient makePath: /configs/solrCloudCollectionConfig/bad-schema-analyzer-class-and-nested.xml
   [junit4]   2> 957599 INFO  (TEST-PingRequestHandlerTest.testPingInClusterWithNoHealthCheck-seed#[81CBBD914B3EF598]) [    ] o.a.s.c.c.SolrZkClient makePath: /configs/solrCloudCollectionConfig/schema-eff.xml
   [junit4]   2> 957600 INFO  (TEST-PingRequestHandlerTest.testPingInClusterWithNoHealthCheck-seed#[81CBBD914B3EF598]) [    ] o.a.s.c.c.SolrZkClient makePath: /configs/solrCloudCollectionConfig/schema-folding.xml
   [junit4]   2> 957601 INFO  (TEST-PingRequestHandlerTest.testPingInClusterWithNoHealthCheck-seed#[81CBBD914B3EF598]) [    ] o.a.s.c.c.SolrZkClient makePath: /configs/solrCloudCollectionConfig/schema-simpleqpplugin.xml
   [junit4]   2> 957602 INFO  (TEST-PingRequestHandlerTest.testPingInClusterWithNoHealthCheck-seed#[81CBBD914B3EF598]) [    ] o.a.s.c.c.SolrZkClient makePath: /configs/solrCloudCollectionConfig/solrconfig-hash.xml
   [junit4]   2> 957603 INFO  (TEST-PingRequestHandler

[...truncated too long message...]

tatus=0 QTime=0
   [junit4]   2> 965729 INFO  (TEST-PingRequestHandlerTest.testEnablingServer-seed#[81CBBD914B3EF598]) [    ] o.a.s.SolrTestCaseJ4 ###Ending testEnablingServer
   [junit4]   2> 965731 INFO  (TEST-PingRequestHandlerTest.testDisablingServer-seed#[81CBBD914B3EF598]) [    ] o.a.s.SolrTestCaseJ4 ###Starting testDisablingServer
   [junit4]   2> 965739 INFO  (TEST-PingRequestHandlerTest.testDisablingServer-seed#[81CBBD914B3EF598]) [    ] o.a.s.c.S.Request [collection1]  webapp=null path=null params={wt=xml} hits=0 status=0 QTime=0
   [junit4]   2> 965740 INFO  (TEST-PingRequestHandlerTest.testDisablingServer-seed#[81CBBD914B3EF598]) [    ] o.a.s.SolrTestCaseJ4 ###Ending testDisablingServer
   [junit4]   2> 965742 INFO  (TEST-PingRequestHandlerTest.testBadActionRaisesException-seed#[81CBBD914B3EF598]) [    ] o.a.s.SolrTestCaseJ4 ###Starting testBadActionRaisesException
   [junit4]   2> 965742 INFO  (TEST-PingRequestHandlerTest.testBadActionRaisesException-seed#[81CBBD914B3EF598]) [    ] o.a.s.SolrTestCaseJ4 ###Ending testBadActionRaisesException
   [junit4]   2> 965742 INFO  (SUITE-PingRequestHandlerTest-seed#[81CBBD914B3EF598]-worker) [    ] o.a.s.SolrTestCaseJ4 ###deleteCore
   [junit4]   2> 965742 INFO  (SUITE-PingRequestHandlerTest-seed#[81CBBD914B3EF598]-worker) [    ] o.a.s.c.CoreContainer Shutting down CoreContainer instance=225640179
   [junit4]   2> 965742 INFO  (SUITE-PingRequestHandlerTest-seed#[81CBBD914B3EF598]-worker) [    ] o.a.s.c.SolrCore [collection1]  CLOSING SolrCore org.apache.solr.core.SolrCore@378b1c2c
   [junit4]   2> 965742 INFO  (SUITE-PingRequestHandlerTest-seed#[81CBBD914B3EF598]-worker) [    ] o.a.s.u.DirectUpdateHandler2 closing DirectUpdateHandler2{commits=0,autocommits=0,soft autocommits=0,optimizes=0,rollbacks=0,expungeDeletes=0,docsPending=0,adds=0,deletesById=0,deletesByQuery=0,errors=0,cumulative_adds=0,cumulative_deletesById=0,cumulative_deletesByQuery=0,cumulative_errors=0,transaction_logs_total_size=0,transaction_logs_total_number=0}
   [junit4]   2> 965743 INFO  (SUITE-PingRequestHandlerTest-seed#[81CBBD914B3EF598]-worker) [    ] o.a.s.u.SolrCoreState Closing SolrCoreState
   [junit4]   2> 965743 INFO  (SUITE-PingRequestHandlerTest-seed#[81CBBD914B3EF598]-worker) [    ] o.a.s.u.DefaultSolrCoreState SolrCoreState ref count has reached 0 - closing IndexWriter
   [junit4]   2> 965743 INFO  (SUITE-PingRequestHandlerTest-seed#[81CBBD914B3EF598]-worker) [    ] o.a.s.u.DefaultSolrCoreState closing IndexWriter with IndexWriterCloser
   [junit4]   2> 965743 INFO  (SUITE-PingRequestHandlerTest-seed#[81CBBD914B3EF598]-worker) [    ] o.a.s.c.SolrCore [collection1] Closing main searcher on request.
   [junit4]   2> 965749 INFO  (SUITE-PingRequestHandlerTest-seed#[81CBBD914B3EF598]-worker) [    ] o.a.s.c.CachingDirectoryFactory Closing MockDirectoryFactory - 2 directories currently being tracked
   [junit4]   2> 965750 INFO  (SUITE-PingRequestHandlerTest-seed#[81CBBD914B3EF598]-worker) [    ] o.a.s.c.CachingDirectoryFactory looking to close /home/jenkins/workspace/Lucene-Solr-trunk-Linux/solr/build/solr-core/test/J0/temp/solr.handler.PingRequestHandlerTest_81CBBD914B3EF598-001/init-core-data-001/index [CachedDir<<refCount=0;path=/home/jenkins/workspace/Lucene-Solr-trunk-Linux/solr/build/solr-core/test/J0/temp/solr.handler.PingRequestHandlerTest_81CBBD914B3EF598-001/init-core-data-001/index;done=false>>]
   [junit4]   2> 965750 INFO  (SUITE-PingRequestHandlerTest-seed#[81CBBD914B3EF598]-worker) [    ] o.a.s.c.CachingDirectoryFactory Closing directory: /home/jenkins/workspace/Lucene-Solr-trunk-Linux/solr/build/solr-core/test/J0/temp/solr.handler.PingRequestHandlerTest_81CBBD914B3EF598-001/init-core-data-001/index
   [junit4]   2> 965750 INFO  (SUITE-PingRequestHandlerTest-seed#[81CBBD914B3EF598]-worker) [    ] o.a.s.c.CachingDirectoryFactory looking to close /home/jenkins/workspace/Lucene-Solr-trunk-Linux/solr/build/solr-core/test/J0/temp/solr.handler.PingRequestHandlerTest_81CBBD914B3EF598-001/init-core-data-001 [CachedDir<<refCount=0;path=/home/jenkins/workspace/Lucene-Solr-trunk-Linux/solr/build/solr-core/test/J0/temp/solr.handler.PingRequestHandlerTest_81CBBD914B3EF598-001/init-core-data-001;done=false>>]
   [junit4]   2> 965750 INFO  (SUITE-PingRequestHandlerTest-seed#[81CBBD914B3EF598]-worker) [    ] o.a.s.c.CachingDirectoryFactory Closing directory: /home/jenkins/workspace/Lucene-Solr-trunk-Linux/solr/build/solr-core/test/J0/temp/solr.handler.PingRequestHandlerTest_81CBBD914B3EF598-001/init-core-data-001
   [junit4]   2> NOTE: leaving temporary files on disk at: /home/jenkins/workspace/Lucene-Solr-trunk-Linux/solr/build/solr-core/test/J0/temp/solr.handler.PingRequestHandlerTest_81CBBD914B3EF598-001
   [junit4]   2> Jan 31, 2016 7:14:31 PM com.carrotsearch.randomizedtesting.ThreadLeakControl checkThreadLeaks
   [junit4]   2> WARNING: Will linger awaiting termination of 2 leaked thread(s).
   [junit4]   2> NOTE: test params are: codec=FastCompressingStoredFields(storedFieldsFormat=CompressingStoredFieldsFormat(compressionMode=FAST, chunkSize=10042, maxDocsPerChunk=788, blockSize=612), termVectorsFormat=CompressingTermVectorsFormat(compressionMode=FAST, chunkSize=10042, blockSize=612)), sim=RandomSimilarity(queryNorm=false,coord=no): {}, locale=mr-IN, timezone=America/Guyana
   [junit4]   2> NOTE: Linux 3.19.0-47-generic amd64/Oracle Corporation 9-ea (64-bit)/cpus=12,threads=1,free=228169368,total=524812288
   [junit4]   2> NOTE: All tests run in this JVM: [OverseerCollectionConfigSetProcessorTest, TestLMDirichletSimilarityFactory, TestRandomCollapseQParserPlugin, HdfsChaosMonkeyNothingIsSafeTest, BigEndianAscendingWordSerializerTest, TestReplicationHandler, DistributedFacetPivotWhiteBoxTest, DistributedQueryElevationComponentTest, TestBinaryField, TestFunctionQuery, PrimUtilsTest, TestJsonRequest, DisMaxRequestHandlerTest, ConnectionReuseTest, CloneFieldUpdateProcessorFactoryTest, QueryEqualityTest, ParsingFieldUpdateProcessorsTest, SystemInfoHandlerTest, TestCrossCoreJoin, TestCopyFieldCollectionResource, UUIDUpdateProcessorFallbackTest, LeaderElectionIntegrationTest, SyncSliceTest, TestFieldTypeCollectionResource, TestFaceting, RAMDirectoryFactoryTest, ExternalFileFieldSortTest, TestExclusionRuleCollectionAccess, TestJoin, TestFastOutputStream, TestLazyCores, TestRealTimeGet, TestMiniSolrCloudCluster, TestRTGBase, TestRawResponseWriter, TestConfig, SolrCoreTest, BlockJoinFacetDistribTest, MultiThreadedOCPTest, TestBadConfig, VersionInfoTest, InfoHandlerTest, PeerSyncTest, TestNRTOpen, TestLuceneMatchVersion, PolyFieldTest, TestFoldingMultitermQuery, DefaultValueUpdateProcessorTest, TestSchemaVersionResource, CurrencyFieldOpenExchangeTest, RequiredFieldsTest, TestCollapseQParserPlugin, TestAnalyzedSuggestions, CdcrReplicationDistributedZkTest, PreAnalyzedFieldTest, HdfsRestartWhileUpdatingTest, TestMacros, TestExactStatsCache, QueryElevationComponentTest, PKIAuthenticationIntegrationTest, TestReplicationHandlerBackup, IndexSchemaRuntimeFieldTest, TestSortingResponseWriter, DistribJoinFromCollectionTest, HdfsNNFailoverTest, DeleteInactiveReplicaTest, TestValueSourceCache, DocumentAnalysisRequestHandlerTest, ConjunctionSolrSpellCheckerTest, TestManagedSynonymFilterFactory, SuggestComponentContextFilterQueryTest, ResourceLoaderTest, AsyncCallRequestStatusResponseTest, CursorPagingTest, GraphQueryTest, JavabinLoaderTest, PathHierarchyTokenizerFactoryTest, TestConfigSetsAPI, TestDistributedSearch, TestCryptoKeys, DistributedDebugComponentTest, TestRandomDVFaceting, TestRTimerTree, TestImplicitCoreProperties, TestComponentsName, CoreAdminCreateDiscoverTest, TestDynamicFieldResource, TestClassicSimilarityFactory, RuleEngineTest, TestNoOpRegenerator, ActionThrottleTest, TestCloudInspectUtil, TestRandomFaceting, XsltUpdateRequestHandlerTest, TestManagedSchema, BasicZkTest, RecoveryZkTest, ZkCLITest, TermVectorComponentDistributedTest, TestStressVersions, TestRangeQuery, SimpleFacetsTest, SolrCmdDistributorTest, TestIndexSearcher, ShowFileRequestHandlerTest, CurrencyFieldXmlFileTest, AnalysisAfterCoreReloadTest, SignatureUpdateProcessorFactoryTest, SuggesterFSTTest, CoreAdminHandlerTest, SolrRequestParserTest, DocValuesTest, SuggesterTSTTest, SuggesterWFSTTest, TestPseudoReturnFields, FieldMutatingUpdateProcessorTest, DirectUpdateHandlerOptimizeTest, DistanceFunctionTest, DebugComponentTest, CacheHeaderTest, LukeRequestHandlerTest, TestQueryTypes, FileBasedSpellCheckerTest, TestIndexingPerformance, MoreLikeThisHandlerTest, TestSolrQueryParser, RegexBoostProcessorTest, TestJmxIntegration, ReturnFieldsTest, UniqFieldsUpdateProcessorFactoryTest, PingRequestHandlerTest]
   [junit4] Completed [375/577 (1!)] on J0 in 9.74s, 6 tests, 1 error <<< FAILURES!

[...truncated 699 lines...]
BUILD FAILED
/home/jenkins/workspace/Lucene-Solr-trunk-Linux/build.xml:740: The following error occurred while executing this line:
/home/jenkins/workspace/Lucene-Solr-trunk-Linux/build.xml:684: The following error occurred while executing this line:
/home/jenkins/workspace/Lucene-Solr-trunk-Linux/build.xml:59: The following error occurred while executing this line:
/home/jenkins/workspace/Lucene-Solr-trunk-Linux/solr/build.xml:233: The following error occurred while executing this line:
/home/jenkins/workspace/Lucene-Solr-trunk-Linux/solr/common-build.xml:524: The following error occurred while executing this line:
/home/jenkins/workspace/Lucene-Solr-trunk-Linux/lucene/common-build.xml:1457: The following error occurred while executing this line:
/home/jenkins/workspace/Lucene-Solr-trunk-Linux/lucene/common-build.xml:1014: There were test failures: 577 suites (8 ignored), 2318 tests, 1 error, 115 ignored (70 assumptions) [seed: 81CBBD914B3EF598]

Total time: 49 minutes 39 seconds
Build step 'Invoke Ant' marked build as failure
Archiving artifacts
[WARNINGS] Skipping publisher since build result is FAILURE
Recording test results
Email was triggered for: Failure - Any
Sending email for trigger: Failure - Any



Mime
View raw message