lucene-dev mailing list archives

Site index · List index
Message view « Date » · « Thread »
Top « Date » · « Thread »
From Policeman Jenkins Server <jenk...@thetaphi.de>
Subject [JENKINS-EA] Lucene-Solr-trunk-Linux (32bit/jdk-9-ea+95) - Build # 15521 - Failure!
Date Tue, 12 Jan 2016 01:28:37 GMT
Build: http://jenkins.thetaphi.de/job/Lucene-Solr-trunk-Linux/15521/
Java: 32bit/jdk-9-ea+95 -client -XX:+UseConcMarkSweepGC -XX:-CompactStrings

2 tests failed.
FAILED:  junit.framework.TestSuite.org.apache.solr.core.TestCoreContainer

Error Message:
Suite timeout exceeded (>= 7200000 msec).

Stack Trace:
java.lang.Exception: Suite timeout exceeded (>= 7200000 msec).
	at __randomizedtesting.SeedInfo.seed([56552133F49562C8]:0)


FAILED:  org.apache.solr.core.TestCoreContainer.testLogWatcherEnabledByDefault

Error Message:
Test abandoned because suite timeout was reached.

Stack Trace:
java.lang.Exception: Test abandoned because suite timeout was reached.
	at __randomizedtesting.SeedInfo.seed([56552133F49562C8]:0)




Build Log:
[...truncated 11493 lines...]
   [junit4] Suite: org.apache.solr.core.TestCoreContainer
   [junit4]   2> Creating dataDir: /home/jenkins/workspace/Lucene-Solr-trunk-Linux/solr/build/solr-core/test/J0/temp/solr.core.TestCoreContainer_56552133F49562C8-001/init-core-data-001
   [junit4]   2> 1238535 INFO  (SUITE-TestCoreContainer-seed#[56552133F49562C8]-worker) [    ] o.a.s.SolrTestCaseJ4 Randomized ssl (false) and clientAuth (false)
   [junit4]   2> 1238537 INFO  (TEST-TestCoreContainer.testCustomHandlers-seed#[56552133F49562C8]) [    ] o.a.s.SolrTestCaseJ4 ###Starting testCustomHandlers
   [junit4]   2> 1238537 INFO  (TEST-TestCoreContainer.testCustomHandlers-seed#[56552133F49562C8]) [    ] o.a.s.c.SolrResourceLoader new SolrResourceLoader for directory: '/home/jenkins/workspace/Lucene-Solr-trunk-Linux/solr/build/solr-core/test/J0/temp/solr.core.TestCoreContainer_56552133F49562C8-001/tempDir-001'
   [junit4]   2> 1238537 INFO  (TEST-TestCoreContainer.testCustomHandlers-seed#[56552133F49562C8]) [    ] o.a.s.c.SolrResourceLoader JNDI not configured for solr (NoInitialContextEx)
   [junit4]   2> 1238537 INFO  (TEST-TestCoreContainer.testCustomHandlers-seed#[56552133F49562C8]) [    ] o.a.s.c.SolrResourceLoader solr home defaulted to 'solr/' (could not find system property or JNDI)
   [junit4]   2> 1238541 INFO  (TEST-TestCoreContainer.testCustomHandlers-seed#[56552133F49562C8]) [    ] o.a.s.c.CorePropertiesLocator Config-defined core root directory: /home/jenkins/workspace/Lucene-Solr-trunk-Linux/solr/build/solr-core/test/J0/temp/solr.core.TestCoreContainer_56552133F49562C8-001/tempDir-001
   [junit4]   2> 1238541 INFO  (TEST-TestCoreContainer.testCustomHandlers-seed#[56552133F49562C8]) [    ] o.a.s.c.CoreContainer New CoreContainer 16565257
   [junit4]   2> 1238541 INFO  (TEST-TestCoreContainer.testCustomHandlers-seed#[56552133F49562C8]) [    ] o.a.s.c.CoreContainer Loading cores into CoreContainer [instanceDir=/home/jenkins/workspace/Lucene-Solr-trunk-Linux/solr/build/solr-core/test/J0/temp/solr.core.TestCoreContainer_56552133F49562C8-001/tempDir-001]
   [junit4]   2> 1238541 WARN  (TEST-TestCoreContainer.testCustomHandlers-seed#[56552133F49562C8]) [    ] o.a.s.c.CoreContainer Couldn't add files from /home/jenkins/workspace/Lucene-Solr-trunk-Linux/solr/build/solr-core/test/J0/temp/solr.core.TestCoreContainer_56552133F49562C8-001/tempDir-001/lib to classpath: /home/jenkins/workspace/Lucene-Solr-trunk-Linux/solr/build/solr-core/test/J0/temp/solr.core.TestCoreContainer_56552133F49562C8-001/tempDir-001/lib
   [junit4]   2> 1238541 INFO  (TEST-TestCoreContainer.testCustomHandlers-seed#[56552133F49562C8]) [    ] o.a.s.h.c.HttpShardHandlerFactory created with socketTimeout : 600000,connTimeout : 60000,maxConnectionsPerHost : 20,maxConnections : 10000,corePoolSize : 0,maximumPoolSize : 2147483647,maxThreadIdleTime : 5,sizeOfQueue : -1,fairnessPolicy : false,useRetries : false,
   [junit4]   2> 1238547 INFO  (TEST-TestCoreContainer.testCustomHandlers-seed#[56552133F49562C8]) [    ] o.a.s.u.UpdateShardHandler Creating UpdateShardHandler HTTP client with params: socketTimeout=600000&connTimeout=60000&retry=true
   [junit4]   2> 1238548 INFO  (TEST-TestCoreContainer.testCustomHandlers-seed#[56552133F49562C8]) [    ] o.a.s.l.LogWatcher SLF4J impl is org.slf4j.impl.Log4jLoggerFactory
   [junit4]   2> 1238548 INFO  (TEST-TestCoreContainer.testCustomHandlers-seed#[56552133F49562C8]) [    ] o.a.s.l.LogWatcher Registering Log Listener [Log4j (org.slf4j.impl.Log4jLoggerFactory)]
   [junit4]   2> 1238548 INFO  (TEST-TestCoreContainer.testCustomHandlers-seed#[56552133F49562C8]) [    ] o.a.s.c.CoreContainer Security conf doesn't exist. Skipping setup for authorization module.
   [junit4]   2> 1238548 INFO  (TEST-TestCoreContainer.testCustomHandlers-seed#[56552133F49562C8]) [    ] o.a.s.c.CoreContainer No authentication plugin used.
   [junit4]   2> 1238549 INFO  (TEST-TestCoreContainer.testCustomHandlers-seed#[56552133F49562C8]) [    ] o.a.s.c.CorePropertiesLocator Looking for core definitions underneath /home/jenkins/workspace/Lucene-Solr-trunk-Linux/solr/build/solr-core/test/J0/temp/solr.core.TestCoreContainer_56552133F49562C8-001/tempDir-001
   [junit4]   2> 1238549 INFO  (TEST-TestCoreContainer.testCustomHandlers-seed#[56552133F49562C8]) [    ] o.a.s.c.CorePropertiesLocator Found 0 core definitions
   [junit4]   2> 1238550 INFO  (TEST-TestCoreContainer.testCustomHandlers-seed#[56552133F49562C8]) [    ] o.a.s.c.CoreContainer Loading cores into CoreContainer [instanceDir=/home/jenkins/workspace/Lucene-Solr-trunk-Linux/solr/build/solr-core/test/J0/temp/solr.core.TestCoreContainer_56552133F49562C8-001/tempDir-001]
   [junit4]   2> 1238550 WARN  (TEST-TestCoreContainer.testCustomHandlers-seed#[56552133F49562C8]) [    ] o.a.s.c.CoreContainer Couldn't add files from /home/jenkins/workspace/Lucene-Solr-trunk-Linux/solr/build/solr-core/test/J0/temp/solr.core.TestCoreContainer_56552133F49562C8-001/tempDir-001/lib to classpath: /home/jenkins/workspace/Lucene-Solr-trunk-Linux/solr/build/solr-core/test/J0/temp/solr.core.TestCoreContainer_56552133F49562C8-001/tempDir-001/lib
   [junit4]   2> 1238550 INFO  (TEST-TestCoreContainer.testCustomHandlers-seed#[56552133F49562C8]) [    ] o.a.s.h.c.HttpShardHandlerFactory created with socketTimeout : 600000,connTimeout : 60000,maxConnectionsPerHost : 20,maxConnections : 10000,corePoolSize : 0,maximumPoolSize : 2147483647,maxThreadIdleTime : 5,sizeOfQueue : -1,fairnessPolicy : false,useRetries : false,
   [junit4]   2> 1238551 INFO  (TEST-TestCoreContainer.testCustomHandlers-seed#[56552133F49562C8]) [    ] o.a.s.u.UpdateShardHandler Creating UpdateShardHandler HTTP client with params: socketTimeout=600000&connTimeout=60000&retry=true
   [junit4]   2> 1238552 INFO  (TEST-TestCoreContainer.testCustomHandlers-seed#[56552133F49562C8]) [    ] o.a.s.l.LogWatcher SLF4J impl is org.slf4j.impl.Log4jLoggerFactory
   [junit4]   2> 1238552 INFO  (TEST-TestCoreContainer.testCustomHandlers-seed#[56552133F49562C8]) [    ] o.a.s.l.LogWatcher Registering Log Listener [Log4j (org.slf4j.impl.Log4jLoggerFactory)]
   [junit4]   2> 1238552 INFO  (TEST-TestCoreContainer.testCustomHandlers-seed#[56552133F49562C8]) [    ] o.a.s.c.CoreContainer Security conf doesn't exist. Skipping setup for authorization module.
   [junit4]   2> 1238552 INFO  (TEST-TestCoreContainer.testCustomHandlers-seed#[56552133F49562C8]) [    ] o.a.s.c.CoreContainer No authentication plugin used.
   [junit4]   2> 1238552 INFO  (TEST-TestCoreContainer.testCustomHandlers-seed#[56552133F49562C8]) [    ] o.a.s.c.CorePropertiesLocator Looking for core definitions underneath /home/jenkins/workspace/Lucene-Solr-trunk-Linux/solr/build/solr-core/test/J0/temp/solr.core.TestCoreContainer_56552133F49562C8-001/tempDir-001
   [junit4]   2> 1238552 INFO  (TEST-TestCoreContainer.testCustomHandlers-seed#[56552133F49562C8]) [    ] o.a.s.c.CorePropertiesLocator Found 0 core definitions
   [junit4]   2> 1238556 INFO  (TEST-TestCoreContainer.testCustomHandlers-seed#[56552133F49562C8]) [    ] o.a.s.c.CoreContainer Shutting down CoreContainer instance=16565257
   [junit4]   2> 1238556 INFO  (TEST-TestCoreContainer.testCustomHandlers-seed#[56552133F49562C8]) [    ] o.a.s.SolrTestCaseJ4 ###Ending testCustomHandlers
   [junit4]   2> 1238557 INFO  (TEST-TestCoreContainer.testClassLoaderHierarchy-seed#[56552133F49562C8]) [    ] o.a.s.SolrTestCaseJ4 ###Starting testClassLoaderHierarchy
   [junit4]   2> 1238558 INFO  (TEST-TestCoreContainer.testClassLoaderHierarchy-seed#[56552133F49562C8]) [    ] o.a.s.c.SolrResourceLoader new SolrResourceLoader for directory: '/home/jenkins/workspace/Lucene-Solr-trunk-Linux/solr/build/solr-core/test/J0/temp/solr.core.TestCoreContainer_56552133F49562C8-001/tempDir-002'
   [junit4]   2> 1238558 INFO  (TEST-TestCoreContainer.testClassLoaderHierarchy-seed#[56552133F49562C8]) [    ] o.a.s.c.SolrResourceLoader JNDI not configured for solr (NoInitialContextEx)
   [junit4]   2> 1238558 INFO  (TEST-TestCoreContainer.testClassLoaderHierarchy-seed#[56552133F49562C8]) [    ] o.a.s.c.SolrResourceLoader solr home defaulted to 'solr/' (could not find system property or JNDI)
   [junit4]   2> 1238561 INFO  (TEST-TestCoreContainer.testClassLoaderHierarchy-seed#[56552133F49562C8]) [    ] o.a.s.c.CorePropertiesLocator Config-defined core root directory: /home/jenkins/workspace/Lucene-Solr-trunk-Linux/solr/build/solr-core/test/J0/temp/solr.core.TestCoreContainer_56552133F49562C8-001/tempDir-002
   [junit4]   2> 1238562 INFO  (TEST-TestCoreContainer.testClassLoaderHierarchy-seed#[56552133F49562C8]) [    ] o.a.s.c.CoreContainer New CoreContainer 11219336
   [junit4]   2> 1238562 INFO  (TEST-TestCoreContainer.testClassLoaderHierarchy-seed#[56552133F49562C8]) [    ] o.a.s.c.CoreContainer Loading cores into CoreContainer [instanceDir=/home/jenkins/workspace/Lucene-Solr-trunk-Linux/solr/build/solr-core/test/J0/temp/solr.core.TestCoreContainer_56552133F49562C8-001/tempDir-002]
   [junit4]   2> 1238562 WARN  (TEST-TestCoreContainer.testClassLoaderHierarchy-seed#[56552133F49562C8]) [    ] o.a.s.c.CoreContainer Couldn't add files from /home/jenkins/workspace/Lucene-Solr-trunk-Linux/solr/build/solr-core/test/J0/temp/solr.core.TestCoreContainer_56552133F49562C8-001/tempDir-002/lib to classpath: /home/jenkins/workspace/Lucene-Solr-trunk-Linux/solr/build/solr-core/test/J0/temp/solr.core.TestCoreContainer_56552133F49562C8-001/tempDir-002/lib
   [junit4]   2> 1238562 INFO  (TEST-TestCoreContainer.testClassLoaderHierarchy-seed#[56552133F49562C8]) [    ] o.a.s.h.c.HttpShardHandlerFactory created with socketTimeout : 600000,connTimeout : 60000,maxConnectionsPerHost : 20,maxConnections : 10000,corePoolSize : 0,maximumPoolSize : 2147483647,maxThreadIdleTime : 5,sizeOfQueue : -1,fairnessPolicy : false,useRetries : false,
   [junit4]   2> 1238563 INFO  (TEST-TestCoreContainer.testClassLoaderHierarchy-seed#[56552133F49562C8]) [    ] o.a.s.u.UpdateShardHandler Creating UpdateShardHandler HTTP client with params: socketTimeout=600000&connTimeout=60000&retry=true
   [junit4]   2> 1238563 INFO  (TEST-TestCoreContainer.testClassLoaderHierarchy-seed#[56552133F49562C8]) [    ] o.a.s.l.LogWatcher SLF4J impl is org.slf4j.impl.Log4jLoggerFactory
   [junit4]   2> 1238563 INFO  (TEST-TestCoreContainer.testClassLoaderHierarchy-seed#[56552133F49562C8]) [    ] o.a.s.l.LogWatcher Registering Log Listener [Log4j (org.slf4j.impl.Log4jLoggerFactory)]
   [junit4]   2> 1238563 INFO  (TEST-TestCoreContainer.testClassLoaderHierarchy-seed#[56552133F49562C8]) [    ] o.a.s.c.CoreContainer Security conf doesn't exist. Skipping setup for authorization module.
   [junit4]   2> 1238563 INFO  (TEST-TestCoreContainer.testClassLoaderHierarchy-seed#[56552133F49562C8]) [    ] o.a.s.c.CoreContainer No authentication plugin used.
   [junit4]   2> 1238564 INFO  (TEST-TestCoreContainer.testClassLoaderHierarchy-seed#[56552133F49562C8]) [    ] o.a.s.c.CorePropertiesLocator Looking for core definitions underneath /home/jenkins/workspace/Lucene-Solr-trunk-Linux/solr/build/solr-core/test/J0/temp/solr.core.TestCoreContainer_56552133F49562C8-001/tempDir-002
   [junit4]   2> 1238564 INFO  (TEST-TestCoreContainer.testClassLoaderHierarchy-seed#[56552133F49562C8]) [    ] o.a.s.c.CorePropertiesLocator Found 0 core definitions
   [junit4]   2> 1238564 INFO  (TEST-TestCoreContainer.testClassLoaderHierarchy-seed#[56552133F49562C8]) [    ] o.a.s.c.CoreDescriptor Created CoreDescriptor: {name=core1, config=solrconfig.xml, loadOnStartup=true, schema=schema.xml, configSetProperties=configsetprops.json, transient=false, dataDir=data/, configSet=minimal}
   [junit4]   2> 1238565 INFO  (TEST-TestCoreContainer.testClassLoaderHierarchy-seed#[56552133F49562C8]) [    ] o.a.s.c.SolrResourceLoader new SolrResourceLoader for directory: '/home/jenkins/workspace/Lucene-Solr-trunk-Linux/solr/core/src/test-files/solr/configsets/minimal'
   [junit4]   2> 1238565 INFO  (TEST-TestCoreContainer.testClassLoaderHierarchy-seed#[56552133F49562C8]) [    ] o.a.s.c.SolrResourceLoader JNDI not configured for solr (NoInitialContextEx)
   [junit4]   2> 1238565 INFO  (TEST-TestCoreContainer.testClassLoaderHierarchy-seed#[56552133F49562C8]) [    ] o.a.s.c.SolrResourceLoader solr home defaulted to 'solr/' (could not find system property or JNDI)
   [junit4]   2> 1238569 INFO  (TEST-TestCoreContainer.testClassLoaderHierarchy-seed#[56552133F49562C8]) [    ] o.a.s.c.SolrConfig current version of requestparams : -1
   [junit4]   2> 1238572 INFO  (TEST-TestCoreContainer.testClassLoaderHierarchy-seed#[56552133F49562C8]) [    ] o.a.s.c.SolrConfig Using Lucene MatchVersion: 6.0.0
   [junit4]   2> 1238575 INFO  (TEST-TestCoreContainer.testClassLoaderHierarchy-seed#[56552133F49562C8]) [    ] o.a.s.c.SolrConfig Loaded SolrConfig: solrconfig.xml
   [junit4]   2> 1238578 INFO  (TEST-TestCoreContainer.testClassLoaderHierarchy-seed#[56552133F49562C8]) [    ] o.a.s.s.IndexSchema [core1] Schema name=minimal
   [junit4]   2> 1238580 WARN  (TEST-TestCoreContainer.testClassLoaderHierarchy-seed#[56552133F49562C8]) [    ] o.a.s.s.IndexSchema no uniqueKey specified in schema.
   [junit4]   2> 1238581 INFO  (TEST-TestCoreContainer.testClassLoaderHierarchy-seed#[56552133F49562C8]) [    ] o.a.s.c.ConfigSetProperties Did not find ConfigSet properties, assuming default properties: Can't find resource 'configsetprops.json' in classpath or '/home/jenkins/workspace/Lucene-Solr-trunk-Linux/solr/core/src/test-files/solr/configsets/minimal'
   [junit4]   2> 1238581 INFO  (TEST-TestCoreContainer.testClassLoaderHierarchy-seed#[56552133F49562C8]) [    ] o.a.s.c.CoreContainer Creating SolrCore 'core1' using configuration from configset /home/jenkins/workspace/Lucene-Solr-trunk-Linux/solr/core/src/test-files/solr/configsets/minimal
   [junit4]   2> 1238582 INFO  (TEST-TestCoreContainer.testClassLoaderHierarchy-seed#[56552133F49562C8]) [    ] o.a.s.c.SolrCore org.apache.solr.core.MockDirectoryFactory
   [junit4]   2> 1238582 INFO  (TEST-TestCoreContainer.testClassLoaderHierarchy-seed#[56552133F49562C8]) [    ] o.a.s.c.SolrCore [[core1] ] Opening new SolrCore at [/home/jenkins/workspace/Lucene-Solr-trunk-Linux/solr/core/src/test-files/solr/configsets/minimal], dataDir=[/home/jenkins/workspace/Lucene-Solr-trunk-Linux/solr/build/solr-core/test/J0/temp/solr.core.TestCoreContainer_56552133F49562C8-001/tempDir-002/core1/data/]
   [junit4]   2> 1238582 INFO  (TEST-TestCoreContainer.testClassLoaderHierarchy-seed#[56552133F49562C8]) [    ] o.a.s.c.SolrCore JMX monitoring not detected for core: core1
   [junit4]   2> 1238583 INFO  (TEST-TestCoreContainer.testClassLoaderHierarchy-seed#[56552133F49562C8]) [    ] o.a.s.c.CachingDirectoryFactory return new directory for /home/jenkins/workspace/Lucene-Solr-trunk-Linux/solr/build/solr-core/test/J0/temp/solr.core.TestCoreContainer_56552133F49562C8-001/tempDir-002/core1/data
   [junit4]   2> 1238583 INFO  (TEST-TestCoreContainer.testClassLoaderHierarchy-seed#[56552133F49562C8]) [    ] o.a.s.c.SolrCore New index directory detected: old=null new=/home/jenkins/workspace/Lucene-Solr-trunk-Linux/solr/build/solr-core/test/J0/temp/solr.core.TestCoreContainer_56552133F49562C8-001/tempDir-002/core1/data/index/
   [junit4]   2> 1238583 WARN  (TEST-TestCoreContainer.testClassLoaderHierarchy-seed#[56552133F49562C8]) [    ] o.a.s.c.SolrCore [core1] Solr index directory '/home/jenkins/workspace/Lucene-Solr-trunk-Linux/solr/build/solr-core/test/J0/temp/solr.core.TestCoreContainer_56552133F49562C8-001/tempDir-002/core1/data/index' doesn't exist. Creating new index...
   [junit4]   2> 1238584 INFO  (TEST-TestCoreContainer.testClassLoaderHierarchy-seed#[56552133F49562C8]) [    ] o.a.s.c.CachingDirectoryFactory return new directory for /home/jenkins/workspace/Lucene-Solr-trunk-Linux/solr/build/solr-core/test/J0/temp/solr.core.TestCoreContainer_56552133F49562C8-001/tempDir-002/core1/data/index
   [junit4]   2> 1238584 INFO  (TEST-TestCoreContainer.testClassLoaderHierarchy-seed#[56552133F49562C8]) [    ] o.a.s.c.SolrDeletionPolicy SolrDeletionPolicy.onCommit: commits: num=1
   [junit4]   2> 	commit{dir=MockDirectoryWrapper(RAMDirectory@1c69f21 lockFactory=org.apache.lucene.store.SingleInstanceLockFactory@e10d83),segFN=segments_1,generation=1}
   [junit4]   2> 1238584 INFO  (TEST-TestCoreContainer.testClassLoaderHierarchy-seed#[56552133F49562C8]) [    ] o.a.s.c.SolrDeletionPolicy newest commit generation = 1
   [junit4]   2> 1238585 INFO  (OldIndexDirectoryCleanupThreadForCore-core1) [    ] o.a.s.c.SolrCore Looking for old index directories to cleanup for core core1 in /home/jenkins/workspace/Lucene-Solr-trunk-Linux/solr/build/solr-core/test/J0/temp/solr.core.TestCoreContainer_56552133F49562C8-001/tempDir-002/core1/data/
   [junit4]   2> 1238585 WARN  (OldIndexDirectoryCleanupThreadForCore-core1) [    ] o.a.s.c.DirectoryFactory /home/jenkins/workspace/Lucene-Solr-trunk-Linux/solr/build/solr-core/test/J0/temp/solr.core.TestCoreContainer_56552133F49562C8-001/tempDir-002/core1/data/ does not point to a valid data directory; skipping clean-up of old index directories.
   [junit4]   2> 1238586 INFO  (TEST-TestCoreContainer.testClassLoaderHierarchy-seed#[56552133F49562C8]) [    ] o.a.s.c.SolrCore no updateRequestProcessorChain defined as default, creating implicit default
   [junit4]   2> 1238587 INFO  (TEST-TestCoreContainer.testClassLoaderHierarchy-seed#[56552133F49562C8]) [    ] o.a.s.h.l.XMLLoader xsltCacheLifetimeSeconds=60
   [junit4]   2> 1238588 INFO  (TEST-TestCoreContainer.testClassLoaderHierarchy-seed#[56552133F49562C8]) [    ] o.a.s.h.l.XMLLoader xsltCacheLifetimeSeconds=60
   [junit4]   2> 1238589 INFO  (TEST-TestCoreContainer.testClassLoaderHierarchy-seed#[56552133F49562C8]) [    ] o.a.s.h.l.XMLLoader xsltCacheLifetimeSeconds=60
   [junit4]   2> 1238590 INFO  (TEST-TestCoreContainer.testClassLoaderHierarchy-seed#[56552133F49562C8]) [    ] o.a.s.h.l.XMLLoader xsltCacheLifetimeSeconds=60
   [junit4]   2> 1238590 INFO  (TEST-TestCoreContainer.testClassLoaderHierarchy-seed#[56552133F49562C8]) [    ] o.a.s.c.RequestHandlers Registered paths: /admin/mbeans,/update/csv,/sql,/update/json/docs,/admin/luke,/export,/select,/admin/segments,/get,/admin/system,/replication,/admin/properties,/config,/stream,/schema,/admin/plugins,/admin/logging,/update/json,/admin/threads,/admin/ping,/update,/admin/file
   [junit4]   2> 1238591 INFO  (TEST-TestCoreContainer.testClassLoaderHierarchy-seed#[56552133F49562C8]) [    ] o.a.s.c.SolrCore Using default statsCache cache: org.apache.solr.search.stats.LocalStatsCache
   [junit4]   2> 1238591 INFO  (TEST-TestCoreContainer.testClassLoaderHierarchy-seed#[56552133F49562C8]) [    ] o.a.s.u.CommitTracker Hard AutoCommit: disabled
   [junit4]   2> 1238591 INFO  (TEST-TestCoreContainer.testClassLoaderHierarchy-seed#[56552133F49562C8]) [    ] o.a.s.u.CommitTracker Soft AutoCommit: disabled
   [junit4]   2> 1238591 INFO  (TEST-TestCoreContainer.testClassLoaderHierarchy-seed#[56552133F49562C8]) [    ] o.a.s.c.SolrDeletionPolicy SolrDeletionPolicy.onInit: commits: num=1
   [junit4]   2> 	commit{dir=MockDirectoryWrapper(RAMDirectory@1c69f21 lockFactory=org.apache.lucene.store.SingleInstanceLockFactory@e10d83),segFN=segments_1,generation=1}
   [junit4]   2> 1238592 INFO  (TEST-TestCoreContainer.testClassLoaderHierarchy-seed#[56552133F49562C8]) [    ] o.a.s.c.SolrDeletionPolicy newest commit generation = 1
   [junit4]   2> 1238592 INFO  (TEST-TestCoreContainer.testClassLoaderHierarchy-seed#[56552133F49562C8]) [    ] o.a.s.s.SolrIndexSearcher Opening [Searcher@1988e94[core1] main]
   [junit4]   2> 1238592 WARN  (TEST-TestCoreContainer.testClassLoaderHierarchy-seed#[56552133F49562C8]) [    ] o.a.s.r.ManagedResourceStorage Cannot write to config directory /home/jenkins/workspace/Lucene-Solr-trunk-Linux/solr/core/src/test-files/solr/configsets/minimal/conf; switching to use InMemory storage instead.
   [junit4]   2> 1238592 INFO  (TEST-TestCoreContainer.testClassLoaderHierarchy-seed#[56552133F49562C8]) [    ] o.a.s.r.RestManager Initializing RestManager with initArgs: {}
   [junit4]   2> 1238592 INFO  (TEST-TestCoreContainer.testClassLoaderHierarchy-seed#[56552133F49562C8]) [    ] o.a.s.r.ManagedResourceStorage Reading _rest_managed.json using InMemoryStorage
   [junit4]   2> 1238592 INFO  (TEST-TestCoreContainer.testClassLoaderHierarchy-seed#[56552133F49562C8]) [    ] o.a.s.r.RestManager Initializing 0 registered ManagedResources
   [junit4]   2> 1238592 INFO  (TEST-TestCoreContainer.testClassLoaderHierarchy-seed#[56552133F49562C8]) [    ] o.a.s.h.ReplicationHandler Commits will be reserved for  10000
   [junit4]   2> 1238592 INFO  (searcherExecutor-4330-thread-1) [    ] o.a.s.c.SolrCore [core1] Registered new searcher Searcher@1988e94[core1] main{ExitableDirectoryReader(UninvertingDirectoryReader())}
   [junit4]   2> 1238593 INFO  (TEST-TestCoreContainer.testClassLoaderHierarchy-seed#[56552133F49562C8]) [    ] o.a.s.c.CoreContainer registering core: core1
   [junit4]   2> 1238593 INFO  (TEST-TestCoreContainer.testClassLoaderHierarchy-seed#[56552133F49562C8]) [    ] o.a.s.c.CoreContainer Shutting down CoreContainer instance=11219336
   [junit4]   2> 1238594 INFO  (TEST-TestCoreContainer.testClassLoaderHierarchy-seed#[56552133F49562C8]) [    ] o.a.s.c.SolrCore [core1]  CLOSING SolrCore org.apache.solr.core.SolrCore@125a8e3
   [junit4]   2> 1238594 INFO  (TEST-TestCoreContainer.testClassLoaderHierarchy-seed#[56552133F49562C8]) [    ] o.a.s.u.DirectUpdateHandler2 closing DirectUpdateHandler2{commits=0,autocommits=0,soft autocommits=0,optimizes=0,rollbacks=0,expungeDeletes=0,docsPending=0,adds=0,deletesById=0,deletesByQuery=0,errors=0,cumulative_adds=0,cumulative_deletesById=0,cumulative_deletesByQuery=0,cumulative_errors=0}
   [junit4]   2> 1238594 INFO  (TEST-TestCoreContainer.testClassLoaderHierarchy-seed#[56552133F49562C8]) [    ] o.a.s.u.SolrCoreState Closing SolrCoreState
   [junit4]   2> 1238594 INFO  (TEST-TestCoreContainer.testClassLoaderHierarchy-seed#[56552133F49562C8]) [    ] o.a.s.u.DefaultSolrCoreState SolrCoreState ref count has reached 0 - closing IndexWriter
   [junit4]   2> 1238594 INFO  (TEST-TestCoreContainer.testClassLoaderHierarchy-seed#[56552133F49562C8]) [    ] o.a.s.u.DefaultSolrCoreState closing IndexWriter with IndexWriterCloser
   [junit4]   2> 1238594 INFO  (TEST-TestCoreContainer.testClassLoaderHierarchy-seed#[56552133F49562C8]) [    ] o.a.s.c.SolrCore [core1] Closing main searcher on request.
   [junit4]   2> 1238594 INFO  (TEST-TestCoreContainer.testClassLoaderHierarchy-seed#[56552133F49562C8]) [    ] o.a.s.c.CachingDirectoryFactory Closing MockDirectoryFactory - 2 directories currently being tracked
   [junit4]   2> 1238594 INFO  (TEST-TestCoreContainer.testClassLoaderHierarchy-seed#[56552133F49562C8]) [    ] o.a.s.c.CachingDirectoryFactory looking to close /home/jenkins/workspace/Lucene-Solr-trunk-Linux/solr/build/solr-core/test/J0/temp/solr.core.TestCoreContainer_56552133F49562C8-001/tempDir-002/core1/data/index [CachedDir<<refCount=0;path=/home/jenkins/workspace/Lucene-Solr-trunk-Linux/solr/build/solr-core/test/J0/temp/solr.core.TestCoreContainer_56552133F49562C8-001/tempDir-002/core1/data/index;done=false>>]
   [junit4]   2> 1238594 INFO  (TEST-TestCoreContainer.testClassLoaderHierarchy-seed#[56552133F49562C8]) [    ] o.a.s.c.CachingDirectoryFactory Closing directory: /home/jenkins/workspace/Lucene-Solr-trunk-Linux/solr/build/solr-core/test/J0/temp/solr.core.TestCoreContainer_56552133F49562C8-001/tempDir-002/core1/data/index
   [junit4]   2> 1238594 INFO  (TEST-TestCoreContainer.testClassLoaderHierarchy-seed#[56552133F49562C8]) [    ] o.a.s.c.CachingDirectoryFactory looking to close /home/jenkins/workspace/Lucene-Solr-trunk-Linux/solr/build/solr-core/test/J0/temp/solr.core.TestCoreContainer_56552133F49562C8-001/tempDir-002/core1/data [CachedDir<<refCount=0;path=/home/jenkins/workspace/Lucene-Solr-trunk-Linux/solr/build/solr-core/test/J0/temp/solr.core.TestCoreContainer_56552133F49562C8-001/tempDir-002/core1/data;done=false>>]
   [junit4]   2> 1238595 INFO  (TEST-TestCoreContainer.testClassLoaderHierarchy-seed#[56552133F49562C8]) [    ] o.a.s.c.CachingDirectoryFactory Closing directory: /home/jenkins/workspace/Lucene-Solr-trunk-Linux/solr/build/solr-core/test/J0/temp/solr.core.TestCoreContainer_56552133F49562C8-001/tempDir-002/core1/data
   [junit4]   2> 1238595 INFO  (TEST-TestCoreContainer.testClassLoaderHierarchy-seed#[56552133F49562C8]) [    ] o.a.s.SolrTestCaseJ4 ###Ending testClassLoaderHierarchy
   [junit4]   2> 1238597 INFO  (TEST-TestCoreContainer.testDeleteBadCores-seed#[56552133F49562C8]) [    ] o.a.s.SolrTestCaseJ4 ###Starting testDeleteBadCores
   [junit4]   2> 1238598 INFO  (TEST-TestCoreContainer.testDeleteBadCores-seed#[56552133F49562C8]) [    ] o.a.s.c.SolrResourceLoader new SolrResourceLoader for directory: '/home/jenkins/workspace/Lucene-Solr-trunk-Linux/solr/build/solr-core/test/J0/temp/solr.core.TestCoreContainer_56552133F49562C8-001/tempDir-003'
   [junit4]   2> 1238598 INFO  (TEST-TestCoreContainer.testDeleteBadCores-seed#[56552133F49562C8]) [    ] o.a.s.c.SolrResourceLoader JNDI not configured for solr (NoInitialContextEx)
   [junit4]   2> 1238598 INFO  (TEST-TestCoreContainer.testDeleteBadCores-seed#[56552133F49562C8]) [    ] o.a.s.c.SolrResourceLoader solr home defaulted to 'solr/' (could not find system property or JNDI)
   [junit4]   2> 1238603 INFO  (TEST-TestCoreContainer.testDeleteBadCores-seed#[56552133F49562C8]) [    ] o.a.s.c.CoreContainer New CoreContainer 33377353
   [junit4]   2> 1238603 INFO  (TEST-TestCoreContainer.testDeleteBadCores-seed#[56552133F49562C8]) [    ] o.a.s.c.CoreDescriptor Created CoreDescriptor: {name=badcore, config=solrconfig.xml, loadOnStartup=true, schema=schema.xml, configSetProperties=configsetprops.json, transient=false, dataDir=data/, configSet=nosuchconfigset}
   [junit4]   2> 1238603 INFO  (TEST-TestCoreContainer.testDeleteBadCores-seed#[56552133F49562C8]) [    ] o.a.s.c.CoreContainer Loading cores into CoreContainer [instanceDir=/home/jenkins/workspace/Lucene-Solr-trunk-Linux/solr/build/solr-core/test/J0/temp/solr.core.TestCoreContainer_56552133F49562C8-001/tempDir-003]
   [junit4]   2> 1238603 WARN  (TEST-TestCoreContainer.testDeleteBadCores-seed#[56552133F49562C8]) [    ] o.a.s.c.CoreContainer Couldn't add files from /home/jenkins/workspace/Lucene-Solr-trunk-Linux/solr/build/solr-core/test/J0/temp/solr.core.TestCoreContainer_56552133F49562C8-001/tempDir-003/lib to classpath: /home/jenkins/workspace/Lucene-Solr-trunk-Linux/solr/build/solr-core/test/J0/temp/solr.core.TestCoreContainer_56552133F49562C8-001/tempDir-003/lib
   [junit4]   2> 1238604 INFO  (TEST-TestCoreContainer.testDeleteBadCores-seed#[56552133F49562C8]) [    ] o.a.s.h.c.HttpShardHandlerFactory created with socketTimeout : 600000,connTimeout : 60000,maxConnectionsPerHost : 20,maxConnections : 10000,corePoolSize : 0,maximumPoolSize : 2147483647,maxThreadIdleTime : 5,sizeOfQueue : -1,fairnessPolicy : false,useRetries : false,
   [junit4]   2> 1238605 INFO  (TEST-TestCoreContainer.testDeleteBadCores-seed#[56552133F49562C8]) [    ] o.a.s.u.UpdateShardHandler Creating UpdateShardHandler HTTP client with params: socketTimeout=600000&connTimeout=60000&retry=true
   [junit4]   2> 1238606 INFO  (TEST-TestCoreContainer.testDeleteBadCores-seed#[56552133F49562C8]) [    ] o.a.s.l.LogWatcher SLF4J impl is org.slf4j.impl.Log4jLoggerFactory
   [junit4]   2> 1238606 INFO  (TEST-TestCoreContainer.testDeleteBadCores-seed#[56552133F49562C8]) [    ] o.a.s.l.LogWatcher Registering Log Listener [Log4j (org.slf4j.impl.Log4jLoggerFactory)]
   [junit4]   2> 1238606 INFO  (TEST-TestCoreContainer.testDeleteBadCores-seed#[56552133F49562C8]) [    ] o.a.s.c.CoreContainer Security conf doesn't exist. Skipping setup for authorization module.
   [junit4]   2> 1238606 INFO  (TEST-TestCoreContainer.testDeleteBadCores-seed#[56552133F49562C8]) [    ] o.a.s.c.CoreContainer No authentication plugin used.
   [junit4]   2> 1238607 ERROR (coreLoadExecutor-4339-thread-1) [    ] o.a.s.c.CoreContainer Error creating core [badcore]: Could not load configuration from directory /home/jenkins/workspace/Lucene-Solr-trunk-Linux/solr/core/src/test-files/solr/configsets/nosuchconfigset
   [junit4]   2> org.apache.solr.common.SolrException: Could not load configuration from directory /home/jenkins/workspace/Lucene-Solr-trunk-Linux/solr/core/src/test-files/solr/configsets/nosuchconfigset
   [junit4]   2> 	at org.apache.solr.core.ConfigSetService$Default.locateInstanceDir(ConfigSetService.java:175)
   [junit4]   2> 	at org.apache.solr.core.ConfigSetService$Default.createCoreResourceLoader(ConfigSetService.java:160)
   [junit4]   2> 	at org.apache.solr.core.ConfigSetService.getConfig(ConfigSetService.java:76)
   [junit4]   2> 	at org.apache.solr.core.CoreContainer.create(CoreContainer.java:815)
   [junit4]   2> 	at org.apache.solr.core.CoreContainer.access$000(CoreContainer.java:87)
   [junit4]   2> 	at org.apache.solr.core.CoreContainer$1.call(CoreContainer.java:467)
   [junit4]   2> 	at org.apache.solr.core.CoreContainer$1.call(CoreContainer.java:458)
   [junit4]   2> 	at java.util.concurrent.FutureTask.run(FutureTask.java:266)
   [junit4]   2> 	at org.apache.solr.common.util.ExecutorUtil$MDCAwareThreadPoolExecutor$1.run(ExecutorUtil.java:232)
   [junit4]   2> 	at java.util.concurrent.ThreadPoolExecutor.runWorker(ThreadPoolExecutor.java:1158)
   [junit4]   2> 	at java.util.concurrent.ThreadPoolExecutor$Worker.run(ThreadPoolExecutor.java:632)
   [junit4]   2> 	at java.lang.Thread.run(Thread.java:747)
   [junit4]   2> 1238613 INFO  (TEST-TestCoreContainer.testDeleteBadCores-seed#[56552133F49562C8]) [    ] o.a.s.c.CoreDescriptor Created CoreDescriptor: {name=badcore, config=solrconfig.xml, loadOnStartup=true, schema=schema.xml, configSetProperties=configsetprops.json, transient=false, dataDir=data/, configSet=minimal}
   [junit4]   2> 1238614 INFO  (TEST-TestCoreContainer.testDeleteBadCores-seed#[56552133F49562C8]) [    ] o.a.s.c.SolrResourceLoader new SolrResourceLoader for directory: '/home/jenkins/workspace/Lucene-Solr-trunk-Linux/solr/core/src/test-files/solr/configsets/minimal'
   [junit4]   2> 1238614 INFO  (TEST-TestCoreContainer.testDeleteBadCores-seed#[56552133F49562C8]) [    ] o.a.s.c.SolrResourceLoader JNDI not configured for solr (NoInitialContextEx)
   [junit4]   2> 1238614 INFO  (TEST-TestCoreContainer.testDeleteBadCores-seed#[56552133F49562C8]) [    ] o.a.s.c.SolrResourceLoader solr home defaulted to 'solr/' (could not find system property or JNDI)
   [junit4]   2> 1238618 INFO  (TEST-TestCoreContainer.testDeleteBadCores-seed#[56552133F49562C8]) [    ] o.a.s.c.SolrConfig current version of requestparams : -1
   [junit4]   2> 1238621 INFO  (TEST-TestCoreContainer.testDeleteBadCores-seed#[56552133F49562C8]) [    ] o.a.s.c.SolrConfig Using Lucene MatchVersion: 6.0.0
   [junit4]   2> 1238639 INFO  (TEST-TestCoreContainer.testDeleteBadCores-seed#[56552133F49562C8]) [    ] o.a.s.c.SolrConfig Loaded SolrConfig: solrconfig.xml
   [junit4]   2> 1238645 INFO  (TEST-TestCoreContainer.testDeleteBadCores-seed#[56552133F49562C8]) [    ] o.a.s.s.IndexSchema [badcore] Schema name=minimal
   [junit4]   2> 1238647 WARN  (TEST-TestCoreContainer.testDeleteBadCores-seed#[56552133F49562C8]) [    ] o.a.s.s.IndexSchema no uniqueKey specified in schema.
   [junit4]   2> 1238649 INFO  (TEST-TestCoreContainer.testDeleteBadCores-seed#[56552133F49562C8]) [    ] o.a.s.c.ConfigSetProperties Did not find ConfigSet properties, assuming default properties: Can't find resource 'configsetprops.json' in classpath or '/home/jenkins/workspace/Lucene-Solr-trunk-Linux/solr/core/src/test-files/solr/configsets/minimal'
   [junit4]   2> 1238649 INFO  (TEST-TestCoreContainer.testDeleteBadCores-seed#[56552133F49562C8]) [    ] o.a.s.c.CoreContainer Creating SolrCore 'badcore' using configuration from configset /home/jenkins/workspace/Lucene-Solr-trunk-Linux/solr/core/src/test-files/solr/configsets/minimal
   [junit4]   2> 1238650 INFO  (TEST-TestCoreContainer.testDeleteBadCores-seed#[56552133F49562C8]) [    ] o.a.s.c.SolrCore org.apache.solr.core.MockDirectoryFactory
   [junit4]   2> 1238650 INFO  (TEST-TestCoreContainer.testDeleteBadCores-seed#[56552133F49562C8]) [    ] o.a.s.c.SolrCore [[badcore] ] Opening new SolrCore at [/home/jenkins/workspace/Lucene-Solr-trunk-Linux/solr/core/src/test-files/solr/configsets/minimal], dataDir=[/home/jenkins/workspace/Lucene-Solr-trunk-Linux/solr/build/solr-core/test/J0/temp/solr.core.TestCoreContainer_56552133F49562C8-001/tempDir-003/badcore/data/]
   [junit4]   2> 1238650 INFO  (TEST-TestCoreContainer.testDeleteBadCores-seed#[56552133F49562C8]) [    ] o.a.s.c.SolrCore JMX monitoring not detected for core: badcore
   [junit4]   2> 1238651 INFO  (TEST-TestCoreContainer.testDeleteBadCores-seed#[56552133F49562C8]) [    ] o.a.s.c.CachingDirectoryFactory return new directory for /home/jenkins/workspace/Lucene-Solr-trunk-Linux/solr/build/solr-core/test/J0/temp/solr.core.TestCoreContainer_56552133F49562C8-001/tempDir-003/badcore/data
   [junit4]   2> 1238651 INFO  (TEST-TestCoreContainer.testDeleteBadCores-seed#[56552133F49562C8]) [    ] o.a.s.c.SolrCore New index directory detected: old=null new=/home/jenkins/workspace/Lucene-Solr-trunk-Linux/solr/build/solr-core/test/J0/temp/solr.core.TestCoreContainer_56552133F49562C8-001/tempDir-003/badcore/data/index/
   [junit4]   2> 1238651 WARN  (TEST-TestCoreContainer.testDeleteBadCores-seed#[56552133F49562C8]) [    ] o.a.s.c.SolrCore [badcore] Solr index directory '/home/jenkins/workspace/Lucene-Solr-trunk-Linux/solr/build/solr-core/test/J0/temp/solr.core.TestCoreContainer_56552133F49562C8-001/tempDir-003/badcore/data/index' doesn't exist. Creating new index...
   [junit4]   2> 1238653 INFO  (TEST-TestCoreContainer.testDeleteBadCores-seed#[56552133F49562C8]) [    ] o.a.s.c.CachingDirectoryFactory return new directory for /home/jenkins/workspace/Lucene-Solr-trunk-Linux/solr/build/solr-core/test/J0/temp/solr.core.TestCoreContainer_56552133F49562C8-001/tempDir-003/badcore/data/index
   [junit4]   2> 1238653 INFO  (TEST-TestCoreContainer.testDeleteBadCores-seed#[56552133F49562C8]) [    ] o.a.s.c.SolrDeletionPolicy SolrDeletionPolicy.onCommit: commits: num=1
   [junit4]   2> 	commit{dir=MockDirectoryWrapper(RAMDirectory@53a320 lockFactory=org.apache.lucene.store.SingleInstanceLockFactory@1f24e2a),segFN=segments_1,generation=1}
   [junit4]   2> 1238653 INFO  (TEST-TestCoreContainer.testDeleteBadCores-seed#[56552133F49562C8]) [    ] o.a.s.c.SolrDeletionPolicy newest commit generation = 1
   [junit4]   2> 1238654 INFO  (OldIndexDirectoryCleanupThreadForCore-badcore) [    ] o.a.s.c.SolrCore Looking for old index directories to cleanup for core badcore in /home/jenkins/workspace/Lucene-Solr-trunk-Linux/solr/build/solr-core/test/J0/temp/solr.core.TestCoreContainer_56552133F49562C8-001/tempDir-003/badcore/data/
   [junit4]   2> 1238654 WARN  (OldIndexDirectoryCleanupThreadForCore-badcore) [    ] o.a.s.c.DirectoryFactory /home/jenkins/workspace/Lucene-Solr-trunk-Linux/solr/build/solr-core/test/J0/temp/solr.core.TestCoreContainer_56552133F49562C8-001/tempDir-003/badcore/data/ does not point to a valid data directory; skipping clean-up of old index directories.
   [junit4]   2> 1238655 INFO  (TEST-TestCoreContainer.testDeleteBadCores-seed#[56552133F49562C8]) [    ] o.a.s.c.SolrCore no updateRequestProcessorChain defined as default, creating implicit default
   [junit4]   2> 1238656 INFO  (TEST-TestCoreContainer.testDeleteBadCores-seed#[56552133F49562C8]) [    ] o.a.s.h.l.XMLLoader xsltCacheLifetimeSeconds=60
   [junit4]   2> 1238657 INFO  (TEST-TestCoreContainer.testDeleteBadCores-seed#[56552133F49562C8]) [    ] o.a.s.h.l.XMLLoader xsltCacheLifetimeSeconds=60
   [junit4]   2> 1238658 INFO  (TEST-TestCoreContainer.testDeleteBadCores-seed#[56552133F49562C8]) [    ] o.a.s.h.l.XMLLoader xsltCacheLifetimeSeconds=60
   [junit4]   2> 1238659 INFO  (TEST-TestCoreContainer.testDeleteBadCores-seed#[56552133F49562C8]) [    ] o.a.s.h.l.XMLLoader xsltCacheLifetimeSeconds=60
   [junit4]   2> 1238659 INFO  (TEST-TestCoreContainer.testDeleteBadCores-seed#[56552133F49562C8]) [    ] o.a.s.c.RequestHandlers Registered paths: /admin/mbeans,/update/csv,/sql,/update/json/docs,/admin/luke,/export,/select,/admin/segments,/get,/admin/system,/replication,/admin/properties,/config,/stream,/schema,/admin/plugins,/admin/logging,/update/json,/admin/threads,/admin/ping,/update,/admin/file
   [junit4]   2> 1238660 INFO  (TEST-TestCoreContainer.testDeleteBadCores-seed#[56552133F49562C8]) [    ] o.a.s.c.SolrCore Using default statsCache cache: org.apache.solr.search.stats.LocalStatsCache
   [junit4]   2> 1238660 INFO  (TEST-TestCoreContainer.testDeleteBadCores-seed#[56552133F49562C8]) [    ] o.a.s.u.CommitTracker Hard AutoCommit: disabled
   [junit4]   2> 1238660 INFO  (TEST-TestCoreContainer.testDeleteBadCores-seed#[56552133F49562C8]) [    ] o.a.s.u.CommitTracker Soft AutoCommit: disabled
   [junit4]   2> 1238660 INFO  (TEST-TestCoreContainer.testDeleteBadCores-seed#[56552133F49562C8]) [    ] o.a.s.c.SolrDeletionPolicy SolrDeletionPolicy.onInit: commits: num=1
   [junit4]   2> 	commit{dir=MockDirectoryWrapper(RAMDirectory@53a320 lockFactory=org.apache.lucene.store.SingleInstanceLockFactory@1f24e2a),segFN=segments_1,generation=1}
   [junit4]   2> 1238660 INFO  (TEST-TestCoreContainer.testDeleteBadCores-seed#[56552133F49562C8]) [    ] o.a.s.c.SolrDeletionPolicy newest commit generation = 1
   [junit4]   2> 1238660 INFO  (TEST-TestCoreContainer.testDeleteBadCores-seed#[56552133F49562C8]) [    ] o.a.s.s.SolrIndexSearcher Opening [Searcher@cfb54[badcore] main]
   [junit4]   2> 1238661 WARN  (TEST-TestCoreContainer.testDeleteBadCores-seed#[56552133F49562C8]) [    ] o.a.s.r.ManagedResourceStorage Cannot write to config directory /home/jenkins/workspace/Lucene-Solr-trunk-Linux/solr/core/src/test-files/solr/configsets/minimal/conf; switching to use InMemory storage instead.
   [junit4]   2> 1238661 INFO  (TEST-TestCoreContainer.testDeleteBadCores-seed#[56552133F49562C8]) [    ] o.a.s.r.RestManager Initializing RestManager with initArgs: {}
   [junit4]   2> 1238661 INFO  (TEST-TestCoreContainer.testDeleteBadCores-seed#[56552133F49562C8]) [    ] o.a.s.r.ManagedResourceStorage Reading _rest_managed.json using InMemoryStorage
   [junit4]   2> 1238661 INFO  (TEST-TestCoreContainer.testDeleteBadCores-seed#[56552133F49562C8]) [    ] o.a.s.r.RestManager Initializing 0 registered ManagedResources
   [junit4]   2> 1238661 INFO  (TEST-TestCoreContainer.testDeleteBadCores-seed#[56552133F49562C8]) [    ] o.a.s.h.ReplicationHandler Commits will be reserved for  10000
   [junit4]   2> 1238661 INFO  (searcherExecutor-4340-thread-1) [    ] o.a.s.c.SolrCore [badcore] Registered new searcher Searcher@cfb54[badcore] main{ExitableDirectoryReader(UninvertingDirectoryReader())}
   [junit4]   2> 1238662 INFO  (TEST-TestCoreContainer.testDeleteBadCores-seed#[56552133F49562C8]) [    ] o.a.s.c.CoreContainer registering core: badcore
   [junit4]   2> 1238664 INFO  (TEST-TestCoreContainer.testDeleteBadCores-seed#[56552133F49562C8]) [    ] o.a.s.c.CoreContainer Shutting down CoreContainer instance=33377353
   [junit4]   2> 1238664 INFO  (TEST-TestCoreContainer.testDeleteBadCores-seed#[56552133F49562C8]) [    ] o.a.s.c.SolrCore [badcore]  CLOSING SolrCore org.apache.solr.core.SolrCore@1934f59
   [junit4]   2> 1238664 INFO  (TEST-TestCoreContainer.testDeleteBadCores-seed#[56552133F49562C8]) [    ] o.a.s.u.DirectUpdateHandler2 closing DirectUpdateHandler2{commits=0,autocommits=0,soft autocommits=0,optimizes=0,rollbacks=0,expungeDeletes=0,docsPending=0,adds=0,deletesById=0,deletesByQuery=0,errors=0,cumulative_adds=0,cumulative_deletesById=0,cumulative_deletesByQuery=0,cumulative_errors=0}
   [junit4]   2> 1238664 INFO  (TEST-TestCoreContainer.testDeleteBadCores-seed#[56552133F49562C8]) [    ] o.a.s.u.SolrCoreState Closing SolrCoreState
   [junit4]   2> 1238665 INFO  (TEST-TestCoreContainer.testDeleteBadCores-seed#[56552133F49562C8]) [    ] o.a.s.u.DefaultSolrCoreState SolrCoreState ref count has reached 0 - closing IndexWriter
   [junit4]   2> 1238665 INFO  (TEST-TestCoreContainer.testDeleteBadCores-seed#[56552133F49562C8]) [    ] o.a.s.u.DefaultSolrCoreState closing IndexWriter with IndexWriterCloser
   [junit4]   2> 1238665 INFO  (TEST-TestCoreContainer.testDeleteBadCores-seed#[56552133F49562C8]) [    ] o.a.s.c.SolrCore [badcore] Closing main searcher on request.
   [junit4]   2> 1238665 INFO  (TEST-TestCoreContainer.testDeleteBadCores-seed#[56552133F49562C8]) [    ] o.a.s.c.CachingDirectoryFactory Closing MockDirectoryFactory - 2 directories currently being tracked
   [junit4]   2> 1238665 INFO  (TEST-TestCoreContainer.testDeleteBadCores-seed#[56552133F49562C8]) [    ] o.a.s.c.CachingDirectoryFactory looking to close /home/jenkins/workspace/Lucene-Solr-trunk-Linux/solr/build/solr-core/test/J0/temp/solr.core.TestCoreContainer_56552133F49562C8-001/tempDir-003/badcore/data/index [CachedDir<<refCount=0;path=/home/jenkins/workspace/Lucene-Solr-trunk-Linux/solr/build/solr-core/test/J0/temp/solr.core.TestCoreContainer_56552133F49562C8-001/tempDir-003/badcore/data/index;done=false>>]
   [junit4]   2> 1238665 INFO  (TEST-TestCoreContainer.testDeleteBadCores-seed#[56552133F49562C8]) [    ] o.a.s.c.CachingDirectoryFactory Closing directory: /home/jenkins/workspace/Lucene-Solr-trunk-Linux/solr/build/solr-core/test/J0/temp/solr.core.TestCoreContainer_56552133F49562C8-001/tempDir-003/badcore/data/index
   [junit4]   2> 1238665 INFO  (TEST-TestCoreContainer.testDeleteBadCores-seed#[56552133F49562C8]) [    ] o.a.s.c.CachingDirectoryFactory looking to close /home/jenkins/workspace/Lucene-Solr-trunk-Linux/solr/build/solr-core/test/J0/temp/solr.core.TestCoreContainer_56552133F49562C8-001/tempDir-003/badcore/data [CachedDir<<refCount=0;path=/home/jenkins/workspace/Lucene-Solr-trunk-Linux/solr/build/solr-core/test/J0/temp/solr.core.TestCoreContainer_56552133F49562C8-001/tempDir-003/badcore/data;done=false>>]
   [junit4]   2> 1238665 INFO  (TEST-TestCoreContainer.testDeleteBadCores-seed#[56552133F49562C8]) [    ] o.a.s.c.CachingDirectoryFactory Closing directory: /home/jenkins/workspace/Lucene-Solr-trunk-Linux/solr/build/solr-core/test/J0/temp/solr.core.TestCoreContainer_56552133F49562C8-001/tempDir-003/badcore/data
   [junit4]   2> 1238665 INFO  (TEST-TestCoreContainer.testDeleteBadCores-seed#[56552133F49562C8]) [    ] o.a.s.SolrTestCaseJ4 ###Ending testDeleteBadCores
   [junit4]   2> 1238667 INFO  (TEST-TestCoreContainer.testNoCores-seed#[56552133F49562C8]) [    ] o.a.s.SolrTestCaseJ4 ###Starting testNoCores
   [junit4]   2> 1238668 INFO  (TEST-TestCoreContainer.testNoCores-seed#[56552133F49562C8]) [    ] o.a.s.c.SolrResourceLoader new SolrResourceLoader for directory: '/home/jenkins/workspace/Lucene-Solr-trunk-Linux/solr/build/solr-core/test/J0/temp/solr.core.TestCoreContainer_56552133F49562C8-001/tempDir-004'
   [junit4]   2> 1238668 INFO  (TEST-TestCoreContainer.testNoCores-seed#[56552133F49562C8]) [    ] o.a.s.c.SolrResourceLoader JNDI not configured for solr (NoInitialContextEx)
   [junit4]   2> 1238668 INFO  (TEST-TestCoreContainer.testNoCores-seed#[56552133F49562C8]) [    ] o.a.s.c.SolrResourceLoader solr home defaulted to 'solr/' (could not find system property or JNDI)
   [junit4]   2> 1238672 INFO  (TEST-TestCoreContainer.testNoCores-seed#[56552133F49562C8]) [    ] o.a.s.c.CorePropertiesLocator Config-defined core root directory: /home/jenkins/workspace/Lucene-Solr-trunk-Linux/solr/build/solr-core/test/J0/temp/solr.core.TestCoreContainer_56552133F49562C8-001/tempDir-004
   [junit4]   2> 1238672 INFO  (TEST-TestCoreContainer.testNoCores-seed#[56552133F49562C8]) [    ] o.a.s.c.CoreContainer New CoreContainer 8972413
   [junit4]   2> 1238672 INFO  (TEST-TestCoreContainer.testNoCores-seed#[56552133F49562C8]) [    ] o.a.s.c.CoreContainer Loading cores into CoreContainer [instanceDir=/home/jenkins/workspace/Lucene-Solr-trunk-Linux/solr/build/solr-core/test/J0/temp/solr.core.TestCoreContainer_56552133F49562C8-001/tempDir-004]
   [junit4]   2> 1238672 WARN  (TEST-TestCoreContainer.testNoCores-seed#[56552133F49562C8]) [    ] o.a.s.c.CoreContainer Couldn't add files from /home/jenkins/workspace/Lucene-Solr-trunk-Linux/solr/build/solr-core/test/J0/temp/solr.core.TestCoreContainer_56552133F49562C8-001/tempDir-004/lib to classpath: /home/jenkins/workspace/Lucene-Solr-trunk-Linux/solr/build/solr-core/test/J0/temp/solr.core.TestCoreContainer_56552133F49562C8-001/tempDir-004/lib
   [junit4]   2> 1238672 INFO  (TEST-TestCoreContainer.testNoCores-seed#[56552133F49562C8]) [    ] o.a.s.h.c.HttpShardHandlerFactory created with socketTimeout : 600000,connTimeout : 60000,maxConnectionsPerHost : 20,maxConnections : 10000,corePoolSize : 0,maximumPoolSize : 2147483647,maxThreadIdleTime : 5,sizeOfQueue : -1,fairnessPolicy : false,useRetries : false,
   [junit4]   2> 1238673 INFO  (TEST-TestCoreContainer.testNoCores-seed#[56552133F49562C8]) [    ] o.a.s.u.UpdateShardHandler Creating UpdateShardHandler HTTP client with params: socketTimeout=600000&connTimeout=60000&retry=true
   [junit4]   2> 1238674 INFO  (TEST-TestCoreContainer.testNoCores-seed#[56552133F49562C8]) [    ] o.a.s.l.LogWatcher SLF4J impl is org.slf4j.impl.Log4jLoggerFactory
   [junit4]   2> 1238674 INFO  (TEST-TestCoreContainer.testNoCores-seed#[56552133F49562C8]) [    ] o.a.s.l.LogWatcher Registering Log Listener [Log4j (org.slf4j.impl.Log4jLoggerFactory)]
   [junit4]   2> 1238674 INFO  (TEST-TestCoreContainer.testNoCores-seed#[56552133F49562C8]) [    ] o.a.s.c.CoreContainer Security conf doesn't exist. Skipping setup for authorization module.
   [junit4]   2> 1238674 INFO  (TEST-TestCoreContainer.testNoCores-seed#[56552133F49562C8]) [    ] o.a.s.c.CoreContainer No authentication plugin used.
   [junit4]   2> 1238674 INFO  (TEST-TestCoreContainer.testNoCores-seed#[56552133F49562C8]) [    ] o.a.s.c.CorePropertiesLocator Looking for core definitions underneath /home/jenkins/workspace/Lucene-Solr-trunk-Linux/solr/build/solr-core/test/J0/temp/solr.core.TestCoreContainer_56552133F49562C8-001/tempDir-004
   [junit4]   2> 1238675 INFO  (TEST-TestCoreContainer.testNoCores-seed#[56552133F49562C8]) [    ] o.a.s.c.CorePropertiesLocator Found 0 core definitions
   [junit4]   2> 1238675 INFO  (TEST-TestCoreContainer.testNoCores-seed#[56552133F49562C8]) [    ] o.a.s.c.CoreDescriptor Created CoreDescriptor: {name=core1, config=solrconfig.xml, loadOnStartup=true, schema=schema.xml, configSetProperties=configsetprops.json, transient=false, dataDir=data/, configSet=minimal}
   [junit4]   2> 1238675 INFO  (TEST-TestCoreContainer.testNoCores-seed#[56552133F49562C8]) [    ] o.a.s.c.SolrResourceLoader new SolrResourceLoader for directory: '/home/jenkins/workspace/Lucene-Solr-trunk-Linux/solr/core/src/test-files/solr/configsets/minimal'
   [junit4]   2> 1238676 INFO  (TEST-TestCoreContainer.testNoCores-seed#[56552133F49562C8]) [    ] o.a.s.c.SolrResourceLoader JNDI not configured for solr (NoInitialContextEx)
   [junit4]   2> 1238676 INFO  (TEST-TestCoreContainer.testNoCores-seed#[56552133F49562C8]) [    ] o.a.s.c.SolrResourceLoader solr home defaulted to 'solr/' (could not find system property or JNDI)
   [junit4]   2> 1238682 INFO  (TEST-TestCoreContainer.testNoCores-seed#[56552133F49562C8]) [    ] o.a.s.c.SolrConfig current version of requestparams : -1
   [junit4]   2> 1238683 INFO  (TEST-TestCoreContainer.testNoCores-seed#[56552133F49562C8]) [    ] o.a.s.c.SolrConfig Using Lucene MatchVersion: 6.0.0
   [junit4]   2> 1238687 INFO  (TEST-TestCoreContainer.testNoCores-seed#[56552133F49562C8]) [    ] o.a.s.c.SolrConfig Loaded SolrConfig: solrconfig.xml
   [junit4]   2> 1238689 INFO  (TEST-TestCoreContainer.testNoCores-seed#[56552133F49562C8]) [    ] o.a.s.s.IndexSchema [core1] Schema name=minimal
   [junit4]   2> 1238691 WARN  (TEST-TestCoreContainer.testNoCores-seed#[56552133F49562C8]) [    ] o.a.s.s.IndexSchema no uniqueKey specified in schema.
   [junit4]   2> 1238692 INFO  (TEST-TestCoreContainer.testNoCores-seed#[56552133F49562C8]) [    ] o.a.s.c.ConfigSetProperties Did not find ConfigSet properties, assuming default properties: Can't find resource 'configsetprops.json' in classpath or '/home/jenkins/workspace/Lucene-Solr-trunk-Linux/solr/core/src/test-files/solr/configsets/minimal'
   [junit4]   2> 1238692 INFO  (TEST-TestCoreContainer.testNoCores-seed#[56552133F49562C8]) [    ] o.a.s.c.CoreContainer Creating SolrCore 'core1' using configuration from configset /home/jenkins/workspace/Lucene-Solr-trunk-Linux/solr/core/src/test-files/solr/configsets/minimal
   [junit4]   2> 1238693 INFO  (TEST-TestCoreContainer.testNoCores-seed#[56552133F49562C8]) [    ] o.a.s.c.SolrCore org.apache.solr.core.MockDirectoryFactory
   [junit4]   2> 1238693 INFO  (TEST-TestCoreContainer.testNoCores-seed#[56552133F49562C8]) [    ] o.a.s.c.SolrCore [[core1] ] Opening new SolrCore at [/home/jenkins/workspace/Lucene-Solr-trunk-Linux/solr/core/src/test-files/solr/configsets/minimal], dataDir=[/home/jenkins/workspace/Lucene-Solr-trunk-Linux/solr/build/solr-core/test/J0/temp/solr.core.TestCoreContainer_56552133F49562C8-001/tempDir-004/core1/data/]
   [junit4]   2> 1238693 INFO  (TEST-TestCoreContainer.testNoCores-seed#[56552133F49562C8]) [    ] o.a.s.c.SolrCore JMX monitoring not detected for core: core1
   [junit4]   2> 1238694 INFO  (TEST-TestCoreContainer.testNoCores-seed#[56552133F49562C8]) [    ] o.a.s.c.CachingDirectoryFactory return new directory for /home/jenkins/workspace/Lucene-Solr-trunk-Linux/solr/build/solr-core/test/J0/temp/solr.core.TestCoreContainer_56552133F49562C8-001/tempDir-004/core1/data
   [junit4]   2> 1238694 INFO  (TEST-TestCoreContainer.testNoCores-seed#[56552133F49562C8]) [    ] o.a.s.c.SolrCore New index directory detected: old=null new=/home/jenkins/workspace/Lucene-Solr-trunk-Linux/solr/build/solr-core/test/J0/temp/solr.core.TestCoreContainer_56552133F49562C8-001/tempDir-004/core1/data/index/
   [junit4]   2> 1238694 WARN  (TEST-TestCoreContainer.testNoCores-seed#[56552133F49562C8]) [    ] o.a.s.c.SolrCore [core1] Solr index directory '/home/jenkins/workspace/Lucene-Solr-trunk-Linux/solr/build/solr-core/test/J0/temp/solr.core.TestCoreContainer_56552133F49562C8-001/tempDir-004/core1/data/index' doesn't exist. Creating new index...
   [junit4]   2> 1238694 INFO  (TEST-TestCoreContainer.testNoCores-seed#[56552133F49562C8]) [    ] o.a.s.c.CachingDirectoryFactory return new directory for /home/jenkins/workspace/Lucene-Solr-trunk-Linux/solr/build/solr-core/test/J0/temp/solr.core.TestCoreContainer_56552133F49562C8-001/tempDir-004/core1/data/index
   [junit4]   2> 1238695 INFO  (TEST-TestCoreContainer.testNoCores-seed#[56552133F49562C8]) [    ] o.a.s.c.SolrDeletionPolicy SolrDeletionPolicy.onCommit: commits: num=1
   [junit4]   2> 	commit{dir=MockDirectoryWrapper(NRTCachingDirectory(RAMDirectory@2693e4 lockFactory=org.apache.lucene.store.SingleInstanceLockFactory@11e5fef; maxCacheMB=0.701171875 maxMergeSizeMB=0.552734375)),segFN=segments_1,generation=1}
   [junit4]   2> 1238695 INFO  (TEST-TestCoreContainer.testNoCores-seed#[56552133F49562C8]) [    ] o.a.s.c.SolrDeletionPolicy newest commit generation = 1
   [junit4]   2> 1238695 INFO  (OldIndexDirectoryCleanupThreadForCore-core1) [    ] o.a.s.c.SolrCore Looking for old index directories to cleanup for core core1 in /home/jenkins/workspace/Lucene-Solr-trunk-Linux/solr/build/solr-core/test/J0/temp/solr.core.TestCoreContainer_56552133F49562C8-001/tempDir-004/core1/data/
   [junit4]   2> 1238695 WARN  (OldIndexDirectoryCleanupThreadForCore-core1) [    ] o.a.s.c.DirectoryFactory /home/jenkins/workspace/Lucene-Solr-trunk-Linux/solr/build/solr-core/test/J0/temp/solr.core.TestCoreContainer_56552133F49562C8-001/tempDir-004/core1/data/ does not point to a valid data directory; skipping clean-up of old index directories.
   [junit4]   2> 1238696 INFO  (TEST-TestCoreContainer.testNoCores-seed#[56552133F49562C8]) [    ] o.a.s.c.SolrCore no updateRequestProcessorChain defined as default, creating implicit default
   [junit4]   2> 1238697 INFO  (TEST-TestCoreContainer.testNoCores-seed#[56552133F49562C8]) [    ] o.a.s.h.l.XMLLoader xsltCacheLifetimeSeconds=60
   [junit4]   2> 1238698 INFO  (TEST-TestCoreContainer.testNoCores-seed#[56552133F49562C8]) [    ] o.a.s.h.l.XMLLoader xsltCacheLifetimeSeconds=60
   [junit4]   2> 1238699 INFO  (TEST-TestCoreContainer.testNoCores-seed#[56552133F49562C8]) [    ] o.a.s.h.l.XMLLoader xsltCacheLifetimeSeconds=60
   [junit4]   2> 1238700 INFO  (TEST-TestCoreContainer.testNoCores-seed#[56552133F49562C8]) [    ] o.a.s.h.l.XMLLoader xsltCacheLifetimeSeconds=60
   [junit4]   2> 1238700 INFO  (TEST-TestCoreContainer.testNoCores-seed#[56552133F49562C8]) [    ] o.a.s.c.RequestHandlers Registered paths: /admin/mbeans,/update/csv,/sql,/update/json/docs,/admin/luke,/export,/select,/admin/segments,/get,/admin/system,/replication,/admin/properties,/config,/stream,/schema,/admin/plugins,/admin/logging,/update/json,/admin/threads,/admin/ping,/update,/admin/file
   [junit4]   2> 1238701 INFO  (TEST-TestCoreContainer.testNoCores-seed#[56552133F49562C8]) [    ] o.a.s.c.SolrCore Using default statsCache cache: org.apache.solr.search.stats.LocalStatsCache
   [junit4]   2> 1238701 INFO  (TEST-TestCoreContainer.testNoCores-seed#[56552133F49562C8]) [    ] o.a.s.u.CommitTracker Hard AutoCommit: disabled
   [junit4]   2> 1238701 INFO  (TEST-TestCoreContainer.testNoCores-seed#[56552133F49562C8]) [    ] o.a.s.u.CommitTracker Soft AutoCommit: disabled
   [junit4]   2> 1238701 INFO  (TEST-TestCoreContainer.testNoCores-seed#[56552133F49562C8]) [    ] o.a.s.c.SolrDeletionPolicy SolrDeletionPolicy.onInit: commits: num=1
   [junit4]   2> 	commit{dir=MockDirectoryWrapper(NRTCachingDirectory(RAMDirectory@2693e4 lockFactory=org.apache.lucene.store.SingleInstanceLockFactory@11e5fef; maxCacheMB=0.701171875 maxMergeSizeMB=0.552734375)),segFN=segments_1,generation=1}
   [junit4]   2> 1238701 INFO  (TEST-TestCoreContainer.testNoCores-seed#[56552133F49562C8]) [    ] o.a.s.c.SolrDeletionPolicy newest commit generation = 1
   [junit4]   2> 1238701 INFO  (TEST-TestCoreContainer.testNoCores-seed#[56552133F49562C8]) [    ] o.a.s.s.SolrIndexSearcher Opening [Searcher@689ab3[core1] main]
   [junit4]   2> 1238702 WARN  (TEST-TestCoreContainer.testNoCores-seed#[56552133F49562C8]) [    ] o.a.s.r.ManagedResourceStorage Cannot write to config directory /home/jenkins/workspace/Lucene-Solr-trunk-Linux/solr/core/src/test-files/solr/configsets/minimal/conf; switching to use InMemory storage instead.
   [junit4]   2> 1238702 INFO  (TEST-TestCoreContainer.testNoCores-seed#[56552133F49562C8]) [    ] o.a.s.r.RestManager Initializing RestManager with initArgs: {}
   [junit4]   2> 1238702 INFO  (TEST-TestCoreContainer.testNoCores-seed#[56552133F49562C8]) [    ] o.a.s.r.ManagedResourceStorage Reading _rest_managed.json using InMemoryStorage
   [junit4]   2> 1238702 INFO  (TEST-TestCoreContainer.testNoCores-seed#[56552133F49562C8]) [    ] o.a.s.r.RestManager Initializing 0 registered ManagedResources
   [junit4]   2> 1238702 INFO  (TEST-TestCoreContainer.testNoCores-seed#[56552133F49562C8]) [    ] o.a.s.h.ReplicationHandler Commits will be reserved for  10000
   [junit4]   2> 1238702 INFO  (searcherExecutor-4350-thread-1) [    ] o.a.s.c.SolrCore [core1] Registered new searcher Searcher@689ab3[core1] main{ExitableDirectoryReader(UninvertingDirectoryReader())}
   [junit4]   2> 1238703 INFO  (TEST-TestCoreContainer.testNoCores-seed#[56552133F49562C8]) [    ] o.a.s.c.CoreContainer registering core: core1
   [junit4]   2> 1238704 INFO  (TEST-TestCoreContainer.testNoCores-seed#[56552133F49562C8]) [    ] o.a.s.c.SolrCore [core1]  CLOSING SolrCore org.apache.solr.core.SolrCore@1bafdd9
   [junit4]   2> 1238704 INFO  (TEST-TestCoreContainer.testNoCores-seed#[56552133F49562C8]) [    ] o.a.s.u.DirectUpdateHandler2 closing DirectUpdateHandler2{commits=0,autocommits=0,soft autocommits=0,optimizes=0,rollbacks=0,expungeDeletes=0,docsPending=0,adds=0,deletesById=0,deletesByQuery=0,errors=0,cumulative_adds=0,cumulative_deletesById=0,cumulative_deletesByQuery=0,cumulative_errors=0}
   [junit4]   2> 1238704 INFO  (TEST-TestCoreContainer.testNoCores-seed#[56552133F49562C8]) [    ] o.a.s.u.SolrCoreState Closing SolrCoreState
   [junit4]   2> 1238704 INFO  (TEST-TestCoreContainer.testNoCores-seed#[56552133F49562C8]) [    ] o.a.s.u.DefaultSolrCoreState SolrCoreState ref count has reached 0 - closing IndexWriter
   [junit4]   2> 1238704 INFO  (TEST-TestCoreContainer.testNoCores-seed#[56552133F49562C8]) [    ] o.a.s.u.DefaultSolrCoreState closing IndexWriter with IndexWriterCloser
   [junit4]   2> 1238704 INFO  (TEST-TestCoreContainer.testNoCores-seed#[56552133F49562C8]) [    ] o.a.s.c.SolrCore [core1] Closing main searcher on request.
   [junit4]   2> 1238704 INFO  (TEST-TestCoreContainer.testNoCores-seed#[56552133F49562C8]) [    ] o.a.s.c.CachingDirectoryFactory Closing MockDirectoryFactory - 2 directories currently being tracked
   [junit4]   2> 1238704 INFO  (TEST-TestCoreContainer.testNoCores-seed#[56552133F49562C8]) [    ] o.a.s.c.CachingDirectoryFactory looking to close /home/jenkins/workspace/Lucene-Solr-trunk-Linux/solr/build/solr-core/test/J0/temp/solr.core.TestCoreContainer_56552133F49562C8-001/tempDir-004/core1/data/index [CachedDir<<refCount=0;path=/home/jenkins/workspace/Lucene-Solr-trunk-Linux/solr/build/solr-core/test/J0/temp/solr.core.TestCoreContainer_56552133F49562C8-001/tempDir-004/core1/data/index;done=false>>]
   [junit4]   2> 1238704 INFO  (TEST-TestCoreContainer.testNoCores-seed#[56552133F49562C8]) [    ] o.a.s.c.CachingDirectoryFactory Closing directory: /home/jenkins/workspace/Lucene-Solr-trunk-Linux/solr/build/solr-core/test/J0/temp/solr.core.TestCoreContainer_56552133F49562C8-001/tempDir-004/core1/data/index
   [junit4]   2> 1238704 INFO  (TEST-TestCoreContainer.testNoCores-seed#[56552133F49562C8]) [    ] o.a.s.c.CachingDirectoryFactory looking to close /home/jenkins/workspace/Lucene-Solr-trunk-Linux/solr/build/solr-core/test/J0/temp/solr.core.TestCoreContainer_56552133F49562C8-001/tempDir-004/core1/data [CachedDir<<refCount=0;path=/home/jenkins/workspace/Lucene-Solr-trunk-Linux/solr/build/solr-core/test/J0/temp/solr.core.TestCoreContainer_56552133F49562C8-001/tempDir-004/core1/data;done=false>>]
   [junit4]   2> 1238705 INFO  (TEST-TestCoreContainer.testNoCores-seed#[56552133F49562C8]) [    ] o.a.s.c.CachingDirectoryFactory Closing directory: /home/jenkins/workspace/Lucene-Solr-trunk-Linux/solr/build/solr-core/test/J0/temp/solr.core.TestCoreContainer_56552133F49562C8-001/tempDir-004/core1/data
   [junit4]   2> 1238705 INFO  (TEST-TestCoreContainer.testNoCores-seed#[56552133F49562C8]) [    ] o.a.s.c.CoreContainer Shutting down CoreContainer instance=8972413
   [junit4]   2> 1238705 INFO  (TEST-TestCoreContainer.testNoCores-seed#[56552133F49562C8]) [    ] o.a.s.SolrTestCaseJ4 ###Ending testNoCores
   [junit4]   2> 1238706 INFO  (TEST-TestCoreContainer.testReloadThreaded-seed#[56552133F49562C8]) [    ] o.a.s.SolrTestCaseJ4 ###Starting testReloadThreaded
   [junit4]   2> 1238707 INFO  (TEST-TestCoreContainer.testReloadThreaded-seed#[56552133F49562C8]) [    ] o.a.s.c.SolrResourceLoader new SolrResourceLoader for directory: '/home/jenkins/workspace/Lucene-Solr-trunk-Linux/solr/build/solr-core/test/J0/temp/solr.core.TestCoreContainer_56552133F49562C8-001/tempDir-005'
   [junit4]   2> 1238707 INFO  (TEST-TestCoreContainer.testReloadThreaded-seed#[56552133F49562C8]) [    ] o.a.s.c.SolrResourceLoader JNDI not configured for solr (NoInitialContextEx)
   [junit4]   2> 1238707 INFO  (TEST-TestCoreContainer.testReloadThreaded-seed#[56552133F49562C8]) [    ] o.a.s.c.SolrResourceLoader solr home defaulted to 'solr/' (could not find system property or JNDI)
   [junit4]   2> 1238710 INFO  (TEST-TestCoreContainer.testReloadThreaded-seed#[56552133F49562C8]) [    ] o.a.s.c.CorePropertiesLocator Config-defined core root directory: /home/jenkins/workspace/Lucene-Solr-trunk-Linux/solr/build/solr-core/test/J0/temp/solr.core.TestCoreContainer_56552133F49562C8-001/tempDir-005
   [junit4]   2> 1238710 INFO  (TEST-TestCoreContainer.testReloadThreaded-seed#[56552133F49562C8]) [    ] o.a.s.c.CoreContainer New CoreContainer 28814176
   [junit4]   2> 1238710 INFO  (TEST-TestCoreContainer.testReloadThreaded-seed#[56552133F49562C8]) [    ] o.a.s.c.CoreContainer Loading cores into CoreContainer [instanceDir=/home/jenkins/workspace/Lucene-Solr-trunk-Linux/solr/build/solr-core/test/J0/temp/solr.core.TestCoreContainer_56552133F49562C8-001/tempDir-005]
   [junit4]   2> 1238710 WARN  (TEST-TestCoreContainer.testReloadThreaded-seed#[56552133F49562C8]) [    ] o.a.s.c.CoreContainer Couldn't add files from /home/jenkins/workspace/Lucene-Solr-trunk-Linux/solr/build/solr-core/test/J0/temp/solr.core.TestCoreContainer_56552133F49562C8-001/tempDir-005/lib to classpath: /home/jenkins/workspace/Lucene-Solr-trunk-Linux/solr/build/solr-core/test/J0/temp/solr.core.TestCoreContainer_56552133F49562C8-001/tempDir-005/lib
   [junit4]   2> 1238710 INFO  (TEST-TestCoreContainer.testReloadThreaded-seed#[56552133F49562C8]) [    ] o.a.s.h.c.HttpShardHandlerFactory created with socketTimeout : 600000,connTimeout : 60000,maxConnectionsPerHost : 20,maxConnections : 10000,corePoolSize : 0,maximumPoolSize : 2147483647,maxThreadIdleTime : 5,sizeOfQueue : -1,fairnessPolicy : false,useRetries : false,
   [junit4]   2> 1238711 INFO  (TEST-TestCoreContainer.testReloadThreaded-seed#[56552133F49562C8]) [    ] o.a.s.u.UpdateShardHandler Creating UpdateShardHandler HTTP client with params: socketTimeout=600000&connTimeout=60000&retry=true
   [junit4]   2> 1238711 INFO  (TEST-TestCoreContainer.testReloadThreaded-seed#[56552133F49562C8]) [    ] o.a.s.l.LogWatcher SLF4J impl is org.slf4j.impl.Log4jLoggerFactory
   [junit4]   2> 1238712 INFO  (TEST-TestCoreContainer.testReloadThreaded-seed#[56552133F49562C8]) [    ] o.a.s.l.LogWatcher Registering Log Listener [Log4j (org.slf4j.impl.Log4jLoggerFactory)]
   [junit4]   2> 1238712 INFO  (TEST-TestCoreContainer.testReloadThreaded-seed#[56552133F49562C8]) [    ] o.a.s.c.CoreContainer Security conf doesn't exist. Skipping setup for authorization module.
   [junit4]   2> 1238712 INFO  (TEST-TestCoreContainer.testReloadThreaded-seed#[56552133F49562C8]) [    ] o.a.s.c.CoreContainer No authentication plugin used.
   [junit4]   2> 1238712 INFO  (TEST-TestCoreContainer.testReloadThreaded-seed#[56552133F49562C8]) [    ] o.a.s.c.CorePropertiesLocator Looking for core definitions underneath /home/jenkins/workspace/Lucene-Solr-trunk-Linux/solr/build/solr-core/test/J0/temp/solr.core.TestCoreContainer_56552133F49562C8-001/tempDir-005
   [junit4]   2> 1238712 INFO  (TEST-TestCoreContainer.testReloadThreaded-seed#[56552133F49562C8]) [    ] o.a.s.c.CorePropertiesLocator Found 0 core definitions
   [junit4]   2> 1238713 INFO  (TEST-TestCoreContainer.testReloadThreaded-seed#[56552133F49562C8]) [    ] o.a.s.c.CoreDescriptor Created CoreDescriptor: {name=core1, config=solrconfig.xml, loadOnStartup=true, schema=schema.xml, configSetProperties=configsetprops.json, transient=false, dataDir=data/, configSet=minimal}
   [junit4]   2> 1238713 INFO  (TEST-TestCoreContainer.testReloadThreaded-seed#[56552133F49562C8]) [    ] o.a.s.c.SolrResourceLoader new SolrResourceLoader for directory: '/home/jenkins/workspace/Lucene-Solr-trunk-Linux/solr/core/src/test-files/solr/configsets/minimal'
   [junit4]   2> 1238713 INFO  (TEST-TestCoreContainer.testReloadThreaded-seed#[56552133F49562C8]) [    ] o.a.s.c.SolrResourceLoader JNDI not configured for solr (NoInitialContextEx)
   [junit4]   2> 1238713 INFO  (TEST-TestCoreContainer.testReloadThreaded-seed#[56552133F49562C8]) [    ] o.a.s.c.SolrResourceLoader solr home defaulted to 'solr/' (could not find system property or JNDI)
   [junit4]   2> 1238717 INFO  (TEST-TestCoreContainer.testReloadThreaded-seed#[56552133F49562C8]) [    ] o.a.s.c.SolrConfig current version of requestparams : -1
   [junit4]   2> 1238719 INFO  (TEST-TestCoreContainer.testReloadThreaded-seed#[56552133F49562C8]) [    ] o.a.s.c.SolrConfig Using Lucene MatchVersion: 6.0.0
   [junit4]   2> 1238723 INFO  (TEST-TestCoreContainer.testReloadThreaded-seed#[56552133F49562C8]) [    ] o.a.s.c.SolrConfig Loaded SolrConfig: solrconfig.xml
   [junit4]   2> 1238726 INFO  (TEST-TestCoreContainer.testReloadThreaded-seed#[56552133F49562C8]) [    ] o.a.s.s.IndexSchema [core1] Schema name=minimal
   [junit4]   2> 1238728 WARN  (TEST-TestCoreContainer.testReloadThreaded-seed#[56552133F49562C8]) [    ] o.a.s.s.IndexSchema no uniqueKey specified in schema.
   [junit4]   2> 1238729 INFO  (TEST-TestCoreContainer.testReloadThreaded-seed#[56552133F49562C8]) [    ] o.a.s.c.ConfigSetProperties Did not find ConfigSet properties, assuming default properties: Can't find resource 'configsetprops.json' in classpath or '/home/jenkins/workspace/Lucene-Solr-trunk-Linux/solr/core/src/test-files/solr/configsets/minimal'
   [junit4]   2> 1238729 INFO  (TEST-TestCoreContainer.testReloadThreaded-seed#[56552133F49562C8]) [    ] o.a.s.c.CoreContainer Creating SolrCore 'core1' using configuration from configset /home/jenkins/workspace/Lucene-Solr-trunk-Linux/solr/core/src/test-files/solr/configsets/minimal
   [junit4]   2> 1238730 INFO  (TEST-TestCoreContainer.testReloadThreaded-seed#[56552133F49562C8]) [    ] o.a.s.c.SolrCore org.apache.solr.core.MockDirectoryFactory
   [junit4]   2> 1238730 INFO  (TEST-TestCoreContainer.testReloadThreaded-seed#[56552133F49562C8]) [    ] o.a.s.c.SolrCore [[core1] ] Opening new SolrCore at [/home/jenkins/workspace/Lucene-Solr-trunk-Linux/solr/core/src/test-files/solr/configsets/minimal], dataDir=[/home/jenkins/workspace/Lucene-Solr-trunk-Linux/solr/build/solr-core/test/J0/temp/solr.core.TestCoreContainer_56552133F49562C8-001/tempDir-005/core1/data/]
   [junit4]   2> 1238730 INFO  (TEST-TestCoreContainer.testReloadThreaded-seed#[56552133F49562C8]) [    ] o.a.s.c.SolrCore JMX monitoring not detected for core: core1
   [junit4]   2> 1238730 INFO  (TEST-TestCoreContainer.testReloadThreaded-seed#[56552133F49562C8]) [    ] o.a.s.c.CachingDirectoryFactory return new directory for /home/jenkins/workspace/Lucene-Solr-trunk-Linux/solr/build/solr-core/test/J0/temp/solr.core.TestCoreContainer_56552133F49562C8-001/tempDir-005/core1/data
   [junit4]   2> 1238730 INFO  (TEST-TestCoreContainer.testReloadThreaded-seed#[56552133F49562C8]) [    ] o.a.s.c.SolrCore New index directory detected: old=null new=/home/jenkins/workspace/Lucene-Solr-trunk-Linux/solr/build/solr-core/test/J0/temp/solr.core.TestCoreContainer_56552133F49562C8-001/tempDir-005/core1/data/index/
   [junit4]   2> 1238731 WARN  (TEST-TestCoreContainer.testReloadThreaded-seed#[56552133F49562C8]) [    ] o.a.s.c.SolrCore [core1] Solr index directory '/home/jenkins/workspace/Lucene-Solr-trunk-Linux/solr/build/solr-core/test/J0/temp/solr.core.TestCoreContainer_56552133F49562C8-001/tempDir-005/core1/data/index' doesn't exist. Creating new index...
   [junit4]   2> 1238731 INFO  (TEST-TestCoreContainer.testReloadThreaded-seed#[56552133F49562C8]) [    ] o.a.s.c.CachingDirectoryFactory return new directory for /home/jenkins/workspace/Lucene-Solr-trunk-Linux/solr/build/solr-core/test/J0/temp/solr.core.TestCoreContainer_56552133F49562C8-001/tempDir-005/core1/data/index
   [junit4]   2> 1238732 INFO  (TEST-TestCoreContainer.testReloadThreaded-seed#[56552133F49562C8]) [    ] o.a.s.c.SolrDeletionPolicy SolrDeletionPolicy.onCommit: commits: num=1
   [junit4]   2> 	commit{dir=MockDirectoryWrapper(RAMDirectory@a464c9 lockFactory=org.apache.lucene.store.SingleInstanceLockFactory@193f91b),segFN=segments_1,generation=1}
   [junit4]   2> 1238732 INFO  (TEST-TestCoreContainer.testReloadThreaded-seed#[56552133F49562C8]) [    ] o.a.s.c.SolrDeletionPolicy newest commit generation = 1
   [junit4]   2> 1238732 INFO  (OldIndexDirectoryCleanupThreadForCore-core1) [    ] o.a.s.c.SolrCore Looking for old index directories to cleanup for core core1 in /home/jenkins/workspace/Lucene-Solr-trunk-Linux/solr/build/solr-core/test/J0/temp/solr.core.TestCoreContainer_56552133F49562C8-001/tempDir-005/core1/data/
   [junit4]   2> 1238732 WARN  (OldIndexDirectoryCleanupThreadForCore-core1) [    ] o.a.s.c.DirectoryFactory /home/jenkins/workspace/Lucene-Solr-trunk-Linux/solr/build/solr-core/test/J0/temp/solr.core.TestCoreContainer_56552133F49562C8-001/tempDir-005/core1/data/ does not point to a valid data directory; skipping clean-up of old index directories.
   [junit4]   2> 1238733 INFO  (TEST-TestCoreContainer.testReloadThreaded-seed#[56552133F49562C8]) [    ] o.a.s.c.SolrCore no updateRequestProcessorChain defined as default, creating implicit default
   [junit4]   2> 1238734 INFO  (TEST-TestCoreContainer.testReloadThreaded-seed#[56552133F49562C8]) [    ] o.a.s.h.l.XMLLoader xsltCacheLifetimeSeconds=60
   [junit4]   2> 1238735 INFO  (TEST-TestCoreContainer.testReloadThreaded-seed#[56552133F49562C8]) [    ] o.a.s.h.l.XMLLoader xsltCacheLifetimeSeconds=60
   [junit4]   2> 1238736 INFO  (TEST-TestCoreContainer.testReloadThreaded-seed#[56552133F49562C8]) [    ] o.a.s.h.l.XMLLoader xsltCacheLifetimeSeconds=60
   [junit4]   2> 1238736 INFO  (TEST-TestCoreContainer.testReloadThreaded-seed#[56552133F49562C8]) [    ] o.a.s.h.l.XMLLoader xsltCacheLifetimeSeconds=60
   [junit4]   2> 1238737 INFO  (TEST-TestCoreContainer.testReloadThreaded-seed#[56552133F49562C8]) [    ] o.a.s.c.RequestHandlers Registered paths: /admin/mbeans,/update/csv,/sql,/update/json/docs,/admin/luke,/export,/select,/admin/segments,/get,/admin/system,/replication,/admin/properties,/config,/stream,/schema,/admin/plugins,/admin/logging,/update/json,/admin/threads,/admin/ping,/update,/admin/file
   [junit4]   2> 1238737 INFO  (TEST-TestCoreContainer.testReloadThreaded-seed#[56552133F49562C8]) [    ] o.a.s.c.SolrCore Using default statsCache cache: org.apache.solr.search.stats.LocalStatsCache
   [junit4]   2> 1238738 INFO  (TEST-TestCoreContainer.testReloadThreaded-seed#[56552133F49562C8]) [    ] o.a.s.u.CommitTracker Hard AutoCommit: disabled
   [junit4]   2> 1238738 INFO  (TEST-TestCoreContainer.testReloadThreaded-seed#[56552133F49562C8]) [    ] o.a.s.u.CommitTracker Soft AutoCommit: disabled
   [junit4]   2> 1238738 INFO  (TEST-TestCoreContainer.testReloadThreaded-seed#[56552133F49562C8]) [    ] o.a.s.c.SolrDeletionPolicy SolrDeletionPolicy.onInit: commits: num=1
   [junit4]   2> 	commit{dir=MockDirectoryWrapper(RAMDirectory@a464c9 lockFactory=org.apache.lucene.store.SingleInstanceLockFactory@193f91b),segFN=segments_1,generation=1}
   [junit4]   2> 1238738 INFO  (TEST-TestCoreContainer.testReloadThreaded-seed#[56552133F49562C8]) [    ] o.a.s.c.SolrDeletionPolicy newest commit generation = 1
   [junit4]   2> 1238738 INFO  (TEST-TestCoreContainer.testReloadThreaded-seed#[56552133F49562C8]) [    ] o.a.s.s.SolrIndexSearcher Opening [Searcher@179b98c[core1] main]
   [junit4]   2> 1238738 WARN  (TEST-TestCoreContainer.testReloadThreaded-seed#[56552133F49562C8]) [    ] o.a.s.r.ManagedResourceStorage Cannot write to config directory /home/jenkins/workspace/Lucene-Solr-trunk-Linux/solr/core/src/test-files/solr/configsets/minimal/conf; switching to use InMemory storage instead.
   [junit4]   2> 1238738 INFO  (TEST-TestCoreContainer.testReloadThreaded-seed#[56552133F49562C8]) [    ] o.a.s.r.RestManager Initializing RestManager with initArgs: {}
   [junit4]   2> 1238738 INFO  (TEST-TestCoreContainer.testReloadThreaded-seed#[56552133F49562C8]) [    ] o.a.s.r.ManagedResourceStorage Reading _rest_managed.json using InMemoryStorage
   [junit4]   2> 1238739 INFO  (TEST-TestCoreContainer.testReloadThreaded-seed#[56552133F49562C8]) [    ] o.a.s.r.RestManager Initializing 0 registered ManagedResources
   [junit4]   2> 1238739 INFO  (TEST-TestCoreContainer.testReloadThreaded-seed#[56552133F49562C8]) [    ] o.a.s.h.ReplicationHandler Commits will be reserved for  10000
   [junit4]   2> 1238739 INFO  (searcherExecutor-4360-thread-1) [    ] o.a.s.c.SolrCore [core1] Registered new searcher Searcher@179b98c[core1] main{ExitableDirectoryReader(UninvertingDirectoryReader())}
   [junit4]   2> 1238740 INFO  (TEST-TestCoreContainer.testReloadThreaded-seed#[56552133F49562C8]) [    ] o.a.s.c.CoreContainer registering core: core1
   [junit4]   2> 1238741 INFO  (Thread-4191) [    ] o.a.s.c.SolrResourceLoader new SolrResourceLoader for directory: '/home/jenkins/workspace/Lucene-Solr-trunk-Linux/solr/core/src/test-files/solr/configsets/minimal'
   [junit4]   2> 1238741 INFO  (Thread-4191) [    ] o.a.s.c.SolrResourceLoader JNDI not configured for solr (NoInitialContextEx)
   [junit4]   2> 1238741 INFO  (Thread-4191) [    ] o.a.s.c.SolrResourceLoader solr home defaulted to 'solr/' (could not find system property or JNDI)
   [junit4]   2> 1238746 INFO  (Thread-4191) [    ] o.a.s.c.SolrConfig current version of requestparams : -1
   [junit4]   2> 1238748 INFO  (Thread-4191) [    ] o.a.s.c.SolrConfig Using Lucene MatchVersion: 6.0.0
   [junit4]   2> 1238752 INFO  (Thread-4191) [    ] o.a.s.c.SolrConfig Loaded SolrConfig: solrconfig.xml
   [junit4]   2> 1238754 INFO  (Thread-4191) [    ] o.a.s.s.IndexSchema [core1] Schema name=minimal
   [junit4]   2> 1238756 WARN  (Thread-4191) [    ] o.a.s.s.IndexSchema no uniqueKey specified in schema.
   [junit4]   2> 1238757 INFO  (Thread-4191) [    ] o.a.s.c.ConfigSetProperties Did not find ConfigSet properties, assuming default properties: Can't find resource 'configsetprops.json' in classpath or '/home/jenkins/workspace/Lucene-Solr-trunk-Linux/solr/core/src/test-files/solr/configsets/minimal'
   [junit4]   2> 1238757 INFO  (Thread-4191) [    ] o.a.s.c.CoreContainer Reloading SolrCore 'core1' using configuration from configset /home/jenkins/workspace/Lucene-Solr-trunk-Linux/solr/core/src/test-files/solr/configsets/minimal
   [junit4]   2> 1238757 INFO  (Thread-4191) [    ] o.a.s.c.SolrCore [[core1] ] Opening new SolrCore at [/home/jenkins/workspace/Lucene-Solr-trunk-Linux/solr/core/src/test-files/solr/configsets/minimal], dataDir=[/home/jenkins/workspace/Lucene-Solr-trunk-Linux/solr/build/solr-core/test/J0/temp/solr.core.TestCoreContainer_56552133F49562C8-001/tempDir-005/core1/data/]
   [junit4]   2> 1238757 INFO  (Thread-4191) [    ] o.a.s.c.SolrCore JMX monitoring not detected for core: core1
   [junit4]   2> 1238757 INFO  (Thread-4191) [    ] o.a.s.c.SolrCore New index directory detected: old=null new=/home/jenkins/workspace/Lucene-Solr-trunk-Linux/solr/build/solr-core/test/J0/temp/solr.core.TestCoreContainer_56552133F49562C8-001/tempDir-005/core1/data/index/
   [junit4]   2> 1238757 INFO  (OldIndexDirectoryCleanupThreadForCore-core1) [    ] o.a.s.c.SolrCore Looking for old index directories to cleanup for core core1 in /home/jenkins/workspace/Lucene-Solr-trunk-Linux/solr/build/solr-core/test/J0/temp/solr.core.TestCoreContainer_56552133F49562C8-001/tempDir-005/core1/data/
   [junit4]   2> 1238758 WARN  (OldIndexDirectoryCleanupThreadForCore-core1) [    ] o.a.s.c.DirectoryFactory /home/jenkins/workspace/Lucene-Solr-trunk-Linux/solr/build/solr-core/test/J0/temp/solr.core.TestCoreContainer_56552133F49562C8-001/tempDir-005/core1/data/ does not point to a valid data directory; skipping clean-up of old index directories.
   [junit4]   2> 1238758 INFO  (Thread-4191) [    ] o.a.s.c.SolrCore no updateRequestProcessorChain defined as default, creating implicit default
   [junit4]   2> 1238759 INFO  (Thread-4191) [    ] o.a.s.h.l.XMLLoader xsltCacheLifetimeSeconds=60
   [junit4]   2> 1238760 INFO  (Thread-4191) [    ] o.a.s.h.l.XMLLoader xsltCacheLifetimeSeconds=60
   [junit4]   2> 1238761 INFO  (Thread-4191) [    ] o.a.s.h.l.XMLLoader xsltCacheLifetimeSeconds=60
   [junit4]   2> 1238761 INFO  (Thread-4191) [    ] o.a.s.h.l.XMLLoader xsltCacheLifetimeSeconds=60
   [junit4]   2> 1238762 INFO  (Thread-4191) [    ] o.a.s.c.RequestHandlers Registered paths: /admin/mbeans,/update/csv,/sql,/update/json/docs,/admin/luke,/export,/select,/admin/segments,/get,/admin/system,/replication,/admin/properties,/config,/stream,/schema,/admin/plugins,/admin/logging,/update/json,/admin/threads,/admin/ping,/update,/admin/file
   [junit4]   2> 1238762 INFO  (Thread-4191) [    ] o.a.s.c.SolrCore Using default statsCache cache: org.apache.solr.search.stats.LocalStatsCache
   [junit4]   2> 1238763 INFO  (Thread-4191) [    ] o.a.s.u.CommitTracker Hard AutoCommit: disabled
   [junit4]   2> 1238763 INFO  (Thread-4191) [    ] o.a.s.u.CommitTracker Soft AutoCommit: disabled
   [junit4]   2> 1238763 INFO  (Thread-4191) [    ] o.a.s.s.SolrIndexSearcher Opening [Searcher@15d032[core1] main]
   [junit4]   2> 1238763 WARN  (Thread-4191) [    ] o.a.s.r.ManagedResourceStorage Cannot write to config directory /home/jenkins/workspace/Lucene-Solr-trunk-Linux/solr/core/src/test-files/solr/configsets/minimal/conf; switching to use InMemory storage instead.
   [junit4]   2> 1238764 INFO  (Thread-4191) [    ] o.a.s.r.RestManager Initializing RestManager with initArgs: {}
   [junit4]   2> 1238764 INFO  (Thread-4191) [    ] o.a.s.r.ManagedResourceStorage Reading _rest_managed.json using InMemoryStorage
   [junit4]   2> 1238764 INFO  (Thread-4191) [    ] o.a.s.r.RestManager Initializing 0 registered ManagedResources
   [junit4]   2> 1238764 INFO  (Thread-4191) [    ] o.a.s.h.ReplicationHandler Commits will be reserved for  10000
   [junit4]   2> 1238764 INFO  (searcherExecutor-4364-thread-1) [    ] o.a.s.c.SolrCore [core1] Registered new searcher Searcher@15d032[core1] main{ExitableDirectoryReader(UninvertingDirectoryReader())}
   [junit4]   2> 1238764 INFO  (Thread-4191) [    ] o.a.s.u.DefaultSolrCoreState Closing old IndexWriter... core=core1
   [junit4]   2> 1238765 INFO  (Thread-4191) [    ] o.a.s.c.SolrDeletionPolicy SolrDeletionPolicy.onInit: commits: num=1
   [junit4]   2> 	commit{dir=MockDirectoryWrapper(RAMDirectory@a464c9 lockFactory=org.apache.lucene.store.SingleInstanceLockFactory@193f91b),segFN=segments_1,generation=1}
   [junit4]   2> 1238765 INFO  (Thread-4191) [    ] o.a.s.c.SolrDeletionPolicy newest commit generation = 1
   [junit4]   2> 1238765 INFO  (Thread-4191) [    ] o.a.s.u.DefaultSolrCoreState New IndexWriter is ready to be used.
   [junit4]   2> 1238765 INFO  (Thread-4191) [    ] o.a.s.s.SolrIndexSearcher Opening [Searcher@3b3929[core1] main]
   [junit4]   2> 1238765 INFO  (Thread-4191) [    ] o.a.s.c.CoreContainer replacing core: core1
   [junit4]   2> 1238765 INFO  (searcherExecutor-4364-thread-1) [    ] o.a.s.c.SolrCore [core1] Registered new searcher Searcher@3b3929[core1] main{ExitableDirectoryReader(UninvertingDirectoryReader())}
   [junit4]   2> 1238765 INFO  (Thread-4191) [    ] o.a.s.c.SolrCore [core1]  CLOSING SolrCore org.apache.solr.core.SolrCore@14098ee
   [junit4]   2> 1238765 INFO  (Thread-4191) [    ] o.a.s.u.DirectUpdateHandler2 closing DirectUpdateHandler2{commits=0,autocommits=0,soft autocommits=0,optimizes=0,rollbacks=0,expungeDeletes=0,docsPending=0,adds=0,deletesById=0,deletesByQuery=0,errors=0,cumulative_adds=0,cumulative_deletesById=0,cumulative_deletesByQuery=0,cumulative_errors=0}
   [junit4]   2> 1238765 INFO  (Thread-4191) [    ] o.a.s.c.SolrCore [core1] Closing main searcher on request.
   [junit4]   2> 1238766 INFO  (Thread-4194) [    ] o.a.s.c.SolrResourceLoader new SolrResourceLoader for directory: '/home/jenkins/workspace/Lucene-Solr-trunk-Linux/solr/core/src/test-files/solr/configsets/minimal'
   [junit4]   2> 1238766 INFO  (Thread-4194) [    ] o.a.s.c.SolrResourceLoader JNDI not configured for solr (NoInitialContextEx)
   [junit4]   2> 1238766 INFO  (Thread-4194) [    ] o.a.s.c.SolrResourceLoader solr home defaulted to 'solr/' (could not find system property or JNDI)
   [junit4]   2> 1238770 INFO  (Thread-4194) [    ] o.a.s.c.SolrConfig current version of requestparams : -1
   [junit4]   2> 1238774 INFO  (Thread-4194) [    ] o.a.s.c.SolrConfig Using Lucene MatchVersion: 6.0.0
   [junit4]   2> 1238779 INFO  (Thread-4194) [    ] o.a.s.c.SolrConfig Loaded SolrConfig: solrconfig.xml
   [junit4]   2> 1238781 INFO  (Thread-4194) [    ] o.a.s.s.IndexSchema [core1] Schema name=minimal
   [junit4]   2> 1238782 WARN  (Thread-4194) [    ] o.a.s.s.IndexSchema no uniqueKey specified in schema.
   [junit4]   2> 1238783 INFO  (Thread-4194) [    ] o.a.s.c.ConfigSetProperties Did not find ConfigSet properties, assuming default properties: Can't find resource 'configsetprops.json' in classpath or '/home/jenkins/workspace/Lucene-Solr-trunk-Linux/solr/core/src/test-files/solr/configsets/minimal'
   [junit4]   2> 1238784 INFO  (Thread-4194) [    ] o.a.s.c.CoreContainer Reloading SolrCore 'core1' using configuration from configset /home/jenkins/workspace/Lucene-Solr-trunk-Linux/solr/core/src/test-files/solr/configsets/minimal
   [junit4]   2> 1238784 INFO  (Thread-4194) [    ] o.a.s.c.SolrCore [[core1] ] Opening new SolrCore at [/home/jenkins/workspace/Lucene-Solr-trunk-Linux/solr/core/src/test-files/solr/configsets/minimal], dataDir=[/home/jenkins/workspace/Lucene-Solr-trunk-Linux/solr/build/solr-core/test/J0/temp/solr.core.TestCoreContainer_56552133F49562C8-001/tempDir-005/core1/data/]
   [junit4]   2> 1238784 INFO  (Thread-4194) [    ] o.a.s.c.SolrCore JMX monitoring not detected for core: core1
   [junit4]   2> 1238784 INFO  (Thread-4194) [    ] o.a.s.c.SolrCore New index directory detected: old=null new=/home/jenkins/workspace/Lucene-Solr-trunk-Linux/solr/build/solr-core/test/J0/temp/solr.core.TestCoreContainer_56552133F49562C8-001/tempDir-005/core1/data/index/
   [junit4]   2> 1238784 INFO  (OldIndexDirectoryCleanupThreadForCore-core1) [    ] o.a.s.c.SolrCore Looking for old index directories to cleanup for core core1 in /home/jenkins/workspace/Lucene-Solr-trunk-Linux/solr/build/solr-core/test/J0/temp/solr.core.TestCoreContainer_56552133F49562C8-001/tempDir-005/core1/data/
   [junit4]   2> 1238784 WARN  (OldIndexDirectoryCleanupThreadForCore-core1) [    ] o.a.s.c.DirectoryFactory /home/jenkins/workspace/Lucene-Solr-trunk-Linux/solr/build/solr-core/test/J0/temp/solr.core.TestCoreContainer_56552133F49562C8-001/tempDir-005/core1/data/ does not point to a valid data directory; skipping clean-up of old index directories.
   [junit4]   2> 1238785 INFO  (Thread-4194) [    ] o.a.s.c.SolrCore no updateRequestProcessorChain defined as default, creating implicit default
   [junit4]   2> 1238786 INFO  (Thread-4194) [    ] o.a.s.h.l.XMLLoader xsltCacheLifetimeSeconds=60
   [junit4]   2> 1238787 INFO  (Thread-4194) [    ] o.a.s.h.l.XMLLoader xsltCacheLifetimeSeconds=60
   [junit4]   2> 1238788 INFO  (Thread-4194) [    ] o.a.s.h.l.XMLLoader xsltCacheLifetimeSeconds=60
   [junit4]   2> 1238789 INFO  (Thread-4194) [    ] o.a.s.h.l.XMLLoader xsltCacheLifetimeSeconds=60
   [junit4]   2> 1238790 INFO  (Thread-4194) [    ] o.a.s.c.RequestHandlers Registered paths: /admin/mbeans,/update/csv,/sql,/update/json/docs,/admin/luke,/export,/select,/admin/segments,/get,/admin/system,/replication,/admin/properties,/config,/stream,/schema,/admin/plugins,/admin/logging,/update/json,/admin/threads,/admin/ping,/update,/admin/file
   [junit4]   2> 1238790 INFO  (Thread-4194) [    ] o.a.s.c.SolrCore Using default statsCache cache: org.apache.solr.search.stats.LocalStatsCache
   [junit4]   2> 1238790 INFO  (Thread-4194) [    ] o.a.s.u.CommitTracker Hard AutoCommit: disabled
   [junit4]   2> 1238790 INFO  (Thread-4194) [    ] o.a.s.u.CommitTracker Soft AutoCommit: disabled
   [junit4]   2> 1238790 INFO  (Thread-4194) [    ] o.a.s.s.SolrIndexSearcher Opening [Searcher@156bd5f[core1] main]
   [junit4]   2> 1238790 WARN  (Thread-4194) [    ] o.a.s.r.ManagedResourceStorage Cannot write to config directory /home/jenkins/workspace/Lucene-Solr-trunk-Linux/solr/core/src/test-files/solr/configsets/minimal/conf; switching to use InMemory storage instead.
   [junit4]   2> 1238791 INFO  (Thread-4194) [    ] o.a.s.r.RestManager Initializing RestManager with initArgs: {}
   [junit4]   2> 1238791 INFO  (Thread-4194) [    ] o.a.s.r.ManagedResourceStorage Reading _rest_managed.json using InMemoryStorage
   [junit4]   2> 1238791 INFO  (Thread-4194) [    ] o.a.s.r.RestManager Initializing 0 registered ManagedResources
   [junit4]   2> 1238791 INFO  (Thread-4194) [    ] o.a.s.h.ReplicationHandler Commits will be reserved for  10000
   [junit4]   2> 1238791 INFO  (searcherExecutor-4368-thread-1) [    ] o.a.s.c.SolrCore [core1] Registered new searcher Searcher@156bd5f[core1] main{ExitableDirectoryReader(UninvertingDirectoryReader())}
   [junit4]   2> 1238791 INFO  (Thread-4194) [    ] o.a.s.u.DefaultSolrCoreState Closing old IndexWriter... core=core1
   [junit4]   2> 1238791 INFO  (Thread-4194) [    ] o.a.s.c.SolrDeletionPolicy SolrDeletionPolicy.onInit: commits: num=1
   [junit4]   2> 	commit{dir=MockDirectoryWrapper(RAMDirectory@a464c9 lockFactory=org.apache.lucene.store.SingleInstanceLockFactory@193f91b),segFN=segments_1,generation=1}
   [junit4]   2> 1238792 INFO  (Thread-4194) [    ] o.a.s.c.SolrDeletionPolicy newest commit generation = 1
   [junit4]   2> 1238792 INFO  (Thread-4194) [    ] o.a.s.u.DefaultSolrCoreState New IndexWriter is ready to be used.
   [junit4]   2> 1238792 INFO  (Thread-4194) [    ] o.a.s.s.SolrIndexSearcher Opening [Searcher@12247b7[core1] main]
   [junit4]   2> 1238792 INFO  (Thread-4194) [    ] o.a.s.c.CoreContainer replacing core: core1
   [junit4]   2> 1238792 INFO  (searcherExecutor-4368-thread-1) [    ] o.a.s.c.SolrCore [core1] Registered new searcher Searcher@12247b7[core1] main{ExitableDirectoryReader(UninvertingDirectoryReader())}
   [junit4]   2> 1238792 INFO  (Thread-4194) [    ] o.a.s.c.SolrCore [core1]  CLOSING SolrCore org.apache.solr.core.SolrCore@101d385
   [junit4]   2> 1238792 INFO  (Thread-4194) [    ] o.a.s.u.DirectUpdateHandler2 closing DirectUpdateHandler2{commits=0,autocommits=0,soft autocommits=0,optimizes=0,rollbacks=0,expungeDeletes=0,docsPending=0,adds=0,deletesById=0,deletesByQuery=0,errors=0,cumulative_adds=0,cumulative_deletesById=0,cumulative_deletesByQuery=0,cumulative_errors=0}
   [junit4]   2> 1238792 INFO  (Thread-4194) [    ] o.a.s.c.SolrCore [core1] Closing main searcher on request.
   [junit4]   2> 1238793 INFO  (Thread-4192) [    ] o.a.s.c.SolrResourceLoader new SolrResourceLoader for directory: '/home/jenkins/workspace/Lucene-Solr-trunk-Linux/solr/core/src/test-files/solr/configsets/minimal'
   [junit4]   2> 1238793 INFO  (Thread-4192) [    ] o.a.s.c.SolrResourceLoader JNDI not configured for solr (NoInitialContextEx)
   [junit4]   2> 1238793 INFO  (Thread-4192) [    ] o.a.s.c.SolrResourceLoader solr home defaulted to 'solr/' (could not find system property or JNDI)
   [junit4]   2> 1238796 INFO  (Thread-4192) [    ] o.a.s.c.SolrConfig current version of requestparams : -1
   [junit4]   2> 1238798 INFO  (Thread-4192) [    ] o.a.s.c.SolrConfig Using Lucene MatchVersion: 6.0.0
   [junit4]   2> 1238802 INFO  (Thread-4192) [    ] o.a.s.c.SolrConfig Loaded SolrConfig: solrconfig.xml
   [junit4]   2> 1238805 INFO  (Thread-4192) [    ] o.a.s.s.IndexSchema [core1] Schema name=minimal
   [junit4]   2> 1238806 WARN  (Thread-4192) [    ] o.a.s.s.IndexSchema no uniqueKey specified in schema.
   [junit4]   2> 1238807 INFO  (Thread-4192) [    ] o.a.s.c.ConfigSetProperties Did not find ConfigSet properties, assuming default properties: Can't find resource 'configsetprops.json' in classpath or '/home/jenkins/workspace/Lucene-Solr-trunk-Linux/solr/core/src/test-files/solr/configsets/minimal'
   [junit4]   2> 1238807 INFO  (Thread-4192) [    ] o.a.s.c.CoreContainer Reloading SolrCore 'core1' using configuration from configset /home/jenkins/workspace/Lucene-Solr-trunk-Linux/solr/core/src/test-files/solr/configsets/minimal
   [junit4]   2> 1238808 INFO  (Thread-4192) [    ] o.a.s.c.SolrCore [[core1] ] Opening new SolrCore at [/home/jenkins/workspace/Lucene-Solr-trunk-Linux/solr/core/src/test-files/solr/configsets/minimal], dataDir=[/home/jenkins/workspace/Lucene-Solr-trunk-Linux/solr/build/solr-core/test/J0/temp/solr.core.TestCoreContainer_56552133F49562C8-001/tempDir-005/core1/data/]
   [junit4]   2> 1238808 INFO  (Thread-4192) [    ] o.a.s.c.SolrCore JMX monitoring not detected for core: core1
   [junit4]   2> 1238808 INFO  (Thread-4192) [    ] o.a.s.c.SolrCore New index directory detected: old=null new=/home/jenkins/workspace/Lucene-Solr-trunk-Linux/solr/build/solr-core/test/J0/temp/solr.core.TestCoreContainer_56552133F49562C8-001/tempDir-005/core1/data/index/
   [junit4]   2> 1238808 INFO  (OldIndexDirectoryCleanupThreadForCore-core1) [    ] o.a.s.c.SolrCore Looking for old index directories to cleanup for core core1 in /home/jenkins/workspace/Lucene-Solr-trunk-Linux/solr/build/solr-core/test/J0/temp/solr.core.TestCoreContainer_56552133F49562C8-001/tempDir-005/core1/data/
   [junit4]   2> 1238808 WARN  (OldIndexDirectoryCleanupThreadForCore-core1) [    ] o.a.s.c.DirectoryFactory /home/jenkins/workspace/Lucene-Solr-trunk-Linux/solr/build/solr-core/test/J0/temp/solr.core.TestCoreContainer_56552133F49562C8-001/tempDir-005/core1/data/ does not point to a valid data directory; skipping clean-up of old index directories.
   [junit4]   2> 1238809 INFO  (T

[...truncated too long message...]

sting.RandomizedRunner$10.evaluate(RandomizedRunner.java:921)
   [junit4]   2>         at com.carrotsearch.randomizedtesting.rules.SystemPropertiesRestoreRule$1.evaluate(SystemPropertiesRestoreRule.java:57)
   [junit4]   2>         at org.apache.lucene.util.TestRuleSetupTeardownChained$1.evaluate(TestRuleSetupTeardownChained.java:50)
   [junit4]   2>         at org.apache.lucene.util.AbstractBeforeAfterRule$1.evaluate(AbstractBeforeAfterRule.java:46)
   [junit4]   2>         at org.apache.lucene.util.TestRuleThreadAndTestName$1.evaluate(TestRuleThreadAndTestName.java:49)
   [junit4]   2>         at org.apache.lucene.util.TestRuleIgnoreAfterMaxFailures$1.evaluate(TestRuleIgnoreAfterMaxFailures.java:65)
   [junit4]   2>         at org.apache.lucene.util.TestRuleMarkFailure$1.evaluate(TestRuleMarkFailure.java:48)
   [junit4]   2>         at com.carrotsearch.randomizedtesting.rules.StatementAdapter.evaluate(StatementAdapter.java:36)
   [junit4]   2>         at com.carrotsearch.randomizedtesting.ThreadLeakControl$StatementRunner.run(ThreadLeakControl.java:367)
   [junit4]   2>         at com.carrotsearch.randomizedtesting.ThreadLeakControl.forkTimeoutingTask(ThreadLeakControl.java:809)
   [junit4]   2>         at com.carrotsearch.randomizedtesting.ThreadLeakControl$3.evaluate(ThreadLeakControl.java:460)
   [junit4]   2>         at com.carrotsearch.randomizedtesting.RandomizedRunner.runSingleTest(RandomizedRunner.java:880)
   [junit4]   2>         at com.carrotsearch.randomizedtesting.RandomizedRunner$5.evaluate(RandomizedRunner.java:781)
   [junit4]   2>         at com.carrotsearch.randomizedtesting.RandomizedRunner$6.evaluate(RandomizedRunner.java:816)
   [junit4]   2>         at com.carrotsearch.randomizedtesting.RandomizedRunner$7.evaluate(RandomizedRunner.java:827)
   [junit4]   2>         at com.carrotsearch.randomizedtesting.rules.StatementAdapter.evaluate(StatementAdapter.java:36)
   [junit4]   2>         at com.carrotsearch.randomizedtesting.rules.SystemPropertiesRestoreRule$1.evaluate(SystemPropertiesRestoreRule.java:57)
   [junit4]   2>         at org.apache.lucene.util.AbstractBeforeAfterRule$1.evaluate(AbstractBeforeAfterRule.java:46)
   [junit4]   2>         at com.carrotsearch.randomizedtesting.rules.StatementAdapter.evaluate(StatementAdapter.java:36)
   [junit4]   2>         at org.apache.lucene.util.TestRuleStoreClassName$1.evaluate(TestRuleStoreClassName.java:42)
   [junit4]   2>         at com.carrotsearch.randomizedtesting.rules.NoShadowingOrOverridesOnMethodsRule$1.evaluate(NoShadowingOrOverridesOnMethodsRule.java:40)
   [junit4]   2>         at com.carrotsearch.randomizedtesting.rules.NoShadowingOrOverridesOnMethodsRule$1.evaluate(NoShadowingOrOverridesOnMethodsRule.java:40)
   [junit4]   2>         at com.carrotsearch.randomizedtesting.rules.StatementAdapter.evaluate(StatementAdapter.java:36)
   [junit4]   2>         at com.carrotsearch.randomizedtesting.rules.StatementAdapter.evaluate(StatementAdapter.java:36)
   [junit4]   2>         at com.carrotsearch.randomizedtesting.rules.StatementAdapter.evaluate(StatementAdapter.java:36)
   [junit4]   2>         at org.apache.lucene.util.TestRuleAssertionsRequired$1.evaluate(TestRuleAssertionsRequired.java:54)
   [junit4]   2>         at org.apache.lucene.util.TestRuleMarkFailure$1.evaluate(TestRuleMarkFailure.java:48)
   [junit4]   2>         at org.apache.lucene.util.TestRuleIgnoreAfterMaxFailures$1.evaluate(TestRuleIgnoreAfterMaxFailures.java:65)
   [junit4]   2>         at org.apache.lucene.util.TestRuleIgnoreTestSuites$1.evaluate(TestRuleIgnoreTestSuites.java:55)
   [junit4]   2>         at com.carrotsearch.randomizedtesting.rules.StatementAdapter.evaluate(StatementAdapter.java:36)
   [junit4]   2>         at com.carrotsearch.randomizedtesting.ThreadLeakControl$StatementRunner.run(ThreadLeakControl.java:367)
   [junit4]   2>         at java.lang.Thread.run(Thread.java:747)
   [junit4]   2>    2) Thread[id=10650, name=Thread-4199, state=WAITING, group=TGRP-TestCoreContainer]
   [junit4]   2>         at java.lang.Object.wait(Native Method)
   [junit4]   2>         at java.lang.Object.wait(Object.java:516)
   [junit4]   2>         at org.apache.solr.core.CloserThread.run(CoreContainer.java:1243)
   [junit4]   2> янв. 12, 2016 5:28:23 ӔМБИСБОНЫ РАЗМӔ com.carrotsearch.randomizedtesting.ThreadLeakControl tryToInterruptAll
   [junit4]   2> INFO: Starting to interrupt leaked threads:
   [junit4]   2>    1) Thread[id=10618, name=TEST-TestCoreContainer.testLogWatcherEnabledByDefault-seed#[56552133F49562C8], state=WAITING, group=TGRP-TestCoreContainer]
   [junit4]   2>    2) Thread[id=10650, name=Thread-4199, state=WAITING, group=TGRP-TestCoreContainer]
   [junit4]   2> 8458760 INFO  (TEST-TestCoreContainer.testLogWatcherEnabledByDefault-seed#[56552133F49562C8]) [    ] o.a.s.SolrTestCaseJ4 ###Ending testLogWatcherEnabledByDefault
   [junit4]   2> 8458761 INFO  (SUITE-TestCoreContainer-seed#[56552133F49562C8]-worker) [    ] o.a.s.SolrTestCaseJ4 ###deleteCore
   [junit4]   2> Jan 12, 2016 1:28:23 AM com.carrotsearch.randomizedtesting.ThreadLeakControl tryToInterruptAll
   [junit4]   2> INFO: All leaked threads terminated.
   [junit4]   2> NOTE: test params are: codec=CheapBastard, sim=RandomSimilarityProvider(queryNorm=false,coord=no): {}, locale=os_RU, timezone=Indian/Mauritius
   [junit4]   2> NOTE: Linux 3.19.0-42-generic i386/Oracle Corporation 9-ea (32-bit)/cpus=12,threads=1,free=83918424,total=518979584
   [junit4]   2> NOTE: All tests run in this JVM: [SynonymTokenizerTest, SSLMigrationTest, TestConfigSetProperties, VMParamsZkACLAndCredentialsProvidersTest, TestExclusionRuleCollectionAccess, TestCSVLoader, TestExactSharedStatsCache, DistributedSuggestComponentTest, ActionThrottleTest, CursorMarkTest, IgnoreCommitOptimizeUpdateProcessorFactoryTest, SharedFSAutoReplicaFailoverTest, TestRandomDVFaceting, URLClassifyProcessorTest, ExternalFileFieldSortTest, ResponseHeaderTest, TestHdfsUpdateLog, DistributedDebugComponentTest, XsltUpdateRequestHandlerTest, TestMiniSolrCloudClusterSSL, BufferStoreTest, InfoHandlerTest, DocumentAnalysisRequestHandlerTest, TestFastOutputStream, CloudMLTQParserTest, ReplicationFactorTest, RequestLoggingTest, DateRangeFieldTest, FileBasedSpellCheckerTest, TestOmitPositions, ConnectionReuseTest, DeleteInactiveReplicaTest, TestLazyCores, TestSchemaNameResource, JavabinLoaderTest, QueryElevationComponentTest, SyncSliceTest, OutputWriterTest, TestAnalyzedSuggestions, JSONWriterTest, TestSolrQueryParserResource, CursorPagingTest, TestIBSimilarityFactory, DateFieldTest, TestNamedUpdateProcessors, CloudExitableDirectoryReaderTest, TestConfigSetsAPI, TestCryptoKeys, PreAnalyzedFieldTest, CurrencyFieldOpenExchangeTest, TestSQLHandler, SolrCoreTest, TestSortingResponseWriter, TestComponentsName, TestObjectReleaseTracker, TestManagedSynonymFilterFactory, ExplicitHLLTest, TestRemoteStreaming, BasicZkTest, TestBlendedInfixSuggestions, LeaderElectionIntegrationTest, TestHighFrequencyDictionaryFactory, BasicDistributedZkTest, EchoParamsTest, SolrRequestParserTest, TestDocSet, TestStressLucene, TestScoreJoinQPNoScore, DirectoryFactoryTest, TestFunctionQuery, OverseerTaskQueueTest, TestFieldTypeCollectionResource, ConfigSetsAPITest, TestInitQParser, TestCopyFieldCollectionResource, CdcrReplicationDistributedZkTest, DataDrivenBlockJoinTest, TestRecoveryHdfs, TestMiniSolrCloudCluster, TestImplicitCoreProperties, HdfsNNFailoverTest, HdfsUnloadDistributedZkTest, SystemInfoHandlerTest, PathHierarchyTokenizerFactoryTest, TestDynamicFieldResource, TestLMDirichletSimilarityFactory, TestPhraseSuggestions, DistributedQueryElevationComponentTest, TestClusterStateMutator, TestValueSourceCache, TestSchemaVersionResource, TestMacros, DistributedSpellCheckComponentTest, ReturnFieldsTest, PolyFieldTest, HdfsChaosMonkeyNothingIsSafeTest, BasicDistributedZk2Test, UnloadDistributedZkTest, OpenCloseCoreStressTest, ShardRoutingTest, FullSolrCloudDistribCmdsTest, TestReplicationHandler, ZkSolrClientTest, TestDistributedGrouping, TestFaceting, TestRealTimeGet, TestStressReorder, TestJoin, TestReload, HardAutoCommitTest, TestRangeQuery, TestCoreContainer]
   [junit4]   2> NOTE: reproduce with: ant test  -Dtestcase=TestCoreContainer -Dtests.seed=56552133F49562C8 -Dtests.multiplier=3 -Dtests.slow=true -Dtests.locale=os_RU -Dtests.timezone=Indian/Mauritius -Dtests.asserts=true -Dtests.file.encoding=UTF-8
   [junit4] ERROR   0.00s J0 | TestCoreContainer (suite) <<<
   [junit4]    > Throwable #1: java.lang.Exception: Suite timeout exceeded (>= 7200000 msec).
   [junit4]    > 	at __randomizedtesting.SeedInfo.seed([56552133F49562C8]:0)
   [junit4] Completed [575/575 (1!)] on J0 in 7220.25s, 6 tests, 2 errors <<< FAILURES!

[...truncated 12 lines...]
BUILD FAILED
/home/jenkins/workspace/Lucene-Solr-trunk-Linux/build.xml:784: The following error occurred while executing this line:
/home/jenkins/workspace/Lucene-Solr-trunk-Linux/build.xml:728: The following error occurred while executing this line:
/home/jenkins/workspace/Lucene-Solr-trunk-Linux/build.xml:59: The following error occurred while executing this line:
/home/jenkins/workspace/Lucene-Solr-trunk-Linux/solr/build.xml:233: The following error occurred while executing this line:
/home/jenkins/workspace/Lucene-Solr-trunk-Linux/solr/common-build.xml:516: The following error occurred while executing this line:
/home/jenkins/workspace/Lucene-Solr-trunk-Linux/lucene/common-build.xml:1424: The following error occurred while executing this line:
/home/jenkins/workspace/Lucene-Solr-trunk-Linux/lucene/common-build.xml:981: There were test failures: 575 suites (8 ignored), 2286 tests, 1 suite-level error, 1 error, 115 ignored (70 assumptions) [seed: 56552133F49562C8]

Total time: 169 minutes 44 seconds
Build step 'Invoke Ant' marked build as failure
Archiving artifacts
[WARNINGS] Skipping publisher since build result is FAILURE
Recording test results
Email was triggered for: Failure - Any
Sending email for trigger: Failure - Any



Mime
View raw message