lucene-dev mailing list archives

Site index · List index
Message view « Date » · « Thread »
Top « Date » · « Thread »
From Policeman Jenkins Server <jenk...@thetaphi.de>
Subject [JENKINS] Lucene-Solr-trunk-MacOSX (64bit/jdk1.8.0) - Build # 2995 - Failure!
Date Tue, 05 Jan 2016 22:53:01 GMT
Build: http://jenkins.thetaphi.de/job/Lucene-Solr-trunk-MacOSX/2995/
Java: 64bit/jdk1.8.0 -XX:+UseCompressedOops -XX:+UseSerialGC

3 tests failed.
FAILED:  org.apache.solr.cloud.CollectionsAPIDistributedZkTest.test

Error Message:
Error from server at https://127.0.0.1:50628/s_ze/f/awholynewcollection_0: non ok status: 500, message:Server Error

Stack Trace:
org.apache.solr.client.solrj.impl.HttpSolrClient$RemoteSolrException: Error from server at https://127.0.0.1:50628/s_ze/f/awholynewcollection_0: non ok status: 500, message:Server Error
	at __randomizedtesting.SeedInfo.seed([F21576DF506C287:877568B75BFAAF7F]:0)
	at org.apache.solr.client.solrj.impl.HttpSolrClient.executeMethod(HttpSolrClient.java:509)
	at org.apache.solr.client.solrj.impl.HttpSolrClient.request(HttpSolrClient.java:241)
	at org.apache.solr.client.solrj.impl.HttpSolrClient.request(HttpSolrClient.java:230)
	at org.apache.solr.client.solrj.SolrRequest.process(SolrRequest.java:150)
	at org.apache.solr.client.solrj.SolrClient.query(SolrClient.java:943)
	at org.apache.solr.client.solrj.SolrClient.query(SolrClient.java:958)
	at org.apache.solr.cloud.AbstractFullDistribZkTestBase.waitForNon403or404or503(AbstractFullDistribZkTestBase.java:1754)
	at org.apache.solr.cloud.CollectionsAPIDistributedZkTest.testCollectionsAPI(CollectionsAPIDistributedZkTest.java:658)
	at org.apache.solr.cloud.CollectionsAPIDistributedZkTest.test(CollectionsAPIDistributedZkTest.java:160)
	at sun.reflect.NativeMethodAccessorImpl.invoke0(Native Method)
	at sun.reflect.NativeMethodAccessorImpl.invoke(NativeMethodAccessorImpl.java:62)
	at sun.reflect.DelegatingMethodAccessorImpl.invoke(DelegatingMethodAccessorImpl.java:43)
	at java.lang.reflect.Method.invoke(Method.java:497)
	at com.carrotsearch.randomizedtesting.RandomizedRunner.invoke(RandomizedRunner.java:1764)
	at com.carrotsearch.randomizedtesting.RandomizedRunner$8.evaluate(RandomizedRunner.java:871)
	at com.carrotsearch.randomizedtesting.RandomizedRunner$9.evaluate(RandomizedRunner.java:907)
	at com.carrotsearch.randomizedtesting.RandomizedRunner$10.evaluate(RandomizedRunner.java:921)
	at org.apache.solr.BaseDistributedSearchTestCase$ShardsRepeatRule$ShardsFixedStatement.callStatement(BaseDistributedSearchTestCase.java:965)
	at org.apache.solr.BaseDistributedSearchTestCase$ShardsRepeatRule$ShardsStatement.evaluate(BaseDistributedSearchTestCase.java:940)
	at com.carrotsearch.randomizedtesting.rules.SystemPropertiesRestoreRule$1.evaluate(SystemPropertiesRestoreRule.java:57)
	at org.apache.lucene.util.TestRuleSetupTeardownChained$1.evaluate(TestRuleSetupTeardownChained.java:50)
	at org.apache.lucene.util.AbstractBeforeAfterRule$1.evaluate(AbstractBeforeAfterRule.java:46)
	at org.apache.lucene.util.TestRuleThreadAndTestName$1.evaluate(TestRuleThreadAndTestName.java:49)
	at org.apache.lucene.util.TestRuleIgnoreAfterMaxFailures$1.evaluate(TestRuleIgnoreAfterMaxFailures.java:65)
	at org.apache.lucene.util.TestRuleMarkFailure$1.evaluate(TestRuleMarkFailure.java:48)
	at com.carrotsearch.randomizedtesting.rules.StatementAdapter.evaluate(StatementAdapter.java:36)
	at com.carrotsearch.randomizedtesting.ThreadLeakControl$StatementRunner.run(ThreadLeakControl.java:367)
	at com.carrotsearch.randomizedtesting.ThreadLeakControl.forkTimeoutingTask(ThreadLeakControl.java:809)
	at com.carrotsearch.randomizedtesting.ThreadLeakControl$3.evaluate(ThreadLeakControl.java:460)
	at com.carrotsearch.randomizedtesting.RandomizedRunner.runSingleTest(RandomizedRunner.java:880)
	at com.carrotsearch.randomizedtesting.RandomizedRunner$5.evaluate(RandomizedRunner.java:781)
	at com.carrotsearch.randomizedtesting.RandomizedRunner$6.evaluate(RandomizedRunner.java:816)
	at com.carrotsearch.randomizedtesting.RandomizedRunner$7.evaluate(RandomizedRunner.java:827)
	at com.carrotsearch.randomizedtesting.rules.StatementAdapter.evaluate(StatementAdapter.java:36)
	at com.carrotsearch.randomizedtesting.rules.SystemPropertiesRestoreRule$1.evaluate(SystemPropertiesRestoreRule.java:57)
	at org.apache.lucene.util.AbstractBeforeAfterRule$1.evaluate(AbstractBeforeAfterRule.java:46)
	at com.carrotsearch.randomizedtesting.rules.StatementAdapter.evaluate(StatementAdapter.java:36)
	at org.apache.lucene.util.TestRuleStoreClassName$1.evaluate(TestRuleStoreClassName.java:42)
	at com.carrotsearch.randomizedtesting.rules.NoShadowingOrOverridesOnMethodsRule$1.evaluate(NoShadowingOrOverridesOnMethodsRule.java:40)
	at com.carrotsearch.randomizedtesting.rules.NoShadowingOrOverridesOnMethodsRule$1.evaluate(NoShadowingOrOverridesOnMethodsRule.java:40)
	at com.carrotsearch.randomizedtesting.rules.StatementAdapter.evaluate(StatementAdapter.java:36)
	at com.carrotsearch.randomizedtesting.rules.StatementAdapter.evaluate(StatementAdapter.java:36)
	at com.carrotsearch.randomizedtesting.rules.StatementAdapter.evaluate(StatementAdapter.java:36)
	at org.apache.lucene.util.TestRuleAssertionsRequired$1.evaluate(TestRuleAssertionsRequired.java:54)
	at org.apache.lucene.util.TestRuleMarkFailure$1.evaluate(TestRuleMarkFailure.java:48)
	at org.apache.lucene.util.TestRuleIgnoreAfterMaxFailures$1.evaluate(TestRuleIgnoreAfterMaxFailures.java:65)
	at org.apache.lucene.util.TestRuleIgnoreTestSuites$1.evaluate(TestRuleIgnoreTestSuites.java:55)
	at com.carrotsearch.randomizedtesting.rules.StatementAdapter.evaluate(StatementAdapter.java:36)
	at com.carrotsearch.randomizedtesting.ThreadLeakControl$StatementRunner.run(ThreadLeakControl.java:367)
	at java.lang.Thread.run(Thread.java:745)


FAILED:  junit.framework.TestSuite.org.apache.solr.cloud.CollectionsAPIDistributedZkTest

Error Message:
6 threads leaked from SUITE scope at org.apache.solr.cloud.CollectionsAPIDistributedZkTest:     1) Thread[id=8550, name=zkCallback-1181-thread-2, state=TIMED_WAITING, group=TGRP-CollectionsAPIDistributedZkTest]         at sun.misc.Unsafe.park(Native Method)         at java.util.concurrent.locks.LockSupport.parkNanos(LockSupport.java:215)         at java.util.concurrent.SynchronousQueue$TransferStack.awaitFulfill(SynchronousQueue.java:460)         at java.util.concurrent.SynchronousQueue$TransferStack.transfer(SynchronousQueue.java:362)         at java.util.concurrent.SynchronousQueue.poll(SynchronousQueue.java:941)         at java.util.concurrent.ThreadPoolExecutor.getTask(ThreadPoolExecutor.java:1066)         at java.util.concurrent.ThreadPoolExecutor.runWorker(ThreadPoolExecutor.java:1127)         at java.util.concurrent.ThreadPoolExecutor$Worker.run(ThreadPoolExecutor.java:617)         at java.lang.Thread.run(Thread.java:745)    2) Thread[id=8552, name=zkCallback-1181-thread-4, state=TIMED_WAITING, group=TGRP-CollectionsAPIDistributedZkTest]         at sun.misc.Unsafe.park(Native Method)         at java.util.concurrent.locks.LockSupport.parkNanos(LockSupport.java:215)         at java.util.concurrent.SynchronousQueue$TransferStack.awaitFulfill(SynchronousQueue.java:460)         at java.util.concurrent.SynchronousQueue$TransferStack.transfer(SynchronousQueue.java:362)         at java.util.concurrent.SynchronousQueue.poll(SynchronousQueue.java:941)         at java.util.concurrent.ThreadPoolExecutor.getTask(ThreadPoolExecutor.java:1066)         at java.util.concurrent.ThreadPoolExecutor.runWorker(ThreadPoolExecutor.java:1127)         at java.util.concurrent.ThreadPoolExecutor$Worker.run(ThreadPoolExecutor.java:617)         at java.lang.Thread.run(Thread.java:745)    3) Thread[id=7546, name=TEST-CollectionsAPIDistributedZkTest.test-seed#[F21576DF506C287]-SendThread(127.0.0.1:50611), state=TIMED_WAITING, group=TGRP-CollectionsAPIDistributedZkTest]         at java.lang.Thread.sleep(Native Method)         at org.apache.zookeeper.client.StaticHostProvider.next(StaticHostProvider.java:101)         at org.apache.zookeeper.ClientCnxn$SendThread.startConnect(ClientCnxn.java:940)         at org.apache.zookeeper.ClientCnxn$SendThread.run(ClientCnxn.java:1003)    4) Thread[id=7548, name=zkCallback-1181-thread-1, state=TIMED_WAITING, group=TGRP-CollectionsAPIDistributedZkTest]         at sun.misc.Unsafe.park(Native Method)         at java.util.concurrent.locks.LockSupport.parkNanos(LockSupport.java:215)         at java.util.concurrent.SynchronousQueue$TransferStack.awaitFulfill(SynchronousQueue.java:460)         at java.util.concurrent.SynchronousQueue$TransferStack.transfer(SynchronousQueue.java:362)         at java.util.concurrent.SynchronousQueue.poll(SynchronousQueue.java:941)         at java.util.concurrent.ThreadPoolExecutor.getTask(ThreadPoolExecutor.java:1066)         at java.util.concurrent.ThreadPoolExecutor.runWorker(ThreadPoolExecutor.java:1127)         at java.util.concurrent.ThreadPoolExecutor$Worker.run(ThreadPoolExecutor.java:617)         at java.lang.Thread.run(Thread.java:745)    5) Thread[id=8551, name=zkCallback-1181-thread-3, state=TIMED_WAITING, group=TGRP-CollectionsAPIDistributedZkTest]         at sun.misc.Unsafe.park(Native Method)         at java.util.concurrent.locks.LockSupport.parkNanos(LockSupport.java:215)         at java.util.concurrent.SynchronousQueue$TransferStack.awaitFulfill(SynchronousQueue.java:460)         at java.util.concurrent.SynchronousQueue$TransferStack.transfer(SynchronousQueue.java:362)         at java.util.concurrent.SynchronousQueue.poll(SynchronousQueue.java:941)         at java.util.concurrent.ThreadPoolExecutor.getTask(ThreadPoolExecutor.java:1066)         at java.util.concurrent.ThreadPoolExecutor.runWorker(ThreadPoolExecutor.java:1127)         at java.util.concurrent.ThreadPoolExecutor$Worker.run(ThreadPoolExecutor.java:617)         at java.lang.Thread.run(Thread.java:745)    6) Thread[id=7547, name=TEST-CollectionsAPIDistributedZkTest.test-seed#[F21576DF506C287]-EventThread, state=WAITING, group=TGRP-CollectionsAPIDistributedZkTest]         at sun.misc.Unsafe.park(Native Method)         at java.util.concurrent.locks.LockSupport.park(LockSupport.java:175)         at java.util.concurrent.locks.AbstractQueuedSynchronizer$ConditionObject.await(AbstractQueuedSynchronizer.java:2039)         at java.util.concurrent.LinkedBlockingQueue.take(LinkedBlockingQueue.java:442)         at org.apache.zookeeper.ClientCnxn$EventThread.run(ClientCnxn.java:494)

Stack Trace:
com.carrotsearch.randomizedtesting.ThreadLeakError: 6 threads leaked from SUITE scope at org.apache.solr.cloud.CollectionsAPIDistributedZkTest: 
   1) Thread[id=8550, name=zkCallback-1181-thread-2, state=TIMED_WAITING, group=TGRP-CollectionsAPIDistributedZkTest]
        at sun.misc.Unsafe.park(Native Method)
        at java.util.concurrent.locks.LockSupport.parkNanos(LockSupport.java:215)
        at java.util.concurrent.SynchronousQueue$TransferStack.awaitFulfill(SynchronousQueue.java:460)
        at java.util.concurrent.SynchronousQueue$TransferStack.transfer(SynchronousQueue.java:362)
        at java.util.concurrent.SynchronousQueue.poll(SynchronousQueue.java:941)
        at java.util.concurrent.ThreadPoolExecutor.getTask(ThreadPoolExecutor.java:1066)
        at java.util.concurrent.ThreadPoolExecutor.runWorker(ThreadPoolExecutor.java:1127)
        at java.util.concurrent.ThreadPoolExecutor$Worker.run(ThreadPoolExecutor.java:617)
        at java.lang.Thread.run(Thread.java:745)
   2) Thread[id=8552, name=zkCallback-1181-thread-4, state=TIMED_WAITING, group=TGRP-CollectionsAPIDistributedZkTest]
        at sun.misc.Unsafe.park(Native Method)
        at java.util.concurrent.locks.LockSupport.parkNanos(LockSupport.java:215)
        at java.util.concurrent.SynchronousQueue$TransferStack.awaitFulfill(SynchronousQueue.java:460)
        at java.util.concurrent.SynchronousQueue$TransferStack.transfer(SynchronousQueue.java:362)
        at java.util.concurrent.SynchronousQueue.poll(SynchronousQueue.java:941)
        at java.util.concurrent.ThreadPoolExecutor.getTask(ThreadPoolExecutor.java:1066)
        at java.util.concurrent.ThreadPoolExecutor.runWorker(ThreadPoolExecutor.java:1127)
        at java.util.concurrent.ThreadPoolExecutor$Worker.run(ThreadPoolExecutor.java:617)
        at java.lang.Thread.run(Thread.java:745)
   3) Thread[id=7546, name=TEST-CollectionsAPIDistributedZkTest.test-seed#[F21576DF506C287]-SendThread(127.0.0.1:50611), state=TIMED_WAITING, group=TGRP-CollectionsAPIDistributedZkTest]
        at java.lang.Thread.sleep(Native Method)
        at org.apache.zookeeper.client.StaticHostProvider.next(StaticHostProvider.java:101)
        at org.apache.zookeeper.ClientCnxn$SendThread.startConnect(ClientCnxn.java:940)
        at org.apache.zookeeper.ClientCnxn$SendThread.run(ClientCnxn.java:1003)
   4) Thread[id=7548, name=zkCallback-1181-thread-1, state=TIMED_WAITING, group=TGRP-CollectionsAPIDistributedZkTest]
        at sun.misc.Unsafe.park(Native Method)
        at java.util.concurrent.locks.LockSupport.parkNanos(LockSupport.java:215)
        at java.util.concurrent.SynchronousQueue$TransferStack.awaitFulfill(SynchronousQueue.java:460)
        at java.util.concurrent.SynchronousQueue$TransferStack.transfer(SynchronousQueue.java:362)
        at java.util.concurrent.SynchronousQueue.poll(SynchronousQueue.java:941)
        at java.util.concurrent.ThreadPoolExecutor.getTask(ThreadPoolExecutor.java:1066)
        at java.util.concurrent.ThreadPoolExecutor.runWorker(ThreadPoolExecutor.java:1127)
        at java.util.concurrent.ThreadPoolExecutor$Worker.run(ThreadPoolExecutor.java:617)
        at java.lang.Thread.run(Thread.java:745)
   5) Thread[id=8551, name=zkCallback-1181-thread-3, state=TIMED_WAITING, group=TGRP-CollectionsAPIDistributedZkTest]
        at sun.misc.Unsafe.park(Native Method)
        at java.util.concurrent.locks.LockSupport.parkNanos(LockSupport.java:215)
        at java.util.concurrent.SynchronousQueue$TransferStack.awaitFulfill(SynchronousQueue.java:460)
        at java.util.concurrent.SynchronousQueue$TransferStack.transfer(SynchronousQueue.java:362)
        at java.util.concurrent.SynchronousQueue.poll(SynchronousQueue.java:941)
        at java.util.concurrent.ThreadPoolExecutor.getTask(ThreadPoolExecutor.java:1066)
        at java.util.concurrent.ThreadPoolExecutor.runWorker(ThreadPoolExecutor.java:1127)
        at java.util.concurrent.ThreadPoolExecutor$Worker.run(ThreadPoolExecutor.java:617)
        at java.lang.Thread.run(Thread.java:745)
   6) Thread[id=7547, name=TEST-CollectionsAPIDistributedZkTest.test-seed#[F21576DF506C287]-EventThread, state=WAITING, group=TGRP-CollectionsAPIDistributedZkTest]
        at sun.misc.Unsafe.park(Native Method)
        at java.util.concurrent.locks.LockSupport.park(LockSupport.java:175)
        at java.util.concurrent.locks.AbstractQueuedSynchronizer$ConditionObject.await(AbstractQueuedSynchronizer.java:2039)
        at java.util.concurrent.LinkedBlockingQueue.take(LinkedBlockingQueue.java:442)
        at org.apache.zookeeper.ClientCnxn$EventThread.run(ClientCnxn.java:494)
	at __randomizedtesting.SeedInfo.seed([F21576DF506C287]:0)


FAILED:  junit.framework.TestSuite.org.apache.solr.cloud.CollectionsAPIDistributedZkTest

Error Message:
There are still zombie threads that couldn't be terminated:    1) Thread[id=8550, name=zkCallback-1181-thread-2, state=TIMED_WAITING, group=TGRP-CollectionsAPIDistributedZkTest]         at sun.misc.Unsafe.park(Native Method)         at java.util.concurrent.locks.LockSupport.parkNanos(LockSupport.java:215)         at java.util.concurrent.SynchronousQueue$TransferStack.awaitFulfill(SynchronousQueue.java:460)         at java.util.concurrent.SynchronousQueue$TransferStack.transfer(SynchronousQueue.java:362)         at java.util.concurrent.SynchronousQueue.poll(SynchronousQueue.java:941)         at java.util.concurrent.ThreadPoolExecutor.getTask(ThreadPoolExecutor.java:1066)         at java.util.concurrent.ThreadPoolExecutor.runWorker(ThreadPoolExecutor.java:1127)         at java.util.concurrent.ThreadPoolExecutor$Worker.run(ThreadPoolExecutor.java:617)         at java.lang.Thread.run(Thread.java:745)    2) Thread[id=8552, name=zkCallback-1181-thread-4, state=TIMED_WAITING, group=TGRP-CollectionsAPIDistributedZkTest]         at sun.misc.Unsafe.park(Native Method)         at java.util.concurrent.locks.LockSupport.parkNanos(LockSupport.java:215)         at java.util.concurrent.SynchronousQueue$TransferStack.awaitFulfill(SynchronousQueue.java:460)         at java.util.concurrent.SynchronousQueue$TransferStack.transfer(SynchronousQueue.java:362)         at java.util.concurrent.SynchronousQueue.poll(SynchronousQueue.java:941)         at java.util.concurrent.ThreadPoolExecutor.getTask(ThreadPoolExecutor.java:1066)         at java.util.concurrent.ThreadPoolExecutor.runWorker(ThreadPoolExecutor.java:1127)         at java.util.concurrent.ThreadPoolExecutor$Worker.run(ThreadPoolExecutor.java:617)         at java.lang.Thread.run(Thread.java:745)    3) Thread[id=7546, name=TEST-CollectionsAPIDistributedZkTest.test-seed#[F21576DF506C287]-SendThread(127.0.0.1:50611), state=TIMED_WAITING, group=TGRP-CollectionsAPIDistributedZkTest]         at java.lang.Thread.sleep(Native Method)         at org.apache.zookeeper.ClientCnxn$SendThread.run(ClientCnxn.java:994)    4) Thread[id=7548, name=zkCallback-1181-thread-1, state=TIMED_WAITING, group=TGRP-CollectionsAPIDistributedZkTest]         at sun.misc.Unsafe.park(Native Method)         at java.util.concurrent.locks.LockSupport.parkNanos(LockSupport.java:215)         at java.util.concurrent.SynchronousQueue$TransferStack.awaitFulfill(SynchronousQueue.java:460)         at java.util.concurrent.SynchronousQueue$TransferStack.transfer(SynchronousQueue.java:362)         at java.util.concurrent.SynchronousQueue.poll(SynchronousQueue.java:941)         at java.util.concurrent.ThreadPoolExecutor.getTask(ThreadPoolExecutor.java:1066)         at java.util.concurrent.ThreadPoolExecutor.runWorker(ThreadPoolExecutor.java:1127)         at java.util.concurrent.ThreadPoolExecutor$Worker.run(ThreadPoolExecutor.java:617)         at java.lang.Thread.run(Thread.java:745)    5) Thread[id=8551, name=zkCallback-1181-thread-3, state=TIMED_WAITING, group=TGRP-CollectionsAPIDistributedZkTest]         at sun.misc.Unsafe.park(Native Method)         at java.util.concurrent.locks.LockSupport.parkNanos(LockSupport.java:215)         at java.util.concurrent.SynchronousQueue$TransferStack.awaitFulfill(SynchronousQueue.java:460)         at java.util.concurrent.SynchronousQueue$TransferStack.transfer(SynchronousQueue.java:362)         at java.util.concurrent.SynchronousQueue.poll(SynchronousQueue.java:941)         at java.util.concurrent.ThreadPoolExecutor.getTask(ThreadPoolExecutor.java:1066)         at java.util.concurrent.ThreadPoolExecutor.runWorker(ThreadPoolExecutor.java:1127)         at java.util.concurrent.ThreadPoolExecutor$Worker.run(ThreadPoolExecutor.java:617)         at java.lang.Thread.run(Thread.java:745)

Stack Trace:
com.carrotsearch.randomizedtesting.ThreadLeakError: There are still zombie threads that couldn't be terminated:
   1) Thread[id=8550, name=zkCallback-1181-thread-2, state=TIMED_WAITING, group=TGRP-CollectionsAPIDistributedZkTest]
        at sun.misc.Unsafe.park(Native Method)
        at java.util.concurrent.locks.LockSupport.parkNanos(LockSupport.java:215)
        at java.util.concurrent.SynchronousQueue$TransferStack.awaitFulfill(SynchronousQueue.java:460)
        at java.util.concurrent.SynchronousQueue$TransferStack.transfer(SynchronousQueue.java:362)
        at java.util.concurrent.SynchronousQueue.poll(SynchronousQueue.java:941)
        at java.util.concurrent.ThreadPoolExecutor.getTask(ThreadPoolExecutor.java:1066)
        at java.util.concurrent.ThreadPoolExecutor.runWorker(ThreadPoolExecutor.java:1127)
        at java.util.concurrent.ThreadPoolExecutor$Worker.run(ThreadPoolExecutor.java:617)
        at java.lang.Thread.run(Thread.java:745)
   2) Thread[id=8552, name=zkCallback-1181-thread-4, state=TIMED_WAITING, group=TGRP-CollectionsAPIDistributedZkTest]
        at sun.misc.Unsafe.park(Native Method)
        at java.util.concurrent.locks.LockSupport.parkNanos(LockSupport.java:215)
        at java.util.concurrent.SynchronousQueue$TransferStack.awaitFulfill(SynchronousQueue.java:460)
        at java.util.concurrent.SynchronousQueue$TransferStack.transfer(SynchronousQueue.java:362)
        at java.util.concurrent.SynchronousQueue.poll(SynchronousQueue.java:941)
        at java.util.concurrent.ThreadPoolExecutor.getTask(ThreadPoolExecutor.java:1066)
        at java.util.concurrent.ThreadPoolExecutor.runWorker(ThreadPoolExecutor.java:1127)
        at java.util.concurrent.ThreadPoolExecutor$Worker.run(ThreadPoolExecutor.java:617)
        at java.lang.Thread.run(Thread.java:745)
   3) Thread[id=7546, name=TEST-CollectionsAPIDistributedZkTest.test-seed#[F21576DF506C287]-SendThread(127.0.0.1:50611), state=TIMED_WAITING, group=TGRP-CollectionsAPIDistributedZkTest]
        at java.lang.Thread.sleep(Native Method)
        at org.apache.zookeeper.ClientCnxn$SendThread.run(ClientCnxn.java:994)
   4) Thread[id=7548, name=zkCallback-1181-thread-1, state=TIMED_WAITING, group=TGRP-CollectionsAPIDistributedZkTest]
        at sun.misc.Unsafe.park(Native Method)
        at java.util.concurrent.locks.LockSupport.parkNanos(LockSupport.java:215)
        at java.util.concurrent.SynchronousQueue$TransferStack.awaitFulfill(SynchronousQueue.java:460)
        at java.util.concurrent.SynchronousQueue$TransferStack.transfer(SynchronousQueue.java:362)
        at java.util.concurrent.SynchronousQueue.poll(SynchronousQueue.java:941)
        at java.util.concurrent.ThreadPoolExecutor.getTask(ThreadPoolExecutor.java:1066)
        at java.util.concurrent.ThreadPoolExecutor.runWorker(ThreadPoolExecutor.java:1127)
        at java.util.concurrent.ThreadPoolExecutor$Worker.run(ThreadPoolExecutor.java:617)
        at java.lang.Thread.run(Thread.java:745)
   5) Thread[id=8551, name=zkCallback-1181-thread-3, state=TIMED_WAITING, group=TGRP-CollectionsAPIDistributedZkTest]
        at sun.misc.Unsafe.park(Native Method)
        at java.util.concurrent.locks.LockSupport.parkNanos(LockSupport.java:215)
        at java.util.concurrent.SynchronousQueue$TransferStack.awaitFulfill(SynchronousQueue.java:460)
        at java.util.concurrent.SynchronousQueue$TransferStack.transfer(SynchronousQueue.java:362)
        at java.util.concurrent.SynchronousQueue.poll(SynchronousQueue.java:941)
        at java.util.concurrent.ThreadPoolExecutor.getTask(ThreadPoolExecutor.java:1066)
        at java.util.concurrent.ThreadPoolExecutor.runWorker(ThreadPoolExecutor.java:1127)
        at java.util.concurrent.ThreadPoolExecutor$Worker.run(ThreadPoolExecutor.java:617)
        at java.lang.Thread.run(Thread.java:745)
	at __randomizedtesting.SeedInfo.seed([F21576DF506C287]:0)




Build Log:
[...truncated 10228 lines...]
   [junit4] Suite: org.apache.solr.cloud.CollectionsAPIDistributedZkTest
   [junit4]   2> Creating dataDir: /Users/jenkins/workspace/Lucene-Solr-trunk-MacOSX/solr/build/solr-core/test/J1/temp/solr.cloud.CollectionsAPIDistributedZkTest_F21576DF506C287-001/init-core-data-001
   [junit4]   2> 1060153 INFO  (SUITE-CollectionsAPIDistributedZkTest-seed#[F21576DF506C287]-worker) [    ] o.a.s.SolrTestCaseJ4 Randomized ssl (true) and clientAuth (false)
   [junit4]   2> 1060154 INFO  (SUITE-CollectionsAPIDistributedZkTest-seed#[F21576DF506C287]-worker) [    ] o.a.s.BaseDistributedSearchTestCase Setting hostContext system property: /s_ze/f
   [junit4]   2> 1060156 INFO  (TEST-CollectionsAPIDistributedZkTest.test-seed#[F21576DF506C287]) [    ] o.a.s.c.ZkTestServer STARTING ZK TEST SERVER
   [junit4]   2> 1060157 INFO  (Thread-2946) [    ] o.a.s.c.ZkTestServer client port:0.0.0.0/0.0.0.0:0
   [junit4]   2> 1060157 INFO  (Thread-2946) [    ] o.a.s.c.ZkTestServer Starting server
   [junit4]   2> 1060257 INFO  (TEST-CollectionsAPIDistributedZkTest.test-seed#[F21576DF506C287]) [    ] o.a.s.c.ZkTestServer start zk server on port:50611
   [junit4]   2> 1060257 INFO  (TEST-CollectionsAPIDistributedZkTest.test-seed#[F21576DF506C287]) [    ] o.a.s.c.c.SolrZkClient Using default ZkCredentialsProvider
   [junit4]   2> 1060258 INFO  (TEST-CollectionsAPIDistributedZkTest.test-seed#[F21576DF506C287]) [    ] o.a.s.c.c.ConnectionManager Waiting for client to connect to ZooKeeper
   [junit4]   2> 1060273 INFO  (zkCallback-1142-thread-1) [    ] o.a.s.c.c.ConnectionManager Watcher org.apache.solr.common.cloud.ConnectionManager@6b990b24 name:ZooKeeperConnection Watcher:127.0.0.1:50611 got event WatchedEvent state:SyncConnected type:None path:null path:null type:None
   [junit4]   2> 1060273 INFO  (TEST-CollectionsAPIDistributedZkTest.test-seed#[F21576DF506C287]) [    ] o.a.s.c.c.ConnectionManager Client is connected to ZooKeeper
   [junit4]   2> 1060273 INFO  (TEST-CollectionsAPIDistributedZkTest.test-seed#[F21576DF506C287]) [    ] o.a.s.c.c.SolrZkClient Using default ZkACLProvider
   [junit4]   2> 1060273 INFO  (TEST-CollectionsAPIDistributedZkTest.test-seed#[F21576DF506C287]) [    ] o.a.s.c.c.SolrZkClient makePath: /solr
   [junit4]   2> 1060290 INFO  (TEST-CollectionsAPIDistributedZkTest.test-seed#[F21576DF506C287]) [    ] o.a.s.c.c.SolrZkClient Using default ZkCredentialsProvider
   [junit4]   2> 1060291 INFO  (TEST-CollectionsAPIDistributedZkTest.test-seed#[F21576DF506C287]) [    ] o.a.s.c.c.ConnectionManager Waiting for client to connect to ZooKeeper
   [junit4]   2> 1060298 INFO  (zkCallback-1143-thread-1) [    ] o.a.s.c.c.ConnectionManager Watcher org.apache.solr.common.cloud.ConnectionManager@6c913b63 name:ZooKeeperConnection Watcher:127.0.0.1:50611/solr got event WatchedEvent state:SyncConnected type:None path:null path:null type:None
   [junit4]   2> 1060299 INFO  (TEST-CollectionsAPIDistributedZkTest.test-seed#[F21576DF506C287]) [    ] o.a.s.c.c.ConnectionManager Client is connected to ZooKeeper
   [junit4]   2> 1060299 INFO  (TEST-CollectionsAPIDistributedZkTest.test-seed#[F21576DF506C287]) [    ] o.a.s.c.c.SolrZkClient Using default ZkACLProvider
   [junit4]   2> 1060299 INFO  (TEST-CollectionsAPIDistributedZkTest.test-seed#[F21576DF506C287]) [    ] o.a.s.c.c.SolrZkClient makePath: /collections/collection1
   [junit4]   2> 1060302 INFO  (TEST-CollectionsAPIDistributedZkTest.test-seed#[F21576DF506C287]) [    ] o.a.s.c.c.SolrZkClient makePath: /collections/collection1/shards
   [junit4]   2> 1060304 INFO  (TEST-CollectionsAPIDistributedZkTest.test-seed#[F21576DF506C287]) [    ] o.a.s.c.c.SolrZkClient makePath: /collections/control_collection
   [junit4]   2> 1060306 INFO  (TEST-CollectionsAPIDistributedZkTest.test-seed#[F21576DF506C287]) [    ] o.a.s.c.c.SolrZkClient makePath: /collections/control_collection/shards
   [junit4]   2> 1060309 INFO  (TEST-CollectionsAPIDistributedZkTest.test-seed#[F21576DF506C287]) [    ] o.a.s.c.AbstractZkTestCase put /Users/jenkins/workspace/Lucene-Solr-trunk-MacOSX/solr/core/src/test-files/solr/collection1/conf/solrconfig-tlog.xml to /configs/conf1/solrconfig.xml
   [junit4]   2> 1060309 INFO  (TEST-CollectionsAPIDistributedZkTest.test-seed#[F21576DF506C287]) [    ] o.a.s.c.c.SolrZkClient makePath: /configs/conf1/solrconfig.xml
   [junit4]   2> 1060313 INFO  (TEST-CollectionsAPIDistributedZkTest.test-seed#[F21576DF506C287]) [    ] o.a.s.c.AbstractZkTestCase put /Users/jenkins/workspace/Lucene-Solr-trunk-MacOSX/solr/core/src/test-files/solr/collection1/conf/schema.xml to /configs/conf1/schema.xml
   [junit4]   2> 1060313 INFO  (TEST-CollectionsAPIDistributedZkTest.test-seed#[F21576DF506C287]) [    ] o.a.s.c.c.SolrZkClient makePath: /configs/conf1/schema.xml
   [junit4]   2> 1060317 INFO  (TEST-CollectionsAPIDistributedZkTest.test-seed#[F21576DF506C287]) [    ] o.a.s.c.AbstractZkTestCase put /Users/jenkins/workspace/Lucene-Solr-trunk-MacOSX/solr/core/src/test-files/solr/collection1/conf/solrconfig.snippet.randomindexconfig.xml to /configs/conf1/solrconfig.snippet.randomindexconfig.xml
   [junit4]   2> 1060317 INFO  (TEST-CollectionsAPIDistributedZkTest.test-seed#[F21576DF506C287]) [    ] o.a.s.c.c.SolrZkClient makePath: /configs/conf1/solrconfig.snippet.randomindexconfig.xml
   [junit4]   2> 1060320 INFO  (TEST-CollectionsAPIDistributedZkTest.test-seed#[F21576DF506C287]) [    ] o.a.s.c.AbstractZkTestCase put /Users/jenkins/workspace/Lucene-Solr-trunk-MacOSX/solr/core/src/test-files/solr/collection1/conf/stopwords.txt to /configs/conf1/stopwords.txt
   [junit4]   2> 1060320 INFO  (TEST-CollectionsAPIDistributedZkTest.test-seed#[F21576DF506C287]) [    ] o.a.s.c.c.SolrZkClient makePath: /configs/conf1/stopwords.txt
   [junit4]   2> 1060324 INFO  (TEST-CollectionsAPIDistributedZkTest.test-seed#[F21576DF506C287]) [    ] o.a.s.c.AbstractZkTestCase put /Users/jenkins/workspace/Lucene-Solr-trunk-MacOSX/solr/core/src/test-files/solr/collection1/conf/protwords.txt to /configs/conf1/protwords.txt
   [junit4]   2> 1060324 INFO  (TEST-CollectionsAPIDistributedZkTest.test-seed#[F21576DF506C287]) [    ] o.a.s.c.c.SolrZkClient makePath: /configs/conf1/protwords.txt
   [junit4]   2> 1060327 INFO  (TEST-CollectionsAPIDistributedZkTest.test-seed#[F21576DF506C287]) [    ] o.a.s.c.AbstractZkTestCase put /Users/jenkins/workspace/Lucene-Solr-trunk-MacOSX/solr/core/src/test-files/solr/collection1/conf/currency.xml to /configs/conf1/currency.xml
   [junit4]   2> 1060328 INFO  (TEST-CollectionsAPIDistributedZkTest.test-seed#[F21576DF506C287]) [    ] o.a.s.c.c.SolrZkClient makePath: /configs/conf1/currency.xml
   [junit4]   2> 1060330 INFO  (TEST-CollectionsAPIDistributedZkTest.test-seed#[F21576DF506C287]) [    ] o.a.s.c.AbstractZkTestCase put /Users/jenkins/workspace/Lucene-Solr-trunk-MacOSX/solr/core/src/test-files/solr/collection1/conf/enumsConfig.xml to /configs/conf1/enumsConfig.xml
   [junit4]   2> 1060330 INFO  (TEST-CollectionsAPIDistributedZkTest.test-seed#[F21576DF506C287]) [    ] o.a.s.c.c.SolrZkClient makePath: /configs/conf1/enumsConfig.xml
   [junit4]   2> 1060333 INFO  (TEST-CollectionsAPIDistributedZkTest.test-seed#[F21576DF506C287]) [    ] o.a.s.c.AbstractZkTestCase put /Users/jenkins/workspace/Lucene-Solr-trunk-MacOSX/solr/core/src/test-files/solr/collection1/conf/open-exchange-rates.json to /configs/conf1/open-exchange-rates.json
   [junit4]   2> 1060334 INFO  (TEST-CollectionsAPIDistributedZkTest.test-seed#[F21576DF506C287]) [    ] o.a.s.c.c.SolrZkClient makePath: /configs/conf1/open-exchange-rates.json
   [junit4]   2> 1060336 INFO  (TEST-CollectionsAPIDistributedZkTest.test-seed#[F21576DF506C287]) [    ] o.a.s.c.AbstractZkTestCase put /Users/jenkins/workspace/Lucene-Solr-trunk-MacOSX/solr/core/src/test-files/solr/collection1/conf/mapping-ISOLatin1Accent.txt to /configs/conf1/mapping-ISOLatin1Accent.txt
   [junit4]   2> 1060336 INFO  (TEST-CollectionsAPIDistributedZkTest.test-seed#[F21576DF506C287]) [    ] o.a.s.c.c.SolrZkClient makePath: /configs/conf1/mapping-ISOLatin1Accent.txt
   [junit4]   2> 1060339 INFO  (TEST-CollectionsAPIDistributedZkTest.test-seed#[F21576DF506C287]) [    ] o.a.s.c.AbstractZkTestCase put /Users/jenkins/workspace/Lucene-Solr-trunk-MacOSX/solr/core/src/test-files/solr/collection1/conf/old_synonyms.txt to /configs/conf1/old_synonyms.txt
   [junit4]   2> 1060339 INFO  (TEST-CollectionsAPIDistributedZkTest.test-seed#[F21576DF506C287]) [    ] o.a.s.c.c.SolrZkClient makePath: /configs/conf1/old_synonyms.txt
   [junit4]   2> 1060343 INFO  (TEST-CollectionsAPIDistributedZkTest.test-seed#[F21576DF506C287]) [    ] o.a.s.c.AbstractZkTestCase put /Users/jenkins/workspace/Lucene-Solr-trunk-MacOSX/solr/core/src/test-files/solr/collection1/conf/synonyms.txt to /configs/conf1/synonyms.txt
   [junit4]   2> 1060343 INFO  (TEST-CollectionsAPIDistributedZkTest.test-seed#[F21576DF506C287]) [    ] o.a.s.c.c.SolrZkClient makePath: /configs/conf1/synonyms.txt
   [junit4]   2> 1060347 WARN  (NIOServerCxn.Factory:0.0.0.0/0.0.0.0:0) [    ] o.a.z.s.NIOServerCnxn caught end of stream exception
   [junit4]   2> EndOfStreamException: Unable to read additional data from client sessionid 0x15213fa67a10001, likely client has closed socket
   [junit4]   2> 	at org.apache.zookeeper.server.NIOServerCnxn.doIO(NIOServerCnxn.java:228)
   [junit4]   2> 	at org.apache.zookeeper.server.NIOServerCnxnFactory.run(NIOServerCnxnFactory.java:208)
   [junit4]   2> 	at java.lang.Thread.run(Thread.java:745)
   [junit4]   2> 1060347 INFO  (TEST-CollectionsAPIDistributedZkTest.test-seed#[F21576DF506C287]) [    ] o.a.s.c.c.SolrZkClient Using default ZkCredentialsProvider
   [junit4]   2> 1060349 INFO  (TEST-CollectionsAPIDistributedZkTest.test-seed#[F21576DF506C287]) [    ] o.a.s.c.c.ConnectionManager Waiting for client to connect to ZooKeeper
   [junit4]   2> 1060353 INFO  (zkCallback-1144-thread-1) [    ] o.a.s.c.c.ConnectionManager Watcher org.apache.solr.common.cloud.ConnectionManager@70699446 name:ZooKeeperConnection Watcher:127.0.0.1:50611/solr got event WatchedEvent state:SyncConnected type:None path:null path:null type:None
   [junit4]   2> 1060354 INFO  (TEST-CollectionsAPIDistributedZkTest.test-seed#[F21576DF506C287]) [    ] o.a.s.c.c.ConnectionManager Client is connected to ZooKeeper
   [junit4]   2> 1060354 INFO  (TEST-CollectionsAPIDistributedZkTest.test-seed#[F21576DF506C287]) [    ] o.a.s.c.c.SolrZkClient Using default ZkACLProvider
   [junit4]   2> 1060358 INFO  (TEST-CollectionsAPIDistributedZkTest.test-seed#[F21576DF506C287]) [    ] o.a.s.c.c.SolrZkClient Using default ZkCredentialsProvider
   [junit4]   2> 1060359 INFO  (TEST-CollectionsAPIDistributedZkTest.test-seed#[F21576DF506C287]) [    ] o.a.s.c.c.ConnectionManager Waiting for client to connect to ZooKeeper
   [junit4]   2> 1060363 INFO  (zkCallback-1145-thread-1) [    ] o.a.s.c.c.ConnectionManager Watcher org.apache.solr.common.cloud.ConnectionManager@11e15717 name:ZooKeeperConnection Watcher:127.0.0.1:50611 got event WatchedEvent state:SyncConnected type:None path:null path:null type:None
   [junit4]   2> 1060363 INFO  (TEST-CollectionsAPIDistributedZkTest.test-seed#[F21576DF506C287]) [    ] o.a.s.c.c.ConnectionManager Client is connected to ZooKeeper
   [junit4]   2> 1060363 INFO  (TEST-CollectionsAPIDistributedZkTest.test-seed#[F21576DF506C287]) [    ] o.a.s.c.c.SolrZkClient Using default ZkACLProvider
   [junit4]   2> 1060363 INFO  (TEST-CollectionsAPIDistributedZkTest.test-seed#[F21576DF506C287]) [    ] o.a.s.c.c.SolrZkClient makePath: /solr
   [junit4]   2> 1060369 INFO  (TEST-CollectionsAPIDistributedZkTest.test-seed#[F21576DF506C287]) [    ] o.a.s.c.c.SolrZkClient Using default ZkCredentialsProvider
   [junit4]   2> 1060377 INFO  (TEST-CollectionsAPIDistributedZkTest.test-seed#[F21576DF506C287]) [    ] o.a.s.c.c.ConnectionManager Waiting for client to connect to ZooKeeper
   [junit4]   2> 1060381 INFO  (zkCallback-1146-thread-1) [    ] o.a.s.c.c.ConnectionManager Watcher org.apache.solr.common.cloud.ConnectionManager@6e0edb8c name:ZooKeeperConnection Watcher:127.0.0.1:50611/solr got event WatchedEvent state:SyncConnected type:None path:null path:null type:None
   [junit4]   2> 1060382 INFO  (TEST-CollectionsAPIDistributedZkTest.test-seed#[F21576DF506C287]) [    ] o.a.s.c.c.ConnectionManager Client is connected to ZooKeeper
   [junit4]   2> 1060382 INFO  (TEST-CollectionsAPIDistributedZkTest.test-seed#[F21576DF506C287]) [    ] o.a.s.c.c.SolrZkClient Using default ZkACLProvider
   [junit4]   2> 1060383 INFO  (TEST-CollectionsAPIDistributedZkTest.test-seed#[F21576DF506C287]) [    ] o.a.s.c.AbstractZkTestCase put /Users/jenkins/workspace/Lucene-Solr-trunk-MacOSX/solr/core/src/test-files/solr/collection1/conf/solrconfig-tlog.xml to /configs/conf2/solrconfig.xml
   [junit4]   2> 1060383 INFO  (TEST-CollectionsAPIDistributedZkTest.test-seed#[F21576DF506C287]) [    ] o.a.s.c.c.SolrZkClient makePath: /configs/conf2/solrconfig.xml
   [junit4]   2> 1060389 INFO  (TEST-CollectionsAPIDistributedZkTest.test-seed#[F21576DF506C287]) [    ] o.a.s.c.AbstractZkTestCase put /Users/jenkins/workspace/Lucene-Solr-trunk-MacOSX/solr/core/src/test-files/solr/collection1/conf/schema.xml to /configs/conf2/schema.xml
   [junit4]   2> 1060390 INFO  (TEST-CollectionsAPIDistributedZkTest.test-seed#[F21576DF506C287]) [    ] o.a.s.c.c.SolrZkClient makePath: /configs/conf2/schema.xml
   [junit4]   2> 1060395 INFO  (TEST-CollectionsAPIDistributedZkTest.test-seed#[F21576DF506C287]) [    ] o.a.s.c.AbstractZkTestCase put /Users/jenkins/workspace/Lucene-Solr-trunk-MacOSX/solr/core/src/test-files/solr/collection1/conf/enumsConfig.xml to /configs/conf2/enumsConfig.xml
   [junit4]   2> 1060395 INFO  (TEST-CollectionsAPIDistributedZkTest.test-seed#[F21576DF506C287]) [    ] o.a.s.c.c.SolrZkClient makePath: /configs/conf2/enumsConfig.xml
   [junit4]   2> 1060400 INFO  (TEST-CollectionsAPIDistributedZkTest.test-seed#[F21576DF506C287]) [    ] o.a.s.c.AbstractZkTestCase put /Users/jenkins/workspace/Lucene-Solr-trunk-MacOSX/solr/core/src/test-files/solr/collection1/conf/solrconfig.snippet.randomindexconfig.xml to /configs/conf2/solrconfig.snippet.randomindexconfig.xml
   [junit4]   2> 1060400 INFO  (TEST-CollectionsAPIDistributedZkTest.test-seed#[F21576DF506C287]) [    ] o.a.s.c.c.SolrZkClient makePath: /configs/conf2/solrconfig.snippet.randomindexconfig.xml
   [junit4]   2> 1060406 INFO  (TEST-CollectionsAPIDistributedZkTest.test-seed#[F21576DF506C287]) [    ] o.a.s.c.AbstractZkTestCase put /Users/jenkins/workspace/Lucene-Solr-trunk-MacOSX/solr/core/src/test-files/solr/collection1/conf/stopwords.txt to /configs/conf2/stopwords.txt
   [junit4]   2> 1060406 INFO  (TEST-CollectionsAPIDistributedZkTest.test-seed#[F21576DF506C287]) [    ] o.a.s.c.c.SolrZkClient makePath: /configs/conf2/stopwords.txt
   [junit4]   2> 1060410 INFO  (TEST-CollectionsAPIDistributedZkTest.test-seed#[F21576DF506C287]) [    ] o.a.s.c.AbstractZkTestCase put /Users/jenkins/workspace/Lucene-Solr-trunk-MacOSX/solr/core/src/test-files/solr/collection1/conf/protwords.txt to /configs/conf2/protwords.txt
   [junit4]   2> 1060411 INFO  (TEST-CollectionsAPIDistributedZkTest.test-seed#[F21576DF506C287]) [    ] o.a.s.c.c.SolrZkClient makePath: /configs/conf2/protwords.txt
   [junit4]   2> 1060414 INFO  (TEST-CollectionsAPIDistributedZkTest.test-seed#[F21576DF506C287]) [    ] o.a.s.c.AbstractZkTestCase put /Users/jenkins/workspace/Lucene-Solr-trunk-MacOSX/solr/core/src/test-files/solr/collection1/conf/currency.xml to /configs/conf2/currency.xml
   [junit4]   2> 1060415 INFO  (TEST-CollectionsAPIDistributedZkTest.test-seed#[F21576DF506C287]) [    ] o.a.s.c.c.SolrZkClient makePath: /configs/conf2/currency.xml
   [junit4]   2> 1060419 INFO  (TEST-CollectionsAPIDistributedZkTest.test-seed#[F21576DF506C287]) [    ] o.a.s.c.AbstractZkTestCase put /Users/jenkins/workspace/Lucene-Solr-trunk-MacOSX/solr/core/src/test-files/solr/collection1/conf/open-exchange-rates.json to /configs/conf2/open-exchange-rates.json
   [junit4]   2> 1060419 INFO  (TEST-CollectionsAPIDistributedZkTest.test-seed#[F21576DF506C287]) [    ] o.a.s.c.c.SolrZkClient makePath: /configs/conf2/open-exchange-rates.json
   [junit4]   2> 1060424 INFO  (TEST-CollectionsAPIDistributedZkTest.test-seed#[F21576DF506C287]) [    ] o.a.s.c.AbstractZkTestCase put /Users/jenkins/workspace/Lucene-Solr-trunk-MacOSX/solr/core/src/test-files/solr/collection1/conf/mapping-ISOLatin1Accent.txt to /configs/conf2/mapping-ISOLatin1Accent.txt
   [junit4]   2> 1060424 INFO  (TEST-CollectionsAPIDistributedZkTest.test-seed#[F21576DF506C287]) [    ] o.a.s.c.c.SolrZkClient makePath: /configs/conf2/mapping-ISOLatin1Accent.txt
   [junit4]   2> 1060429 INFO  (TEST-CollectionsAPIDistributedZkTest.test-seed#[F21576DF506C287]) [    ] o.a.s.c.AbstractZkTestCase put /Users/jenkins/workspace/Lucene-Solr-trunk-MacOSX/solr/core/src/test-files/solr/collection1/conf/old_synonyms.txt to /configs/conf2/old_synonyms.txt
   [junit4]   2> 1060429 INFO  (TEST-CollectionsAPIDistributedZkTest.test-seed#[F21576DF506C287]) [    ] o.a.s.c.c.SolrZkClient makePath: /configs/conf2/old_synonyms.txt
   [junit4]   2> 1060434 INFO  (TEST-CollectionsAPIDistributedZkTest.test-seed#[F21576DF506C287]) [    ] o.a.s.c.AbstractZkTestCase put /Users/jenkins/workspace/Lucene-Solr-trunk-MacOSX/solr/core/src/test-files/solr/collection1/conf/synonyms.txt to /configs/conf2/synonyms.txt
   [junit4]   2> 1060434 INFO  (TEST-CollectionsAPIDistributedZkTest.test-seed#[F21576DF506C287]) [    ] o.a.s.c.c.SolrZkClient makePath: /configs/conf2/synonyms.txt
   [junit4]   2> 1060438 INFO  (TEST-CollectionsAPIDistributedZkTest.test-seed#[F21576DF506C287]) [    ] o.a.s.c.AbstractZkTestCase put /Users/jenkins/workspace/Lucene-Solr-trunk-MacOSX/solr/core/src/test-files/solr/collection1/conf/elevate.xml to /configs/conf2/elevate.xml
   [junit4]   2> 1060439 INFO  (TEST-CollectionsAPIDistributedZkTest.test-seed#[F21576DF506C287]) [    ] o.a.s.c.c.SolrZkClient makePath: /configs/conf2/elevate.xml
   [junit4]   2> 1060773 INFO  (TEST-CollectionsAPIDistributedZkTest.test-seed#[F21576DF506C287]) [    ] o.a.s.SolrTestCaseJ4 Writing core.properties file to /Users/jenkins/workspace/Lucene-Solr-trunk-MacOSX/solr/build/solr-core/test/J1/temp/solr.cloud.CollectionsAPIDistributedZkTest_F21576DF506C287-001/control-001/cores/collection1
   [junit4]   2> 1060776 INFO  (TEST-CollectionsAPIDistributedZkTest.test-seed#[F21576DF506C287]) [    ] o.e.j.s.Server jetty-9.3.6.v20151106
   [junit4]   2> 1060778 INFO  (TEST-CollectionsAPIDistributedZkTest.test-seed#[F21576DF506C287]) [    ] o.e.j.s.h.ContextHandler Started o.e.j.s.ServletContextHandler@6b99b582{/s_ze/f,null,AVAILABLE}
   [junit4]   2> 1060779 INFO  (TEST-CollectionsAPIDistributedZkTest.test-seed#[F21576DF506C287]) [    ] o.e.j.u.s.SslContextFactory x509=X509@3213c13b(solrtest,h=[],w=[]) for SslContextFactory@6a019ba6(file:///Users/jenkins/workspace/Lucene-Solr-trunk-MacOSX/solr/server/etc/test/solrtest.keystore,file:///Users/jenkins/workspace/Lucene-Solr-trunk-MacOSX/solr/server/etc/test/solrtest.keystore)
   [junit4]   2> 1060781 INFO  (TEST-CollectionsAPIDistributedZkTest.test-seed#[F21576DF506C287]) [    ] o.e.j.s.ServerConnector Started ServerConnector@2fef7844{SSL,[ssl, http/1.1]}{127.0.0.1:50623}
   [junit4]   2> 1060781 INFO  (TEST-CollectionsAPIDistributedZkTest.test-seed#[F21576DF506C287]) [    ] o.e.j.s.Server Started @1064500ms
   [junit4]   2> 1060781 INFO  (TEST-CollectionsAPIDistributedZkTest.test-seed#[F21576DF506C287]) [    ] o.a.s.c.s.e.JettySolrRunner Jetty properties: {solr.data.dir=/Users/jenkins/workspace/Lucene-Solr-trunk-MacOSX/solr/build/solr-core/test/J1/temp/solr.cloud.CollectionsAPIDistributedZkTest_F21576DF506C287-001/tempDir-001/control/data, hostContext=/s_ze/f, hostPort=50623, coreRootDirectory=/Users/jenkins/workspace/Lucene-Solr-trunk-MacOSX/solr/build/solr-core/test/J1/temp/solr.cloud.CollectionsAPIDistributedZkTest_F21576DF506C287-001/control-001/cores}
   [junit4]   2> 1060783 INFO  (TEST-CollectionsAPIDistributedZkTest.test-seed#[F21576DF506C287]) [    ] o.a.s.s.SolrDispatchFilter SolrDispatchFilter.init(): sun.misc.Launcher$AppClassLoader@74a14482
   [junit4]   2> 1060783 INFO  (TEST-CollectionsAPIDistributedZkTest.test-seed#[F21576DF506C287]) [    ] o.a.s.c.SolrResourceLoader new SolrResourceLoader for directory: '/Users/jenkins/workspace/Lucene-Solr-trunk-MacOSX/solr/build/solr-core/test/J1/temp/solr.cloud.CollectionsAPIDistributedZkTest_F21576DF506C287-001/control-001'
   [junit4]   2> 1060783 INFO  (TEST-CollectionsAPIDistributedZkTest.test-seed#[F21576DF506C287]) [    ] o.a.s.c.SolrResourceLoader JNDI not configured for solr (NoInitialContextEx)
   [junit4]   2> 1060783 INFO  (TEST-CollectionsAPIDistributedZkTest.test-seed#[F21576DF506C287]) [    ] o.a.s.c.SolrResourceLoader solr home defaulted to 'solr/' (could not find system property or JNDI)
   [junit4]   2> 1060783 INFO  (TEST-CollectionsAPIDistributedZkTest.test-seed#[F21576DF506C287]) [    ] o.a.s.c.c.SolrZkClient Using default ZkCredentialsProvider
   [junit4]   2> 1060784 INFO  (TEST-CollectionsAPIDistributedZkTest.test-seed#[F21576DF506C287]) [    ] o.a.s.c.c.ConnectionManager Waiting for client to connect to ZooKeeper
   [junit4]   2> 1060786 INFO  (zkCallback-1147-thread-1) [    ] o.a.s.c.c.ConnectionManager Watcher org.apache.solr.common.cloud.ConnectionManager@6ca1ebb7 name:ZooKeeperConnection Watcher:127.0.0.1:50611/solr got event WatchedEvent state:SyncConnected type:None path:null path:null type:None
   [junit4]   2> 1060786 INFO  (TEST-CollectionsAPIDistributedZkTest.test-seed#[F21576DF506C287]) [    ] o.a.s.c.c.ConnectionManager Client is connected to ZooKeeper
   [junit4]   2> 1060786 INFO  (TEST-CollectionsAPIDistributedZkTest.test-seed#[F21576DF506C287]) [    ] o.a.s.c.c.SolrZkClient Using default ZkACLProvider
   [junit4]   2> 1060788 INFO  (TEST-CollectionsAPIDistributedZkTest.test-seed#[F21576DF506C287]) [    ] o.a.s.s.SolrDispatchFilter Loading solr.xml from SolrHome (not found in ZooKeeper)
   [junit4]   2> 1060788 INFO  (TEST-CollectionsAPIDistributedZkTest.test-seed#[F21576DF506C287]) [    ] o.a.s.c.SolrXmlConfig Loading container configuration from /Users/jenkins/workspace/Lucene-Solr-trunk-MacOSX/solr/build/solr-core/test/J1/temp/solr.cloud.CollectionsAPIDistributedZkTest_F21576DF506C287-001/control-001/solr.xml
   [junit4]   2> 1060795 INFO  (TEST-CollectionsAPIDistributedZkTest.test-seed#[F21576DF506C287]) [    ] o.a.s.c.CorePropertiesLocator Config-defined core root directory: /Users/jenkins/workspace/Lucene-Solr-trunk-MacOSX/solr/build/solr-core/test/J1/temp/solr.cloud.CollectionsAPIDistributedZkTest_F21576DF506C287-001/control-001/cores
   [junit4]   2> 1060796 INFO  (TEST-CollectionsAPIDistributedZkTest.test-seed#[F21576DF506C287]) [    ] o.a.s.c.CoreContainer New CoreContainer 753778065
   [junit4]   2> 1060796 INFO  (TEST-CollectionsAPIDistributedZkTest.test-seed#[F21576DF506C287]) [    ] o.a.s.c.CoreContainer Loading cores into CoreContainer [instanceDir=/Users/jenkins/workspace/Lucene-Solr-trunk-MacOSX/solr/build/solr-core/test/J1/temp/solr.cloud.CollectionsAPIDistributedZkTest_F21576DF506C287-001/control-001]
   [junit4]   2> 1060796 WARN  (TEST-CollectionsAPIDistributedZkTest.test-seed#[F21576DF506C287]) [    ] o.a.s.c.CoreContainer Couldn't add files from /Users/jenkins/workspace/Lucene-Solr-trunk-MacOSX/solr/build/solr-core/test/J1/temp/solr.cloud.CollectionsAPIDistributedZkTest_F21576DF506C287-001/control-001/lib to classpath: /Users/jenkins/workspace/Lucene-Solr-trunk-MacOSX/solr/build/solr-core/test/J1/temp/solr.cloud.CollectionsAPIDistributedZkTest_F21576DF506C287-001/control-001/lib
   [junit4]   2> 1060796 INFO  (TEST-CollectionsAPIDistributedZkTest.test-seed#[F21576DF506C287]) [    ] o.a.s.h.c.HttpShardHandlerFactory created with socketTimeout : 90000,urlScheme : ,connTimeout : 15000,maxConnectionsPerHost : 20,maxConnections : 10000,corePoolSize : 0,maximumPoolSize : 2147483647,maxThreadIdleTime : 5,sizeOfQueue : -1,fairnessPolicy : false,useRetries : false,
   [junit4]   2> 1060799 INFO  (TEST-CollectionsAPIDistributedZkTest.test-seed#[F21576DF506C287]) [    ] o.a.s.u.UpdateShardHandler Creating UpdateShardHandler HTTP client with params: socketTimeout=340000&connTimeout=45000&retry=true
   [junit4]   2> 1060801 INFO  (TEST-CollectionsAPIDistributedZkTest.test-seed#[F21576DF506C287]) [    ] o.a.s.l.LogWatcher SLF4J impl is org.slf4j.impl.Log4jLoggerFactory
   [junit4]   2> 1060801 INFO  (TEST-CollectionsAPIDistributedZkTest.test-seed#[F21576DF506C287]) [    ] o.a.s.l.LogWatcher Registering Log Listener [Log4j (org.slf4j.impl.Log4jLoggerFactory)]
   [junit4]   2> 1060801 INFO  (TEST-CollectionsAPIDistributedZkTest.test-seed#[F21576DF506C287]) [    ] o.a.s.c.ZkContainer Zookeeper client=127.0.0.1:50611/solr
   [junit4]   2> 1060801 INFO  (TEST-CollectionsAPIDistributedZkTest.test-seed#[F21576DF506C287]) [    ] o.a.s.c.ZkController zkHost includes chroot
   [junit4]   2> 1060801 INFO  (TEST-CollectionsAPIDistributedZkTest.test-seed#[F21576DF506C287]) [    ] o.a.s.c.c.SolrZkClient Using default ZkCredentialsProvider
   [junit4]   2> 1060802 INFO  (TEST-CollectionsAPIDistributedZkTest.test-seed#[F21576DF506C287]) [    ] o.a.s.c.c.ConnectionManager Waiting for client to connect to ZooKeeper
   [junit4]   2> 1060804 INFO  (zkCallback-1150-thread-1) [    ] o.a.s.c.c.ConnectionManager Watcher org.apache.solr.common.cloud.ConnectionManager@694477a8 name:ZooKeeperConnection Watcher:127.0.0.1:50611 got event WatchedEvent state:SyncConnected type:None path:null path:null type:None
   [junit4]   2> 1060804 INFO  (TEST-CollectionsAPIDistributedZkTest.test-seed#[F21576DF506C287]) [    ] o.a.s.c.c.ConnectionManager Client is connected to ZooKeeper
   [junit4]   2> 1060805 INFO  (TEST-CollectionsAPIDistributedZkTest.test-seed#[F21576DF506C287]) [    ] o.a.s.c.c.SolrZkClient Using default ZkACLProvider
   [junit4]   2> 1060809 INFO  (TEST-CollectionsAPIDistributedZkTest.test-seed#[F21576DF506C287]) [n:127.0.0.1:50623_s_ze%2Ff    ] o.a.s.c.c.ConnectionManager Waiting for client to connect to ZooKeeper
   [junit4]   2> 1060811 INFO  (zkCallback-1151-thread-1-processing-n:127.0.0.1:50623_s_ze%2Ff) [n:127.0.0.1:50623_s_ze%2Ff    ] o.a.s.c.c.ConnectionManager Watcher org.apache.solr.common.cloud.ConnectionManager@4b2f33b5 name:ZooKeeperConnection Watcher:127.0.0.1:50611/solr got event WatchedEvent state:SyncConnected type:None path:null path:null type:None
   [junit4]   2> 1060811 INFO  (TEST-CollectionsAPIDistributedZkTest.test-seed#[F21576DF506C287]) [n:127.0.0.1:50623_s_ze%2Ff    ] o.a.s.c.c.ConnectionManager Client is connected to ZooKeeper
   [junit4]   2> 1060813 INFO  (TEST-CollectionsAPIDistributedZkTest.test-seed#[F21576DF506C287]) [n:127.0.0.1:50623_s_ze%2Ff    ] o.a.s.c.c.SolrZkClient makePath: /overseer/queue
   [junit4]   2> 1060817 INFO  (TEST-CollectionsAPIDistributedZkTest.test-seed#[F21576DF506C287]) [n:127.0.0.1:50623_s_ze%2Ff    ] o.a.s.c.c.SolrZkClient makePath: /overseer/collection-queue-work
   [junit4]   2> 1060825 INFO  (TEST-CollectionsAPIDistributedZkTest.test-seed#[F21576DF506C287]) [n:127.0.0.1:50623_s_ze%2Ff    ] o.a.s.c.c.SolrZkClient makePath: /overseer/collection-map-running
   [junit4]   2> 1060829 INFO  (TEST-CollectionsAPIDistributedZkTest.test-seed#[F21576DF506C287]) [n:127.0.0.1:50623_s_ze%2Ff    ] o.a.s.c.c.SolrZkClient makePath: /overseer/collection-map-completed
   [junit4]   2> 1060832 INFO  (TEST-CollectionsAPIDistributedZkTest.test-seed#[F21576DF506C287]) [n:127.0.0.1:50623_s_ze%2Ff    ] o.a.s.c.c.SolrZkClient makePath: /overseer/collection-map-failure
   [junit4]   2> 1060838 INFO  (TEST-CollectionsAPIDistributedZkTest.test-seed#[F21576DF506C287]) [n:127.0.0.1:50623_s_ze%2Ff    ] o.a.s.c.c.SolrZkClient makePath: /live_nodes
   [junit4]   2> 1060841 INFO  (TEST-CollectionsAPIDistributedZkTest.test-seed#[F21576DF506C287]) [n:127.0.0.1:50623_s_ze%2Ff    ] o.a.s.c.c.SolrZkClient makePath: /aliases.json
   [junit4]   2> 1060845 INFO  (TEST-CollectionsAPIDistributedZkTest.test-seed#[F21576DF506C287]) [n:127.0.0.1:50623_s_ze%2Ff    ] o.a.s.c.c.SolrZkClient makePath: /clusterstate.json
   [junit4]   2> 1060848 INFO  (TEST-CollectionsAPIDistributedZkTest.test-seed#[F21576DF506C287]) [n:127.0.0.1:50623_s_ze%2Ff    ] o.a.s.c.c.SolrZkClient makePath: /security.json
   [junit4]   2> 1060850 INFO  (TEST-CollectionsAPIDistributedZkTest.test-seed#[F21576DF506C287]) [n:127.0.0.1:50623_s_ze%2Ff    ] o.a.s.c.ZkController Register node as live in ZooKeeper:/live_nodes/127.0.0.1:50623_s_ze%2Ff
   [junit4]   2> 1060851 INFO  (TEST-CollectionsAPIDistributedZkTest.test-seed#[F21576DF506C287]) [n:127.0.0.1:50623_s_ze%2Ff    ] o.a.s.c.c.SolrZkClient makePath: /live_nodes/127.0.0.1:50623_s_ze%2Ff
   [junit4]   2> 1060855 INFO  (TEST-CollectionsAPIDistributedZkTest.test-seed#[F21576DF506C287]) [n:127.0.0.1:50623_s_ze%2Ff    ] o.a.s.c.c.SolrZkClient makePath: /overseer_elect
   [junit4]   2> 1060858 INFO  (TEST-CollectionsAPIDistributedZkTest.test-seed#[F21576DF506C287]) [n:127.0.0.1:50623_s_ze%2Ff    ] o.a.s.c.c.SolrZkClient makePath: /overseer_elect/election
   [junit4]   2> 1060861 INFO  (TEST-CollectionsAPIDistributedZkTest.test-seed#[F21576DF506C287]) [n:127.0.0.1:50623_s_ze%2Ff    ] o.a.s.c.Overseer Overseer (id=null) closing
   [junit4]   2> 1060862 INFO  (TEST-CollectionsAPIDistributedZkTest.test-seed#[F21576DF506C287]) [n:127.0.0.1:50623_s_ze%2Ff    ] o.a.s.c.LeaderElector Joined leadership election with path: /overseer_elect/election/95160508329558023-127.0.0.1:50623_s_ze%2Ff-n_0000000000
   [junit4]   2> 1060863 INFO  (TEST-CollectionsAPIDistributedZkTest.test-seed#[F21576DF506C287]) [n:127.0.0.1:50623_s_ze%2Ff    ] o.a.s.c.OverseerElectionContext I am going to be the leader 127.0.0.1:50623_s_ze%2Ff
   [junit4]   2> 1060863 INFO  (TEST-CollectionsAPIDistributedZkTest.test-seed#[F21576DF506C287]) [n:127.0.0.1:50623_s_ze%2Ff    ] o.a.s.c.c.SolrZkClient makePath: /overseer_elect/leader
   [junit4]   2> 1060865 INFO  (TEST-CollectionsAPIDistributedZkTest.test-seed#[F21576DF506C287]) [n:127.0.0.1:50623_s_ze%2Ff    ] o.a.s.c.Overseer Overseer (id=95160508329558023-127.0.0.1:50623_s_ze%2Ff-n_0000000000) starting
   [junit4]   2> 1060870 INFO  (TEST-CollectionsAPIDistributedZkTest.test-seed#[F21576DF506C287]) [n:127.0.0.1:50623_s_ze%2Ff    ] o.a.s.c.c.SolrZkClient makePath: /overseer/queue-work
   [junit4]   2> 1060883 INFO  (TEST-CollectionsAPIDistributedZkTest.test-seed#[F21576DF506C287]) [n:127.0.0.1:50623_s_ze%2Ff    ] o.a.s.c.OverseerAutoReplicaFailoverThread Starting OverseerAutoReplicaFailoverThread autoReplicaFailoverWorkLoopDelay=10000 autoReplicaFailoverWaitAfterExpiration=10000 autoReplicaFailoverBadNodeExpiration=60000
   [junit4]   2> 1060884 INFO  (TEST-CollectionsAPIDistributedZkTest.test-seed#[F21576DF506C287]) [n:127.0.0.1:50623_s_ze%2Ff    ] o.a.s.c.c.ZkStateReader Updating cluster state from ZooKeeper... 
   [junit4]   2> 1060884 INFO  (OverseerCollectionConfigSetProcessor-95160508329558023-127.0.0.1:50623_s_ze%2Ff-n_0000000000) [n:127.0.0.1:50623_s_ze%2Ff    ] o.a.s.c.OverseerTaskProcessor Process current queue of overseer operations
   [junit4]   2> 1060885 INFO  (OverseerStateUpdate-95160508329558023-127.0.0.1:50623_s_ze%2Ff-n_0000000000) [n:127.0.0.1:50623_s_ze%2Ff    ] o.a.s.c.Overseer Starting to work on the main queue
   [junit4]   2> 1060903 INFO  (TEST-CollectionsAPIDistributedZkTest.test-seed#[F21576DF506C287]) [n:127.0.0.1:50623_s_ze%2Ff    ] o.a.s.c.CoreContainer Security conf doesn't exist. Skipping setup for authorization module.
   [junit4]   2> 1060903 INFO  (TEST-CollectionsAPIDistributedZkTest.test-seed#[F21576DF506C287]) [n:127.0.0.1:50623_s_ze%2Ff    ] o.a.s.c.CoreContainer No authentication plugin used.
   [junit4]   2> 1060906 INFO  (TEST-CollectionsAPIDistributedZkTest.test-seed#[F21576DF506C287]) [n:127.0.0.1:50623_s_ze%2Ff    ] o.a.s.c.CorePropertiesLocator Looking for core definitions underneath /Users/jenkins/workspace/Lucene-Solr-trunk-MacOSX/solr/build/solr-core/test/J1/temp/solr.cloud.CollectionsAPIDistributedZkTest_F21576DF506C287-001/control-001/cores
   [junit4]   2> 1060907 INFO  (TEST-CollectionsAPIDistributedZkTest.test-seed#[F21576DF506C287]) [n:127.0.0.1:50623_s_ze%2Ff    ] o.a.s.c.CoreDescriptor Created CoreDescriptor: {name=collection1, config=solrconfig.xml, transient=false, schema=schema.xml, loadOnStartup=true, configSetProperties=configsetprops.json, collection=control_collection, coreNodeName=, dataDir=data/, shard=}
   [junit4]   2> 1060907 INFO  (TEST-CollectionsAPIDistributedZkTest.test-seed#[F21576DF506C287]) [n:127.0.0.1:50623_s_ze%2Ff    ] o.a.s.c.CorePropertiesLocator Found core collection1 in /Users/jenkins/workspace/Lucene-Solr-trunk-MacOSX/solr/build/solr-core/test/J1/temp/solr.cloud.CollectionsAPIDistributedZkTest_F21576DF506C287-001/control-001/cores/collection1
   [junit4]   2> 1060907 INFO  (TEST-CollectionsAPIDistributedZkTest.test-seed#[F21576DF506C287]) [n:127.0.0.1:50623_s_ze%2Ff    ] o.a.s.c.CorePropertiesLocator Found 1 core definitions
   [junit4]   2> 1060909 INFO  (TEST-CollectionsAPIDistributedZkTest.test-seed#[F21576DF506C287]) [n:127.0.0.1:50623_s_ze%2Ff    ] o.a.s.s.SolrDispatchFilter user.dir=/Users/jenkins/workspace/Lucene-Solr-trunk-MacOSX/solr/build/solr-core/test/J1
   [junit4]   2> 1060910 INFO  (TEST-CollectionsAPIDistributedZkTest.test-seed#[F21576DF506C287]) [n:127.0.0.1:50623_s_ze%2Ff    ] o.a.s.s.SolrDispatchFilter SolrDispatchFilter.init() done
   [junit4]   2> 1060911 INFO  (coreLoadExecutor-3762-thread-1-processing-n:127.0.0.1:50623_s_ze%2Ff) [n:127.0.0.1:50623_s_ze%2Ff c:control_collection   x:collection1] o.a.s.c.ZkController publishing state=down
   [junit4]   2> 1060911 INFO  (coreLoadExecutor-3762-thread-1-processing-n:127.0.0.1:50623_s_ze%2Ff) [n:127.0.0.1:50623_s_ze%2Ff c:control_collection   x:collection1] o.a.s.c.ZkController numShards not found on descriptor - reading it from system property
   [junit4]   2> 1060915 INFO  (OverseerStateUpdate-95160508329558023-127.0.0.1:50623_s_ze%2Ff-n_0000000000) [n:127.0.0.1:50623_s_ze%2Ff    ] o.a.s.c.Overseer processMessage: queueSize: 1, message = {
   [junit4]   2>   "core":"collection1",
   [junit4]   2>   "roles":null,
   [junit4]   2>   "base_url":"https://127.0.0.1:50623/s_ze/f",
   [junit4]   2>   "node_name":"127.0.0.1:50623_s_ze%2Ff",
   [junit4]   2>   "numShards":"1",
   [junit4]   2>   "state":"down",
   [junit4]   2>   "shard":null,
   [junit4]   2>   "collection":"control_collection",
   [junit4]   2>   "operation":"state"} current state version: 0
   [junit4]   2> 1060915 INFO  (coreLoadExecutor-3762-thread-1-processing-n:127.0.0.1:50623_s_ze%2Ff) [n:127.0.0.1:50623_s_ze%2Ff c:control_collection   x:collection1] o.a.s.c.ZkController look for our core node name
   [junit4]   2> 1060916 INFO  (OverseerStateUpdate-95160508329558023-127.0.0.1:50623_s_ze%2Ff-n_0000000000) [n:127.0.0.1:50623_s_ze%2Ff    ] o.a.s.c.o.ReplicaMutator Update state numShards=1 message={
   [junit4]   2>   "core":"collection1",
   [junit4]   2>   "roles":null,
   [junit4]   2>   "base_url":"https://127.0.0.1:50623/s_ze/f",
   [junit4]   2>   "node_name":"127.0.0.1:50623_s_ze%2Ff",
   [junit4]   2>   "numShards":"1",
   [junit4]   2>   "state":"down",
   [junit4]   2>   "shard":null,
   [junit4]   2>   "collection":"control_collection",
   [junit4]   2>   "operation":"state"}
   [junit4]   2> 1060917 INFO  (OverseerStateUpdate-95160508329558023-127.0.0.1:50623_s_ze%2Ff-n_0000000000) [n:127.0.0.1:50623_s_ze%2Ff    ] o.a.s.c.o.ClusterStateMutator building a new cName: control_collection
   [junit4]   2> 1060918 INFO  (OverseerStateUpdate-95160508329558023-127.0.0.1:50623_s_ze%2Ff-n_0000000000) [n:127.0.0.1:50623_s_ze%2Ff    ] o.a.s.c.o.ReplicaMutator Assigning new node to shard shard=shard1
   [junit4]   2> 1060920 INFO  (zkCallback-1151-thread-1-processing-n:127.0.0.1:50623_s_ze%2Ff) [n:127.0.0.1:50623_s_ze%2Ff    ] o.a.s.c.c.ZkStateReader A cluster state change: [WatchedEvent state:SyncConnected type:NodeDataChanged path:/clusterstate.json], has occurred - updating... (live nodes size: [1])
   [junit4]   2> 1061917 INFO  (coreLoadExecutor-3762-thread-1-processing-n:127.0.0.1:50623_s_ze%2Ff) [n:127.0.0.1:50623_s_ze%2Ff c:control_collection   x:collection1] o.a.s.c.ZkController waiting to find shard id in clusterstate for collection1
   [junit4]   2> 1061917 INFO  (coreLoadExecutor-3762-thread-1-processing-n:127.0.0.1:50623_s_ze%2Ff) [n:127.0.0.1:50623_s_ze%2Ff c:control_collection   x:collection1] o.a.s.c.ZkController Check for collection zkNode:control_collection
   [junit4]   2> 1061918 INFO  (coreLoadExecutor-3762-thread-1-processing-n:127.0.0.1:50623_s_ze%2Ff) [n:127.0.0.1:50623_s_ze%2Ff c:control_collection   x:collection1] o.a.s.c.ZkController Collection zkNode exists
   [junit4]   2> 1061918 INFO  (coreLoadExecutor-3762-thread-1-processing-n:127.0.0.1:50623_s_ze%2Ff) [n:127.0.0.1:50623_s_ze%2Ff c:control_collection   x:collection1] o.a.s.c.c.ZkStateReader Load collection config from: [/collections/control_collection]
   [junit4]   2> 1061919 INFO  (coreLoadExecutor-3762-thread-1-processing-n:127.0.0.1:50623_s_ze%2Ff) [n:127.0.0.1:50623_s_ze%2Ff c:control_collection   x:collection1] o.a.s.c.c.ZkStateReader path=[/collections/control_collection] [configName]=[conf1] specified config exists in ZooKeeper
   [junit4]   2> 1061920 INFO  (coreLoadExecutor-3762-thread-1-processing-n:127.0.0.1:50623_s_ze%2Ff) [n:127.0.0.1:50623_s_ze%2Ff c:control_collection   x:collection1] o.a.s.c.SolrResourceLoader new SolrResourceLoader for directory: '/Users/jenkins/workspace/Lucene-Solr-trunk-MacOSX/solr/build/solr-core/test/J1/temp/solr.cloud.CollectionsAPIDistributedZkTest_F21576DF506C287-001/control-001/cores/collection1'
   [junit4]   2> 1061920 INFO  (coreLoadExecutor-3762-thread-1-processing-n:127.0.0.1:50623_s_ze%2Ff) [n:127.0.0.1:50623_s_ze%2Ff c:control_collection   x:collection1] o.a.s.c.SolrResourceLoader JNDI not configured for solr (NoInitialContextEx)
   [junit4]   2> 1061920 INFO  (coreLoadExecutor-3762-thread-1-processing-n:127.0.0.1:50623_s_ze%2Ff) [n:127.0.0.1:50623_s_ze%2Ff c:control_collection   x:collection1] o.a.s.c.SolrResourceLoader solr home defaulted to 'solr/' (could not find system property or JNDI)
   [junit4]   2> 1061923 INFO  (coreLoadExecutor-3762-thread-1-processing-n:127.0.0.1:50623_s_ze%2Ff) [n:127.0.0.1:50623_s_ze%2Ff c:control_collection   x:collection1] o.a.s.c.Config loaded config solrconfig.xml with version 0 
   [junit4]   2> 1061933 INFO  (coreLoadExecutor-3762-thread-1-processing-n:127.0.0.1:50623_s_ze%2Ff) [n:127.0.0.1:50623_s_ze%2Ff c:control_collection   x:collection1] o.a.s.c.SolrConfig current version of requestparams : -1
   [junit4]   2> 1061975 INFO  (coreLoadExecutor-3762-thread-1-processing-n:127.0.0.1:50623_s_ze%2Ff) [n:127.0.0.1:50623_s_ze%2Ff c:control_collection   x:collection1] o.a.s.c.SolrConfig Using Lucene MatchVersion: 6.0.0
   [junit4]   2> 1061984 INFO  (coreLoadExecutor-3762-thread-1-processing-n:127.0.0.1:50623_s_ze%2Ff) [n:127.0.0.1:50623_s_ze%2Ff c:control_collection   x:collection1] o.a.s.c.SolrConfig Loaded SolrConfig: solrconfig.xml
   [junit4]   2> 1061991 INFO  (coreLoadExecutor-3762-thread-1-processing-n:127.0.0.1:50623_s_ze%2Ff) [n:127.0.0.1:50623_s_ze%2Ff c:control_collection   x:collection1] o.a.s.s.IndexSchema [collection1] Schema name=test
   [junit4]   2> 1062098 INFO  (coreLoadExecutor-3762-thread-1-processing-n:127.0.0.1:50623_s_ze%2Ff) [n:127.0.0.1:50623_s_ze%2Ff c:control_collection   x:collection1] o.a.s.s.OpenExchangeRatesOrgProvider Initialized with rates=open-exchange-rates.json, refreshInterval=1440.
   [junit4]   2> 1062107 INFO  (coreLoadExecutor-3762-thread-1-processing-n:127.0.0.1:50623_s_ze%2Ff) [n:127.0.0.1:50623_s_ze%2Ff c:control_collection   x:collection1] o.a.s.s.IndexSchema default search field in schema is text
   [junit4]   2> 1062108 INFO  (coreLoadExecutor-3762-thread-1-processing-n:127.0.0.1:50623_s_ze%2Ff) [n:127.0.0.1:50623_s_ze%2Ff c:control_collection   x:collection1] o.a.s.s.IndexSchema unique key field: id
   [junit4]   2> 1062128 INFO  (coreLoadExecutor-3762-thread-1-processing-n:127.0.0.1:50623_s_ze%2Ff) [n:127.0.0.1:50623_s_ze%2Ff c:control_collection   x:collection1] o.a.s.s.FileExchangeRateProvider Reloading exchange rates from file currency.xml
   [junit4]   2> 1062131 INFO  (coreLoadExecutor-3762-thread-1-processing-n:127.0.0.1:50623_s_ze%2Ff) [n:127.0.0.1:50623_s_ze%2Ff c:control_collection   x:collection1] o.a.s.s.FileExchangeRateProvider Reloading exchange rates from file currency.xml
   [junit4]   2> 1062134 INFO  (coreLoadExecutor-3762-thread-1-processing-n:127.0.0.1:50623_s_ze%2Ff) [n:127.0.0.1:50623_s_ze%2Ff c:control_collection   x:collection1] o.a.s.s.OpenExchangeRatesOrgProvider Reloading exchange rates from open-exchange-rates.json
   [junit4]   2> 1062136 INFO  (coreLoadExecutor-3762-thread-1-processing-n:127.0.0.1:50623_s_ze%2Ff) [n:127.0.0.1:50623_s_ze%2Ff c:control_collection   x:collection1] o.a.s.s.OpenExchangeRatesOrgProvider Reloading exchange rates from open-exchange-rates.json
   [junit4]   2> 1062140 INFO  (coreLoadExecutor-3762-thread-1-processing-n:127.0.0.1:50623_s_ze%2Ff) [n:127.0.0.1:50623_s_ze%2Ff c:control_collection   x:collection1] o.a.s.c.ConfigSetProperties Did not find ConfigSet properties, assuming default properties: Can't find resource 'configsetprops.json' in classpath or '/configs/conf1', cwd=/Users/jenkins/workspace/Lucene-Solr-trunk-MacOSX/solr/build/solr-core/test/J1
   [junit4]   2> 1062140 INFO  (coreLoadExecutor-3762-thread-1-processing-n:127.0.0.1:50623_s_ze%2Ff) [n:127.0.0.1:50623_s_ze%2Ff c:control_collection   x:collection1] o.a.s.c.CoreContainer Creating SolrCore 'collection1' using configuration from collection control_collection
   [junit4]   2> 1062140 INFO  (coreLoadExecutor-3762-thread-1-processing-n:127.0.0.1:50623_s_ze%2Ff) [n:127.0.0.1:50623_s_ze%2Ff c:control_collection s:shard1 r:core_node1 x:collection1] o.a.s.c.SolrCore org.apache.solr.core.MockDirectoryFactory
   [junit4]   2> 1062141 INFO  (coreLoadExecutor-3762-thread-1-processing-n:127.0.0.1:50623_s_ze%2Ff) [n:127.0.0.1:50623_s_ze%2Ff c:control_collection s:shard1 r:core_node1 x:collection1] o.a.s.c.SolrCore [[collection1] ] Opening new SolrCore at [/Users/jenkins/workspace/Lucene-Solr-trunk-MacOSX/solr/build/solr-core/test/J1/temp/solr.cloud.CollectionsAPIDistributedZkTest_F21576DF506C287-001/control-001/cores/collection1], dataDir=[/Users/jenkins/workspace/Lucene-Solr-trunk-MacOSX/solr/build/solr-core/test/J1/temp/solr.cloud.CollectionsAPIDistributedZkTest_F21576DF506C287-001/control-001/cores/collection1/data/]
   [junit4]   2> 1062141 INFO  (coreLoadExecutor-3762-thread-1-processing-n:127.0.0.1:50623_s_ze%2Ff) [n:127.0.0.1:50623_s_ze%2Ff c:control_collection s:shard1 r:core_node1 x:collection1] o.a.s.c.JmxMonitoredMap JMX monitoring is enabled. Adding Solr mbeans to JMX Server: com.sun.jmx.mbeanserver.JmxMBeanServer@47a09b81
   [junit4]   2> 1062141 INFO  (coreLoadExecutor-3762-thread-1-processing-n:127.0.0.1:50623_s_ze%2Ff) [n:127.0.0.1:50623_s_ze%2Ff c:control_collection s:shard1 r:core_node1 x:collection1] o.a.s.c.CachingDirectoryFactory return new directory for /Users/jenkins/workspace/Lucene-Solr-trunk-MacOSX/solr/build/solr-core/test/J1/temp/solr.cloud.CollectionsAPIDistributedZkTest_F21576DF506C287-001/control-001/cores/collection1/data
   [junit4]   2> 1062141 INFO  (coreLoadExecutor-3762-thread-1-processing-n:127.0.0.1:50623_s_ze%2Ff) [n:127.0.0.1:50623_s_ze%2Ff c:control_collection s:shard1 r:core_node1 x:collection1] o.a.s.c.SolrCore New index directory detected: old=null new=/Users/jenkins/workspace/Lucene-Solr-trunk-MacOSX/solr/build/solr-core/test/J1/temp/solr.cloud.CollectionsAPIDistributedZkTest_F21576DF506C287-001/control-001/cores/collection1/data/index/
   [junit4]   2> 1062142 WARN  (coreLoadExecutor-3762-thread-1-processing-n:127.0.0.1:50623_s_ze%2Ff) [n:127.0.0.1:50623_s_ze%2Ff c:control_collection s:shard1 r:core_node1 x:collection1] o.a.s.c.SolrCore [collection1] Solr index directory '/Users/jenkins/workspace/Lucene-Solr-trunk-MacOSX/solr/build/solr-core/test/J1/temp/solr.cloud.CollectionsAPIDistributedZkTest_F21576DF506C287-001/control-001/cores/collection1/data/index' doesn't exist. Creating new index...
   [junit4]   2> 1062142 INFO  (coreLoadExecutor-3762-thread-1-processing-n:127.0.0.1:50623_s_ze%2Ff) [n:127.0.0.1:50623_s_ze%2Ff c:control_collection s:shard1 r:core_node1 x:collection1] o.a.s.c.CachingDirectoryFactory return new directory for /Users/jenkins/workspace/Lucene-Solr-trunk-MacOSX/solr/build/solr-core/test/J1/temp/solr.cloud.CollectionsAPIDistributedZkTest_F21576DF506C287-001/control-001/cores/collection1/data/index
   [junit4]   2> 1062142 INFO  (coreLoadExecutor-3762-thread-1-processing-n:127.0.0.1:50623_s_ze%2Ff) [n:127.0.0.1:50623_s_ze%2Ff c:control_collection s:shard1 r:core_node1 x:collection1] o.a.s.u.RandomMergePolicy RandomMergePolicy wrapping class org.apache.lucene.index.TieredMergePolicy: [TieredMergePolicy: maxMergeAtOnce=25, maxMergeAtOnceExplicit=49, maxMergedSegmentMB=99.873046875, floorSegmentMB=1.255859375, forceMergeDeletesPctAllowed=24.736264508598374, segmentsPerTier=18.0, maxCFSSegmentSizeMB=8.796093022207999E12, noCFSRatio=0.0
   [junit4]   2> 1062143 INFO  (coreLoadExecutor-3762-thread-1-processing-n:127.0.0.1:50623_s_ze%2Ff) [n:127.0.0.1:50623_s_ze%2Ff c:control_collection s:shard1 r:core_node1 x:collection1] o.a.s.c.SolrDeletionPolicy SolrDeletionPolicy.onCommit: commits: num=1
   [junit4]   2> 	commit{dir=MockDirectoryWrapper(RAMDirectory@10ef63ce lockFactory=org.apache.lucene.store.SingleInstanceLockFactory@60afab27),segFN=segments_1,generation=1}
   [junit4]   2> 1062143 INFO  (coreLoadExecutor-3762-thread-1-processing-n:127.0.0.1:50623_s_ze%2Ff) [n:127.0.0.1:50623_s_ze%2Ff c:control_collection s:shard1 r:core_node1 x:collection1] o.a.s.c.SolrDeletionPolicy newest commit generation = 1
   [junit4]   2> 1062144 INFO  (OldIndexDirectoryCleanupThreadForCore-collection1) [n:127.0.0.1:50623_s_ze%2Ff c:control_collection s:shard1 r:core_node1 x:collection1] o.a.s.c.SolrCore Looking for old index directories to cleanup for core collection1 in /Users/jenkins/workspace/Lucene-Solr-trunk-MacOSX/solr/build/solr-core/test/J1/temp/solr.cloud.CollectionsAPIDistributedZkTest_F21576DF506C287-001/control-001/cores/collection1/data/
   [junit4]   2> 1062144 WARN  (OldIndexDirectoryCleanupThreadForCore-collection1) [n:127.0.0.1:50623_s_ze%2Ff c:control_collection s:shard1 r:core_node1 x:collection1] o.a.s.c.DirectoryFactory /Users/jenkins/workspace/Lucene-Solr-trunk-MacOSX/solr/build/solr-core/test/J1/temp/solr.cloud.CollectionsAPIDistributedZkTest_F21576DF506C287-001/control-001/cores/collection1/data/ does not point to a valid data directory; skipping clean-up of old index directories.
   [junit4]   2> 1062147 INFO  (coreLoadExecutor-3762-thread-1-processing-n:127.0.0.1:50623_s_ze%2Ff) [n:127.0.0.1:50623_s_ze%2Ff c:control_collection s:shard1 r:core_node1 x:collection1] o.a.s.u.p.UpdateRequestProcessorChain creating updateRequestProcessorChain "nodistrib"
   [junit4]   2> 1062147 INFO  (coreLoadExecutor-3762-thread-1-processing-n:127.0.0.1:50623_s_ze%2Ff) [n:127.0.0.1:50623_s_ze%2Ff c:control_collection s:shard1 r:core_node1 x:collection1] o.a.s.u.p.UpdateRequestProcessorChain creating updateRequestProcessorChain "dedupe"
   [junit4]   2> 1062147 INFO  (coreLoadExecutor-3762-thread-1-processing-n:127.0.0.1:50623_s_ze%2Ff) [n:127.0.0.1:50623_s_ze%2Ff c:control_collection s:shard1 r:core_node1 x:collection1] o.a.s.u.p.UpdateRequestProcessorChain inserting DistributedUpdateProcessorFactory into updateRequestProcessorChain "dedupe"
   [junit4]   2> 1062147 INFO  (coreLoadExecutor-3762-thread-1-processing-n:127.0.0.1:50623_s_ze%2Ff) [n:127.0.0.1:50623_s_ze%2Ff c:control_collection s:shard1 r:core_node1 x:collection1] o.a.s.u.p.UpdateRequestProcessorChain creating updateRequestProcessorChain "stored_sig"
   [junit4]   2> 1062147 INFO  (coreLoadExecutor-3762-thread-1-processing-n:127.0.0.1:50623_s_ze%2Ff) [n:127.0.0.1:50623_s_ze%2Ff c:control_collection s:shard1 r:core_node1 x:collection1] o.a.s.u.p.UpdateRequestProcessorChain inserting DistributedUpdateProcessorFactory into updateRequestProcessorChain "stored_sig"
   [junit4]   2> 1062147 INFO  (coreLoadExecutor-3762-thread-1-processing-n:127.0.0.1:50623_s_ze%2Ff) [n:127.0.0.1:50623_s_ze%2Ff c:control_collection s:shard1 r:core_node1 x:collection1] o.a.s.u.p.UpdateRequestProcessorChain creating updateRequestProcessorChain "distrib-dup-test-chain-explicit"
   [junit4]   2> 1062148 INFO  (coreLoadExecutor-3762-thread-1-processing-n:127.0.0.1:50623_s_ze%2Ff) [n:127.0.0.1:50623_s_ze%2Ff c:control_collection s:shard1 r:core_node1 x:collection1] o.a.s.u.p.UpdateRequestProcessorChain creating updateRequestProcessorChain "distrib-dup-test-chain-implicit"
   [junit4]   2> 1062148 INFO  (coreLoadExecutor-3762-thread-1-processing-n:127.0.0.1:50623_s_ze%2Ff) [n:127.0.0.1:50623_s_ze%2Ff c:control_collection s:shard1 r:core_node1 x:collection1] o.a.s.u.p.UpdateRequestProcessorChain inserting DistributedUpdateProcessorFactory into updateRequestProcessorChain "distrib-dup-test-chain-implicit"
   [junit4]   2> 1062148 INFO  (coreLoadExecutor-3762-thread-1-processing-n:127.0.0.1:50623_s_ze%2Ff) [n:127.0.0.1:50623_s_ze%2Ff c:control_collection s:shard1 r:core_node1 x:collection1] o.a.s.c.SolrCore no updateRequestProcessorChain defined as default, creating implicit default
   [junit4]   2> 1062148 WARN  (coreLoadExecutor-3762-thread-1-processing-n:127.0.0.1:50623_s_ze%2Ff) [n:127.0.0.1:50623_s_ze%2Ff c:control_collection s:shard1 r:core_node1 x:collection1] o.a.s.c.RequestHandlers INVALID paramSet a in requestHandler {type = requestHandler,name = /dump,class = DumpRequestHandler,args = {defaults={a=A,b=B}}}
   [junit4]   2> 1062153 INFO  (coreLoadExecutor-3762-thread-1-processing-n:127.0.0.1:50623_s_ze%2Ff) [n:127.0.0.1:50623_s_ze%2Ff c:control_collection s:shard1 r:core_node1 x:collection1] o.a.s.h.l.XMLLoader xsltCacheLifetimeSeconds=60
   [junit4]   2> 1062155 INFO  (coreLoadExecutor-3762-thread-1-processing-n:127.0.0.1:50623_s_ze%2Ff) [n:127.0.0.1:50623_s_ze%2Ff c:control_collection s:shard1 r:core_node1 x:collection1] o.a.s.h.l.XMLLoader xsltCacheLifetimeSeconds=60
   [junit4]   2> 1062156 INFO  (coreLoadExecutor-3762-thread-1-processing-n:127.0.0.1:50623_s_ze%2Ff) [n:127.0.0.1:50623_s_ze%2Ff c:control_collection s:shard1 r:core_node1 x:collection1] o.a.s.h.l.XMLLoader xsltCacheLifetimeSeconds=60
   [junit4]   2> 1062157 INFO  (coreLoadExecutor-3762-thread-1-processing-n:127.0.0.1:50623_s_ze%2Ff) [n:127.0.0.1:50623_s_ze%2Ff c:control_collection s:shard1 r:core_node1 x:collection1] o.a.s.h.l.XMLLoader xsltCacheLifetimeSeconds=60
   [junit4]   2> 1062161 INFO  (coreLoadExecutor-3762-thread-1-processing-n:127.0.0.1:50623_s_ze%2Ff) [n:127.0.0.1:50623_s_ze%2Ff c:control_collection s:shard1 r:core_node1 x:collection1] o.a.s.c.RequestHandlers Registered paths: /admin/mbeans,standard,/dump,/update/csv,/sql,/update/json/docs,/admin/luke,/export,/admin/segments,/get,/admin/system,/replication,/admin/properties,/config,/stream,/schema,/admin/plugins,/admin/logging,/update/json,/admin/threads,/admin/ping,/update,/admin/file
   [junit4]   2> 1062161 INFO  (coreLoadExecutor-3762-thread-1-processing-n:127.0.0.1:50623_s_ze%2Ff) [n:127.0.0.1:50623_s_ze%2Ff c:control_collection s:shard1 r:core_node1 x:collection1] o.a.s.c.SolrCore Using default statsCache cache: org.apache.solr.search.stats.LocalStatsCache
   [junit4]   2> 1062163 INFO  (coreLoadExecutor-3762-thread-1-processing-n:127.0.0.1:50623_s_ze%2Ff) [n:127.0.0.1:50623_s_ze%2Ff c:control_collection s:shard1 r:core_node1 x:collection1] o.a.s.u.UpdateHandler Using UpdateLog implementation: org.apache.solr.update.UpdateLog
   [junit4]   2> 1062163 INFO  (coreLoadExecutor-3762-thread-1-processing-n:127.0.0.1:50623_s_ze%2Ff) [n:127.0.0.1:50623_s_ze%2Ff c:control_collection s:shard1 r:core_node1 x:collection1] o.a.s.u.UpdateLog Initializing UpdateLog: dataDir= defaultSyncLevel=FLUSH numRecordsToKeep=100 maxNumLogsToKeep=10 numVersionBuckets=65536
   [junit4]   2> 1062164 INFO  (coreLoadExecutor-3762-thread-1-processing-n:127.0.0.1:50623_s_ze%2Ff) [n:127.0.0.1:50623_s_ze%2Ff c:control_collection s:shard1 r:core_node1 x:collection1] o.a.s.u.CommitTracker Hard AutoCommit: disabled
   [junit4]   2> 1062164 INFO  (coreLoadExecutor-3762-thread-1-processing-n:127.0.0.1:50623_s_ze%2Ff) [n:127.0.0.1:50623_s_ze%2Ff c:control_collection s:shard1 r:core_node1 x:collection1] o.a.s.u.CommitTracker Soft AutoCommit: disabled
   [junit4]   2> 1062164 INFO  (coreLoadExecutor-3762-thread-1-processing-n:127.0.0.1:50623_s_ze%2Ff) [n:127.0.0.1:50623_s_ze%2Ff c:control_collection s:shard1 r:core_node1 x:collection1] o.a.s.u.RandomMergePolicy RandomMergePolicy wrapping class org.apache.lucene.index.TieredMergePolicy: [TieredMergePolicy: maxMergeAtOnce=25, maxMergeAtOnceExplicit=15, maxMergedSegmentMB=51.3642578125, floorSegmentMB=0.40625, forceMergeDeletesPctAllowed=20.872765796180175, segmentsPerTier=46.0, maxCFSSegmentSizeMB=8.796093022207999E12, noCFSRatio=0.0
   [junit4]   2> 1062165 INFO  (coreLoadExecutor-3762-thread-1-processing-n:127.0.0.1:50623_s_ze%2Ff) [n:127.0.0.1:50623_s_ze%2Ff c:control_collection s:shard1 r:core_node1 x:collection1] o.a.s.c.SolrDeletionPolicy SolrDeletionPolicy.onInit: commits: num=1
   [junit4]   2> 	commit{dir=MockDirectoryWrapper(RAMDirectory@10ef63ce lockFactory=org.apache.lucene.store.SingleInstanceLockFactory@60afab27),segFN=segments_1,generation=1}
   [junit4]   2> 1062165 INFO  (coreLoadExecutor-3762-thread-1-processing-n:127.0.0.1:50623_s_ze%2Ff) [n:127.0.0.1:50623_s_ze%2Ff c:control_collection s:shard1 r:core_node1 x:collection1] o.a.s.c.SolrDeletionPolicy newest commit generation = 1
   [junit4]   2> 1062165 INFO  (coreLoadExecutor-3762-thread-1-processing-n:127.0.0.1:50623_s_ze%2Ff) [n:127.0.0.1:50623_s_ze%2Ff c:control_collection s:shard1 r:core_node1 x:collection1] o.a.s.s.SolrIndexSearcher Opening Searcher@5baf49e2[collection1] main
   [junit4]   2> 1062165 INFO  (coreLoadExecutor-3762-thread-1-processing-n:127.0.0.1:50623_s_ze%2Ff) [n:127.0.0.1:50623_s_ze%2Ff c:control_collection s:shard1 r:core_node1 x:collection1] o.a.s.c.c.ZkStateReader Load collection config from: [/collections/control_collection]
   [junit4]   2> 1062167 INFO  (coreLoadExecutor-3762-thread-1-processing-n:127.0.0.1:50623_s_ze%2Ff) [n:127.0.0.1:50623_s_ze%2Ff c:control_collection s:shard1 r:core_node1 x:collection1] o.a.s.c.c.ZkStateReader path=[/collections/control_collection] [configName]=[conf1] specified config exists in ZooKeeper
   [junit4]   2> 1062167 INFO  (coreLoadExecutor-3762-thread-1-processing-n:127.0.0.1:50623_s_ze%2Ff) [n:127.0.0.1:50623_s_ze%2Ff c:control_collection s:shard1 r:core_node1 x:collection1] o.a.s.r.ManagedResourceStorage Setting up ZooKeeper-based storage for the RestManager with znodeBase: /configs/conf1
   [junit4]   2> 1062167 INFO  (coreLoadExecutor-3762-thread-1-processing-n:127.0.0.1:50623_s_ze%2Ff) [n:127.0.0.1:50623_s_ze%2Ff c:control_collection s:shard1 r:core_node1 x:collection1] o.a.s.r.ManagedResourceStorage Configured ZooKeeperStorageIO with znodeBase: /configs/conf1
   [junit4]   2> 1062167 INFO  (coreLoadExecutor-3762-thread-1-processing-n:127.0.0.1:50623_s_ze%2Ff) [n:127.0.0.1:50623_s_ze%2Ff c:control_collection s:shard1 r:core_node1 x:collection1] o.a.s.r.RestManager Initializing RestManager with initArgs: {}
   [junit4]   2> 1062167 INFO  (coreLoadExecutor-3762-thread-1-processing-n:127.0.0.1:50623_s_ze%2Ff) [n:127.0.0.1:50623_s_ze%2Ff c:control_collection s:shard1 r:core_node1 x:collection1] o.a.s.r.ManagedResourceStorage Reading _rest_managed.json using ZooKeeperStorageIO:path=/configs/conf1
   [junit4]   2> 1062168 INFO  (coreLoadExecutor-3762-thread-1-processing-n:127.0.0.1:50623_s_ze%2Ff) [n:127.0.0.1:50623_s_ze%2Ff c:control_collection s:shard1 r:core_node1 x:collection1] o.a.s.r.ManagedResourceStorage No data found for znode /configs/conf1/_rest_managed.json
   [junit4]   2> 1062168 INFO  (coreLoadExecutor-3762-thread-1-processing-n:127.0.0.1:50623_s_ze%2Ff) [n:127.0.0.1:50623_s_ze%2Ff c:control_collection s:shard1 r:core_node1 x:collection1] o.a.s.r.ManagedResourceStorage Loaded null at path _rest_managed.json using ZooKeeperStorageIO:path=/configs/conf1
   [junit4]   2> 1062168 INFO  (coreLoadExecutor-3762-thread-1-processing-n:127.0.0.1:50623_s_ze%2Ff) [n:127.0.0.1:50623_s_ze%2Ff c:control_collection s:shard1 r:core_node1 x:collection1] o.a.s.r.RestManager Initializing 0 registered ManagedResources
   [junit4]   2> 1062168 INFO  (coreLoadExecutor-3762-thread-1-processing-n:127.0.0.1:50623_s_ze%2Ff) [n:127.0.0.1:50623_s_ze%2Ff c:control_collection s:shard1 r:core_node1 x:collection1] o.a.s.h.ReplicationHandler Commits will be reserved for  10000
   [junit4]   2> 1062169 INFO  (searcherExecutor-3763-thread-1-processing-n:127.0.0.1:50623_s_ze%2Ff x:collection1 s:shard1 c:control_collection r:core_node1) [n:127.0.0.1:50623_s_ze%2Ff c:control_collection s:shard1 r:core_node1 x:collection1] o.a.s.c.SolrCore [collection1] Registered new searcher Searcher@5baf49e2[collection1] main{ExitableDirectoryReader(UninvertingDirectoryReader())}
   [junit4]   2> 1062169 INFO  (coreLoadExecutor-3762-thread-1-processing-n:127.0.0.1:50623_s_ze%2Ff) [n:127.0.0.1:50623_s_ze%2Ff c:control_collection s:shard1 r:core_node1 x:collection1] o.a.s.u.UpdateLog Looking up max value of version field to seed version buckets
   [junit4]   2> 1062169 INFO  (coreLoadExecutor-3762-thread-1-processing-n:127.0.0.1:50623_s_ze%2Ff) [n:127.0.0.1:50623_s_ze%2Ff c:control_collection s:shard1 r:core_node1 x:collection1] o.a.s.u.VersionInfo Refreshing highest value of _version_ for 65536 version buckets from index
   [junit4]   2> 1062169 INFO  (coreLoadExecutor-3762-thread-1-processing-n:127.0.0.1:50623_s_ze%2Ff) [n:127.0.0.1:50623_s_ze%2Ff c:control_collection s:shard1 r:core_node1 x:collection1] o.a.s.u.VersionInfo No terms found for _version_, cannot seed version bucket highest value from index
   [junit4]   2> 1062169 INFO  (coreLoadExecutor-3762-thread-1-processing-n:127.0.0.1:50623_s_ze%2Ff) [n:127.0.0.1:50623_s_ze%2Ff c:control_collection s:shard1 r:core_node1 x:collection1] o.a.s.u.UpdateLog Could not find max version in index or recent updates, using new clock 1522568135379517440
   [junit4]   2> 1062171 INFO  (coreLoadExecutor-3762-thread-1-processing-n:127.0.0.1:50623_s_ze%2Ff) [n:127.0.0.1:50623_s_ze%2Ff c:control_collection s:shard1 r:core_node1 x:collection1] o.a.s.u.UpdateLog Took 2.0ms to seed version buckets with highest version 1522568135379517440
   [junit4]   2> 1062171 INFO  (coreLoadExecutor-3762-thread-1-processing-n:127.0.0.1:50623_s_ze%2Ff) [n:127.0.0.1:50623_s_ze%2Ff c:control_collection s:shard1 r:core_node1 x:collection1] o.a.s.c.ZkController watch zkdir /configs/conf1
   [junit4]   2> 1062172 INFO  (coreLoadExecutor-3762-thread-1-processing-n:127.0.0.1:50623_s_ze%2Ff) [n:127.0.0.1:50623_s_ze%2Ff c:control_collection s:shard1 r:core_node1 x:collection1] o.a.s.c.CoreContainer registering core: collection1
   [junit4]   2> 1062173 INFO  (coreZkRegister-3756-thread-1-processing-n:127.0.0.1:50623_s_ze%2Ff x:collection1 s:shard1 c:control_collection r:core_node1) [n:127.0.0.1:50623_s_ze%2Ff c:control_collection s:shard1 r:core_node1 x:collection1] o.a.s.c.ZkController Register replica - core:collection1 address:https://127.0.0.1:50623/s_ze/f collection:control_collection shard:shard1
   [junit4]   2> 1062175 INFO  (coreZkRegister-3756-thread-1-processing-n:127.0.0.1:50623_s_ze%2Ff x:collection1 s:shard1 c:control_collection r:core_node1) [n:127.0.0.1:50623_s_ze%2Ff c:control_collection s:shard1 r:core_node1 x:collection1] o.a.s.c.c.SolrZkClient makePath: /collections/control_collection/leader_elect/shard1/election
   [junit4]   2> 1062184 INFO  (coreZkRegister-3756-thread-1-processing-n:127.0.0.1:50623_s_ze%2Ff x:collection1 s:shard1 c:control_collection r:core_node1) [n:127.0.0.1:50623_s_ze%2Ff c:control_collection s:shard1 r:core_node1 x:collection1] o.a.s.c.LeaderElector Joined leadership election with path: /collections/control_collection/leader_elect/shard1/election/95160508329558023-core_node1-n_0000000000
   [junit4]   2> 1062186 INFO  (coreZkRegister-3756-thread-1-processing-n:127.0.0.1:50623_s_ze%2Ff x:collection1 s:shard1 c:control_collection r:core_node1) [n:127.0.0.1:50623_s_ze%2Ff c:control_collection s:shard1 r:core_node1 x:collection1] o.a.s.c.ShardLeaderElectionContext Running the leader process for shard=shard1 and weAreReplacement=false and leaderVoteWait=180000
   [junit4]   2> 1062192 INFO  (coreZkRegister-3756-thread-1-processing-n:127.0.0.1:50623_s_ze%2Ff x:collection1 s:shard1 c:control_collection r:core_node1) [n:127.0.0.1:50623_s_ze%2Ff c:control_collection s:shard1 r:core_node1 x:collection1] o.a.s.c.ShardLeaderElectionContext Enough replicas found to continue.
   [junit4]   2> 1062192 INFO  (coreZkRegister-3756-thread-1-processing-n:127.0.0.1:50623_s_ze%2Ff x:collection1 s:shard1 c:control_collection r:core_node1) [n:127.0.0.1:50623_s_ze%2Ff c:control_collection s:shard1 r:core_node1 x:collection1] o.a.s.c.ShardLeaderElectionContext I may be the new leader - try and sync
   [junit4]   2> 1062192 INFO  (coreZkRegister-3756-thread-1-processing-n:127.0.0.1:50623_s_ze%2Ff x:collection1 s:shard1 c:control_collection r:core_node1) [n:127.0.0.1:50623_s_ze%2Ff c:control_collection s:shard1 r:core_node1 x:collection1] o.a.s.c.SyncStrategy Sync replicas to https://127.0.0.1:50623/s_ze/f/collection1/
   [junit4]   2> 1062192 INFO  (coreZkRegister-3756-thread-1-processing-n:127.0.0.1:50623_s_ze%2Ff x:collection1 s:shard1 c:control_collection r:core_node1) [n:127.0.0.1:50623_s_ze%2Ff c:control_collection s:shard1 r:core_node1 x:collection1] o.a.s.c.SyncStrategy Sync Success - now sync replicas to me
   [junit4]   2> 1062192 INFO  (coreZkRegister-3756-thread-1-processing-n:127.0.0.1:50623_s_ze%2Ff x:collection1 s:shard1 c:control_collection r:core_node1) [n:127.0.0.1:50623_s_ze%2Ff c:control_collection s:shard1 r:core_node1 x:collection1] o.a.s.c.SyncStrategy https://127.0.0.1:50623/s_ze/f/collection1/ has no replicas
   [junit4]   2> 1062193 INFO  (OverseerStateUpdate-95160508329558023-127.0.0.1:50623_s_ze%2Ff-n_0000000000) [n:127.0.0.1:50623_s_ze%2Ff    ] o.a.s.c.Overseer processMessage: queueSize: 1, message = {
   [junit4]   2>   "operation":"leader",
   [junit4]   2>   "shard":"shard1",
   [junit4]   2>   "collection":"control_collection"} current state version: 1
   [junit4]   2> 1062194 INFO  (coreZkRegister-3756-thread-1-processing-n:127.0.0.1:50623_s_ze%2Ff x:collection1 s:shard1 c:control_collection r:core_node1) [n:127.0.0.1:50623_s_ze%2Ff c:control_collection s:shard1 r:core_node1 x:collection1] o.a.s.c.c.SolrZkClient makePath: /collections/control_collection/leaders/shard1
   [junit4]   2> 1062204 INFO  (coreZkRegister-3756-thread-1-processing-n:127.0.0.1:50623_s_ze%2Ff x:collection1 s:shard1 c:control_collection r:core_node1) [n:127.0.0.1:50623_s_ze%2Ff c:control_collection s:shard1 r:core_node1 x:collection1] o.a.s.c.ShardLeaderElectionContextBase Creating leader registration node
   [junit4]   2> 1062208 INFO  (coreZkRegister-3756-thread-1-processing-n:127.0.0.1:50623_s_ze%2Ff x:collection1 s:shard1 c:control_collection r:core_node1) [n:127.0.0.1:50623_s_ze%2Ff c:control_collection s:shard1 r:core_node1 x:collection1] o.a.s.c.ShardLeaderElectionContext I am the new leader: https://127.0.0.1:50623/s_ze/f/collection1/ shard1
   [junit4]   2> 1062211 INFO  (OverseerStateUpdate-95160508329558023-127.0.0.1:50623_s_ze%2Ff-n_0000000000) [n:127.0.0.1:50623_s_ze%2Ff    ] o.a.s.c.Overseer processMessage: queueSize: 1, message = {
   [junit4]   2>   "operation":"leader",
   [junit4]   2>   "shard":"shard1",
   [junit4]   2>   "collection":"control_collection",
   [junit4]   2>   "base_url":"https://127.0.0.1:50623/s_ze/f",
   [junit4]   2>   "core":"collection1",
   [junit4]   2>   "state":"active"} current state version: 1
   [junit4]   2> 1062320 INFO  (zkCallback-1151-thread-1-processing-n:127.0.0.1:50623_s_ze%2Ff) [n:127.0.0.1:50623_s_ze%2Ff    ] o.a.s.c.c.ZkStateReader A cluster state change: [WatchedEvent state:SyncConnected type:NodeDataChanged path:/clusterstate.json], has occurred - updating... (live nodes size: [1])
   [junit4]   2> 1062365 INFO  (coreZkRegister-3756-thread-1-processing-n:127.0.0.1:50623_s_ze%2Ff x:collection1 s:shard1 c:control_collection r:core_node1) [n:127.0.0.1:50623_s_ze%2Ff c:control_collection s:shard1 r:core_node1 x:collection1] o.a.s.c.ZkController We are https://127.0.0.1:50623/s_ze/f/collection1/ and leader is https://127.0.0.1:50623/s_ze/f/collection1/
   [junit4]   2> 1062366 INFO  (coreZkRegister-3756-thread-1-processing-n:127.0.0.1:50623_s_ze%2Ff x:collection1 s:shard1 c:control_collection r:core_node1) [n:127.0.0.1:50623_s_ze%2Ff c:control_collection s:shard1 r:core_node1 x:collection1] o.a.s.c.ZkController No LogReplay needed for core=collection1 baseURL=https://127.0.0.1:50623/s_ze/f
   [junit4]   2> 1062367 INFO  (coreZkRegister-3756-thread-1-processing-n:127.0.0.1:50623_s_ze%2Ff x:collection1 s:shard1 c:control_collection r:core_node1) [n:127.0.0.1:50623_s_ze%2Ff c:control_collection s:shard1 r:core_node1 x:collection1] o.a.s.c.ZkController I am the leader, no recovery necessary
   [junit4]   2> 1062367 INFO  (coreZkRegister-3756-thread-1-processing-n:127.0.0.1:50623_s_ze%2Ff x:collection1 s:shard1 c:control_collection r:core_node1) [n:127.0.0.1:50623_s_ze%2Ff c:control_collection s:shard1 r:core_node1 x:collection1] o.a.s.c.ZkController publishing state=active
   [junit4]   2> 1062367 INFO  (coreZkRegister-3756-thread-1-processing-n:127.0.0.1:50623_s_ze%2Ff x:collection1 s:shard1 c:control_collection r:core_node1) [n:127.0.0.1:50623_s_ze%2Ff c:control_collection s:shard1 r:core_node1 x:collection1] o.a.s.c.ZkController numShards not found on descriptor - reading it from system property
   [junit4]   2> 1062371 INFO  (OverseerStateUpdate-95160508329558023-127.0.0.1:50623_s_ze%2Ff-n_0000000000) [n:127.0.0.1:50623_s_ze%2Ff    ] o.a.s.c.Overseer processMessage: queueSize: 1, message = {
   [junit4]   2>   "core":"collection1",
   [junit4]   2>   "core_node_name":"core_node1",
   [junit4]   2>   "roles":null,
   [junit4]   2>   "base_url":"https://127.0.0.1:50623/s_ze/f",
   [junit4]   2>   "node_name":"127.0.0.1:50623_s_ze%2Ff",
   [junit4]   2>   "numShards":"1",
   [junit4]   2>   "state":"active",
   [junit4]   2>   "shard":"shard1",
   [junit4]   2>   "collection":"control_collection",
   [junit4]   2>   "operation":"state"} current state version: 2
   [junit4]   2> 1062372 INFO  (OverseerStateUpdate-95160508329558023-127.0.0.1:50623_s_ze%2Ff-n_0000000000) [n:127.0.0.1:50623_s_ze%2Ff    ] o.a.s.c.o.ReplicaMutator Update state numShards=1 message={
   [junit4]   2>   "core":"collection1",
   [junit4]   2>   "core_node_name":"core_node1",
   [junit4]   2>   "roles":null,
   [junit4]   2>   "base_url":"https://127.0.0.1:50623/s_ze/f",
   [junit4]   2>   "node_name":"127.0.0.1:50623_s_ze%2Ff",
   [junit4]   2>   "numShar

[...truncated too long message...]

junit4]    >         at java.util.concurrent.SynchronousQueue$TransferStack.transfer(SynchronousQueue.java:362)
   [junit4]    >         at java.util.concurrent.SynchronousQueue.poll(SynchronousQueue.java:941)
   [junit4]    >         at java.util.concurrent.ThreadPoolExecutor.getTask(ThreadPoolExecutor.java:1066)
   [junit4]    >         at java.util.concurrent.ThreadPoolExecutor.runWorker(ThreadPoolExecutor.java:1127)
   [junit4]    >         at java.util.concurrent.ThreadPoolExecutor$Worker.run(ThreadPoolExecutor.java:617)
   [junit4]    >         at java.lang.Thread.run(Thread.java:745)
   [junit4]    >    3) Thread[id=7546, name=TEST-CollectionsAPIDistributedZkTest.test-seed#[F21576DF506C287]-SendThread(127.0.0.1:50611), state=TIMED_WAITING, group=TGRP-CollectionsAPIDistributedZkTest]
   [junit4]    >         at java.lang.Thread.sleep(Native Method)
   [junit4]    >         at org.apache.zookeeper.client.StaticHostProvider.next(StaticHostProvider.java:101)
   [junit4]    >         at org.apache.zookeeper.ClientCnxn$SendThread.startConnect(ClientCnxn.java:940)
   [junit4]    >         at org.apache.zookeeper.ClientCnxn$SendThread.run(ClientCnxn.java:1003)
   [junit4]    >    4) Thread[id=7548, name=zkCallback-1181-thread-1, state=TIMED_WAITING, group=TGRP-CollectionsAPIDistributedZkTest]
   [junit4]    >         at sun.misc.Unsafe.park(Native Method)
   [junit4]    >         at java.util.concurrent.locks.LockSupport.parkNanos(LockSupport.java:215)
   [junit4]    >         at java.util.concurrent.SynchronousQueue$TransferStack.awaitFulfill(SynchronousQueue.java:460)
   [junit4]    >         at java.util.concurrent.SynchronousQueue$TransferStack.transfer(SynchronousQueue.java:362)
   [junit4]    >         at java.util.concurrent.SynchronousQueue.poll(SynchronousQueue.java:941)
   [junit4]    >         at java.util.concurrent.ThreadPoolExecutor.getTask(ThreadPoolExecutor.java:1066)
   [junit4]    >         at java.util.concurrent.ThreadPoolExecutor.runWorker(ThreadPoolExecutor.java:1127)
   [junit4]    >         at java.util.concurrent.ThreadPoolExecutor$Worker.run(ThreadPoolExecutor.java:617)
   [junit4]    >         at java.lang.Thread.run(Thread.java:745)
   [junit4]    >    5) Thread[id=8551, name=zkCallback-1181-thread-3, state=TIMED_WAITING, group=TGRP-CollectionsAPIDistributedZkTest]
   [junit4]    >         at sun.misc.Unsafe.park(Native Method)
   [junit4]    >         at java.util.concurrent.locks.LockSupport.parkNanos(LockSupport.java:215)
   [junit4]    >         at java.util.concurrent.SynchronousQueue$TransferStack.awaitFulfill(SynchronousQueue.java:460)
   [junit4]    >         at java.util.concurrent.SynchronousQueue$TransferStack.transfer(SynchronousQueue.java:362)
   [junit4]    >         at java.util.concurrent.SynchronousQueue.poll(SynchronousQueue.java:941)
   [junit4]    >         at java.util.concurrent.ThreadPoolExecutor.getTask(ThreadPoolExecutor.java:1066)
   [junit4]    >         at java.util.concurrent.ThreadPoolExecutor.runWorker(ThreadPoolExecutor.java:1127)
   [junit4]    >         at java.util.concurrent.ThreadPoolExecutor$Worker.run(ThreadPoolExecutor.java:617)
   [junit4]    >         at java.lang.Thread.run(Thread.java:745)
   [junit4]    >    6) Thread[id=7547, name=TEST-CollectionsAPIDistributedZkTest.test-seed#[F21576DF506C287]-EventThread, state=WAITING, group=TGRP-CollectionsAPIDistributedZkTest]
   [junit4]    >         at sun.misc.Unsafe.park(Native Method)
   [junit4]    >         at java.util.concurrent.locks.LockSupport.park(LockSupport.java:175)
   [junit4]    >         at java.util.concurrent.locks.AbstractQueuedSynchronizer$ConditionObject.await(AbstractQueuedSynchronizer.java:2039)
   [junit4]    >         at java.util.concurrent.LinkedBlockingQueue.take(LinkedBlockingQueue.java:442)
   [junit4]    >         at org.apache.zookeeper.ClientCnxn$EventThread.run(ClientCnxn.java:494)
   [junit4]    > 	at __randomizedtesting.SeedInfo.seed([F21576DF506C287]:0)Throwable #2: com.carrotsearch.randomizedtesting.ThreadLeakError: There are still zombie threads that couldn't be terminated:
   [junit4]    >    1) Thread[id=8550, name=zkCallback-1181-thread-2, state=TIMED_WAITING, group=TGRP-CollectionsAPIDistributedZkTest]
   [junit4]    >         at sun.misc.Unsafe.park(Native Method)
   [junit4]    >         at java.util.concurrent.locks.LockSupport.parkNanos(LockSupport.java:215)
   [junit4]    >         at java.util.concurrent.SynchronousQueue$TransferStack.awaitFulfill(SynchronousQueue.java:460)
   [junit4]    >         at java.util.concurrent.SynchronousQueue$TransferStack.transfer(SynchronousQueue.java:362)
   [junit4]    >         at java.util.concurrent.SynchronousQueue.poll(SynchronousQueue.java:941)
   [junit4]    >         at java.util.concurrent.ThreadPoolExecutor.getTask(ThreadPoolExecutor.java:1066)
   [junit4]    >         at java.util.concurrent.ThreadPoolExecutor.runWorker(ThreadPoolExecutor.java:1127)
   [junit4]    >         at java.util.concurrent.ThreadPoolExecutor$Worker.run(ThreadPoolExecutor.java:617)
   [junit4]    >         at java.lang.Thread.run(Thread.java:745)
   [junit4]    >    2) Thread[id=8552, name=zkCallback-1181-thread-4, state=TIMED_WAITING, group=TGRP-CollectionsAPIDistributedZkTest]
   [junit4]    >         at sun.misc.Unsafe.park(Native Method)
   [junit4]    >         at java.util.concurrent.locks.LockSupport.parkNanos(LockSupport.java:215)
   [junit4]    >         at java.util.concurrent.SynchronousQueue$TransferStack.awaitFulfill(SynchronousQueue.java:460)
   [junit4]    >         at java.util.concurrent.SynchronousQueue$TransferStack.transfer(SynchronousQueue.java:362)
   [junit4]    >         at java.util.concurrent.SynchronousQueue.poll(SynchronousQueue.java:941)
   [junit4]    >         at java.util.concurrent.ThreadPoolExecutor.getTask(ThreadPoolExecutor.java:1066)
   [junit4]    >         at java.util.concurrent.ThreadPoolExecutor.runWorker(ThreadPoolExecutor.java:1127)
   [junit4]    >         at java.util.concurrent.ThreadPoolExecutor$Worker.run(ThreadPoolExecutor.java:617)
   [junit4]    >         at java.lang.Thread.run(Thread.java:745)
   [junit4]    >    3) Thread[id=7546, name=TEST-CollectionsAPIDistributedZkTest.test-seed#[F21576DF506C287]-SendThread(127.0.0.1:50611), state=TIMED_WAITING, group=TGRP-CollectionsAPIDistributedZkTest]
   [junit4]    >         at java.lang.Thread.sleep(Native Method)
   [junit4]    >         at org.apache.zookeeper.ClientCnxn$SendThread.run(ClientCnxn.java:994)
   [junit4]    >    4) Thread[id=7548, name=zkCallback-1181-thread-1, state=TIMED_WAITING, group=TGRP-CollectionsAPIDistributedZkTest]
   [junit4]    >         at sun.misc.Unsafe.park(Native Method)
   [junit4]    >         at java.util.concurrent.locks.LockSupport.parkNanos(LockSupport.java:215)
   [junit4]    >         at java.util.concurrent.SynchronousQueue$TransferStack.awaitFulfill(SynchronousQueue.java:460)
   [junit4]    >         at java.util.concurrent.SynchronousQueue$TransferStack.transfer(SynchronousQueue.java:362)
   [junit4]    >         at java.util.concurrent.SynchronousQueue.poll(SynchronousQueue.java:941)
   [junit4]    >         at java.util.concurrent.ThreadPoolExecutor.getTask(ThreadPoolExecutor.java:1066)
   [junit4]    >         at java.util.concurrent.ThreadPoolExecutor.runWorker(ThreadPoolExecutor.java:1127)
   [junit4]    >         at java.util.concurrent.ThreadPoolExecutor$Worker.run(ThreadPoolExecutor.java:617)
   [junit4]    >         at java.lang.Thread.run(Thread.java:745)
   [junit4]    >    5) Thread[id=8551, name=zkCallback-1181-thread-3, state=TIMED_WAITING, group=TGRP-CollectionsAPIDistributedZkTest]
   [junit4]    >         at sun.misc.Unsafe.park(Native Method)
   [junit4]    >         at java.util.concurrent.locks.LockSupport.parkNanos(LockSupport.java:215)
   [junit4]    >         at java.util.concurrent.SynchronousQueue$TransferStack.awaitFulfill(SynchronousQueue.java:460)
   [junit4]    >         at java.util.concurrent.SynchronousQueue$TransferStack.transfer(SynchronousQueue.java:362)
   [junit4]    >         at java.util.concurrent.SynchronousQueue.poll(SynchronousQueue.java:941)
   [junit4]    >         at java.util.concurrent.ThreadPoolExecutor.getTask(ThreadPoolExecutor.java:1066)
   [junit4]    >         at java.util.concurrent.ThreadPoolExecutor.runWorker(ThreadPoolExecutor.java:1127)
   [junit4]    >         at java.util.concurrent.ThreadPoolExecutor$Worker.run(ThreadPoolExecutor.java:617)
   [junit4]    >         at java.lang.Thread.run(Thread.java:745)
   [junit4]    > 	at __randomizedtesting.SeedInfo.seed([F21576DF506C287]:0)
   [junit4] Completed [258/573 (1!)] on J1 in 80.15s, 1 test, 3 errors <<< FAILURES!

[...truncated 1029 lines...]
BUILD FAILED
/Users/jenkins/workspace/Lucene-Solr-trunk-MacOSX/build.xml:784: The following error occurred while executing this line:
/Users/jenkins/workspace/Lucene-Solr-trunk-MacOSX/build.xml:728: The following error occurred while executing this line:
/Users/jenkins/workspace/Lucene-Solr-trunk-MacOSX/build.xml:59: The following error occurred while executing this line:
/Users/jenkins/workspace/Lucene-Solr-trunk-MacOSX/solr/build.xml:233: The following error occurred while executing this line:
/Users/jenkins/workspace/Lucene-Solr-trunk-MacOSX/solr/common-build.xml:516: The following error occurred while executing this line:
/Users/jenkins/workspace/Lucene-Solr-trunk-MacOSX/lucene/common-build.xml:1424: The following error occurred while executing this line:
/Users/jenkins/workspace/Lucene-Solr-trunk-MacOSX/lucene/common-build.xml:981: There were test failures: 573 suites (8 ignored), 2284 tests, 2 suite-level errors, 1 error, 1240 ignored (62 assumptions) [seed: F21576DF506C287]

Total time: 40 minutes 41 seconds
Build step 'Invoke Ant' marked build as failure
Archiving artifacts
[WARNINGS] Skipping publisher since build result is FAILURE
Recording test results
Email was triggered for: Failure - Any
Sending email for trigger: Failure - Any



Mime
View raw message