lucene-dev mailing list archives

Site index · List index
Message view « Date » · « Thread »
Top « Date » · « Thread »
From Apache Jenkins Server <jenk...@builds.apache.org>
Subject [JENKINS] Lucene-Solr-Tests-5.x-Java7 - Build # 3922 - Still Failing
Date Sun, 17 Jan 2016 09:02:14 GMT
Build: https://builds.apache.org/job/Lucene-Solr-Tests-5.x-Java7/3922/

1 tests failed.
FAILED:  org.apache.solr.handler.TestReplicationHandlerBackup.doTestBackup

Error Message:
Failed to create backup

Stack Trace:
java.lang.AssertionError: Failed to create backup
	at __randomizedtesting.SeedInfo.seed([DFB6C4D531D8ABD0:9E3DE4B01666589F]:0)
	at org.junit.Assert.fail(Assert.java:93)
	at org.apache.solr.handler.CheckBackupStatus.fetchStatus(CheckBackupStatus.java:51)
	at org.apache.solr.handler.TestReplicationHandlerBackup.doTestBackup(TestReplicationHandlerBackup.java:197)
	at sun.reflect.NativeMethodAccessorImpl.invoke0(Native Method)
	at sun.reflect.NativeMethodAccessorImpl.invoke(NativeMethodAccessorImpl.java:57)
	at sun.reflect.DelegatingMethodAccessorImpl.invoke(DelegatingMethodAccessorImpl.java:43)
	at java.lang.reflect.Method.invoke(Method.java:606)
	at com.carrotsearch.randomizedtesting.RandomizedRunner.invoke(RandomizedRunner.java:1764)
	at com.carrotsearch.randomizedtesting.RandomizedRunner$8.evaluate(RandomizedRunner.java:871)
	at com.carrotsearch.randomizedtesting.RandomizedRunner$9.evaluate(RandomizedRunner.java:907)
	at com.carrotsearch.randomizedtesting.RandomizedRunner$10.evaluate(RandomizedRunner.java:921)
	at com.carrotsearch.randomizedtesting.rules.SystemPropertiesRestoreRule$1.evaluate(SystemPropertiesRestoreRule.java:57)
	at org.apache.lucene.util.TestRuleSetupTeardownChained$1.evaluate(TestRuleSetupTeardownChained.java:50)
	at org.apache.lucene.util.AbstractBeforeAfterRule$1.evaluate(AbstractBeforeAfterRule.java:46)
	at org.apache.lucene.util.TestRuleThreadAndTestName$1.evaluate(TestRuleThreadAndTestName.java:49)
	at org.apache.lucene.util.TestRuleIgnoreAfterMaxFailures$1.evaluate(TestRuleIgnoreAfterMaxFailures.java:65)
	at org.apache.lucene.util.TestRuleMarkFailure$1.evaluate(TestRuleMarkFailure.java:48)
	at com.carrotsearch.randomizedtesting.rules.StatementAdapter.evaluate(StatementAdapter.java:36)
	at com.carrotsearch.randomizedtesting.ThreadLeakControl$StatementRunner.run(ThreadLeakControl.java:367)
	at com.carrotsearch.randomizedtesting.ThreadLeakControl.forkTimeoutingTask(ThreadLeakControl.java:809)
	at com.carrotsearch.randomizedtesting.ThreadLeakControl$3.evaluate(ThreadLeakControl.java:460)
	at com.carrotsearch.randomizedtesting.RandomizedRunner.runSingleTest(RandomizedRunner.java:880)
	at com.carrotsearch.randomizedtesting.RandomizedRunner$5.evaluate(RandomizedRunner.java:781)
	at com.carrotsearch.randomizedtesting.RandomizedRunner$6.evaluate(RandomizedRunner.java:816)
	at com.carrotsearch.randomizedtesting.RandomizedRunner$7.evaluate(RandomizedRunner.java:827)
	at com.carrotsearch.randomizedtesting.rules.StatementAdapter.evaluate(StatementAdapter.java:36)
	at com.carrotsearch.randomizedtesting.rules.SystemPropertiesRestoreRule$1.evaluate(SystemPropertiesRestoreRule.java:57)
	at org.apache.lucene.util.AbstractBeforeAfterRule$1.evaluate(AbstractBeforeAfterRule.java:46)
	at com.carrotsearch.randomizedtesting.rules.StatementAdapter.evaluate(StatementAdapter.java:36)
	at org.apache.lucene.util.TestRuleStoreClassName$1.evaluate(TestRuleStoreClassName.java:42)
	at com.carrotsearch.randomizedtesting.rules.NoShadowingOrOverridesOnMethodsRule$1.evaluate(NoShadowingOrOverridesOnMethodsRule.java:40)
	at com.carrotsearch.randomizedtesting.rules.NoShadowingOrOverridesOnMethodsRule$1.evaluate(NoShadowingOrOverridesOnMethodsRule.java:40)
	at com.carrotsearch.randomizedtesting.rules.StatementAdapter.evaluate(StatementAdapter.java:36)
	at com.carrotsearch.randomizedtesting.rules.StatementAdapter.evaluate(StatementAdapter.java:36)
	at com.carrotsearch.randomizedtesting.rules.StatementAdapter.evaluate(StatementAdapter.java:36)
	at org.apache.lucene.util.TestRuleAssertionsRequired$1.evaluate(TestRuleAssertionsRequired.java:54)
	at org.apache.lucene.util.TestRuleMarkFailure$1.evaluate(TestRuleMarkFailure.java:48)
	at org.apache.lucene.util.TestRuleIgnoreAfterMaxFailures$1.evaluate(TestRuleIgnoreAfterMaxFailures.java:65)
	at org.apache.lucene.util.TestRuleIgnoreTestSuites$1.evaluate(TestRuleIgnoreTestSuites.java:55)
	at com.carrotsearch.randomizedtesting.rules.StatementAdapter.evaluate(StatementAdapter.java:36)
	at com.carrotsearch.randomizedtesting.ThreadLeakControl$StatementRunner.run(ThreadLeakControl.java:367)
	at java.lang.Thread.run(Thread.java:745)




Build Log:
[...truncated 10055 lines...]
   [junit4] Suite: org.apache.solr.handler.TestReplicationHandlerBackup
   [junit4]   2> Creating dataDir: /x1/jenkins/jenkins-slave/workspace/Lucene-Solr-Tests-5.x-Java7/solr/build/solr-core/test/J1/temp/solr.handler.TestReplicationHandlerBackup_DFB6C4D531D8ABD0-001/init-core-data-001
   [junit4]   2> 751312 INFO  (TEST-TestReplicationHandlerBackup.doTestBackup-seed#[DFB6C4D531D8ABD0]) [    ] o.a.s.SolrTestCaseJ4 ###Starting doTestBackup
   [junit4]   2> 751313 INFO  (TEST-TestReplicationHandlerBackup.doTestBackup-seed#[DFB6C4D531D8ABD0]) [    ] o.a.s.SolrTestCaseJ4 Writing core.properties file to /x1/jenkins/jenkins-slave/workspace/Lucene-Solr-Tests-5.x-Java7/solr/build/solr-core/test/J1/temp/solr.handler.TestReplicationHandlerBackup_DFB6C4D531D8ABD0-001/solr-instance-001/collection1
   [junit4]   2> 751324 INFO  (TEST-TestReplicationHandlerBackup.doTestBackup-seed#[DFB6C4D531D8ABD0]) [    ] o.e.j.s.Server jetty-9.2.13.v20150730
   [junit4]   2> 751326 INFO  (TEST-TestReplicationHandlerBackup.doTestBackup-seed#[DFB6C4D531D8ABD0]) [    ] o.e.j.s.h.ContextHandler Started o.e.j.s.ServletContextHandler@25166f5e{/solr,null,AVAILABLE}
   [junit4]   2> 751328 INFO  (TEST-TestReplicationHandlerBackup.doTestBackup-seed#[DFB6C4D531D8ABD0]) [    ] o.e.j.s.ServerConnector Started ServerConnector@63e99757{HTTP/1.1}{127.0.0.1:36526}
   [junit4]   2> 751328 INFO  (TEST-TestReplicationHandlerBackup.doTestBackup-seed#[DFB6C4D531D8ABD0]) [    ] o.e.j.s.Server Started @754263ms
   [junit4]   2> 751328 INFO  (TEST-TestReplicationHandlerBackup.doTestBackup-seed#[DFB6C4D531D8ABD0]) [    ] o.a.s.c.s.e.JettySolrRunner Jetty properties: {hostPort=36526, hostContext=/solr, solr.data.dir=/x1/jenkins/jenkins-slave/workspace/Lucene-Solr-Tests-5.x-Java7/solr/build/solr-core/test/J1/temp/solr.handler.TestReplicationHandlerBackup_DFB6C4D531D8ABD0-001/solr-instance-001/collection1/data}
   [junit4]   2> 751329 INFO  (TEST-TestReplicationHandlerBackup.doTestBackup-seed#[DFB6C4D531D8ABD0]) [    ] o.a.s.s.SolrDispatchFilter SolrDispatchFilter.init(): sun.misc.Launcher$AppClassLoader@4f6de641
   [junit4]   2> 751329 INFO  (TEST-TestReplicationHandlerBackup.doTestBackup-seed#[DFB6C4D531D8ABD0]) [    ] o.a.s.c.SolrResourceLoader new SolrResourceLoader for directory: '/x1/jenkins/jenkins-slave/workspace/Lucene-Solr-Tests-5.x-Java7/solr/build/solr-core/test/J1/temp/solr.handler.TestReplicationHandlerBackup_DFB6C4D531D8ABD0-001/solr-instance-001'
   [junit4]   2> 751329 INFO  (TEST-TestReplicationHandlerBackup.doTestBackup-seed#[DFB6C4D531D8ABD0]) [    ] o.a.s.c.SolrResourceLoader JNDI not configured for solr (NoInitialContextEx)
   [junit4]   2> 751329 INFO  (TEST-TestReplicationHandlerBackup.doTestBackup-seed#[DFB6C4D531D8ABD0]) [    ] o.a.s.c.SolrResourceLoader solr home defaulted to 'solr/' (could not find system property or JNDI)
   [junit4]   2> 751329 INFO  (TEST-TestReplicationHandlerBackup.doTestBackup-seed#[DFB6C4D531D8ABD0]) [    ] o.a.s.c.SolrXmlConfig Loading container configuration from /x1/jenkins/jenkins-slave/workspace/Lucene-Solr-Tests-5.x-Java7/solr/build/solr-core/test/J1/temp/solr.handler.TestReplicationHandlerBackup_DFB6C4D531D8ABD0-001/solr-instance-001/solr.xml
   [junit4]   2> 751345 INFO  (TEST-TestReplicationHandlerBackup.doTestBackup-seed#[DFB6C4D531D8ABD0]) [    ] o.a.s.c.CorePropertiesLocator Config-defined core root directory: /x1/jenkins/jenkins-slave/workspace/Lucene-Solr-Tests-5.x-Java7/solr/build/solr-core/test/J1/temp/solr.handler.TestReplicationHandlerBackup_DFB6C4D531D8ABD0-001/solr-instance-001/.
   [junit4]   2> 751345 INFO  (TEST-TestReplicationHandlerBackup.doTestBackup-seed#[DFB6C4D531D8ABD0]) [    ] o.a.s.c.CoreContainer New CoreContainer 1089521297
   [junit4]   2> 751345 INFO  (TEST-TestReplicationHandlerBackup.doTestBackup-seed#[DFB6C4D531D8ABD0]) [    ] o.a.s.c.CoreContainer Loading cores into CoreContainer [instanceDir=/x1/jenkins/jenkins-slave/workspace/Lucene-Solr-Tests-5.x-Java7/solr/build/solr-core/test/J1/temp/solr.handler.TestReplicationHandlerBackup_DFB6C4D531D8ABD0-001/solr-instance-001]
   [junit4]   2> 751346 WARN  (TEST-TestReplicationHandlerBackup.doTestBackup-seed#[DFB6C4D531D8ABD0]) [    ] o.a.s.c.CoreContainer Couldn't add files from /x1/jenkins/jenkins-slave/workspace/Lucene-Solr-Tests-5.x-Java7/solr/build/solr-core/test/J1/temp/solr.handler.TestReplicationHandlerBackup_DFB6C4D531D8ABD0-001/solr-instance-001/lib to classpath: /x1/jenkins/jenkins-slave/workspace/Lucene-Solr-Tests-5.x-Java7/solr/build/solr-core/test/J1/temp/solr.handler.TestReplicationHandlerBackup_DFB6C4D531D8ABD0-001/solr-instance-001/lib
   [junit4]   2> 751346 INFO  (TEST-TestReplicationHandlerBackup.doTestBackup-seed#[DFB6C4D531D8ABD0]) [    ] o.a.s.h.c.HttpShardHandlerFactory created with socketTimeout : 90000,urlScheme : ,connTimeout : 15000,maxConnectionsPerHost : 20,maxConnections : 10000,corePoolSize : 0,maximumPoolSize : 2147483647,maxThreadIdleTime : 5,sizeOfQueue : -1,fairnessPolicy : false,useRetries : false,
   [junit4]   2> 751347 INFO  (TEST-TestReplicationHandlerBackup.doTestBackup-seed#[DFB6C4D531D8ABD0]) [    ] o.a.s.u.UpdateShardHandler Creating UpdateShardHandler HTTP client with params: socketTimeout=340000&connTimeout=45000&retry=true
   [junit4]   2> 751348 INFO  (TEST-TestReplicationHandlerBackup.doTestBackup-seed#[DFB6C4D531D8ABD0]) [    ] o.a.s.l.LogWatcher SLF4J impl is org.slf4j.impl.Log4jLoggerFactory
   [junit4]   2> 751348 INFO  (TEST-TestReplicationHandlerBackup.doTestBackup-seed#[DFB6C4D531D8ABD0]) [    ] o.a.s.l.LogWatcher Registering Log Listener [Log4j (org.slf4j.impl.Log4jLoggerFactory)]
   [junit4]   2> 751348 INFO  (TEST-TestReplicationHandlerBackup.doTestBackup-seed#[DFB6C4D531D8ABD0]) [    ] o.a.s.c.CoreContainer Security conf doesn't exist. Skipping setup for authorization module.
   [junit4]   2> 751348 INFO  (TEST-TestReplicationHandlerBackup.doTestBackup-seed#[DFB6C4D531D8ABD0]) [    ] o.a.s.c.CoreContainer No authentication plugin used.
   [junit4]   2> 751349 INFO  (TEST-TestReplicationHandlerBackup.doTestBackup-seed#[DFB6C4D531D8ABD0]) [    ] o.a.s.c.CorePropertiesLocator Looking for core definitions underneath /x1/jenkins/jenkins-slave/workspace/Lucene-Solr-Tests-5.x-Java7/solr/build/solr-core/test/J1/temp/solr.handler.TestReplicationHandlerBackup_DFB6C4D531D8ABD0-001/solr-instance-001/.
   [junit4]   2> 751350 INFO  (TEST-TestReplicationHandlerBackup.doTestBackup-seed#[DFB6C4D531D8ABD0]) [    ] o.a.s.c.CoreDescriptor Created CoreDescriptor: {configSetProperties=configsetprops.json, loadOnStartup=true, schema=schema.xml, name=collection1, dataDir=data/, transient=false, config=solrconfig.xml}
   [junit4]   2> 751350 INFO  (TEST-TestReplicationHandlerBackup.doTestBackup-seed#[DFB6C4D531D8ABD0]) [    ] o.a.s.c.CorePropertiesLocator Found core collection1 in /x1/jenkins/jenkins-slave/workspace/Lucene-Solr-Tests-5.x-Java7/solr/build/solr-core/test/J1/temp/solr.handler.TestReplicationHandlerBackup_DFB6C4D531D8ABD0-001/solr-instance-001/./collection1
   [junit4]   2> 751350 INFO  (TEST-TestReplicationHandlerBackup.doTestBackup-seed#[DFB6C4D531D8ABD0]) [    ] o.a.s.c.CorePropertiesLocator Found 1 core definitions
   [junit4]   2> 751351 INFO  (coreLoadExecutor-824-thread-1) [    ] o.a.s.c.SolrResourceLoader new SolrResourceLoader for directory: '/x1/jenkins/jenkins-slave/workspace/Lucene-Solr-Tests-5.x-Java7/solr/build/solr-core/test/J1/temp/solr.handler.TestReplicationHandlerBackup_DFB6C4D531D8ABD0-001/solr-instance-001/collection1'
   [junit4]   2> 751351 INFO  (TEST-TestReplicationHandlerBackup.doTestBackup-seed#[DFB6C4D531D8ABD0]) [    ] o.a.s.s.SolrDispatchFilter user.dir=/x1/jenkins/jenkins-slave/workspace/Lucene-Solr-Tests-5.x-Java7/solr/build/solr-core/test/J1
   [junit4]   2> 751357 INFO  (TEST-TestReplicationHandlerBackup.doTestBackup-seed#[DFB6C4D531D8ABD0]) [    ] o.a.s.s.SolrDispatchFilter SolrDispatchFilter.init() done
   [junit4]   2> 751358 INFO  (coreLoadExecutor-824-thread-1) [    ] o.a.s.c.SolrResourceLoader JNDI not configured for solr (NoInitialContextEx)
   [junit4]   2> 751358 INFO  (coreLoadExecutor-824-thread-1) [    ] o.a.s.c.SolrResourceLoader solr home defaulted to 'solr/' (could not find system property or JNDI)
   [junit4]   2> 751370 INFO  (coreLoadExecutor-824-thread-1) [    ] o.a.s.c.SolrConfig current version of requestparams : -1
   [junit4]   2> 751388 INFO  (coreLoadExecutor-824-thread-1) [    ] o.a.s.c.SolrConfig Using Lucene MatchVersion: 5.5.0
   [junit4]   2> 751437 INFO  (coreLoadExecutor-824-thread-1) [    ] o.a.s.c.SolrConfig Loaded SolrConfig: solrconfig.xml
   [junit4]   2> 751444 INFO  (coreLoadExecutor-824-thread-1) [    ] o.a.s.s.IndexSchema [collection1] Schema name=test
   [junit4]   2> 751457 INFO  (coreLoadExecutor-824-thread-1) [    ] o.a.s.s.IndexSchema unique key field: id
   [junit4]   2> 751460 INFO  (coreLoadExecutor-824-thread-1) [    ] o.a.s.c.ConfigSetProperties Did not find ConfigSet properties, assuming default properties: Can't find resource 'configsetprops.json' in classpath or '/x1/jenkins/jenkins-slave/workspace/Lucene-Solr-Tests-5.x-Java7/solr/build/solr-core/test/J1/temp/solr.handler.TestReplicationHandlerBackup_DFB6C4D531D8ABD0-001/solr-instance-001/collection1'
   [junit4]   2> 751460 INFO  (coreLoadExecutor-824-thread-1) [    ] o.a.s.c.CoreContainer Creating SolrCore 'collection1' using configuration from instancedir /x1/jenkins/jenkins-slave/workspace/Lucene-Solr-Tests-5.x-Java7/solr/build/solr-core/test/J1/temp/solr.handler.TestReplicationHandlerBackup_DFB6C4D531D8ABD0-001/solr-instance-001/./collection1
   [junit4]   2> 751460 INFO  (coreLoadExecutor-824-thread-1) [    x:collection1] o.a.s.c.SolrCore org.apache.solr.core.MockDirectoryFactory
   [junit4]   2> 751460 INFO  (coreLoadExecutor-824-thread-1) [    x:collection1] o.a.s.c.SolrCore [[collection1] ] Opening new SolrCore at [/x1/jenkins/jenkins-slave/workspace/Lucene-Solr-Tests-5.x-Java7/solr/build/solr-core/test/J1/temp/solr.handler.TestReplicationHandlerBackup_DFB6C4D531D8ABD0-001/solr-instance-001/collection1], dataDir=[/x1/jenkins/jenkins-slave/workspace/Lucene-Solr-Tests-5.x-Java7/solr/build/solr-core/test/J1/temp/solr.handler.TestReplicationHandlerBackup_DFB6C4D531D8ABD0-001/solr-instance-001/./collection1/data/]
   [junit4]   2> 751461 INFO  (coreLoadExecutor-824-thread-1) [    x:collection1] o.a.s.c.SolrCore JMX monitoring not detected for core: collection1
   [junit4]   2> 751461 INFO  (coreLoadExecutor-824-thread-1) [    x:collection1] o.a.s.c.CachingDirectoryFactory return new directory for /x1/jenkins/jenkins-slave/workspace/Lucene-Solr-Tests-5.x-Java7/solr/build/solr-core/test/J1/temp/solr.handler.TestReplicationHandlerBackup_DFB6C4D531D8ABD0-001/solr-instance-001/./collection1/data
   [junit4]   2> 751461 INFO  (coreLoadExecutor-824-thread-1) [    x:collection1] o.a.s.c.SolrCore New index directory detected: old=null new=/x1/jenkins/jenkins-slave/workspace/Lucene-Solr-Tests-5.x-Java7/solr/build/solr-core/test/J1/temp/solr.handler.TestReplicationHandlerBackup_DFB6C4D531D8ABD0-001/solr-instance-001/./collection1/data/index/
   [junit4]   2> 751461 WARN  (coreLoadExecutor-824-thread-1) [    x:collection1] o.a.s.c.SolrCore [collection1] Solr index directory '/x1/jenkins/jenkins-slave/workspace/Lucene-Solr-Tests-5.x-Java7/solr/build/solr-core/test/J1/temp/solr.handler.TestReplicationHandlerBackup_DFB6C4D531D8ABD0-001/solr-instance-001/./collection1/data/index' doesn't exist. Creating new index...
   [junit4]   2> 751462 INFO  (coreLoadExecutor-824-thread-1) [    x:collection1] o.a.s.c.CachingDirectoryFactory return new directory for /x1/jenkins/jenkins-slave/workspace/Lucene-Solr-Tests-5.x-Java7/solr/build/solr-core/test/J1/temp/solr.handler.TestReplicationHandlerBackup_DFB6C4D531D8ABD0-001/solr-instance-001/./collection1/data/index
   [junit4]   2> 751462 INFO  (coreLoadExecutor-824-thread-1) [    x:collection1] o.a.s.u.RandomMergePolicy RandomMergePolicy wrapping class org.apache.lucene.index.LogDocMergePolicy: [LogDocMergePolicy: minMergeSize=1000, mergeFactor=31, maxMergeSize=9223372036854775807, maxMergeSizeForForcedMerge=9223372036854775807, calibrateSizeByDeletes=false, maxMergeDocs=2147483647, maxCFSSegmentSizeMB=8.796093022207999E12, noCFSRatio=0.849768397745467]
   [junit4]   2> 751463 INFO  (coreLoadExecutor-824-thread-1) [    x:collection1] o.a.s.c.SolrDeletionPolicy SolrDeletionPolicy.onCommit: commits: num=1
   [junit4]   2> 	commit{dir=MockDirectoryWrapper(RAMDirectory@73ff4e6 lockFactory=org.apache.lucene.store.SingleInstanceLockFactory@77e72bc1),segFN=segments_1,generation=1}
   [junit4]   2> 751463 INFO  (coreLoadExecutor-824-thread-1) [    x:collection1] o.a.s.c.SolrDeletionPolicy newest commit generation = 1
   [junit4]   2> 751463 INFO  (OldIndexDirectoryCleanupThreadForCore-collection1) [    x:collection1] o.a.s.c.SolrCore Looking for old index directories to cleanup for core collection1 in /x1/jenkins/jenkins-slave/workspace/Lucene-Solr-Tests-5.x-Java7/solr/build/solr-core/test/J1/temp/solr.handler.TestReplicationHandlerBackup_DFB6C4D531D8ABD0-001/solr-instance-001/./collection1/data/
   [junit4]   2> 751466 INFO  (coreLoadExecutor-824-thread-1) [    x:collection1] o.a.s.c.SolrCore no updateRequestProcessorChain defined as default, creating implicit default
   [junit4]   2> 751471 INFO  (coreLoadExecutor-824-thread-1) [    x:collection1] o.a.s.h.l.XMLLoader xsltCacheLifetimeSeconds=60
   [junit4]   2> 751473 INFO  (coreLoadExecutor-824-thread-1) [    x:collection1] o.a.s.h.l.XMLLoader xsltCacheLifetimeSeconds=60
   [junit4]   2> 751474 INFO  (coreLoadExecutor-824-thread-1) [    x:collection1] o.a.s.h.l.XMLLoader xsltCacheLifetimeSeconds=60
   [junit4]   2> 751476 INFO  (coreLoadExecutor-824-thread-1) [    x:collection1] o.a.s.h.l.XMLLoader xsltCacheLifetimeSeconds=60
   [junit4]   2> 751485 INFO  (coreLoadExecutor-824-thread-1) [    x:collection1] o.a.s.c.RequestHandlers Registered paths: /admin/file,/admin/ping,/admin/logging,/schema,/admin/segments,/admin/system,/admin/plugins,/replication,/update/json/docs,/update/csv,/update/json,/admin/luke,/admin/threads,standard,/get,/admin/properties,/config,/update,/admin/mbeans
   [junit4]   2> 751486 INFO  (coreLoadExecutor-824-thread-1) [    x:collection1] o.a.s.c.SolrCore Using default statsCache cache: org.apache.solr.search.stats.LocalStatsCache
   [junit4]   2> 751486 INFO  (coreLoadExecutor-824-thread-1) [    x:collection1] o.a.s.u.CommitTracker Hard AutoCommit: disabled
   [junit4]   2> 751487 INFO  (coreLoadExecutor-824-thread-1) [    x:collection1] o.a.s.u.CommitTracker Soft AutoCommit: disabled
   [junit4]   2> 751487 INFO  (coreLoadExecutor-824-thread-1) [    x:collection1] o.a.s.u.RandomMergePolicy RandomMergePolicy wrapping class org.apache.lucene.index.LogByteSizeMergePolicy: [LogByteSizeMergePolicy: minMergeSize=1677721, mergeFactor=24, maxMergeSize=2147483648, maxMergeSizeForForcedMerge=9223372036854775807, calibrateSizeByDeletes=false, maxMergeDocs=2147483647, maxCFSSegmentSizeMB=8.796093022207999E12, noCFSRatio=0.5244304212096673]
   [junit4]   2> 751487 INFO  (coreLoadExecutor-824-thread-1) [    x:collection1] o.a.s.c.SolrDeletionPolicy SolrDeletionPolicy.onInit: commits: num=1
   [junit4]   2> 	commit{dir=MockDirectoryWrapper(RAMDirectory@73ff4e6 lockFactory=org.apache.lucene.store.SingleInstanceLockFactory@77e72bc1),segFN=segments_1,generation=1}
   [junit4]   2> 751488 INFO  (coreLoadExecutor-824-thread-1) [    x:collection1] o.a.s.c.SolrDeletionPolicy newest commit generation = 1
   [junit4]   2> 751488 INFO  (coreLoadExecutor-824-thread-1) [    x:collection1] o.a.s.s.SolrIndexSearcher Opening Searcher@3006f919[collection1] main
   [junit4]   2> 751488 INFO  (coreLoadExecutor-824-thread-1) [    x:collection1] o.a.s.r.ManagedResourceStorage File-based storage initialized to use dir: /x1/jenkins/jenkins-slave/workspace/Lucene-Solr-Tests-5.x-Java7/solr/build/solr-core/test/J1/temp/solr.handler.TestReplicationHandlerBackup_DFB6C4D531D8ABD0-001/solr-instance-001/collection1/conf
   [junit4]   2> 751488 INFO  (coreLoadExecutor-824-thread-1) [    x:collection1] o.a.s.r.RestManager Initializing RestManager with initArgs: {storageDir=/x1/jenkins/jenkins-slave/workspace/Lucene-Solr-Tests-5.x-Java7/solr/build/solr-core/test/J1/temp/solr.handler.TestReplicationHandlerBackup_DFB6C4D531D8ABD0-001/solr-instance-001/collection1/conf}
   [junit4]   2> 751488 INFO  (coreLoadExecutor-824-thread-1) [    x:collection1] o.a.s.r.ManagedResourceStorage Reading _rest_managed.json using file:dir=/x1/jenkins/jenkins-slave/workspace/Lucene-Solr-Tests-5.x-Java7/solr/build/solr-core/test/J1/temp/solr.handler.TestReplicationHandlerBackup_DFB6C4D531D8ABD0-001/solr-instance-001/collection1/conf
   [junit4]   2> 751489 INFO  (coreLoadExecutor-824-thread-1) [    x:collection1] o.a.s.r.RestManager Initializing 0 registered ManagedResources
   [junit4]   2> 751489 INFO  (coreLoadExecutor-824-thread-1) [    x:collection1] o.a.s.h.ReplicationHandler Replication enabled for following config files: schema-replication2.xml:schema.xml
   [junit4]   2> 751489 INFO  (coreLoadExecutor-824-thread-1) [    x:collection1] o.a.s.h.ReplicationHandler Commits will be reserved for  10000
   [junit4]   2> 751489 INFO  (searcherExecutor-825-thread-1-processing-x:collection1) [    x:collection1] o.a.s.c.SolrCore [collection1] Registered new searcher Searcher@3006f919[collection1] main{ExitableDirectoryReader(UninvertingDirectoryReader())}
   [junit4]   2> 751489 INFO  (coreLoadExecutor-824-thread-1) [    x:collection1] o.a.s.c.CoreContainer registering core: collection1
   [junit4]   2> 751862 INFO  (qtp1251857046-4469) [    x:collection1] o.a.s.u.DirectUpdateHandler2 [collection1] REMOVING ALL DOCUMENTS FROM INDEX
   [junit4]   2> 751863 INFO  (qtp1251857046-4469) [    x:collection1] o.a.s.u.p.LogUpdateProcessorFactory [collection1]  webapp=/solr path=/update params={wt=javabin&version=2}{deleteByQuery=*:*} 0 1
   [junit4]   2> 751867 INFO  (qtp1251857046-4470) [    x:collection1] o.a.s.u.p.LogUpdateProcessorFactory [collection1]  webapp=/solr path=/update params={wt=javabin&version=2}{add=[0]} 0 1
   [junit4]   2> 751870 INFO  (qtp1251857046-4471) [    x:collection1] o.a.s.u.p.LogUpdateProcessorFactory [collection1]  webapp=/solr path=/update params={wt=javabin&version=2}{add=[1]} 0 0
   [junit4]   2> 751872 INFO  (qtp1251857046-4472) [    x:collection1] o.a.s.u.p.LogUpdateProcessorFactory [collection1]  webapp=/solr path=/update params={wt=javabin&version=2}{add=[2]} 0 0
   [junit4]   2> 751875 INFO  (qtp1251857046-4473) [    x:collection1] o.a.s.u.p.LogUpdateProcessorFactory [collection1]  webapp=/solr path=/update params={wt=javabin&version=2}{add=[3]} 0 0
   [junit4]   2> 751877 INFO  (qtp1251857046-4469) [    x:collection1] o.a.s.u.p.LogUpdateProcessorFactory [collection1]  webapp=/solr path=/update params={wt=javabin&version=2}{add=[4]} 0 0
   [junit4]   2> 751879 INFO  (qtp1251857046-4470) [    x:collection1] o.a.s.u.p.LogUpdateProcessorFactory [collection1]  webapp=/solr path=/update params={wt=javabin&version=2}{add=[5]} 0 0
   [junit4]   2> 751882 INFO  (qtp1251857046-4471) [    x:collection1] o.a.s.u.p.LogUpdateProcessorFactory [collection1]  webapp=/solr path=/update params={wt=javabin&version=2}{add=[6]} 0 0
   [junit4]   2> 751884 INFO  (qtp1251857046-4472) [    x:collection1] o.a.s.u.p.LogUpdateProcessorFactory [collection1]  webapp=/solr path=/update params={wt=javabin&version=2}{add=[7]} 0 0
   [junit4]   2> 751886 INFO  (qtp1251857046-4473) [    x:collection1] o.a.s.u.p.LogUpdateProcessorFactory [collection1]  webapp=/solr path=/update params={wt=javabin&version=2}{add=[8]} 0 0
   [junit4]   2> 751889 INFO  (qtp1251857046-4469) [    x:collection1] o.a.s.u.p.LogUpdateProcessorFactory [collection1]  webapp=/solr path=/update params={wt=javabin&version=2}{add=[9]} 0 0
   [junit4]   2> 751891 INFO  (qtp1251857046-4470) [    x:collection1] o.a.s.u.p.LogUpdateProcessorFactory [collection1]  webapp=/solr path=/update params={wt=javabin&version=2}{add=[10]} 0 0
   [junit4]   2> 751893 INFO  (qtp1251857046-4471) [    x:collection1] o.a.s.u.p.LogUpdateProcessorFactory [collection1]  webapp=/solr path=/update params={wt=javabin&version=2}{add=[11]} 0 0
   [junit4]   2> 751897 INFO  (qtp1251857046-4472) [    x:collection1] o.a.s.u.p.LogUpdateProcessorFactory [collection1]  webapp=/solr path=/update params={wt=javabin&version=2}{add=[12]} 0 0
   [junit4]   2> 751899 INFO  (qtp1251857046-4473) [    x:collection1] o.a.s.u.p.LogUpdateProcessorFactory [collection1]  webapp=/solr path=/update params={wt=javabin&version=2}{add=[13]} 0 0
   [junit4]   2> 751901 INFO  (qtp1251857046-4469) [    x:collection1] o.a.s.u.p.LogUpdateProcessorFactory [collection1]  webapp=/solr path=/update params={wt=javabin&version=2}{add=[14]} 0 0
   [junit4]   2> 751904 INFO  (qtp1251857046-4470) [    x:collection1] o.a.s.u.p.LogUpdateProcessorFactory [collection1]  webapp=/solr path=/update params={wt=javabin&version=2}{add=[15]} 0 0
   [junit4]   2> 751906 INFO  (qtp1251857046-4471) [    x:collection1] o.a.s.u.p.LogUpdateProcessorFactory [collection1]  webapp=/solr path=/update params={wt=javabin&version=2}{add=[16]} 0 0
   [junit4]   2> 751909 INFO  (qtp1251857046-4472) [    x:collection1] o.a.s.u.p.LogUpdateProcessorFactory [collection1]  webapp=/solr path=/update params={wt=javabin&version=2}{add=[17]} 0 0
   [junit4]   2> 751912 INFO  (qtp1251857046-4473) [    x:collection1] o.a.s.u.p.LogUpdateProcessorFactory [collection1]  webapp=/solr path=/update params={wt=javabin&version=2}{add=[18]} 0 0
   [junit4]   2> 751914 INFO  (qtp1251857046-4469) [    x:collection1] o.a.s.u.p.LogUpdateProcessorFactory [collection1]  webapp=/solr path=/update params={wt=javabin&version=2}{add=[19]} 0 0
   [junit4]   2> 751917 INFO  (qtp1251857046-4470) [    x:collection1] o.a.s.u.p.LogUpdateProcessorFactory [collection1]  webapp=/solr path=/update params={wt=javabin&version=2}{add=[20]} 0 0
   [junit4]   2> 751919 INFO  (qtp1251857046-4471) [    x:collection1] o.a.s.u.p.LogUpdateProcessorFactory [collection1]  webapp=/solr path=/update params={wt=javabin&version=2}{add=[21]} 0 0
   [junit4]   2> 751922 INFO  (qtp1251857046-4472) [    x:collection1] o.a.s.u.p.LogUpdateProcessorFactory [collection1]  webapp=/solr path=/update params={wt=javabin&version=2}{add=[22]} 0 0
   [junit4]   2> 751924 INFO  (qtp1251857046-4473) [    x:collection1] o.a.s.u.p.LogUpdateProcessorFactory [collection1]  webapp=/solr path=/update params={wt=javabin&version=2}{add=[23]} 0 0
   [junit4]   2> 751926 INFO  (qtp1251857046-4469) [    x:collection1] o.a.s.u.p.LogUpdateProcessorFactory [collection1]  webapp=/solr path=/update params={wt=javabin&version=2}{add=[24]} 0 0
   [junit4]   2> 751928 INFO  (qtp1251857046-4470) [    x:collection1] o.a.s.u.p.LogUpdateProcessorFactory [collection1]  webapp=/solr path=/update params={wt=javabin&version=2}{add=[25]} 0 0
   [junit4]   2> 751931 INFO  (qtp1251857046-4471) [    x:collection1] o.a.s.u.p.LogUpdateProcessorFactory [collection1]  webapp=/solr path=/update params={wt=javabin&version=2}{add=[26]} 0 0
   [junit4]   2> 751933 INFO  (qtp1251857046-4472) [    x:collection1] o.a.s.u.p.LogUpdateProcessorFactory [collection1]  webapp=/solr path=/update params={wt=javabin&version=2}{add=[27]} 0 0
   [junit4]   2> 751935 INFO  (qtp1251857046-4473) [    x:collection1] o.a.s.u.p.LogUpdateProcessorFactory [collection1]  webapp=/solr path=/update params={wt=javabin&version=2}{add=[28]} 0 0
   [junit4]   2> 751938 INFO  (qtp1251857046-4469) [    x:collection1] o.a.s.u.p.LogUpdateProcessorFactory [collection1]  webapp=/solr path=/update params={wt=javabin&version=2}{add=[29]} 0 0
   [junit4]   2> 751940 INFO  (qtp1251857046-4470) [    x:collection1] o.a.s.u.p.LogUpdateProcessorFactory [collection1]  webapp=/solr path=/update params={wt=javabin&version=2}{add=[30]} 0 0
   [junit4]   2> 751942 INFO  (qtp1251857046-4471) [    x:collection1] o.a.s.u.p.LogUpdateProcessorFactory [collection1]  webapp=/solr path=/update params={wt=javabin&version=2}{add=[31]} 0 0
   [junit4]   2> 751944 INFO  (qtp1251857046-4472) [    x:collection1] o.a.s.u.p.LogUpdateProcessorFactory [collection1]  webapp=/solr path=/update params={wt=javabin&version=2}{add=[32]} 0 0
   [junit4]   2> 751947 INFO  (qtp1251857046-4473) [    x:collection1] o.a.s.u.p.LogUpdateProcessorFactory [collection1]  webapp=/solr path=/update params={wt=javabin&version=2}{add=[33]} 0 0
   [junit4]   2> 751949 INFO  (qtp1251857046-4469) [    x:collection1] o.a.s.u.p.LogUpdateProcessorFactory [collection1]  webapp=/solr path=/update params={wt=javabin&version=2}{add=[34]} 0 0
   [junit4]   2> 751951 INFO  (qtp1251857046-4470) [    x:collection1] o.a.s.u.p.LogUpdateProcessorFactory [collection1]  webapp=/solr path=/update params={wt=javabin&version=2}{add=[35]} 0 0
   [junit4]   2> 751954 INFO  (qtp1251857046-4471) [    x:collection1] o.a.s.u.p.LogUpdateProcessorFactory [collection1]  webapp=/solr path=/update params={wt=javabin&version=2}{add=[36]} 0 0
   [junit4]   2> 751956 INFO  (qtp1251857046-4472) [    x:collection1] o.a.s.u.p.LogUpdateProcessorFactory [collection1]  webapp=/solr path=/update params={wt=javabin&version=2}{add=[37]} 0 0
   [junit4]   2> 751958 INFO  (qtp1251857046-4473) [    x:collection1] o.a.s.u.p.LogUpdateProcessorFactory [collection1]  webapp=/solr path=/update params={wt=javabin&version=2}{add=[38]} 0 0
   [junit4]   2> 751961 INFO  (qtp1251857046-4469) [    x:collection1] o.a.s.u.p.LogUpdateProcessorFactory [collection1]  webapp=/solr path=/update params={wt=javabin&version=2}{add=[39]} 0 0
   [junit4]   2> 751963 INFO  (qtp1251857046-4470) [    x:collection1] o.a.s.u.p.LogUpdateProcessorFactory [collection1]  webapp=/solr path=/update params={wt=javabin&version=2}{add=[40]} 0 0
   [junit4]   2> 751967 INFO  (qtp1251857046-4471) [    x:collection1] o.a.s.u.p.LogUpdateProcessorFactory [collection1]  webapp=/solr path=/update params={wt=javabin&version=2}{add=[41]} 0 0
   [junit4]   2> 751970 INFO  (qtp1251857046-4472) [    x:collection1] o.a.s.u.p.LogUpdateProcessorFactory [collection1]  webapp=/solr path=/update params={wt=javabin&version=2}{add=[42]} 0 0
   [junit4]   2> 751973 INFO  (qtp1251857046-4473) [    x:collection1] o.a.s.u.p.LogUpdateProcessorFactory [collection1]  webapp=/solr path=/update params={wt=javabin&version=2}{add=[43]} 0 0
   [junit4]   2> 751975 INFO  (qtp1251857046-4469) [    x:collection1] o.a.s.u.p.LogUpdateProcessorFactory [collection1]  webapp=/solr path=/update params={wt=javabin&version=2}{add=[44]} 0 0
   [junit4]   2> 751978 INFO  (qtp1251857046-4470) [    x:collection1] o.a.s.u.p.LogUpdateProcessorFactory [collection1]  webapp=/solr path=/update params={wt=javabin&version=2}{add=[45]} 0 0
   [junit4]   2> 751980 INFO  (qtp1251857046-4471) [    x:collection1] o.a.s.u.p.LogUpdateProcessorFactory [collection1]  webapp=/solr path=/update params={wt=javabin&version=2}{add=[46]} 0 0
   [junit4]   2> 751983 INFO  (qtp1251857046-4472) [    x:collection1] o.a.s.u.p.LogUpdateProcessorFactory [collection1]  webapp=/solr path=/update params={wt=javabin&version=2}{add=[47]} 0 0
   [junit4]   2> 751985 INFO  (qtp1251857046-4473) [    x:collection1] o.a.s.u.p.LogUpdateProcessorFactory [collection1]  webapp=/solr path=/update params={wt=javabin&version=2}{add=[48]} 0 0
   [junit4]   2> 751988 INFO  (qtp1251857046-4469) [    x:collection1] o.a.s.u.p.LogUpdateProcessorFactory [collection1]  webapp=/solr path=/update params={wt=javabin&version=2}{add=[49]} 0 0
   [junit4]   2> 751990 INFO  (qtp1251857046-4470) [    x:collection1] o.a.s.u.p.LogUpdateProcessorFactory [collection1]  webapp=/solr path=/update params={wt=javabin&version=2}{add=[50]} 0 0
   [junit4]   2> 751993 INFO  (qtp1251857046-4471) [    x:collection1] o.a.s.u.p.LogUpdateProcessorFactory [collection1]  webapp=/solr path=/update params={wt=javabin&version=2}{add=[51]} 0 0
   [junit4]   2> 751995 INFO  (qtp1251857046-4472) [    x:collection1] o.a.s.u.p.LogUpdateProcessorFactory [collection1]  webapp=/solr path=/update params={wt=javabin&version=2}{add=[52]} 0 0
   [junit4]   2> 751998 INFO  (qtp1251857046-4473) [    x:collection1] o.a.s.u.p.LogUpdateProcessorFactory [collection1]  webapp=/solr path=/update params={wt=javabin&version=2}{add=[53]} 0 0
   [junit4]   2> 752000 INFO  (qtp1251857046-4469) [    x:collection1] o.a.s.u.p.LogUpdateProcessorFactory [collection1]  webapp=/solr path=/update params={wt=javabin&version=2}{add=[54]} 0 0
   [junit4]   2> 752002 INFO  (qtp1251857046-4470) [    x:collection1] o.a.s.u.p.LogUpdateProcessorFactory [collection1]  webapp=/solr path=/update params={wt=javabin&version=2}{add=[55]} 0 0
   [junit4]   2> 752005 INFO  (qtp1251857046-4471) [    x:collection1] o.a.s.u.p.LogUpdateProcessorFactory [collection1]  webapp=/solr path=/update params={wt=javabin&version=2}{add=[56]} 0 0
   [junit4]   2> 752007 INFO  (qtp1251857046-4472) [    x:collection1] o.a.s.u.p.LogUpdateProcessorFactory [collection1]  webapp=/solr path=/update params={wt=javabin&version=2}{add=[57]} 0 0
   [junit4]   2> 752010 INFO  (qtp1251857046-4473) [    x:collection1] o.a.s.u.p.LogUpdateProcessorFactory [collection1]  webapp=/solr path=/update params={wt=javabin&version=2}{add=[58]} 0 0
   [junit4]   2> 752012 INFO  (qtp1251857046-4469) [    x:collection1] o.a.s.u.p.LogUpdateProcessorFactory [collection1]  webapp=/solr path=/update params={wt=javabin&version=2}{add=[59]} 0 0
   [junit4]   2> 752015 INFO  (qtp1251857046-4470) [    x:collection1] o.a.s.u.p.LogUpdateProcessorFactory [collection1]  webapp=/solr path=/update params={wt=javabin&version=2}{add=[60]} 0 0
   [junit4]   2> 752017 INFO  (qtp1251857046-4471) [    x:collection1] o.a.s.u.p.LogUpdateProcessorFactory [collection1]  webapp=/solr path=/update params={wt=javabin&version=2}{add=[61]} 0 0
   [junit4]   2> 752019 INFO  (qtp1251857046-4472) [    x:collection1] o.a.s.u.p.LogUpdateProcessorFactory [collection1]  webapp=/solr path=/update params={wt=javabin&version=2}{add=[62]} 0 0
   [junit4]   2> 752022 INFO  (qtp1251857046-4473) [    x:collection1] o.a.s.u.p.LogUpdateProcessorFactory [collection1]  webapp=/solr path=/update params={wt=javabin&version=2}{add=[63]} 0 0
   [junit4]   2> 752024 INFO  (qtp1251857046-4469) [    x:collection1] o.a.s.u.p.LogUpdateProcessorFactory [collection1]  webapp=/solr path=/update params={wt=javabin&version=2}{add=[64]} 0 0
   [junit4]   2> 752027 INFO  (qtp1251857046-4470) [    x:collection1] o.a.s.u.p.LogUpdateProcessorFactory [collection1]  webapp=/solr path=/update params={wt=javabin&version=2}{add=[65]} 0 0
   [junit4]   2> 752029 INFO  (qtp1251857046-4471) [    x:collection1] o.a.s.u.p.LogUpdateProcessorFactory [collection1]  webapp=/solr path=/update params={wt=javabin&version=2}{add=[66]} 0 0
   [junit4]   2> 752031 INFO  (qtp1251857046-4472) [    x:collection1] o.a.s.u.p.LogUpdateProcessorFactory [collection1]  webapp=/solr path=/update params={wt=javabin&version=2}{add=[67]} 0 0
   [junit4]   2> 752034 INFO  (qtp1251857046-4473) [    x:collection1] o.a.s.u.p.LogUpdateProcessorFactory [collection1]  webapp=/solr path=/update params={wt=javabin&version=2}{add=[68]} 0 0
   [junit4]   2> 752036 INFO  (qtp1251857046-4469) [    x:collection1] o.a.s.u.p.LogUpdateProcessorFactory [collection1]  webapp=/solr path=/update params={wt=javabin&version=2}{add=[69]} 0 0
   [junit4]   2> 752038 INFO  (qtp1251857046-4470) [    x:collection1] o.a.s.u.p.LogUpdateProcessorFactory [collection1]  webapp=/solr path=/update params={wt=javabin&version=2}{add=[70]} 0 0
   [junit4]   2> 752040 INFO  (qtp1251857046-4471) [    x:collection1] o.a.s.u.p.LogUpdateProcessorFactory [collection1]  webapp=/solr path=/update params={wt=javabin&version=2}{add=[71]} 0 0
   [junit4]   2> 752043 INFO  (qtp1251857046-4472) [    x:collection1] o.a.s.u.p.LogUpdateProcessorFactory [collection1]  webapp=/solr path=/update params={wt=javabin&version=2}{add=[72]} 0 0
   [junit4]   2> 752046 INFO  (qtp1251857046-4473) [    x:collection1] o.a.s.u.p.LogUpdateProcessorFactory [collection1]  webapp=/solr path=/update params={wt=javabin&version=2}{add=[73]} 0 0
   [junit4]   2> 752048 INFO  (qtp1251857046-4469) [    x:collection1] o.a.s.u.p.LogUpdateProcessorFactory [collection1]  webapp=/solr path=/update params={wt=javabin&version=2}{add=[74]} 0 0
   [junit4]   2> 752051 INFO  (qtp1251857046-4470) [    x:collection1] o.a.s.u.p.LogUpdateProcessorFactory [collection1]  webapp=/solr path=/update params={wt=javabin&version=2}{add=[75]} 0 0
   [junit4]   2> 752053 INFO  (qtp1251857046-4471) [    x:collection1] o.a.s.u.p.LogUpdateProcessorFactory [collection1]  webapp=/solr path=/update params={wt=javabin&version=2}{add=[76]} 0 0
   [junit4]   2> 752056 INFO  (qtp1251857046-4472) [    x:collection1] o.a.s.u.p.LogUpdateProcessorFactory [collection1]  webapp=/solr path=/update params={wt=javabin&version=2}{add=[77]} 0 0
   [junit4]   2> 752058 INFO  (qtp1251857046-4473) [    x:collection1] o.a.s.u.p.LogUpdateProcessorFactory [collection1]  webapp=/solr path=/update params={wt=javabin&version=2}{add=[78]} 0 0
   [junit4]   2> 752061 INFO  (qtp1251857046-4469) [    x:collection1] o.a.s.u.p.LogUpdateProcessorFactory [collection1]  webapp=/solr path=/update params={wt=javabin&version=2}{add=[79]} 0 0
   [junit4]   2> 752063 INFO  (qtp1251857046-4470) [    x:collection1] o.a.s.u.p.LogUpdateProcessorFactory [collection1]  webapp=/solr path=/update params={wt=javabin&version=2}{add=[80]} 0 0
   [junit4]   2> 752065 INFO  (qtp1251857046-4471) [    x:collection1] o.a.s.u.p.LogUpdateProcessorFactory [collection1]  webapp=/solr path=/update params={wt=javabin&version=2}{add=[81]} 0 0
   [junit4]   2> 752068 INFO  (qtp1251857046-4472) [    x:collection1] o.a.s.u.p.LogUpdateProcessorFactory [collection1]  webapp=/solr path=/update params={wt=javabin&version=2}{add=[82]} 0 0
   [junit4]   2> 752070 INFO  (qtp1251857046-4473) [    x:collection1] o.a.s.u.p.LogUpdateProcessorFactory [collection1]  webapp=/solr path=/update params={wt=javabin&version=2}{add=[83]} 0 0
   [junit4]   2> 752073 INFO  (qtp1251857046-4469) [    x:collection1] o.a.s.u.p.LogUpdateProcessorFactory [collection1]  webapp=/solr path=/update params={wt=javabin&version=2}{add=[84]} 0 0
   [junit4]   2> 752075 INFO  (qtp1251857046-4470) [    x:collection1] o.a.s.u.p.LogUpdateProcessorFactory [collection1]  webapp=/solr path=/update params={wt=javabin&version=2}{add=[85]} 0 0
   [junit4]   2> 752077 INFO  (qtp1251857046-4471) [    x:collection1] o.a.s.u.p.LogUpdateProcessorFactory [collection1]  webapp=/solr path=/update params={wt=javabin&version=2}{add=[86]} 0 0
   [junit4]   2> 752080 INFO  (qtp1251857046-4472) [    x:collection1] o.a.s.u.p.LogUpdateProcessorFactory [collection1]  webapp=/solr path=/update params={wt=javabin&version=2}{add=[87]} 0 0
   [junit4]   2> 752082 INFO  (qtp1251857046-4473) [    x:collection1] o.a.s.u.p.LogUpdateProcessorFactory [collection1]  webapp=/solr path=/update params={wt=javabin&version=2}{add=[88]} 0 0
   [junit4]   2> 752085 INFO  (qtp1251857046-4469) [    x:collection1] o.a.s.u.p.LogUpdateProcessorFactory [collection1]  webapp=/solr path=/update params={wt=javabin&version=2}{add=[89]} 0 0
   [junit4]   2> 752087 INFO  (qtp1251857046-4470) [    x:collection1] o.a.s.u.p.LogUpdateProcessorFactory [collection1]  webapp=/solr path=/update params={wt=javabin&version=2}{add=[90]} 0 0
   [junit4]   2> 752089 INFO  (qtp1251857046-4471) [    x:collection1] o.a.s.u.DirectUpdateHandler2 start commit{,optimize=false,openSearcher=true,waitSearcher=true,expungeDeletes=false,softCommit=false,prepareCommit=false}
   [junit4]   2> 752097 INFO  (qtp1251857046-4471) [    x:collection1] o.a.s.c.SolrDeletionPolicy SolrDeletionPolicy.onCommit: commits: num=2
   [junit4]   2> 	commit{dir=MockDirectoryWrapper(RAMDirectory@73ff4e6 lockFactory=org.apache.lucene.store.SingleInstanceLockFactory@77e72bc1),segFN=segments_1,generation=1}
   [junit4]   2> 	commit{dir=MockDirectoryWrapper(RAMDirectory@73ff4e6 lockFactory=org.apache.lucene.store.SingleInstanceLockFactory@77e72bc1),segFN=segments_2,generation=2}
   [junit4]   2> 752098 INFO  (qtp1251857046-4471) [    x:collection1] o.a.s.c.SolrDeletionPolicy newest commit generation = 2
   [junit4]   2> 752104 INFO  (qtp1251857046-4471) [    x:collection1] o.a.s.s.SolrIndexSearcher Opening Searcher@5e88bc04[collection1] main
   [junit4]   2> 752104 INFO  (searcherExecutor-825-thread-1-processing-x:collection1) [    x:collection1] o.a.s.c.SolrCore [collection1] Registered new searcher Searcher@5e88bc04[collection1] main{ExitableDirectoryReader(UninvertingDirectoryReader(Uninverting(_0(5.5.0):c91)))}
   [junit4]   2> 752105 INFO  (qtp1251857046-4471) [    x:collection1] o.a.s.u.DirectUpdateHandler2 end_commit_flush
   [junit4]   2> 752105 INFO  (qtp1251857046-4471) [    x:collection1] o.a.s.u.p.LogUpdateProcessorFactory [collection1]  webapp=/solr path=/update params={softCommit=false&waitSearcher=true&wt=javabin&commit=true&version=2}{commit=} 0 15
   [junit4]   2> 752107 INFO  (Thread-3656) [    x:collection1] o.a.s.h.SnapShooter Creating backup snapshot <not named> at /x1/jenkins/jenkins-slave/workspace/Lucene-Solr-Tests-5.x-Java7/solr/build/solr-core/test/J1/temp/solr.handler.TestReplicationHandlerBackup_DFB6C4D531D8ABD0-001/solr-instance-001/./collection1/data/
   [junit4]   2> 752111 INFO  (qtp1251857046-4472) [    x:collection1] o.a.s.c.S.Request [collection1]  webapp=/solr path=/replication params={command=backup} status=0 QTime=2
   [junit4]   2> 752112 INFO  (Thread-3657) [    x:collection1] o.a.s.h.SnapShooter Creating backup snapshot <not named> at /x1/jenkins/jenkins-slave/workspace/Lucene-Solr-Tests-5.x-Java7/solr/build/solr-core/test/J1/temp/solr.handler.TestReplicationHandlerBackup_DFB6C4D531D8ABD0-001/solr-instance-001/./collection1/data/
   [junit4]   2> 752113 INFO  (Thread-3657) [    x:collection1] o.a.s.h.SnapShooter Done creating backup snapshot: <not named> at /x1/jenkins/jenkins-slave/workspace/Lucene-Solr-Tests-5.x-Java7/solr/build/solr-core/test/J1/temp/solr.handler.TestReplicationHandlerBackup_DFB6C4D531D8ABD0-001/solr-instance-001/./collection1/data/
   [junit4]   2> 752123 ERROR (Thread-3656) [    x:collection1] o.a.s.h.SnapShooter Exception while creating snapshot
   [junit4]   2> java.nio.file.NoSuchFileException: /x1/jenkins/jenkins-slave/workspace/Lucene-Solr-Tests-5.x-Java7/solr/build/solr-core/test/J1/temp/solr.handler.TestReplicationHandlerBackup_DFB6C4D531D8ABD0-001/solr-instance-001/collection1/data/snapshot.20160117101400111/_0.cfs
   [junit4]   2> 	at sun.nio.fs.UnixException.translateToIOException(UnixException.java:86)
   [junit4]   2> 	at sun.nio.fs.UnixException.rethrowAsIOException(UnixException.java:102)
   [junit4]   2> 	at sun.nio.fs.UnixException.rethrowAsIOException(UnixException.java:107)
   [junit4]   2> 	at sun.nio.fs.UnixFileSystemProvider.newByteChannel(UnixFileSystemProvider.java:214)
   [junit4]   2> 	at java.nio.file.spi.FileSystemProvider.newOutputStream(FileSystemProvider.java:430)
   [junit4]   2> 	at java.nio.file.Files.newOutputStream(Files.java:172)
   [junit4]   2> 	at org.apache.lucene.store.FSDirectory$FSIndexOutput.<init>(FSDirectory.java:276)
   [junit4]   2> 	at org.apache.lucene.store.FSDirectory.createOutput(FSDirectory.java:225)
   [junit4]   2> 	at org.apache.lucene.store.Directory.copyFrom(Directory.java:151)
   [junit4]   2> 	at org.apache.solr.handler.SnapShooter.copyFiles(SnapShooter.java:203)
   [junit4]   2> 	at org.apache.solr.handler.SnapShooter.createSnapshot(SnapShooter.java:136)
   [junit4]   2> 	at org.apache.solr.handler.SnapShooter$1.run(SnapShooter.java:85)
   [junit4]   2> 752131 INFO  (qtp1251857046-4473) [    x:collection1] o.a.s.c.S.Request [collection1]  webapp=/solr path=/replication params={command=details} status=0 QTime=0
   [junit4]   2> 752133 INFO  (TEST-TestReplicationHandlerBackup.doTestBackup-seed#[DFB6C4D531D8ABD0]) [    ] o.a.s.SolrTestCaseJ4 ###Ending doTestBackup
   [junit4]   2> 752134 INFO  (TEST-TestReplicationHandlerBackup.doTestBackup-seed#[DFB6C4D531D8ABD0]) [    ] o.e.j.s.ServerConnector Stopped ServerConnector@63e99757{HTTP/1.1}{127.0.0.1:0}
   [junit4]   2> 752134 INFO  (TEST-TestReplicationHandlerBackup.doTestBackup-seed#[DFB6C4D531D8ABD0]) [    ] o.a.s.c.CoreContainer Shutting down CoreContainer instance=1089521297
   [junit4]   2> 752134 INFO  (TEST-TestReplicationHandlerBackup.doTestBackup-seed#[DFB6C4D531D8ABD0]) [    x:collection1] o.a.s.c.SolrCore [collection1]  CLOSING SolrCore org.apache.solr.core.SolrCore@1c376b72
   [junit4]   2> 752134 INFO  (TEST-TestReplicationHandlerBackup.doTestBackup-seed#[DFB6C4D531D8ABD0]) [    x:collection1] o.a.s.u.DirectUpdateHandler2 closing DirectUpdateHandler2{commits=1,autocommits=0,soft autocommits=0,optimizes=0,rollbacks=0,expungeDeletes=0,docsPending=0,adds=0,deletesById=0,deletesByQuery=0,errors=0,cumulative_adds=91,cumulative_deletesById=0,cumulative_deletesByQuery=1,cumulative_errors=0}
   [junit4]   2> 752135 INFO  (TEST-TestReplicationHandlerBackup.doTestBackup-seed#[DFB6C4D531D8ABD0]) [    x:collection1] o.a.s.u.SolrCoreState Closing SolrCoreState
   [junit4]   2> 752135 INFO  (TEST-TestReplicationHandlerBackup.doTestBackup-seed#[DFB6C4D531D8ABD0]) [    x:collection1] o.a.s.u.DefaultSolrCoreState SolrCoreState ref count has reached 0 - closing IndexWriter
   [junit4]   2> 752135 INFO  (TEST-TestReplicationHandlerBackup.doTestBackup-seed#[DFB6C4D531D8ABD0]) [    x:collection1] o.a.s.u.DefaultSolrCoreState closing IndexWriter with IndexWriterCloser
   [junit4]   2> 752136 INFO  (TEST-TestReplicationHandlerBackup.doTestBackup-seed#[DFB6C4D531D8ABD0]) [    x:collection1] o.a.s.c.SolrCore [collection1] Closing main searcher on request.
   [junit4]   2> 752136 INFO  (TEST-TestReplicationHandlerBackup.doTestBackup-seed#[DFB6C4D531D8ABD0]) [    x:collection1] o.a.s.c.CachingDirectoryFactory Closing MockDirectoryFactory - 2 directories currently being tracked
   [junit4]   2> 752136 INFO  (TEST-TestReplicationHandlerBackup.doTestBackup-seed#[DFB6C4D531D8ABD0]) [    x:collection1] o.a.s.c.CachingDirectoryFactory looking to close /x1/jenkins/jenkins-slave/workspace/Lucene-Solr-Tests-5.x-Java7/solr/build/solr-core/test/J1/temp/solr.handler.TestReplicationHandlerBackup_DFB6C4D531D8ABD0-001/solr-instance-001/./collection1/data/index [CachedDir<<refCount=0;path=/x1/jenkins/jenkins-slave/workspace/Lucene-Solr-Tests-5.x-Java7/solr/build/solr-core/test/J1/temp/solr.handler.TestReplicationHandlerBackup_DFB6C4D531D8ABD0-001/solr-instance-001/./collection1/data/index;done=false>>]
   [junit4]   2> 752136 INFO  (TEST-TestReplicationHandlerBackup.doTestBackup-seed#[DFB6C4D531D8ABD0]) [    x:collection1] o.a.s.c.CachingDirectoryFactory Closing directory: /x1/jenkins/jenkins-slave/workspace/Lucene-Solr-Tests-5.x-Java7/solr/build/solr-core/test/J1/temp/solr.handler.TestReplicationHandlerBackup_DFB6C4D531D8ABD0-001/solr-instance-001/./collection1/data/index
   [junit4]   2> 752136 INFO  (TEST-TestReplicationHandlerBackup.doTestBackup-seed#[DFB6C4D531D8ABD0]) [    x:collection1] o.a.s.c.CachingDirectoryFactory looking to close /x1/jenkins/jenkins-slave/workspace/Lucene-Solr-Tests-5.x-Java7/solr/build/solr-core/test/J1/temp/solr.handler.TestReplicationHandlerBackup_DFB6C4D531D8ABD0-001/solr-instance-001/./collection1/data [CachedDir<<refCount=0;path=/x1/jenkins/jenkins-slave/workspace/Lucene-Solr-Tests-5.x-Java7/solr/build/solr-core/test/J1/temp/solr.handler.TestReplicationHandlerBackup_DFB6C4D531D8ABD0-001/solr-instance-001/./collection1/data;done=false>>]
   [junit4]   2> 752137 INFO  (TEST-TestReplicationHandlerBackup.doTestBackup-seed#[DFB6C4D531D8ABD0]) [    x:collection1] o.a.s.c.CachingDirectoryFactory Closing directory: /x1/jenkins/jenkins-slave/workspace/Lucene-Solr-Tests-5.x-Java7/solr/build/solr-core/test/J1/temp/solr.handler.TestReplicationHandlerBackup_DFB6C4D531D8ABD0-001/solr-instance-001/./collection1/data
   [junit4]   2> 752137 INFO  (TEST-TestReplicationHandlerBackup.doTestBackup-seed#[DFB6C4D531D8ABD0]) [    x:collection1] o.e.j.s.h.ContextHandler Stopped o.e.j.s.ServletContextHandler@25166f5e{/solr,null,UNAVAILABLE}
   [junit4]   2> NOTE: reproduce with: ant test  -Dtestcase=TestReplicationHandlerBackup -Dtests.method=doTestBackup -Dtests.seed=DFB6C4D531D8ABD0 -Dtests.multiplier=2 -Dtests.slow=true -Dtests.locale=ru-RU -Dtests.timezone=Europe/Sofia -Dtests.asserts=true -Dtests.file.encoding=ISO-8859-1
   [junit4] FAILURE 0.84s J1 | TestReplicationHandlerBackup.doTestBackup <<<
   [junit4]    > Throwable #1: java.lang.AssertionError: Failed to create backup
   [junit4]    > 	at __randomizedtesting.SeedInfo.seed([DFB6C4D531D8ABD0:9E3DE4B01666589F]:0)
   [junit4]    > 	at org.apache.solr.handler.CheckBackupStatus.fetchStatus(CheckBackupStatus.java:51)
   [junit4]    > 	at org.apache.solr.handler.TestReplicationHandlerBackup.doTestBackup(TestReplicationHandlerBackup.java:197)
   [junit4]    > 	at java.lang.Thread.run(Thread.java:745)
   [junit4]   2> 752152 INFO  (TEST-TestReplicationHandlerBackup.testBackupOnCommit-seed#[DFB6C4D531D8ABD0]) [    ] o.a.s.SolrTestCaseJ4 ###Starting testBackupOnCommit
   [junit4]   2> 752153 INFO  (TEST-TestReplicationHandlerBackup.testBackupOnCommit-seed#[DFB6C4D531D8ABD0]) [    ] o.a.s.SolrTestCaseJ4 Writing core.properties file to /x1/jenkins/jenkins-slave/workspace/Lucene-Solr-Tests-5.x-Java7/solr/build/solr-core/test/J1/temp/solr.handler.TestReplicationHandlerBackup_DFB6C4D531D8ABD0-001/solr-instance-002/collection1
   [junit4]   2> 752158 INFO  (TEST-TestReplicationHandlerBackup.testBackupOnCommit-seed#[DFB6C4D531D8ABD0]) [    ] o.e.j.s.Server jetty-9.2.13.v20150730
   [junit4]   2> 752160 INFO  (TEST-TestReplicationHandlerBackup.testBackupOnCommit-seed#[DFB6C4D531D8ABD0]) [    ] o.e.j.s.h.ContextHandler Started o.e.j.s.ServletContextHandler@3c8f9f08{/solr,null,AVAILABLE}
   [junit4]   2> 752161 INFO  (TEST-TestReplicationHandlerBackup.testBackupOnCommit-seed#[DFB6C4D531D8ABD0]) [    ] o.e.j.s.ServerConnector Started ServerConnector@5e3d66a{HTTP/1.1}{127.0.0.1:51618}
   [junit4]   2> 752161 INFO  (TEST-TestReplicationHandlerBackup.testBackupOnCommit-seed#[DFB6C4D531D8ABD0]) [    ] o.e.j.s.Server Started @755096ms
   [junit4]   2> 752161 INFO  (TEST-TestReplicationHandlerBackup.testBackupOnCommit-seed#[DFB6C4D531D8ABD0]) [    ] o.a.s.c.s.e.JettySolrRunner Jetty properties: {hostContext=/solr, hostPort=51618, solr.data.dir=/x1/jenkins/jenkins-slave/workspace/Lucene-Solr-Tests-5.x-Java7/solr/build/solr-core/test/J1/temp/solr.handler.TestReplicationHandlerBackup_DFB6C4D531D8ABD0-001/solr-instance-002/collection1/data}
   [junit4]   2> 752161 INFO  (TEST-TestReplicationHandlerBackup.testBackupOnCommit-seed#[DFB6C4D531D8ABD0]) [    ] o.a.s.s.SolrDispatchFilter SolrDispatchFilter.init(): sun.misc.Launcher$AppClassLoader@4f6de641
   [junit4]   2> 752161 INFO  (TEST-TestReplicationHandlerBackup.testBackupOnCommit-seed#[DFB6C4D531D8ABD0]) [    ] o.a.s.c.SolrResourceLoader new SolrResourceLoader for directory: '/x1/jenkins/jenkins-slave/workspace/Lucene-Solr-Tests-5.x-Java7/solr/build/solr-core/test/J1/temp/solr.handler.TestReplicationHandlerBackup_DFB6C4D531D8ABD0-001/solr-instance-002'
   [junit4]   2> 752161 INFO  (TEST-TestReplicationHandlerBackup.testBackupOnCommit-seed#[DFB6C4D531D8ABD0]) [    ] o.a.s.c.SolrResourceLoader JNDI not configured for solr (NoInitialContextEx)
   [junit4]   2> 752161 INFO  (TEST-TestReplicationHandlerBackup.testBackupOnCommit-seed#[DFB6C4D531D8ABD0]) [    ] o.a.s.c.SolrResourceLoader solr home defaulted to 'solr/' (could not find system property or JNDI)
   [junit4]   2> 752162 INFO  (TEST-TestReplicationHandlerBackup.testBackupOnCommit-seed#[DFB6C4D531D8ABD0]) [    ] o.a.s.c.SolrXmlConfig Loading container configuration from /x1/jenkins/jenkins-slave/workspace/Lucene-Solr-Tests-5.x-Java7/solr/build/solr-core/test/J1/temp/solr.handler.TestReplicationHandlerBackup_DFB6C4D531D8ABD0-001/solr-instance-002/solr.xml
   [junit4]   2> 752180 INFO  (TEST-TestReplicationHandlerBackup.testBackupOnCommit-seed#[DFB6C4D531D8ABD0]) [    ] o.a.s.c.CorePropertiesLocator Config-defined core root directory: /x1/jenkins/jenkins-slave/workspace/Lucene-Solr-Tests-5.x-Java7/solr/build/solr-core/test/J1/temp/solr.handler.TestReplicationHandlerBackup_DFB6C4D531D8ABD0-001/solr-instance-002/.
   [junit4]   2> 752181 INFO  (TEST-TestReplicationHandlerBackup.testBackupOnCommit-seed#[DFB6C4D531D8ABD0]) [    ] o.a.s.c.CoreContainer New CoreContainer 1530220710
   [junit4]   2> 752181 INFO  (TEST-TestReplicationHandlerBackup.testBackupOnCommit-seed#[DFB6C4D531D8ABD0]) [    ] o.a.s.c.CoreContainer Loading cores into CoreContainer [instanceDir=/x1/jenkins/jenkins-slave/workspace/Lucene-Solr-Tests-5.x-Java7/solr/build/solr-core/test/J1/temp/solr.handler.TestReplicationHandlerBackup_DFB6C4D531D8ABD0-001/solr-instance-002]
   [junit4]   2> 752181 WARN  (TEST-TestReplicationHandlerBackup.testBackupOnCommit-seed#[DFB6C4D531D8ABD0]) [    ] o.a.s.c.CoreContainer Couldn't add files from /x1/jenkins/jenkins-slave/workspace/Lucene-Solr-Tests-5.x-Java7/solr/build/solr-core/test/J1/temp/solr.handler.TestReplicationHandlerBackup_DFB6C4D531D8ABD0-001/solr-instance-002/lib to classpath: /x1/jenkins/jenkins-slave/workspace/Lucene-Solr-Tests-5.x-Java7/solr/build/solr-core/test/J1/temp/solr.handler.TestReplicationHandlerBackup_DFB6C4D531D8ABD0-001/solr-instance-002/lib
   [junit4]   2> 752181 INFO  (TEST-TestReplicationHandlerBackup.testBackupOnCommit-seed#[DFB6C4D531D8ABD0]) [    ] o.a.s.h.c.HttpShardHandlerFactory created with socketTimeout : 90000,urlScheme : ,connTimeout : 15000,maxConnectionsPerHost : 20,maxConnections : 10000,corePoolSize : 0,maximumPoolSize : 2147483647,maxThreadIdleTime : 5,sizeOfQueue : -1,fairnessPolicy : false,useRetries : false,
   [junit4]   2> 752182 INFO  (TEST-TestReplicationHandlerBackup.testBackupOnCommit-seed#[DFB6C4D531D8ABD0]) [    ] o.a.s.u.UpdateShardHandler Creating UpdateShardHandler HTTP client with params: socketTimeout=340000&connTimeout=45000&retry=true
   [junit4]   2> 752183 INFO  (TEST-TestReplicationHandlerBackup.testBackupOnCommit-seed#[DFB6C4D531D8ABD0]) [    ] o.a.s.l.LogWatcher SLF4J impl is org.slf4j.impl.Log4jLoggerFactory
   [junit4]   2> 752183 INFO  (TEST-TestReplicationHandlerBackup.testBackupOnCommit-seed#[DFB6C4D531D8ABD0]) [    ] o.a.s.l.LogWatcher Registering Log Listener [Log4j (org.slf4j.impl.Log4jLoggerFactory)]
   [junit4]   2> 752183 INFO  (TEST-TestReplicationHandlerBackup.testBackupOnCommit-seed#[DFB6C4D531D8ABD0]) [    ] o.a.s.c.CoreContainer Security conf doesn't exist. Skipping setup for authorization module.
   [junit4]   2> 752183 INFO  (TEST-TestReplicationHandlerBackup.testBackupOnCommit-seed#[DFB6C4D531D8ABD0]) [    ] o.a.s.c.CoreContainer No authentication plugin used.
   [junit4]   2> 752184 INFO  (TEST-TestReplicationHandlerBackup.testBackupOnCommit-seed#[DFB6C4D531D8ABD0]) [    ] o.a.s.c.CorePropertiesLocator Looking for core definitions underneath /x1/jenkins/jenkins-slave/workspace/Lucene-Solr-Tests-5.x-Java7/solr/build/solr-core/test/J1/temp/solr.handler.TestReplicationHandlerBackup_DFB6C4D531D8ABD0-001/solr-instance-002/.
   [junit4]   2> 752185 INFO  (TEST-TestReplicationHandlerBackup.testBackupOnCommit-seed#[DFB6C4D531D8ABD0]) [    ] o.a.s.c.CoreDescriptor Created CoreDescriptor: {configSetProperties=configsetprops.json, dataDir=data/, transient=false, config=solrconfig.xml, name=collection1, loadOnStartup=true, schema=schema.xml}
   [junit4]   2> 752185 INFO  (TEST-TestReplicationHandlerBackup.testBackupOnCommit-seed#[DFB6C4D531D8ABD0]) [    ] o.a.s.c.CorePropertiesLocator Found core collection1 in /x1/jenkins/jenkins-slave/workspace/Lucene-Solr-Tests-5.x-Java7/solr/build/solr-core/test/J1/temp/solr.handler.TestReplicationHandlerBackup_DFB6C4D531D8ABD0-001/solr-instance-002/./collection1
   [junit4]   2> 752185 INFO  (TEST-TestReplicationHandlerBackup.testBackupOnCommit-seed#[DFB6C4D531D8ABD0]) [    ] o.a.s.c.CorePropertiesLocator Found 1 core definitions
   [junit4]   2> 752186 INFO  (TEST-TestReplicationHandlerBackup.testBackupOnCommit-seed#[DFB6C4D531D8ABD0]) [    ] o.a.s.s.SolrDispatchFilter user.dir=/x1/jenkins/jenkins-slave/workspace/Lucene-Solr-Tests-5.x-Java7/solr/build/solr-core/test/J1
   [junit4]   2> 752186 INFO  (TEST-TestReplicationHandlerBackup.testBackupOnCommit-seed#[DFB6C4D531D8ABD0]) [    ] o.a.s.s.SolrDispatchFilter SolrDispatchFilter.init() done
   [junit4]   2> 752186 INFO  (coreLoadExecutor-834-thread-1) [    ] o.a.s.c.SolrResourceLoader new SolrResourceLoader for directory: '/x1/jenkins/jenkins-slave/workspace/Lucene-Solr-Tests-5.x-Java7/solr/build/solr-core/test/J1/temp/solr.handler.TestReplicationHandlerBackup_DFB6C4D531D8ABD0-001/solr-instance-002/collection1'
   [junit4]   2> 752187 INFO  (coreLoadExecutor-834-thread-1) [    ] o.a.s.c.SolrResourceLoader JNDI not configured for solr (NoInitialContextEx)
   [junit4]   2> 752187 INFO  (coreLoadExecutor-834-thread-1) [    ] o.a.s.c.SolrResourceLoader solr home defaulted to 'solr/' (could not find system property or JNDI)
   [junit4]   2> 752197 INFO  (coreLoadExecutor-834-thread-1) [    ] o.a.s.c.SolrConfig current version of requestparams : -1
   [junit4]   2> 752214 INFO  (coreLoadExecutor-834-thread-1) [    ] o.a.s.c.SolrConfig Using Lucene MatchVersion: 5.5.0
   [junit4]   2> 752245 INFO  (coreLoadExecutor-834-thread-1) [    ] o.a.s.c.SolrConfig Loaded SolrConfig: solrconfig.xml
   [junit4]   2> 752250 INFO  (coreLoadExecutor-834-thread-1) [    ] o.a.s.s.IndexSchema [collection1] Schema name=test
   [junit4]   2> 752260 INFO  (coreLoadExecutor-834-thread-1) [    ] o.a.s.s.IndexSchema unique key field: id
   [junit4]   2> 752262 INFO  (coreLoadExecutor-834-thread-1) [    ] o.a.s.c.ConfigSetProperties Did not find ConfigSet properties, assuming default properties: Can't find resource 'configsetprops.json' in classpath or '/x1/jenkins/jenkins-slave/workspace/Lucene-Solr-Tests-5.x-Java7/solr/build/solr-core/test/J1/temp/solr.handler.TestReplicationHandlerBackup_DFB6C4D531D8ABD0-001/solr-instance-002/collection1'
   [junit4]   2> 752262 INFO  (coreLoadExecutor-834-thread-1) [    ] o.a.s.c.CoreContainer Creating SolrCore 'collection1' using configuration from instancedir /x1/jenkins/jenkins-slave/workspace/Lucene-Solr-Tests-5.x-Java7/solr/build/solr-core/test/J1/temp/solr.handler.TestReplicationHandlerBackup_DFB6C4D531D8ABD0-001/solr-instance-002/./collection1
   [junit4]   2> 752262 INFO  (coreLoadExecutor-834-thread-1) [    x:collection1] o.a.s.c.SolrCore org.apache.solr.core.MockDirectoryFactory
   [junit4]   2> 752263 INFO  (coreLoadExecutor-834-thread-1) [    x:collection1] o.a.s.c.SolrCore [[collection1] ] Opening new SolrCore at [/x1/jenkins/jenkins-slave/workspace/Lucene-Solr-Tests-5.x-Java7/solr/build/solr-core/test/J1/temp/solr.handler.TestReplicationHandlerBackup_DFB6C4D531D8ABD0-001/solr-instance-002/collection1], dataDir=[/x1/jenkins/jenkins-slave/workspace/Lucene-Solr-Tests-5.x-Java7/solr/build/solr-core/test/J1/temp/solr.handler.TestReplicationHandlerBackup_DFB6C4D531D8ABD0-001/solr-instance-002/./collection1/data/]
   [junit4]   2> 752263 INFO  (coreLoadExecutor-834-thread-1) [    x:collection1] o.a.s.c.SolrCore JMX monitoring not detected for core: collection1
   [junit4]   2> 752263 INFO  (coreLoadExecutor-834-thread-1) [    x:collection1] o.a.s.c.CachingDirectoryFactory return new directory for /x1/jenkins/jenkins-slave/workspace/Lucene-Solr-Tests-5.x-Java7/solr/build/solr-core/test/J1/temp/solr.handler.TestReplicationHandlerBackup_DFB6C4D531D8ABD0-001/solr-instance-002/./collection1/data
   [junit4]   2> 752263 INFO  (coreLoadExecutor-834-thread-1) [    x:collection1] o.a.s.c.SolrCore New index directory detected: old=null new=/x1/jenkins/jenkins-slave/workspace/Lucene-Solr-Tests-5.x-Java7/solr/build/solr-core/test/J1/temp/solr.handler.TestReplicationHandlerBackup_DFB6C4D531D8ABD0-001/solr-instance-002/./collection1/data/index/
   [junit4]   2> 752263 WARN  (coreLoadExecutor-834-thread-1) [    x:collection1] o.a.s.c.SolrCore [collection1] Solr index directory '/x1/jenkins/jenkins-slave/workspace/Lucene-Solr-Tests-5.x-Java7/solr/build/solr-core/test/J1/temp/solr.handler.TestReplicationHandlerBackup_DFB6C4D531D8ABD0-001/solr-instance-002/./collection1/data/index' doesn't exist. Creating new index...
   [junit4]   2> 752264 INFO  (coreLoadExecutor-834-thread-1) [    x:collection1] o.a.s.c.CachingDirectoryFactory return new directory for /x1/jenkins/jenkins-slave/workspace/Lucene-Solr-Tests-5.x-Java7/solr/build/solr-core/test/J1/temp/solr.handler.TestReplicationHandlerBackup_DFB6C4D531D8ABD0-001/solr-instance-002/./collection1/data/index
   [junit4]   2> 752264 INFO  (coreLoadExecutor-834-thread-1) [    x:collection1] o.a.s.u.RandomMergePolicy RandomMergePolicy wrapping class org.apache.lucene.index.LogDocMergePolicy: [LogDocMergePolicy: minMergeSize=1000, mergeFactor=31, maxMergeSize=9223372036854775807, maxMergeSizeForForcedMerge=9223372036854775807, calibrateSizeByDeletes=false, maxMergeDocs=2147483647, maxCFSSegmentSizeMB=8.796093022207999E12, noCFSRatio=0.849768397745467]
   [junit4]   2> 752264 INFO  (coreLoadExecutor-834-thread-1) [    x:collection1] o.a.s.c.SolrDeletionPolicy SolrDeletionPolicy.onCommit: commits: num=1
   [junit4]   2> 	commit{dir=MockDirectoryWrapper(RAMDirectory@7c7b8fe3 lockFactory=org.apache.lucene.store.SingleInstanceLockFactory@1423bfee),segFN=segments_1,generation=1}
   [junit4]   2> 752264 INFO  (coreLoadExecutor-834-thread-1) [    x:collection1] o.a.s.c.SolrDeletionPolicy newest commit generation = 1
   [junit4]   2> 752265 INFO  (OldIndexDirectoryCleanupThreadForCore-collection1) [    x:collection1] o.a.s.c.SolrCore Looking for old index directories to cleanup for core collection1 in /x1/jenkins/jenkins-slave/workspace/Lucene-Solr-Tests-5.x-Java7/solr/build/solr-core/test/J1/temp/solr.handler.TestReplicationHandlerBackup_DFB6C4D531D8ABD0-001/solr-instance-002/./collection1/data/
   [junit4]   2> 752267 INFO  (coreLoadExecutor-834-thread-1) [    x:collection1] o.a.s.c.SolrCore no updateRequestProcessorChain defined as default, creating implicit default
   [junit4]   2> 752270 INFO  (coreLoadExecutor-834-thread-1) [    x:collection1] o.a.s.h.l.XMLLoader xsltCacheLifetimeSeconds=60
   [junit4]   2> 752271 INFO  (coreLoadExecutor-834-thread-1) [    x:collection1] o.a.s.h.l.XMLLoader xsltCacheLifetimeSeconds=60
   [junit4]   2> 752273 INFO  (coreLoadExecutor-834-thread-1) [    x:collection1] o.a.s.h.l.XMLLoader xsltCacheLifetimeSeconds=60
   [junit4]   2> 752274 INFO  (coreLoadExecutor-834-thread-1) [    x:collection1] o.a.s.h.l.XMLLoader xsltCacheLifetimeSeconds=60
   [junit4]   2> 752276 INFO  (coreLoadExecutor-834-thread-1) [    x:collection1] o.a.s.c.PluginBag requestHandler : 'lazy' created with startup=lazy 
   [junit4]   2> 752276 INFO  (coreLoadExecutor-834-thread-1) [    x:collection1] o.a.s.c.RequestHandlers Registered paths: /admin/file,/admin/ping,/admin/logging,/schema,/admin/segments,/admin/system,/admin/plugins,/replication,/update/json/docs,/update/csv,/update/json,/admin/luke,/admin/threads,standard,/get,/admin/properties,/config,lazy,/update,defaults,/admin/mbeans
   [junit4]   2> 752277 INFO  (coreLoadExecutor-834-thread-1) [    x:collection1] o.a.s.c.SolrCore Using default statsCache cache: org.apache.solr.search.stats.LocalStatsCache
   [junit4]   2> 752278 INFO  (coreLoadExecutor-834-thread-1) [    x:collection1] o.a.s.u.CommitTracker Hard AutoCommit: disabled
   [junit4]   2> 752278 INFO  (coreLoadExecutor-834-thread-1) [    x:collection1] o.a.s.u.CommitTracker Soft AutoCommit: disabled
   [junit4]   2> 752278 INFO  (coreLoadExecutor-834-thread-1) [    x:collection1] o.a.s.u.RandomMergePolicy RandomMergePolicy wrapping class org.apache.lucene.index.LogByteSizeMergePolicy: [LogByteSizeMergePolicy: minMergeSize=1677721, mergeFactor=24, maxMergeSize=2147483648, maxMergeSizeForForcedMerge=9223372036854775807, calibrateSizeByDeletes=false, maxMergeDocs=2147483647, maxCFSSegmentSizeMB=8.796093022207999E12, noCFSRatio=0.5244304212096673]
   [junit4]   2> 752278 INFO  (coreLoadExecutor-834-thread-1) [    x:collection1] o.a.s.c.SolrDeletionPolicy SolrDeletionPolicy.onInit: commits: num=1
   [junit4]   2> 	commit{dir=MockDirectoryWrapper(RAMDirectory@7c7b8fe3 lockFactory=org.apache.lucene.store.SingleInstanceLockFactory@1423bfee),segFN=segments_1,generation=1}
   [junit4]   2> 752279 INFO  (coreLoadExecutor-834-thread-1) [    x:collection1] o.a.s.c.SolrDeletionPolicy newest commit generation = 1
   [junit4]   2> 752279 INFO  (coreLoadExecutor-834-thread-1) [    x:collection1] o.a.s.s.SolrIndexSearcher Opening Searcher@f612a9[collection1] main
   [junit4]   2> 752279 INFO  (coreLoadExecutor-834-thread-1) [    x:collection1] o.a.s.r.ManagedResourceStorage File-based storage initialized to use dir: /x1/jenkins/jenkins-slave/workspace/Lucene-Solr-Tests-5.x-Java7/solr/build/solr-core/test/J1/temp/solr.handler.TestReplicationHandlerBackup_DFB6C4D531D8ABD0-001/solr-instance-002/collection1/conf
   [junit4]   2> 752279 INFO  (coreLoadExecutor-834-thread-1) [    x:collection1] o.a.s.r.RestManager Initializing RestManager with initArgs: {storageDir=/x1/jenkins/jenkins-slave/workspace/Lucene-Solr-Tests-5.x-Java7/solr/build/solr-core/test/J1/temp/solr.handler.TestReplicationHandlerBackup_DFB6C4D531D8ABD0-001/solr-instance-002/collection1/conf}
   [junit4]   2> 752279 INFO  (coreLoadExecutor-834-thread-1) [    x:collection1] o.a.s.r.ManagedResourceStorage Reading _rest_managed.json using file:dir=/x1/jenkins/jenkins-slave/workspace/Lucene-Solr-Tests-5.x-Java7/solr/build/solr-core/test/J1/temp/solr.handler.TestReplicationHandlerBackup_DFB6C4D531D8ABD0-001/solr-instance-002/collection1/conf
   [junit4]   2> 752279 INFO  (coreLoadExecutor-834-thread-1) [    x:collection1] o.a.s.r.RestManager Initializing 0 registered ManagedResources
   [junit4]   2> 752280 INFO  (coreLoadExecutor-834-thread-1) [    x:collection1] o.a.s.h.ReplicationHandler Replication enabled for following config files: schema-replication2.xml:schema.xml
   [junit4]   2> 752280 INFO  (coreLoadExecutor-834-thread-1) [    x:collection1] o.a.s.h.ReplicationHandler Commits will be reserved for  10000
   [junit4]   2> 752280 INFO  (searcherExecutor-835-thread-1-processing-x:collection1) [    x:collection1] o.a.s.c.SolrCore [collection1] Registered new searcher Searcher@f612a9[collection1] main{ExitableDirectoryReader(UninvertingDirectoryReader())}
   [junit4]   2> 752280 INFO  (coreLoadExecutor-834-thread-1) [    x:collection1] o.a.s.c.CoreContainer registering core: collection1
   [junit4]   2> 752691 INFO  (qtp394885212-4494) [    x:collection1] o.a.s.u.DirectUpdateHandler2 [collection1] REMOVING ALL DOCUMENTS FROM INDEX
   [junit4]   2> 752692 INFO  (qtp394885212-4494) [    x:collection1] o.a.s.u.p.LogUpdateProcessorFactory [collection1]  webapp=/solr path=/update params={wt=javabin&version=2}{deleteByQuery=*:*} 0 1
   [junit4]   2> 752695 INFO  (qtp394885212-4492) [    x:collection1] o.a.s.u.p.LogUpdateProcessorFactory [collection1]  webapp=/solr path=/update params={wt=javabin&version=2}{add=[0]} 0 1
   [junit4]   2> 752698 INFO  (qtp394885212-4496) [    x:collection1] o.a.s.u.p.LogUpdateProcessorFactory [collection1]  webapp=/solr path=/update params={wt=javabin&version=2}{add=[1]} 0 0
   [junit4]   2> 752700 INFO  (qtp394885212-4493) [    x:collection1] o.a.s.u.p.LogUpdateProcessorFactory [collection1]  webapp=/solr path=/update params={wt=javabin&version=2}{add=[2]} 0 0
   [junit4]   2> 752703 INFO  (qtp394885212-4500) [    x:collection1] o.a.s.u.p.LogUpdateProcessorFactory [collection1]  webapp=/solr path=/update params={wt=javabin&version=2}{add=[3]} 0 0
   [junit4]   2> 752705 INFO  (qtp394885212-4495) [    x:collection1] o.a.s.u.p.LogUpdateProcessorFactory [collection1]  webapp=/solr path=/update params={wt=javabin&version=2}{add=[4]} 0 0
   [junit4]   2> 752707 INFO  (qtp394885212-4494) [    x:collection1] o.a.s.u.p.LogUpdateProcessorFactory [collection1]  webapp=/solr path=/update params={wt=javabin&version=2}{add=[5]} 0 0
   [junit4]   2> 752710 INFO  (qtp394885212-4492) [    x:collection1] o.a.s.u.p.LogUpdateProcessorFactory [collection1]  webapp=/solr path=/update params={wt=javabin&version=2}{add=[6]} 0 0
   [junit4]   2> 752712 INFO  (qtp394885212-4496) [    x:collection1] o.a.s.u.p.LogUpdateProcessorFactory [collection1]  webapp=/solr path=/update params={wt=javabin&version=2}{add=[7]} 0 0
   [junit4]   2> 752714 INFO  (qtp394885212-4493) [    x:collection1] o.a.s.u.p.LogUpdateProcessorFactory [collection1]  webapp=/solr path=/update params={wt=javabin&version=2}{add=[8]} 0 0
   [junit4]   2> 752717 INFO  (qtp394885212-4500) [    x:collection1] o.a.s.u.p.LogUpdateProcessorFactory [collection1]  webapp=/solr path=/update params={wt=javabin&version=2}{add=[9]} 0 0
   [junit4]   2> 752719 INFO  (qtp394885212-4495) [    x:collection1] o.a.s.u.p.LogUpdateProcessorFactory [collection1]  webapp=/solr path=/update params={wt=javabin&version=2}{add=[10]} 0 0
   [junit4]   2> 752721 INFO  (qtp394885212-4494) [    x:collection1] o.a.s.u.p.LogUpdateProcessorFactory [collection1]  webapp=/solr path=/update params={wt=javabin&version=2}{add=[11]} 0 0
   [junit4]   2> 752723 INFO  (qtp394885212-4492) [    x:collection1] o.a.s.u.p.LogUpdateProcessorFactory [collection1]  webapp=/solr path=/update params={wt=javabin&version=2}{add=[12]} 0 0
   [junit4]   2> 752726 INFO  (qtp394885212-4496) [    x:collection1] o.a.s.u.p.LogUpdateProcessorFactory [collection1]  webapp=/solr path=/update params={wt=javabin&version=2}{add=[13]} 0 0
   [junit4]   2> 752728 INFO  (qtp394885212-4493) [    x:collection1] o.a.s.u.p.LogUpdateProcessorFactory [collection1]  webapp=/solr path=/update params={wt=javabin&version=2}{add=[14]} 0 0
   [junit4]   2> 752730 INFO  (qtp394885212-4500) [    x:collection1] o.a.s.u.p.LogUpdateProcessorFactory [collection1]  webapp=/solr path=/update params={wt=javabin&version=2}{add=[15]} 0 0
   [junit4]   2> 752732 INFO  (qtp394885212-4495) [    x:collection1] o.a.s.u.p.LogUpdateProcessorFactory [collection1]  webapp=/solr path=/update params={wt=javabin&version=2}{add=[16]} 0 0
   [junit4]   2> 752735 INFO  (qtp394885212-4494) [    x:collection1] o.a.s.u.p.LogUpdateProcessorFactory [collection1]  webapp=/solr path=/update params={wt=javabin&version=2}{add=[17]} 0 0
   [junit4]   2> 752737 INFO  (qtp394885212-4492) [    x:collection1] o.a.s.u.p.LogUpdateProcessorFactory [collection1]  webapp=/solr path=/update params={wt=javabin&version=2}{add=[18]} 0 0
   [junit4]   2> 752739 INFO  (qtp394885212-4496) [    x:collection1] o.a.s.u.p.LogUpdateProcessorFactory [collection1]  webapp=/solr path=/update params={wt=javabin&version=2}{add=[19]} 0 0
   [junit4]   2> 752741 INFO  (qtp394885212-4493) [    x:collection1] o.a.s.u.p.LogUpdateProcessorFactory [collection1]  webapp=/solr path=/update params={wt=javabin&version=2}{add=[20]} 0 0
   [junit4]   2> 752744 INFO  (qtp394885212-4500) [    x:collection1] o.a.s.u.p.LogUpdateProcessorFactory [collection1]  webapp=/solr path=/update params={wt=javabin&version=2}{add=[21]} 0 0
   [junit4]   2> 752746 INFO  (qtp394885212-4495) [    x:collection1] o.a.s.u.p.LogUpdateProcessorFactory [collection1]  webapp=/solr path=/update params={wt=javabin&version=2}{add=[22]} 0 0
   [junit4]   2> 752748 INFO  (qtp394885212-4494) [    x:collection1] o.a.s.u.p.LogUpdateProcessorFactory [collection1]  webapp=/solr path=/update params={wt=javabin&version=2}{add=[23]} 0 0
   [junit4]   2> 752750 INFO  (qtp394885212-4492) [    x:collection1] o.a.s.u.p.LogUpdateProcessorFactory [collection1]  webapp=/solr path=/update params={wt=javabin&version=2}{add=[24]} 0 0
   [junit4]   2> 752753 INFO  (qtp394885212-4496) [    x:collection1] o.a.s.u.p.LogUpdateProcessorFactory [collection1]  webapp=/solr path=/update params={wt=javabin&version=2}{add=[25]} 0 0
   [junit4]   2> 752755 INFO  (qtp394885212-4493) [    x:collection1] o.a.s.u.p.LogUpdateProcessorFactory [collection1]  webapp=/solr path=/update params={wt=javabin&version=2}{add=[26]} 0 0
   [junit4]   2> 752757 INFO  (qtp394885212-4500) [    x:collection1] o.a.s.u.p.LogUpdateProcessorFactory [collection1]  webapp=/solr path=/update params={wt=javabin&version=2}{add=[27]} 0 0
   [junit4]   2> 752760 INFO  (qtp394885212-4495) [    x:collection1] o.a.s.u.p.LogUpdateProcessorFactory [collection1]  webapp=/solr path=/update params={wt=javabin&version=2}{add=[28]} 0 0
   [junit4]   2> 752762 INFO  (qtp394885212-4494) [    x:collection1] o.a.s.u.p.LogUpdateProcessorFactory [collection1]  webapp=/solr path=/update params={wt=javabin&version=2}{add=[29]} 0 0
   [junit4]   2> 752764 INFO  (qtp394885212-4492) [    x:collection1] o.a.s.u.p.LogUpdateProcessorFactory [collection1]  webapp=/solr path=/update params={wt=javabin&version=2}{add=[30]} 0 0
   [junit4]   2> 752767 INFO  (qtp394885212-4496) [    x:collection1] o.a.s.u.p.LogUpdateProcessorFactory [collection1]  webapp=/solr path=/update params={wt=javabin&version=2}{add=[31]} 0 0
   [junit4]   2> 752769 INFO  (qtp394885212-4493) [    x:collection1] o.a.s.u.p.LogUpdateProcessorFactory [collection1]  webapp=/solr path=/update params={wt=javabin&version=2}{add=[32]} 0 0
   [junit4]   2> 752772 INFO  (qtp394885212-4500) [    x:collection1] o.a.s.u.p.LogUpdateProcessorFactory [collection1]  webapp=/solr path=/update params={wt=javabin&version=2}{add=[33]} 0 0
   [junit4]   2> 752774 INFO  (qtp394885212-4495) [    x:collection1] o.a.s.u.p.LogUpdateProcessorFactory [collection1]  webapp=/solr path=/update params={wt=javabin&version=2}{add=[34]} 0 0
   [junit4]   2> 752776 INFO  (qtp394885212-4494) [    x:collection1] o.a.s.u.p.LogUpdateProcessorFactory [collection1]  webapp=/solr path=/update params={wt=javabin&version=2}{add=[35]} 0 0
   [junit4]   2> 752779 INFO  (qtp394885212-4492) [    x:collection1] o.a.s.u.p.LogUpdateProcessorFactory [collection1]  webapp=/solr path=/update params={wt=javabin&version=2}{add=[36]} 0 0
   [junit4]   2> 752781 INFO  (qtp394885212-4496) [    x:collection1] o.a.s.u.p.LogUpdateProcessorFactory [collection1]  webapp=/solr path=/update params={wt=javabin&version=2}{add=[37]} 0 0
   [junit4]   2> 752783 INFO  (qtp394885212-4493) [    x:collection1] o.a.s.u.p.LogUpdateProcessorFactory [collection1]  webapp=/solr path=/update params={wt=javabin&version=2}{add=[38]} 0 0
   [junit4]   2> 752786 INFO  (qtp394885212-4500) [    x:collection1] o.a.s.u.p.LogUpdateProcessorFactory [collection1]  webapp=/solr path=/update params={wt=javabin&version=2}{add=[39]} 0 0
   [junit4]   2> 752788 INFO  (qtp394885212-4495) [    x:collection1] o.a.s.u.p.LogUpdateProcessorFactory [collection1]  webapp=/solr path=/update params={wt=javabin&version=2}{add=[40]} 0 0
   [junit4]   2> 752790 INFO  (qtp394885212-4494) [    x:collection1] o.a.s.u.p.LogUpdateProcessorFactory [collection1]  webapp=/solr path=/update params={wt=javabin&version=2}{add=[41]} 0 0
   [junit4]   2> 752793 INFO  (qtp394885212-4492) [    x:collection1] o.a.s.u.p.LogUpdateProcessorFactory [collection1]  webapp=/solr path=/update params={wt=javabin&version=2}{add=[42]} 0 0
   [junit4]   2> 752795 INFO  (qtp394885212-4496) [    x:collection1] o.a.s.u.p.LogUpdateProcessorFactory [collection1]  webapp=/solr path=/update params={wt=javabin&version=2}{add=[43]} 0 0
   [junit4]   2> 752797 INFO  (qtp394885212-4493) [    x:collection1] o.a.s.u.p.LogUpdateProcessorFactory [collection1]  webapp=/solr path=/update params={wt=javabin&version=2}{add=[44]} 0 0
   [junit4]   2> 752799 INFO  (qtp394885212-4500) [    x:collection1] o.a.s.u.p.LogUpdateProcessorFactory [collection1]  webapp=/solr path=/update params={wt=javabin&version=2}{add=[45]} 0 0
   [junit4]   2> 752802 INFO  (qtp394885212-4495) [    x:collection1] o.a.s.u.p.LogUpdateProcessorFactory [collection1]  webapp=/solr path=/update params={wt=javabin&version=2}{add=[46]} 0 0
   [junit4]   2> 752804 INFO  (qtp394885212-4494) [    x:collection1] o.a.s.u.p.LogUpdateProcessorFactory [collection1]  webapp=/solr path=/update params={wt=javabin&version=2}{add=[47]} 0 0
   [junit4]   2> 752807 INFO  (qtp394885212-4492) [    x:collection1] o.a.s.u.p.LogUpdateProcessorFactory [collection1]  webapp=/solr path=/update params={wt=javabin&version=2}{add=[48]} 0 0
   [junit4]   2> 752809 INFO  (qtp394885212-4496) [    x:collection1] o.a.s.u.p.LogUpdateProcessorFactory [collection1]  webapp=/solr path=/update params={wt=javabin&version=2}{add=[49]} 0 0
   [junit4]   2> 752811 INFO  (qtp394885212-4493) [    x:collection1] o.a.s.u.p.LogUpdateProcessorFactory [collection1]  webapp=/solr path=/update params={wt=javabin&version=2}{add=[50]} 0 0
   [junit4]   2> 752813 INFO  (qtp394885212-4500) [    x:collection1] o.a.s.u.p.LogUpdateProcessorFactory [collection1]  webapp=/solr path=/update params={wt=javabin&version=2}{add=[51]} 0 0
   [junit4]   2> 752816 INFO  (qtp394885212-4495) [    x:collection1] o.a.s.u.p.LogUpdateProcessorFactory [collection1]  webapp=/solr path=/update params={wt=javabin&version=2}{add=[52]} 0 0
   [junit4]   2> 752819 INFO  (qtp394885212-4494) [    x:collection1] o.a.s.u.p.LogUpdateProcessorFactory [collection1]  webapp=/solr path=/update params={wt=javabin&version=2}{add=[53]} 0 0
   [junit4]   2> 752821 INFO  (qtp394885212-4492) [    x:collection1] o.a.s.u.p.LogUpdateProcessorFactory [collection1]  webapp=/solr path=/update params={wt=javabin&version=2}{add=[54]} 0 0
   [junit4]   2> 752823 INFO  (qtp394885212-4496) [    x:collection1] o.a.s.u.DirectUpdateHandler2 start commit{,optimize=false,openSearcher=true,waitSearcher=true,expungeDeletes=false,softCommit=false,prepareCommit=false}
   [junit4]   2> 752829 INFO  (qtp394885212-4496) [    x:collection1] o.a.s.c.SolrDeletionPolicy SolrDeletionPolicy.onCommit: commits: num=2
   [junit4]   2> 	commit{dir=MockDirectoryWrapper(RAMDirectory@7c7b8fe3 lockFactory=org.apache.lucene.store.SingleInstanceLockFactory@1423bfee),segFN=segments_1,generation=1}
   [junit4]   2> 	commit{dir=MockDirectoryWrapper(RAMDirectory@7c7b8fe3 lockFactory=org.apache.lucene.store.SingleInstanceLockFactory@1423bfee),segFN=segments_2,generation=2}
   [junit4]   2> 752829 INFO  (qtp394885212-4496) [    x:collection1] o.a.s.c.SolrDeletionPolicy newest commit generation = 2
   [junit4]   2> 752830 INFO  (Thread-3674) [    x:collection1] o.a.s.h.SnapShooter Creating backup snapshot <not named> at /x1/jenkins/jenkins-slave/workspace/Lucene-Solr-Tests-5.x-Java7/solr/build/solr-core/test/J1/temp/solr.handler.TestReplicationHandlerBackup_DFB6C4D531D8ABD0-001/solr-instance-002/./collection1/data/
   [junit4]   2> 752831 INFO  (qtp394885212-4496) [    x:collection1] o.a.s.s.SolrIndexSearcher Opening Searcher@2ce282a9[collection1] main
   [junit4]   2> 752832 INFO  (qtp394885212-4496) [    x:collection1] o.a.s.u.DirectUpdateHandler2 end_commit_flush
   [junit4]   2> 752832 INFO  (searcherExecutor-835-thread-1-processing-x:collection1) [    x:collection1] o.a.s.c.SolrCore [collection1] Registered new searcher Searcher@2ce282a9[collection1] main{ExitableDirectoryReader(UninvertingDirectoryReader(Uninverting(_0(5.5.0):c55)))}
   [junit4]   2> 752832 INFO  (Thread-3674) [    x:collection1] o.a.s.h.SnapShooter Done creating backup snapshot: <not named> at /x1/jenkins/jenkins-slave/workspace/Lucene-Solr-Tests-5.x-Java7/solr/build/solr-core/test/J1/temp/solr.handler.TestReplicationHandlerBackup_DFB6C4D531D8ABD0-001/solr-instance-002/./collection1/data/
   [junit4]   2> 752832 INFO  (qtp394885212-4496) [    x:collection1] o.a.s.u.p.LogUpdateProcessorFactory [collection1]  webapp=/solr path=/update params={softCommit=false&waitSearcher=true&wt=javabin&commit=true&version=2}{commit=} 0 8
   [junit4]   2> 752835 INFO  (qtp394885212-4493) [    x:collection1] o.a.s.c.S.Request [collection1]  webapp=/solr path=/replication params={command=details} status=0 QTime=0
   [junit4]   2> 753842 INFO  (TEST-TestReplicationHandlerBackup.testBackupOnCommit-seed#[DFB6C4D531D8ABD0]) [    ] o.a.s.SolrTestCaseJ4 ###Ending testBackupOnCommit
   [junit4]   2> 753844 INFO  (TEST-TestReplicationHandlerBackup.testBackupOnCommit-seed#[DFB6C4D531D8ABD0]) [    ] o.e.j.s.ServerConnector Stopped ServerConnector@5e3d66a{HTTP/1.1}{127.0.0.1:0}
   [junit4]   2> 753844 INFO  (TEST-TestReplicationHandlerBackup.testBackupOnCommit-seed#[DFB6C4D531D8ABD0]) [    ] o.a.s.c.CoreContainer Shutting down CoreContainer instance=1530220710
   [junit4]   2> 753845 INFO  (TEST-TestReplicationHandlerBackup.testBackupOnCommit-seed#[DFB6C4D531D8ABD0]) [    x:collection1] o.a.s.c.SolrCore [collection1]  CLOSING SolrCore org.apache.solr.core.SolrCore@51483946
   [junit4]   2> 753845 INFO  (TEST-TestReplicationHandlerBackup.testBackupOnCommit-seed#[DFB6C4D531D8ABD0]) [    x:collection1] o.a.s.u.DirectUpdateHandler2 closing DirectUpdateHandler2{commits=1,autocommits=0,soft autocommits=0,optimizes=0,rollbacks=0,expungeDeletes=0,docsPending=0,adds=0,deletesById=0,deletesByQuery=0,errors=0,cumulative_adds=55,cumulative_deletesById=0,cumulative_deletesByQuery=1,cumulative_errors=0}
   [junit4]   2> 753845 INFO  (TEST-TestReplicationHandlerBackup.testBackupOnCommit-seed#[DFB6C4D531D8ABD0]) [    x:collection1] o.a.s.u.SolrCoreState Closing SolrCoreState
   [junit4]   2> 753845 INFO  (TEST-TestReplicationHandlerBackup.testBackupOnCommit-seed#[DFB6C4D531D8ABD0]) [    x:collection1] o.a.s.u.DefaultSolrCoreState SolrCoreState ref count has reached 0 - closing IndexWriter
   [junit4]   2> 753845 INFO  (TEST-TestReplicationHandlerBackup.testBackupOnCommit-seed#[DFB6C4D531D8ABD0]) [    x:collection1] o.a.s.u.DefaultSolrCoreState closing IndexWriter with IndexWriterCloser
   [junit4]   2> 753846 INFO  (TEST-TestReplicationHandlerBackup.testBackupOnCommit-seed#[DFB6C4D531D8ABD0]) [    x:collection1] o.a.s.c.SolrCore [collection1] Closing main searcher on request.
   [junit4]   2> 753846 INFO  (TEST-TestReplicationHandlerBackup.testBackupOnCommit-seed#[DFB6C4D531D8ABD0]) [    x:collection1] o.a.s.c.CachingDirectoryFactory Closing MockDirectoryFactory - 2 directories currently being tracked
   [junit4]   2> 753846 INFO  (TEST-TestReplicationHandlerBackup.testBackupOnCommit-seed#[DFB6C4D531D8ABD0]) [    x:collection1] o.a.s.c.CachingDirectoryFactory looking to close /x1/jenkins/jenkins-slave/workspace/Lucene-Solr-Tests-5.x-Java7/solr/build/solr-core/test/J1/temp/solr.handler.TestReplicationHandlerBackup_DFB6C4D531D8ABD0-001/solr-instance-002/./collection1/data/index [CachedDir<<refCount=0;path=/x1/jenkins/jenkins-slave/workspace/Lucene-Solr-Tests-5.x-Java7/solr/build/solr-core/test/J1/temp/solr.handler.TestReplicationHandlerBackup_DFB6C4D531D8ABD0-001/solr-instance-002/./collection1/data/index;done=false>>]
   [junit4]   2> 753846 INFO  (TEST-TestReplicationHandlerBackup.testBackupOnCommit-seed#[DFB6C4D531D8ABD0]) [    x:collection1] o.a.s.c.CachingDirectoryFactory Closing directory: /x1/jenkins/jenkins-slave/workspace/Lucene-Solr-Tests-5.x-Java7/solr/build/solr-core/test/J1/temp/solr.handler.TestReplicationHandlerBackup_DFB6C4D531D8ABD0-001/solr-instance-002/./collection1/data/index
   [junit4]   2> 753846 INFO  (TEST-TestReplicationHandlerBackup.testBackupOnCommit-seed#[DFB6C4D531D8ABD0]) [    x:collection1] o.a.s.c.CachingDirectoryFactory looking to close /x1/jenkins/jenkins-slave/workspace/Lucene-Solr-Tests-5.x-Java7/solr/build/solr-core/test/J1/temp/solr.handler.TestReplicationHandlerBackup_DFB6C4D531D8ABD0-001/solr-instance-002/./collection1/data [CachedDir<<refCount=0;path=/x1/jenkins/jenkins-slave/workspace/Lucene-Solr-Tests-5.x-Java7/solr/build/solr-core/test/J1/temp/solr.handler.TestReplicationHandlerBackup_DFB6C4D531D8ABD0-001/solr-instance-002/./collection1/data;done=false>>]
   [junit4]   2> 753846 INFO  (TEST-TestReplicationHandlerBackup.testBackupOnCommit-seed#[DFB6C4D531D8ABD0]) [    x:collection1] o.a.s.c.CachingDirectoryFactory Closing directory: /x1/jenkins/jenkins-slave/workspace/Lucene-Solr-Tests-5.x-Java7/solr/build/solr-core/test/J1/temp/solr.handler.TestReplicationHandlerBackup_DFB6C4D531D8ABD0-001/solr-instance-002/./collection1/data
   [junit4]   2> 753847 INFO  (TEST-TestReplicationHandlerBackup.testBackupOnCommit-seed#[DFB6C4D531D8ABD0]) [    x:collection1] o.e.j.s.h.ContextHandler Stopped o.e.j.s.ServletContextHandler@3c8f9f08{/solr,null,UNAVAILABLE}
   [junit4]   2> 753849 INFO  (SUITE-TestReplicationHandlerBackup-seed#[DFB6C4D531D8ABD0]-worker) [    ] o.a.s.SolrTestCaseJ4 ###deleteCore
   [junit4]   2> NOTE: leaving temporary files on disk at: /x1/jenkins/jenkins-slave/workspace/Lucene-Solr-Tests-5.x-Java7/solr/build/solr-core/test/J1/temp/solr.handler.TestReplicationHandlerBackup_DFB6C4D531D8ABD0-001
   [junit4]   2> NOTE: test params are: codec=Asserting(Lucene54): {name=PostingsFormat(name=Asserting), id=PostingsFormat(name=Asserting)}, docValues:{}, sim=DefaultSimilarity, locale=ru-RU, timezone=Europe/Sofia
   [junit4]   2> NOTE: Linux 3.13.0-52-generic amd64/Oracle Corporation 1.7.0_80 (64-bit)/cpus=4,threads=1,free=139586936,total=344981504
   [junit4]   2> NOTE: All tests run in this JVM: [UpdateRequestProcessorFactoryTest, TestQuerySenderNoQuery, AddSchemaFieldsUpdateProcessorFactoryTest, TestFastLRUCache, TestCursorMarkWithoutUniqueKey, TestStressVersions, TestAddFieldRealTimeGet, DistributedIntervalFacetingTest, TestDocumentBuilder, SuggesterFSTTest, AnalyticsMergeStrategyTest, DocExpirationUpdateProcessorFactoryTest, ClusterStateUpdateTest, TestExceedMaxTermLength, MergeStrategyTest, PKIAuthenticationIntegrationTest, TestLMJelinekMercerSimilarityFactory, TestRecoveryHdfs, TestPivotHelperCode, TestQueryUtils, LeaderInitiatedRecoveryOnCommitTest, TestUniqueKeyFieldResource, BlockJoinFacetDistribTest, SmileWriterTest, TestReplicationHandlerBackup]
   [junit4] Completed [83/565 (1!)] on J1 in 2.57s, 2 tests, 1 failure <<< FAILURES!

[...truncated 1569 lines...]
BUILD FAILED
/x1/jenkins/jenkins-slave/workspace/Lucene-Solr-Tests-5.x-Java7/build.xml:794: The following error occurred while executing this line:
/x1/jenkins/jenkins-slave/workspace/Lucene-Solr-Tests-5.x-Java7/build.xml:738: The following error occurred while executing this line:
/x1/jenkins/jenkins-slave/workspace/Lucene-Solr-Tests-5.x-Java7/build.xml:59: The following error occurred while executing this line:
/x1/jenkins/jenkins-slave/workspace/Lucene-Solr-Tests-5.x-Java7/solr/build.xml:233: The following error occurred while executing this line:
/x1/jenkins/jenkins-slave/workspace/Lucene-Solr-Tests-5.x-Java7/solr/common-build.xml:534: The following error occurred while executing this line:
/x1/jenkins/jenkins-slave/workspace/Lucene-Solr-Tests-5.x-Java7/lucene/common-build.xml:1444: The following error occurred while executing this line:
/x1/jenkins/jenkins-slave/workspace/Lucene-Solr-Tests-5.x-Java7/lucene/common-build.xml:1000: There were test failures: 565 suites (7 ignored), 2259 tests, 1 failure, 54 ignored (39 assumptions) [seed: DFB6C4D531D8ABD0]

Total time: 86 minutes 25 seconds
Build step 'Invoke Ant' marked build as failure
Archiving artifacts
Recording test results
Email was triggered for: Failure - Any
Sending email for trigger: Failure - Any



Mime
View raw message