lucene-dev mailing list archives

Site index · List index
Message view « Date » · « Thread »
Top « Date » · « Thread »
From Policeman Jenkins Server <jenk...@thetaphi.de>
Subject [JENKINS] Lucene-Solr-trunk-Linux (64bit/jdk1.8.0_66) - Build # 15500 - Still Failing!
Date Sun, 10 Jan 2016 03:26:01 GMT
Build: http://jenkins.thetaphi.de/job/Lucene-Solr-trunk-Linux/15500/
Java: 64bit/jdk1.8.0_66 -XX:+UseCompressedOops -XX:+UseG1GC

1 tests failed.
FAILED:  org.apache.solr.cloud.HttpPartitionTest.test

Error Message:
Didn't see all replicas for shard shard1 in c8n_1x2 come up within 30000 ms! ClusterState: {   "collection1":{     "replicationFactor":"1",     "shards":{       "shard1":{         "range":"80000000-ffffffff",         "state":"active",         "replicas":{"core_node2":{             "core":"collection1",             "base_url":"http://127.0.0.1:45602",             "node_name":"127.0.0.1:45602_",             "state":"active",             "leader":"true"}}},       "shard2":{         "range":"0-7fffffff",         "state":"active",         "replicas":{           "core_node1":{             "core":"collection1",             "base_url":"http://127.0.0.1:40878",             "node_name":"127.0.0.1:40878_",             "state":"active",             "leader":"true"},           "core_node3":{             "core":"collection1",             "base_url":"http://127.0.0.1:45045",             "node_name":"127.0.0.1:45045_",             "state":"active"}}}},     "router":{"name":"compositeId"},     "maxShardsPerNode":"1",     "autoAddReplicas":"false",     "autoCreated":"true"},   "control_collection":{     "replicationFactor":"1",     "shards":{"shard1":{         "range":"80000000-7fffffff",         "state":"active",         "replicas":{"core_node1":{             "core":"collection1",             "base_url":"http://127.0.0.1:58979",             "node_name":"127.0.0.1:58979_",             "state":"active",             "leader":"true"}}}},     "router":{"name":"compositeId"},     "maxShardsPerNode":"1",     "autoAddReplicas":"false",     "autoCreated":"true"},   "c8n_1x2":{     "replicationFactor":"2",     "shards":{"shard1":{         "range":"80000000-7fffffff",         "state":"active",         "replicas":{           "core_node1":{             "core":"c8n_1x2_shard1_replica2",             "base_url":"http://127.0.0.1:58979",             "node_name":"127.0.0.1:58979_",             "state":"recovering"},           "core_node2":{             "core":"c8n_1x2_shard1_replica1",             "base_url":"http://127.0.0.1:45602",             "node_name":"127.0.0.1:45602_",             "state":"active",             "leader":"true"}}}},     "router":{"name":"compositeId"},     "maxShardsPerNode":"1",     "autoAddReplicas":"false"},   "collMinRf_1x3":{     "replicationFactor":"3",     "shards":{"shard1":{         "range":"80000000-7fffffff",         "state":"active",         "replicas":{           "core_node1":{             "core":"collMinRf_1x3_shard1_replica1",             "base_url":"http://127.0.0.1:58979",             "node_name":"127.0.0.1:58979_",             "state":"active"},           "core_node2":{             "core":"collMinRf_1x3_shard1_replica2",             "base_url":"http://127.0.0.1:45045",             "node_name":"127.0.0.1:45045_",             "state":"active"},           "core_node3":{             "core":"collMinRf_1x3_shard1_replica3",             "base_url":"http://127.0.0.1:40878",             "node_name":"127.0.0.1:40878_",             "state":"active",             "leader":"true"}}}},     "router":{"name":"compositeId"},     "maxShardsPerNode":"1",     "autoAddReplicas":"false"}}

Stack Trace:
java.lang.AssertionError: Didn't see all replicas for shard shard1 in c8n_1x2 come up within 30000 ms! ClusterState: {
  "collection1":{
    "replicationFactor":"1",
    "shards":{
      "shard1":{
        "range":"80000000-ffffffff",
        "state":"active",
        "replicas":{"core_node2":{
            "core":"collection1",
            "base_url":"http://127.0.0.1:45602",
            "node_name":"127.0.0.1:45602_",
            "state":"active",
            "leader":"true"}}},
      "shard2":{
        "range":"0-7fffffff",
        "state":"active",
        "replicas":{
          "core_node1":{
            "core":"collection1",
            "base_url":"http://127.0.0.1:40878",
            "node_name":"127.0.0.1:40878_",
            "state":"active",
            "leader":"true"},
          "core_node3":{
            "core":"collection1",
            "base_url":"http://127.0.0.1:45045",
            "node_name":"127.0.0.1:45045_",
            "state":"active"}}}},
    "router":{"name":"compositeId"},
    "maxShardsPerNode":"1",
    "autoAddReplicas":"false",
    "autoCreated":"true"},
  "control_collection":{
    "replicationFactor":"1",
    "shards":{"shard1":{
        "range":"80000000-7fffffff",
        "state":"active",
        "replicas":{"core_node1":{
            "core":"collection1",
            "base_url":"http://127.0.0.1:58979",
            "node_name":"127.0.0.1:58979_",
            "state":"active",
            "leader":"true"}}}},
    "router":{"name":"compositeId"},
    "maxShardsPerNode":"1",
    "autoAddReplicas":"false",
    "autoCreated":"true"},
  "c8n_1x2":{
    "replicationFactor":"2",
    "shards":{"shard1":{
        "range":"80000000-7fffffff",
        "state":"active",
        "replicas":{
          "core_node1":{
            "core":"c8n_1x2_shard1_replica2",
            "base_url":"http://127.0.0.1:58979",
            "node_name":"127.0.0.1:58979_",
            "state":"recovering"},
          "core_node2":{
            "core":"c8n_1x2_shard1_replica1",
            "base_url":"http://127.0.0.1:45602",
            "node_name":"127.0.0.1:45602_",
            "state":"active",
            "leader":"true"}}}},
    "router":{"name":"compositeId"},
    "maxShardsPerNode":"1",
    "autoAddReplicas":"false"},
  "collMinRf_1x3":{
    "replicationFactor":"3",
    "shards":{"shard1":{
        "range":"80000000-7fffffff",
        "state":"active",
        "replicas":{
          "core_node1":{
            "core":"collMinRf_1x3_shard1_replica1",
            "base_url":"http://127.0.0.1:58979",
            "node_name":"127.0.0.1:58979_",
            "state":"active"},
          "core_node2":{
            "core":"collMinRf_1x3_shard1_replica2",
            "base_url":"http://127.0.0.1:45045",
            "node_name":"127.0.0.1:45045_",
            "state":"active"},
          "core_node3":{
            "core":"collMinRf_1x3_shard1_replica3",
            "base_url":"http://127.0.0.1:40878",
            "node_name":"127.0.0.1:40878_",
            "state":"active",
            "leader":"true"}}}},
    "router":{"name":"compositeId"},
    "maxShardsPerNode":"1",
    "autoAddReplicas":"false"}}
	at __randomizedtesting.SeedInfo.seed([1E8E755F8FF10DA4:96DA4A85210D605C]:0)
	at org.junit.Assert.fail(Assert.java:93)
	at org.apache.solr.cloud.AbstractFullDistribZkTestBase.ensureAllReplicasAreActive(AbstractFullDistribZkTestBase.java:1844)
	at org.apache.solr.cloud.HttpPartitionTest.testRf2(HttpPartitionTest.java:349)
	at org.apache.solr.cloud.HttpPartitionTest.test(HttpPartitionTest.java:109)
	at sun.reflect.NativeMethodAccessorImpl.invoke0(Native Method)
	at sun.reflect.NativeMethodAccessorImpl.invoke(NativeMethodAccessorImpl.java:62)
	at sun.reflect.DelegatingMethodAccessorImpl.invoke(DelegatingMethodAccessorImpl.java:43)
	at java.lang.reflect.Method.invoke(Method.java:497)
	at com.carrotsearch.randomizedtesting.RandomizedRunner.invoke(RandomizedRunner.java:1764)
	at com.carrotsearch.randomizedtesting.RandomizedRunner$8.evaluate(RandomizedRunner.java:871)
	at com.carrotsearch.randomizedtesting.RandomizedRunner$9.evaluate(RandomizedRunner.java:907)
	at com.carrotsearch.randomizedtesting.RandomizedRunner$10.evaluate(RandomizedRunner.java:921)
	at org.apache.solr.BaseDistributedSearchTestCase$ShardsRepeatRule$ShardsFixedStatement.callStatement(BaseDistributedSearchTestCase.java:965)
	at org.apache.solr.BaseDistributedSearchTestCase$ShardsRepeatRule$ShardsStatement.evaluate(BaseDistributedSearchTestCase.java:940)
	at com.carrotsearch.randomizedtesting.rules.SystemPropertiesRestoreRule$1.evaluate(SystemPropertiesRestoreRule.java:57)
	at org.apache.lucene.util.TestRuleSetupTeardownChained$1.evaluate(TestRuleSetupTeardownChained.java:50)
	at org.apache.lucene.util.AbstractBeforeAfterRule$1.evaluate(AbstractBeforeAfterRule.java:46)
	at org.apache.lucene.util.TestRuleThreadAndTestName$1.evaluate(TestRuleThreadAndTestName.java:49)
	at org.apache.lucene.util.TestRuleIgnoreAfterMaxFailures$1.evaluate(TestRuleIgnoreAfterMaxFailures.java:65)
	at org.apache.lucene.util.TestRuleMarkFailure$1.evaluate(TestRuleMarkFailure.java:48)
	at com.carrotsearch.randomizedtesting.rules.StatementAdapter.evaluate(StatementAdapter.java:36)
	at com.carrotsearch.randomizedtesting.ThreadLeakControl$StatementRunner.run(ThreadLeakControl.java:367)
	at com.carrotsearch.randomizedtesting.ThreadLeakControl.forkTimeoutingTask(ThreadLeakControl.java:809)
	at com.carrotsearch.randomizedtesting.ThreadLeakControl$3.evaluate(ThreadLeakControl.java:460)
	at com.carrotsearch.randomizedtesting.RandomizedRunner.runSingleTest(RandomizedRunner.java:880)
	at com.carrotsearch.randomizedtesting.RandomizedRunner$5.evaluate(RandomizedRunner.java:781)
	at com.carrotsearch.randomizedtesting.RandomizedRunner$6.evaluate(RandomizedRunner.java:816)
	at com.carrotsearch.randomizedtesting.RandomizedRunner$7.evaluate(RandomizedRunner.java:827)
	at com.carrotsearch.randomizedtesting.rules.StatementAdapter.evaluate(StatementAdapter.java:36)
	at com.carrotsearch.randomizedtesting.rules.SystemPropertiesRestoreRule$1.evaluate(SystemPropertiesRestoreRule.java:57)
	at org.apache.lucene.util.AbstractBeforeAfterRule$1.evaluate(AbstractBeforeAfterRule.java:46)
	at com.carrotsearch.randomizedtesting.rules.StatementAdapter.evaluate(StatementAdapter.java:36)
	at org.apache.lucene.util.TestRuleStoreClassName$1.evaluate(TestRuleStoreClassName.java:42)
	at com.carrotsearch.randomizedtesting.rules.NoShadowingOrOverridesOnMethodsRule$1.evaluate(NoShadowingOrOverridesOnMethodsRule.java:40)
	at com.carrotsearch.randomizedtesting.rules.NoShadowingOrOverridesOnMethodsRule$1.evaluate(NoShadowingOrOverridesOnMethodsRule.java:40)
	at com.carrotsearch.randomizedtesting.rules.StatementAdapter.evaluate(StatementAdapter.java:36)
	at com.carrotsearch.randomizedtesting.rules.StatementAdapter.evaluate(StatementAdapter.java:36)
	at com.carrotsearch.randomizedtesting.rules.StatementAdapter.evaluate(StatementAdapter.java:36)
	at org.apache.lucene.util.TestRuleAssertionsRequired$1.evaluate(TestRuleAssertionsRequired.java:54)
	at org.apache.lucene.util.TestRuleMarkFailure$1.evaluate(TestRuleMarkFailure.java:48)
	at org.apache.lucene.util.TestRuleIgnoreAfterMaxFailures$1.evaluate(TestRuleIgnoreAfterMaxFailures.java:65)
	at org.apache.lucene.util.TestRuleIgnoreTestSuites$1.evaluate(TestRuleIgnoreTestSuites.java:55)
	at com.carrotsearch.randomizedtesting.rules.StatementAdapter.evaluate(StatementAdapter.java:36)
	at com.carrotsearch.randomizedtesting.ThreadLeakControl$StatementRunner.run(ThreadLeakControl.java:367)
	at java.lang.Thread.run(Thread.java:745)




Build Log:
[...truncated 10786 lines...]
   [junit4] Suite: org.apache.solr.cloud.HttpPartitionTest
   [junit4]   2> Creating dataDir: /home/jenkins/workspace/Lucene-Solr-trunk-Linux/solr/build/solr-core/test/J0/temp/solr.cloud.HttpPartitionTest_1E8E755F8FF10DA4-001/init-core-data-001
   [junit4]   2> 1194439 INFO  (SUITE-HttpPartitionTest-seed#[1E8E755F8FF10DA4]-worker) [    ] o.a.s.BaseDistributedSearchTestCase Setting hostContext system property: /
   [junit4]   2> 1194440 INFO  (TEST-HttpPartitionTest.test-seed#[1E8E755F8FF10DA4]) [    ] o.a.s.c.ZkTestServer STARTING ZK TEST SERVER
   [junit4]   2> 1194440 INFO  (Thread-5007) [    ] o.a.s.c.ZkTestServer client port:0.0.0.0/0.0.0.0:0
   [junit4]   2> 1194440 INFO  (Thread-5007) [    ] o.a.s.c.ZkTestServer Starting server
   [junit4]   2> 1194540 INFO  (TEST-HttpPartitionTest.test-seed#[1E8E755F8FF10DA4]) [    ] o.a.s.c.ZkTestServer start zk server on port:41992
   [junit4]   2> 1194541 INFO  (TEST-HttpPartitionTest.test-seed#[1E8E755F8FF10DA4]) [    ] o.a.s.c.c.SolrZkClient Using default ZkCredentialsProvider
   [junit4]   2> 1194541 INFO  (TEST-HttpPartitionTest.test-seed#[1E8E755F8FF10DA4]) [    ] o.a.s.c.c.ConnectionManager Waiting for client to connect to ZooKeeper
   [junit4]   2> 1194544 INFO  (zkCallback-1878-thread-1) [    ] o.a.s.c.c.ConnectionManager Watcher org.apache.solr.common.cloud.ConnectionManager@37acec81 name:ZooKeeperConnection Watcher:127.0.0.1:41992 got event WatchedEvent state:SyncConnected type:None path:null path:null type:None
   [junit4]   2> 1194544 INFO  (TEST-HttpPartitionTest.test-seed#[1E8E755F8FF10DA4]) [    ] o.a.s.c.c.ConnectionManager Client is connected to ZooKeeper
   [junit4]   2> 1194544 INFO  (TEST-HttpPartitionTest.test-seed#[1E8E755F8FF10DA4]) [    ] o.a.s.c.c.SolrZkClient Using default ZkACLProvider
   [junit4]   2> 1194544 INFO  (TEST-HttpPartitionTest.test-seed#[1E8E755F8FF10DA4]) [    ] o.a.s.c.c.SolrZkClient makePath: /solr
   [junit4]   2> 1194546 INFO  (TEST-HttpPartitionTest.test-seed#[1E8E755F8FF10DA4]) [    ] o.a.s.c.c.SolrZkClient Using default ZkCredentialsProvider
   [junit4]   2> 1194547 INFO  (TEST-HttpPartitionTest.test-seed#[1E8E755F8FF10DA4]) [    ] o.a.s.c.c.ConnectionManager Waiting for client to connect to ZooKeeper
   [junit4]   2> 1194547 INFO  (zkCallback-1879-thread-1) [    ] o.a.s.c.c.ConnectionManager Watcher org.apache.solr.common.cloud.ConnectionManager@36184fb0 name:ZooKeeperConnection Watcher:127.0.0.1:41992/solr got event WatchedEvent state:SyncConnected type:None path:null path:null type:None
   [junit4]   2> 1194547 INFO  (TEST-HttpPartitionTest.test-seed#[1E8E755F8FF10DA4]) [    ] o.a.s.c.c.ConnectionManager Client is connected to ZooKeeper
   [junit4]   2> 1194548 INFO  (TEST-HttpPartitionTest.test-seed#[1E8E755F8FF10DA4]) [    ] o.a.s.c.c.SolrZkClient Using default ZkACLProvider
   [junit4]   2> 1194548 INFO  (TEST-HttpPartitionTest.test-seed#[1E8E755F8FF10DA4]) [    ] o.a.s.c.c.SolrZkClient makePath: /collections/collection1
   [junit4]   2> 1194549 INFO  (TEST-HttpPartitionTest.test-seed#[1E8E755F8FF10DA4]) [    ] o.a.s.c.c.SolrZkClient makePath: /collections/collection1/shards
   [junit4]   2> 1194549 INFO  (TEST-HttpPartitionTest.test-seed#[1E8E755F8FF10DA4]) [    ] o.a.s.c.c.SolrZkClient makePath: /collections/control_collection
   [junit4]   2> 1194549 INFO  (TEST-HttpPartitionTest.test-seed#[1E8E755F8FF10DA4]) [    ] o.a.s.c.c.SolrZkClient makePath: /collections/control_collection/shards
   [junit4]   2> 1194550 INFO  (TEST-HttpPartitionTest.test-seed#[1E8E755F8FF10DA4]) [    ] o.a.s.c.AbstractZkTestCase put /home/jenkins/workspace/Lucene-Solr-trunk-Linux/solr/core/src/test-files/solr/collection1/conf/solrconfig-tlog.xml to /configs/conf1/solrconfig.xml
   [junit4]   2> 1194550 INFO  (TEST-HttpPartitionTest.test-seed#[1E8E755F8FF10DA4]) [    ] o.a.s.c.c.SolrZkClient makePath: /configs/conf1/solrconfig.xml
   [junit4]   2> 1194551 INFO  (TEST-HttpPartitionTest.test-seed#[1E8E755F8FF10DA4]) [    ] o.a.s.c.AbstractZkTestCase put /home/jenkins/workspace/Lucene-Solr-trunk-Linux/solr/core/src/test-files/solr/collection1/conf/schema.xml to /configs/conf1/schema.xml
   [junit4]   2> 1194551 INFO  (TEST-HttpPartitionTest.test-seed#[1E8E755F8FF10DA4]) [    ] o.a.s.c.c.SolrZkClient makePath: /configs/conf1/schema.xml
   [junit4]   2> 1194551 INFO  (TEST-HttpPartitionTest.test-seed#[1E8E755F8FF10DA4]) [    ] o.a.s.c.AbstractZkTestCase put /home/jenkins/workspace/Lucene-Solr-trunk-Linux/solr/core/src/test-files/solr/collection1/conf/solrconfig.snippet.randomindexconfig.xml to /configs/conf1/solrconfig.snippet.randomindexconfig.xml
   [junit4]   2> 1194551 INFO  (TEST-HttpPartitionTest.test-seed#[1E8E755F8FF10DA4]) [    ] o.a.s.c.c.SolrZkClient makePath: /configs/conf1/solrconfig.snippet.randomindexconfig.xml
   [junit4]   2> 1194552 INFO  (TEST-HttpPartitionTest.test-seed#[1E8E755F8FF10DA4]) [    ] o.a.s.c.AbstractZkTestCase put /home/jenkins/workspace/Lucene-Solr-trunk-Linux/solr/core/src/test-files/solr/collection1/conf/stopwords.txt to /configs/conf1/stopwords.txt
   [junit4]   2> 1194552 INFO  (TEST-HttpPartitionTest.test-seed#[1E8E755F8FF10DA4]) [    ] o.a.s.c.c.SolrZkClient makePath: /configs/conf1/stopwords.txt
   [junit4]   2> 1194552 INFO  (TEST-HttpPartitionTest.test-seed#[1E8E755F8FF10DA4]) [    ] o.a.s.c.AbstractZkTestCase put /home/jenkins/workspace/Lucene-Solr-trunk-Linux/solr/core/src/test-files/solr/collection1/conf/protwords.txt to /configs/conf1/protwords.txt
   [junit4]   2> 1194553 INFO  (TEST-HttpPartitionTest.test-seed#[1E8E755F8FF10DA4]) [    ] o.a.s.c.c.SolrZkClient makePath: /configs/conf1/protwords.txt
   [junit4]   2> 1194553 INFO  (TEST-HttpPartitionTest.test-seed#[1E8E755F8FF10DA4]) [    ] o.a.s.c.AbstractZkTestCase put /home/jenkins/workspace/Lucene-Solr-trunk-Linux/solr/core/src/test-files/solr/collection1/conf/currency.xml to /configs/conf1/currency.xml
   [junit4]   2> 1194553 INFO  (TEST-HttpPartitionTest.test-seed#[1E8E755F8FF10DA4]) [    ] o.a.s.c.c.SolrZkClient makePath: /configs/conf1/currency.xml
   [junit4]   2> 1194553 INFO  (TEST-HttpPartitionTest.test-seed#[1E8E755F8FF10DA4]) [    ] o.a.s.c.AbstractZkTestCase put /home/jenkins/workspace/Lucene-Solr-trunk-Linux/solr/core/src/test-files/solr/collection1/conf/enumsConfig.xml to /configs/conf1/enumsConfig.xml
   [junit4]   2> 1194554 INFO  (TEST-HttpPartitionTest.test-seed#[1E8E755F8FF10DA4]) [    ] o.a.s.c.c.SolrZkClient makePath: /configs/conf1/enumsConfig.xml
   [junit4]   2> 1194555 INFO  (TEST-HttpPartitionTest.test-seed#[1E8E755F8FF10DA4]) [    ] o.a.s.c.AbstractZkTestCase put /home/jenkins/workspace/Lucene-Solr-trunk-Linux/solr/core/src/test-files/solr/collection1/conf/open-exchange-rates.json to /configs/conf1/open-exchange-rates.json
   [junit4]   2> 1194555 INFO  (TEST-HttpPartitionTest.test-seed#[1E8E755F8FF10DA4]) [    ] o.a.s.c.c.SolrZkClient makePath: /configs/conf1/open-exchange-rates.json
   [junit4]   2> 1194555 INFO  (TEST-HttpPartitionTest.test-seed#[1E8E755F8FF10DA4]) [    ] o.a.s.c.AbstractZkTestCase put /home/jenkins/workspace/Lucene-Solr-trunk-Linux/solr/core/src/test-files/solr/collection1/conf/mapping-ISOLatin1Accent.txt to /configs/conf1/mapping-ISOLatin1Accent.txt
   [junit4]   2> 1194555 INFO  (TEST-HttpPartitionTest.test-seed#[1E8E755F8FF10DA4]) [    ] o.a.s.c.c.SolrZkClient makePath: /configs/conf1/mapping-ISOLatin1Accent.txt
   [junit4]   2> 1194556 INFO  (TEST-HttpPartitionTest.test-seed#[1E8E755F8FF10DA4]) [    ] o.a.s.c.AbstractZkTestCase put /home/jenkins/workspace/Lucene-Solr-trunk-Linux/solr/core/src/test-files/solr/collection1/conf/old_synonyms.txt to /configs/conf1/old_synonyms.txt
   [junit4]   2> 1194556 INFO  (TEST-HttpPartitionTest.test-seed#[1E8E755F8FF10DA4]) [    ] o.a.s.c.c.SolrZkClient makePath: /configs/conf1/old_synonyms.txt
   [junit4]   2> 1194556 INFO  (TEST-HttpPartitionTest.test-seed#[1E8E755F8FF10DA4]) [    ] o.a.s.c.AbstractZkTestCase put /home/jenkins/workspace/Lucene-Solr-trunk-Linux/solr/core/src/test-files/solr/collection1/conf/synonyms.txt to /configs/conf1/synonyms.txt
   [junit4]   2> 1194556 INFO  (TEST-HttpPartitionTest.test-seed#[1E8E755F8FF10DA4]) [    ] o.a.s.c.c.SolrZkClient makePath: /configs/conf1/synonyms.txt
   [junit4]   2> 1194606 INFO  (TEST-HttpPartitionTest.test-seed#[1E8E755F8FF10DA4]) [    ] o.a.s.SolrTestCaseJ4 Writing core.properties file to /home/jenkins/workspace/Lucene-Solr-trunk-Linux/solr/build/solr-core/test/J0/temp/solr.cloud.HttpPartitionTest_1E8E755F8FF10DA4-001/control-001/cores/collection1
   [junit4]   2> 1194607 INFO  (TEST-HttpPartitionTest.test-seed#[1E8E755F8FF10DA4]) [    ] o.e.j.s.Server jetty-9.2.13.v20150730
   [junit4]   2> 1194608 INFO  (TEST-HttpPartitionTest.test-seed#[1E8E755F8FF10DA4]) [    ] o.e.j.s.h.ContextHandler Started o.e.j.s.ServletContextHandler@18927011{/,null,AVAILABLE}
   [junit4]   2> 1194608 INFO  (TEST-HttpPartitionTest.test-seed#[1E8E755F8FF10DA4]) [    ] o.e.j.s.ServerConnector Started ServerConnector@3fc96ec7{HTTP/1.1}{127.0.0.1:33642}
   [junit4]   2> 1194608 INFO  (TEST-HttpPartitionTest.test-seed#[1E8E755F8FF10DA4]) [    ] o.e.j.s.Server Started @1196417ms
   [junit4]   2> 1194608 INFO  (TEST-HttpPartitionTest.test-seed#[1E8E755F8FF10DA4]) [    ] o.a.s.c.s.e.JettySolrRunner Jetty properties: {solr.data.dir=/home/jenkins/workspace/Lucene-Solr-trunk-Linux/solr/build/solr-core/test/J0/temp/solr.cloud.HttpPartitionTest_1E8E755F8FF10DA4-001/tempDir-001/control/data, hostContext=/, hostPort=58979, coreRootDirectory=/home/jenkins/workspace/Lucene-Solr-trunk-Linux/solr/build/solr-core/test/J0/temp/solr.cloud.HttpPartitionTest_1E8E755F8FF10DA4-001/control-001/cores}
   [junit4]   2> 1194608 INFO  (TEST-HttpPartitionTest.test-seed#[1E8E755F8FF10DA4]) [    ] o.a.s.s.SolrDispatchFilter SolrDispatchFilter.init(): sun.misc.Launcher$AppClassLoader@4e0e2f2a
   [junit4]   2> 1194609 INFO  (TEST-HttpPartitionTest.test-seed#[1E8E755F8FF10DA4]) [    ] o.a.s.c.SolrResourceLoader new SolrResourceLoader for directory: '/home/jenkins/workspace/Lucene-Solr-trunk-Linux/solr/build/solr-core/test/J0/temp/solr.cloud.HttpPartitionTest_1E8E755F8FF10DA4-001/control-001'
   [junit4]   2> 1194609 INFO  (TEST-HttpPartitionTest.test-seed#[1E8E755F8FF10DA4]) [    ] o.a.s.c.SolrResourceLoader JNDI not configured for solr (NoInitialContextEx)
   [junit4]   2> 1194609 INFO  (TEST-HttpPartitionTest.test-seed#[1E8E755F8FF10DA4]) [    ] o.a.s.c.SolrResourceLoader solr home defaulted to 'solr/' (could not find system property or JNDI)
   [junit4]   2> 1194609 INFO  (TEST-HttpPartitionTest.test-seed#[1E8E755F8FF10DA4]) [    ] o.a.s.c.c.SolrZkClient Using default ZkCredentialsProvider
   [junit4]   2> 1194609 INFO  (TEST-HttpPartitionTest.test-seed#[1E8E755F8FF10DA4]) [    ] o.a.s.c.c.ConnectionManager Waiting for client to connect to ZooKeeper
   [junit4]   2> 1194610 INFO  (zkCallback-1880-thread-1) [    ] o.a.s.c.c.ConnectionManager Watcher org.apache.solr.common.cloud.ConnectionManager@9404c14 name:ZooKeeperConnection Watcher:127.0.0.1:41992/solr got event WatchedEvent state:SyncConnected type:None path:null path:null type:None
   [junit4]   2> 1194610 INFO  (TEST-HttpPartitionTest.test-seed#[1E8E755F8FF10DA4]) [    ] o.a.s.c.c.ConnectionManager Client is connected to ZooKeeper
   [junit4]   2> 1194610 INFO  (TEST-HttpPartitionTest.test-seed#[1E8E755F8FF10DA4]) [    ] o.a.s.c.c.SolrZkClient Using default ZkACLProvider
   [junit4]   2> 1194610 INFO  (TEST-HttpPartitionTest.test-seed#[1E8E755F8FF10DA4]) [    ] o.a.s.s.SolrDispatchFilter Loading solr.xml from SolrHome (not found in ZooKeeper)
   [junit4]   2> 1194610 INFO  (TEST-HttpPartitionTest.test-seed#[1E8E755F8FF10DA4]) [    ] o.a.s.c.SolrXmlConfig Loading container configuration from /home/jenkins/workspace/Lucene-Solr-trunk-Linux/solr/build/solr-core/test/J0/temp/solr.cloud.HttpPartitionTest_1E8E755F8FF10DA4-001/control-001/solr.xml
   [junit4]   2> 1194613 INFO  (TEST-HttpPartitionTest.test-seed#[1E8E755F8FF10DA4]) [    ] o.a.s.c.CorePropertiesLocator Config-defined core root directory: /home/jenkins/workspace/Lucene-Solr-trunk-Linux/solr/build/solr-core/test/J0/temp/solr.cloud.HttpPartitionTest_1E8E755F8FF10DA4-001/control-001/cores
   [junit4]   2> 1194613 INFO  (TEST-HttpPartitionTest.test-seed#[1E8E755F8FF10DA4]) [    ] o.a.s.c.CoreContainer New CoreContainer 137772012
   [junit4]   2> 1194614 INFO  (TEST-HttpPartitionTest.test-seed#[1E8E755F8FF10DA4]) [    ] o.a.s.c.CoreContainer Loading cores into CoreContainer [instanceDir=/home/jenkins/workspace/Lucene-Solr-trunk-Linux/solr/build/solr-core/test/J0/temp/solr.cloud.HttpPartitionTest_1E8E755F8FF10DA4-001/control-001]
   [junit4]   2> 1194614 WARN  (TEST-HttpPartitionTest.test-seed#[1E8E755F8FF10DA4]) [    ] o.a.s.c.CoreContainer Couldn't add files from /home/jenkins/workspace/Lucene-Solr-trunk-Linux/solr/build/solr-core/test/J0/temp/solr.cloud.HttpPartitionTest_1E8E755F8FF10DA4-001/control-001/lib to classpath: /home/jenkins/workspace/Lucene-Solr-trunk-Linux/solr/build/solr-core/test/J0/temp/solr.cloud.HttpPartitionTest_1E8E755F8FF10DA4-001/control-001/lib
   [junit4]   2> 1194614 INFO  (TEST-HttpPartitionTest.test-seed#[1E8E755F8FF10DA4]) [    ] o.a.s.h.c.HttpShardHandlerFactory created with socketTimeout : 90000,urlScheme : ,connTimeout : 15000,maxConnectionsPerHost : 20,maxConnections : 10000,corePoolSize : 0,maximumPoolSize : 2147483647,maxThreadIdleTime : 5,sizeOfQueue : -1,fairnessPolicy : false,useRetries : false,
   [junit4]   2> 1194615 INFO  (TEST-HttpPartitionTest.test-seed#[1E8E755F8FF10DA4]) [    ] o.a.s.u.UpdateShardHandler Creating UpdateShardHandler HTTP client with params: socketTimeout=340000&connTimeout=45000&retry=true
   [junit4]   2> 1194615 INFO  (TEST-HttpPartitionTest.test-seed#[1E8E755F8FF10DA4]) [    ] o.a.s.l.LogWatcher SLF4J impl is org.slf4j.impl.Log4jLoggerFactory
   [junit4]   2> 1194615 INFO  (TEST-HttpPartitionTest.test-seed#[1E8E755F8FF10DA4]) [    ] o.a.s.l.LogWatcher Registering Log Listener [Log4j (org.slf4j.impl.Log4jLoggerFactory)]
   [junit4]   2> 1194615 INFO  (TEST-HttpPartitionTest.test-seed#[1E8E755F8FF10DA4]) [    ] o.a.s.c.ZkContainer Zookeeper client=127.0.0.1:41992/solr
   [junit4]   2> 1194615 INFO  (TEST-HttpPartitionTest.test-seed#[1E8E755F8FF10DA4]) [    ] o.a.s.c.ZkController zkHost includes chroot
   [junit4]   2> 1194615 INFO  (TEST-HttpPartitionTest.test-seed#[1E8E755F8FF10DA4]) [    ] o.a.s.c.c.SolrZkClient Using default ZkCredentialsProvider
   [junit4]   2> 1194616 INFO  (TEST-HttpPartitionTest.test-seed#[1E8E755F8FF10DA4]) [    ] o.a.s.c.c.ConnectionManager Waiting for client to connect to ZooKeeper
   [junit4]   2> 1194616 INFO  (zkCallback-1883-thread-1) [    ] o.a.s.c.c.ConnectionManager Watcher org.apache.solr.common.cloud.ConnectionManager@4c72e9b7 name:ZooKeeperConnection Watcher:127.0.0.1:41992 got event WatchedEvent state:SyncConnected type:None path:null path:null type:None
   [junit4]   2> 1194617 INFO  (TEST-HttpPartitionTest.test-seed#[1E8E755F8FF10DA4]) [    ] o.a.s.c.c.ConnectionManager Client is connected to ZooKeeper
   [junit4]   2> 1194617 INFO  (TEST-HttpPartitionTest.test-seed#[1E8E755F8FF10DA4]) [    ] o.a.s.c.c.SolrZkClient Using default ZkACLProvider
   [junit4]   2> 1194617 INFO  (TEST-HttpPartitionTest.test-seed#[1E8E755F8FF10DA4]) [n:127.0.0.1:58979_    ] o.a.s.c.c.ConnectionManager Waiting for client to connect to ZooKeeper
   [junit4]   2> 1194618 INFO  (zkCallback-1884-thread-1-processing-n:127.0.0.1:58979_) [n:127.0.0.1:58979_    ] o.a.s.c.c.ConnectionManager Watcher org.apache.solr.common.cloud.ConnectionManager@765135fd name:ZooKeeperConnection Watcher:127.0.0.1:41992/solr got event WatchedEvent state:SyncConnected type:None path:null path:null type:None
   [junit4]   2> 1194618 INFO  (TEST-HttpPartitionTest.test-seed#[1E8E755F8FF10DA4]) [n:127.0.0.1:58979_    ] o.a.s.c.c.ConnectionManager Client is connected to ZooKeeper
   [junit4]   2> 1194619 INFO  (TEST-HttpPartitionTest.test-seed#[1E8E755F8FF10DA4]) [n:127.0.0.1:58979_    ] o.a.s.c.c.SolrZkClient makePath: /overseer/queue
   [junit4]   2> 1194619 INFO  (TEST-HttpPartitionTest.test-seed#[1E8E755F8FF10DA4]) [n:127.0.0.1:58979_    ] o.a.s.c.c.SolrZkClient makePath: /overseer/collection-queue-work
   [junit4]   2> 1194620 INFO  (TEST-HttpPartitionTest.test-seed#[1E8E755F8FF10DA4]) [n:127.0.0.1:58979_    ] o.a.s.c.c.SolrZkClient makePath: /overseer/collection-map-running
   [junit4]   2> 1194620 INFO  (TEST-HttpPartitionTest.test-seed#[1E8E755F8FF10DA4]) [n:127.0.0.1:58979_    ] o.a.s.c.c.SolrZkClient makePath: /overseer/collection-map-completed
   [junit4]   2> 1194621 INFO  (TEST-HttpPartitionTest.test-seed#[1E8E755F8FF10DA4]) [n:127.0.0.1:58979_    ] o.a.s.c.c.SolrZkClient makePath: /overseer/collection-map-failure
   [junit4]   2> 1194621 INFO  (TEST-HttpPartitionTest.test-seed#[1E8E755F8FF10DA4]) [n:127.0.0.1:58979_    ] o.a.s.c.c.SolrZkClient makePath: /live_nodes
   [junit4]   2> 1194622 INFO  (TEST-HttpPartitionTest.test-seed#[1E8E755F8FF10DA4]) [n:127.0.0.1:58979_    ] o.a.s.c.c.SolrZkClient makePath: /aliases.json
   [junit4]   2> 1194622 INFO  (TEST-HttpPartitionTest.test-seed#[1E8E755F8FF10DA4]) [n:127.0.0.1:58979_    ] o.a.s.c.c.SolrZkClient makePath: /clusterstate.json
   [junit4]   2> 1194623 INFO  (TEST-HttpPartitionTest.test-seed#[1E8E755F8FF10DA4]) [n:127.0.0.1:58979_    ] o.a.s.c.c.SolrZkClient makePath: /security.json
   [junit4]   2> 1194623 INFO  (TEST-HttpPartitionTest.test-seed#[1E8E755F8FF10DA4]) [n:127.0.0.1:58979_    ] o.a.s.c.ZkController Register node as live in ZooKeeper:/live_nodes/127.0.0.1:58979_
   [junit4]   2> 1194623 INFO  (TEST-HttpPartitionTest.test-seed#[1E8E755F8FF10DA4]) [n:127.0.0.1:58979_    ] o.a.s.c.c.SolrZkClient makePath: /live_nodes/127.0.0.1:58979_
   [junit4]   2> 1194623 INFO  (TEST-HttpPartitionTest.test-seed#[1E8E755F8FF10DA4]) [n:127.0.0.1:58979_    ] o.a.s.c.c.SolrZkClient makePath: /overseer_elect
   [junit4]   2> 1194624 INFO  (TEST-HttpPartitionTest.test-seed#[1E8E755F8FF10DA4]) [n:127.0.0.1:58979_    ] o.a.s.c.c.SolrZkClient makePath: /overseer_elect/election
   [junit4]   2> 1194624 INFO  (TEST-HttpPartitionTest.test-seed#[1E8E755F8FF10DA4]) [n:127.0.0.1:58979_    ] o.a.s.c.Overseer Overseer (id=null) closing
   [junit4]   2> 1194624 INFO  (TEST-HttpPartitionTest.test-seed#[1E8E755F8FF10DA4]) [n:127.0.0.1:58979_    ] o.a.s.c.LeaderElector Joined leadership election with path: /overseer_elect/election/95184214179905540-127.0.0.1:58979_-n_0000000000
   [junit4]   2> 1194624 INFO  (TEST-HttpPartitionTest.test-seed#[1E8E755F8FF10DA4]) [n:127.0.0.1:58979_    ] o.a.s.c.OverseerElectionContext I am going to be the leader 127.0.0.1:58979_
   [junit4]   2> 1194624 INFO  (TEST-HttpPartitionTest.test-seed#[1E8E755F8FF10DA4]) [n:127.0.0.1:58979_    ] o.a.s.c.c.SolrZkClient makePath: /overseer_elect/leader
   [junit4]   2> 1194625 INFO  (TEST-HttpPartitionTest.test-seed#[1E8E755F8FF10DA4]) [n:127.0.0.1:58979_    ] o.a.s.c.Overseer Overseer (id=95184214179905540-127.0.0.1:58979_-n_0000000000) starting
   [junit4]   2> 1194625 INFO  (TEST-HttpPartitionTest.test-seed#[1E8E755F8FF10DA4]) [n:127.0.0.1:58979_    ] o.a.s.c.c.SolrZkClient makePath: /overseer/queue-work
   [junit4]   2> 1194628 INFO  (TEST-HttpPartitionTest.test-seed#[1E8E755F8FF10DA4]) [n:127.0.0.1:58979_    ] o.a.s.c.OverseerAutoReplicaFailoverThread Starting OverseerAutoReplicaFailoverThread autoReplicaFailoverWorkLoopDelay=10000 autoReplicaFailoverWaitAfterExpiration=30000 autoReplicaFailoverBadNodeExpiration=60000
   [junit4]   2> 1194628 INFO  (TEST-HttpPartitionTest.test-seed#[1E8E755F8FF10DA4]) [n:127.0.0.1:58979_    ] o.a.s.c.c.ZkStateReader Updating cluster state from ZooKeeper... 
   [junit4]   2> 1194628 INFO  (OverseerCollectionConfigSetProcessor-95184214179905540-127.0.0.1:58979_-n_0000000000) [n:127.0.0.1:58979_    ] o.a.s.c.OverseerTaskProcessor Process current queue of overseer operations
   [junit4]   2> 1194628 INFO  (OverseerStateUpdate-95184214179905540-127.0.0.1:58979_-n_0000000000) [n:127.0.0.1:58979_    ] o.a.s.c.Overseer Starting to work on the main queue
   [junit4]   2> 1194637 INFO  (TEST-HttpPartitionTest.test-seed#[1E8E755F8FF10DA4]) [n:127.0.0.1:58979_    ] o.a.s.c.CoreContainer Security conf doesn't exist. Skipping setup for authorization module.
   [junit4]   2> 1194637 INFO  (TEST-HttpPartitionTest.test-seed#[1E8E755F8FF10DA4]) [n:127.0.0.1:58979_    ] o.a.s.c.CoreContainer No authentication plugin used.
   [junit4]   2> 1194638 INFO  (TEST-HttpPartitionTest.test-seed#[1E8E755F8FF10DA4]) [n:127.0.0.1:58979_    ] o.a.s.c.CorePropertiesLocator Looking for core definitions underneath /home/jenkins/workspace/Lucene-Solr-trunk-Linux/solr/build/solr-core/test/J0/temp/solr.cloud.HttpPartitionTest_1E8E755F8FF10DA4-001/control-001/cores
   [junit4]   2> 1194639 INFO  (TEST-HttpPartitionTest.test-seed#[1E8E755F8FF10DA4]) [n:127.0.0.1:58979_    ] o.a.s.c.CoreDescriptor Created CoreDescriptor: {name=collection1, config=solrconfig.xml, transient=false, schema=schema.xml, loadOnStartup=true, configSetProperties=configsetprops.json, collection=control_collection, coreNodeName=, dataDir=data/, shard=}
   [junit4]   2> 1194639 INFO  (TEST-HttpPartitionTest.test-seed#[1E8E755F8FF10DA4]) [n:127.0.0.1:58979_    ] o.a.s.c.CorePropertiesLocator Found core collection1 in /home/jenkins/workspace/Lucene-Solr-trunk-Linux/solr/build/solr-core/test/J0/temp/solr.cloud.HttpPartitionTest_1E8E755F8FF10DA4-001/control-001/cores/collection1
   [junit4]   2> 1194639 INFO  (TEST-HttpPartitionTest.test-seed#[1E8E755F8FF10DA4]) [n:127.0.0.1:58979_    ] o.a.s.c.CorePropertiesLocator Found 1 core definitions
   [junit4]   2> 1194640 INFO  (TEST-HttpPartitionTest.test-seed#[1E8E755F8FF10DA4]) [n:127.0.0.1:58979_    ] o.a.s.s.SolrDispatchFilter user.dir=/home/jenkins/workspace/Lucene-Solr-trunk-Linux/solr/build/solr-core/test/J0
   [junit4]   2> 1194640 INFO  (TEST-HttpPartitionTest.test-seed#[1E8E755F8FF10DA4]) [n:127.0.0.1:58979_    ] o.a.s.s.SolrDispatchFilter SolrDispatchFilter.init() done
   [junit4]   2> 1194640 INFO  (coreLoadExecutor-5757-thread-1-processing-n:127.0.0.1:58979_) [n:127.0.0.1:58979_ c:control_collection   x:collection1] o.a.s.c.ZkController publishing state=down
   [junit4]   2> 1194640 INFO  (coreLoadExecutor-5757-thread-1-processing-n:127.0.0.1:58979_) [n:127.0.0.1:58979_ c:control_collection   x:collection1] o.a.s.c.ZkController numShards not found on descriptor - reading it from system property
   [junit4]   2> 1194641 INFO  (coreLoadExecutor-5757-thread-1-processing-n:127.0.0.1:58979_) [n:127.0.0.1:58979_ c:control_collection   x:collection1] o.a.s.c.ZkController look for our core node name
   [junit4]   2> 1194641 INFO  (OverseerStateUpdate-95184214179905540-127.0.0.1:58979_-n_0000000000) [n:127.0.0.1:58979_    ] o.a.s.c.Overseer processMessage: queueSize: 1, message = {
   [junit4]   2>   "core":"collection1",
   [junit4]   2>   "roles":null,
   [junit4]   2>   "base_url":"http://127.0.0.1:58979",
   [junit4]   2>   "node_name":"127.0.0.1:58979_",
   [junit4]   2>   "numShards":"1",
   [junit4]   2>   "state":"down",
   [junit4]   2>   "shard":null,
   [junit4]   2>   "collection":"control_collection",
   [junit4]   2>   "operation":"state"} current state version: 0
   [junit4]   2> 1194641 INFO  (OverseerStateUpdate-95184214179905540-127.0.0.1:58979_-n_0000000000) [n:127.0.0.1:58979_    ] o.a.s.c.o.ReplicaMutator Update state numShards=1 message={
   [junit4]   2>   "core":"collection1",
   [junit4]   2>   "roles":null,
   [junit4]   2>   "base_url":"http://127.0.0.1:58979",
   [junit4]   2>   "node_name":"127.0.0.1:58979_",
   [junit4]   2>   "numShards":"1",
   [junit4]   2>   "state":"down",
   [junit4]   2>   "shard":null,
   [junit4]   2>   "collection":"control_collection",
   [junit4]   2>   "operation":"state"}
   [junit4]   2> 1194641 INFO  (OverseerStateUpdate-95184214179905540-127.0.0.1:58979_-n_0000000000) [n:127.0.0.1:58979_    ] o.a.s.c.o.ClusterStateMutator building a new cName: control_collection
   [junit4]   2> 1194641 INFO  (OverseerStateUpdate-95184214179905540-127.0.0.1:58979_-n_0000000000) [n:127.0.0.1:58979_    ] o.a.s.c.o.ReplicaMutator Assigning new node to shard shard=shard1
   [junit4]   2> 1194642 INFO  (zkCallback-1884-thread-1-processing-n:127.0.0.1:58979_) [n:127.0.0.1:58979_    ] o.a.s.c.c.ZkStateReader A cluster state change: [WatchedEvent state:SyncConnected type:NodeDataChanged path:/clusterstate.json], has occurred - updating... (live nodes size: [1])
   [junit4]   2> 1195641 INFO  (coreLoadExecutor-5757-thread-1-processing-n:127.0.0.1:58979_) [n:127.0.0.1:58979_ c:control_collection   x:collection1] o.a.s.c.ZkController waiting to find shard id in clusterstate for collection1
   [junit4]   2> 1195641 INFO  (coreLoadExecutor-5757-thread-1-processing-n:127.0.0.1:58979_) [n:127.0.0.1:58979_ c:control_collection   x:collection1] o.a.s.c.ZkController Check for collection zkNode:control_collection
   [junit4]   2> 1195641 INFO  (coreLoadExecutor-5757-thread-1-processing-n:127.0.0.1:58979_) [n:127.0.0.1:58979_ c:control_collection   x:collection1] o.a.s.c.ZkController Collection zkNode exists
   [junit4]   2> 1195641 INFO  (coreLoadExecutor-5757-thread-1-processing-n:127.0.0.1:58979_) [n:127.0.0.1:58979_ c:control_collection   x:collection1] o.a.s.c.c.ZkStateReader Load collection config from: [/collections/control_collection]
   [junit4]   2> 1195641 INFO  (coreLoadExecutor-5757-thread-1-processing-n:127.0.0.1:58979_) [n:127.0.0.1:58979_ c:control_collection   x:collection1] o.a.s.c.c.ZkStateReader path=[/collections/control_collection] [configName]=[conf1] specified config exists in ZooKeeper
   [junit4]   2> 1195642 INFO  (coreLoadExecutor-5757-thread-1-processing-n:127.0.0.1:58979_) [n:127.0.0.1:58979_ c:control_collection   x:collection1] o.a.s.c.SolrResourceLoader new SolrResourceLoader for directory: '/home/jenkins/workspace/Lucene-Solr-trunk-Linux/solr/build/solr-core/test/J0/temp/solr.cloud.HttpPartitionTest_1E8E755F8FF10DA4-001/control-001/cores/collection1'
   [junit4]   2> 1195642 INFO  (coreLoadExecutor-5757-thread-1-processing-n:127.0.0.1:58979_) [n:127.0.0.1:58979_ c:control_collection   x:collection1] o.a.s.c.SolrResourceLoader JNDI not configured for solr (NoInitialContextEx)
   [junit4]   2> 1195642 INFO  (coreLoadExecutor-5757-thread-1-processing-n:127.0.0.1:58979_) [n:127.0.0.1:58979_ c:control_collection   x:collection1] o.a.s.c.SolrResourceLoader solr home defaulted to 'solr/' (could not find system property or JNDI)
   [junit4]   2> 1195643 INFO  (coreLoadExecutor-5757-thread-1-processing-n:127.0.0.1:58979_) [n:127.0.0.1:58979_ c:control_collection   x:collection1] o.a.s.c.Config loaded config solrconfig.xml with version 0 
   [junit4]   2> 1195645 INFO  (coreLoadExecutor-5757-thread-1-processing-n:127.0.0.1:58979_) [n:127.0.0.1:58979_ c:control_collection   x:collection1] o.a.s.c.SolrConfig current version of requestparams : -1
   [junit4]   2> 1195648 INFO  (coreLoadExecutor-5757-thread-1-processing-n:127.0.0.1:58979_) [n:127.0.0.1:58979_ c:control_collection   x:collection1] o.a.s.c.SolrConfig Using Lucene MatchVersion: 6.0.0
   [junit4]   2> 1195653 INFO  (coreLoadExecutor-5757-thread-1-processing-n:127.0.0.1:58979_) [n:127.0.0.1:58979_ c:control_collection   x:collection1] o.a.s.c.SolrConfig Loaded SolrConfig: solrconfig.xml
   [junit4]   2> 1195656 INFO  (coreLoadExecutor-5757-thread-1-processing-n:127.0.0.1:58979_) [n:127.0.0.1:58979_ c:control_collection   x:collection1] o.a.s.s.IndexSchema [collection1] Schema name=test
   [junit4]   2> 1195750 INFO  (coreLoadExecutor-5757-thread-1-processing-n:127.0.0.1:58979_) [n:127.0.0.1:58979_ c:control_collection   x:collection1] o.a.s.s.OpenExchangeRatesOrgProvider Initialized with rates=open-exchange-rates.json, refreshInterval=1440.
   [junit4]   2> 1195754 INFO  (coreLoadExecutor-5757-thread-1-processing-n:127.0.0.1:58979_) [n:127.0.0.1:58979_ c:control_collection   x:collection1] o.a.s.s.IndexSchema default search field in schema is text
   [junit4]   2> 1195755 INFO  (coreLoadExecutor-5757-thread-1-processing-n:127.0.0.1:58979_) [n:127.0.0.1:58979_ c:control_collection   x:collection1] o.a.s.s.IndexSchema unique key field: id
   [junit4]   2> 1195758 INFO  (coreLoadExecutor-5757-thread-1-processing-n:127.0.0.1:58979_) [n:127.0.0.1:58979_ c:control_collection   x:collection1] o.a.s.s.FileExchangeRateProvider Reloading exchange rates from file currency.xml
   [junit4]   2> 1195759 INFO  (coreLoadExecutor-5757-thread-1-processing-n:127.0.0.1:58979_) [n:127.0.0.1:58979_ c:control_collection   x:collection1] o.a.s.s.FileExchangeRateProvider Reloading exchange rates from file currency.xml
   [junit4]   2> 1195760 INFO  (coreLoadExecutor-5757-thread-1-processing-n:127.0.0.1:58979_) [n:127.0.0.1:58979_ c:control_collection   x:collection1] o.a.s.s.OpenExchangeRatesOrgProvider Reloading exchange rates from open-exchange-rates.json
   [junit4]   2> 1195760 INFO  (coreLoadExecutor-5757-thread-1-processing-n:127.0.0.1:58979_) [n:127.0.0.1:58979_ c:control_collection   x:collection1] o.a.s.s.OpenExchangeRatesOrgProvider Reloading exchange rates from open-exchange-rates.json
   [junit4]   2> 1195761 INFO  (coreLoadExecutor-5757-thread-1-processing-n:127.0.0.1:58979_) [n:127.0.0.1:58979_ c:control_collection   x:collection1] o.a.s.c.ConfigSetProperties Did not find ConfigSet properties, assuming default properties: Can't find resource 'configsetprops.json' in classpath or '/configs/conf1', cwd=/home/jenkins/workspace/Lucene-Solr-trunk-Linux/solr/build/solr-core/test/J0
   [junit4]   2> 1195761 INFO  (coreLoadExecutor-5757-thread-1-processing-n:127.0.0.1:58979_) [n:127.0.0.1:58979_ c:control_collection   x:collection1] o.a.s.c.CoreContainer Creating SolrCore 'collection1' using configuration from collection control_collection
   [junit4]   2> 1195922 INFO  (coreLoadExecutor-5757-thread-1-processing-n:127.0.0.1:58979_) [n:127.0.0.1:58979_ c:control_collection s:shard1 r:core_node1 x:collection1] o.a.s.c.SolrCore org.apache.solr.core.MockDirectoryFactory
   [junit4]   2> 1195923 INFO  (coreLoadExecutor-5757-thread-1-processing-n:127.0.0.1:58979_) [n:127.0.0.1:58979_ c:control_collection s:shard1 r:core_node1 x:collection1] o.a.s.c.SolrCore [[collection1] ] Opening new SolrCore at [/home/jenkins/workspace/Lucene-Solr-trunk-Linux/solr/build/solr-core/test/J0/temp/solr.cloud.HttpPartitionTest_1E8E755F8FF10DA4-001/control-001/cores/collection1], dataDir=[/home/jenkins/workspace/Lucene-Solr-trunk-Linux/solr/build/solr-core/test/J0/temp/solr.cloud.HttpPartitionTest_1E8E755F8FF10DA4-001/control-001/cores/collection1/data/]
   [junit4]   2> 1195923 INFO  (coreLoadExecutor-5757-thread-1-processing-n:127.0.0.1:58979_) [n:127.0.0.1:58979_ c:control_collection s:shard1 r:core_node1 x:collection1] o.a.s.c.JmxMonitoredMap JMX monitoring is enabled. Adding Solr mbeans to JMX Server: com.sun.jmx.mbeanserver.JmxMBeanServer@46258aae
   [junit4]   2> 1195923 INFO  (coreLoadExecutor-5757-thread-1-processing-n:127.0.0.1:58979_) [n:127.0.0.1:58979_ c:control_collection s:shard1 r:core_node1 x:collection1] o.a.s.c.CachingDirectoryFactory return new directory for /home/jenkins/workspace/Lucene-Solr-trunk-Linux/solr/build/solr-core/test/J0/temp/solr.cloud.HttpPartitionTest_1E8E755F8FF10DA4-001/control-001/cores/collection1/data
   [junit4]   2> 1195923 INFO  (coreLoadExecutor-5757-thread-1-processing-n:127.0.0.1:58979_) [n:127.0.0.1:58979_ c:control_collection s:shard1 r:core_node1 x:collection1] o.a.s.c.SolrCore New index directory detected: old=null new=/home/jenkins/workspace/Lucene-Solr-trunk-Linux/solr/build/solr-core/test/J0/temp/solr.cloud.HttpPartitionTest_1E8E755F8FF10DA4-001/control-001/cores/collection1/data/index/
   [junit4]   2> 1195923 WARN  (coreLoadExecutor-5757-thread-1-processing-n:127.0.0.1:58979_) [n:127.0.0.1:58979_ c:control_collection s:shard1 r:core_node1 x:collection1] o.a.s.c.SolrCore [collection1] Solr index directory '/home/jenkins/workspace/Lucene-Solr-trunk-Linux/solr/build/solr-core/test/J0/temp/solr.cloud.HttpPartitionTest_1E8E755F8FF10DA4-001/control-001/cores/collection1/data/index' doesn't exist. Creating new index...
   [junit4]   2> 1195923 INFO  (coreLoadExecutor-5757-thread-1-processing-n:127.0.0.1:58979_) [n:127.0.0.1:58979_ c:control_collection s:shard1 r:core_node1 x:collection1] o.a.s.c.CachingDirectoryFactory return new directory for /home/jenkins/workspace/Lucene-Solr-trunk-Linux/solr/build/solr-core/test/J0/temp/solr.cloud.HttpPartitionTest_1E8E755F8FF10DA4-001/control-001/cores/collection1/data/index
   [junit4]   2> 1195923 INFO  (coreLoadExecutor-5757-thread-1-processing-n:127.0.0.1:58979_) [n:127.0.0.1:58979_ c:control_collection s:shard1 r:core_node1 x:collection1] o.a.s.u.RandomMergePolicy RandomMergePolicy wrapping class org.apache.lucene.index.TieredMergePolicy: [TieredMergePolicy: maxMergeAtOnce=32, maxMergeAtOnceExplicit=11, maxMergedSegmentMB=32.8408203125, floorSegmentMB=1.1728515625, forceMergeDeletesPctAllowed=6.794576799041141, segmentsPerTier=11.0, maxCFSSegmentSizeMB=8.796093022207999E12, noCFSRatio=1.0
   [junit4]   2> 1195924 INFO  (coreLoadExecutor-5757-thread-1-processing-n:127.0.0.1:58979_) [n:127.0.0.1:58979_ c:control_collection s:shard1 r:core_node1 x:collection1] o.a.s.c.SolrDeletionPolicy SolrDeletionPolicy.onCommit: commits: num=1
   [junit4]   2> 	commit{dir=MockDirectoryWrapper(RAMDirectory@5071d4d0 lockFactory=org.apache.lucene.store.SingleInstanceLockFactory@25e378ec),segFN=segments_1,generation=1}
   [junit4]   2> 1195924 INFO  (coreLoadExecutor-5757-thread-1-processing-n:127.0.0.1:58979_) [n:127.0.0.1:58979_ c:control_collection s:shard1 r:core_node1 x:collection1] o.a.s.c.SolrDeletionPolicy newest commit generation = 1
   [junit4]   2> 1195924 INFO  (OldIndexDirectoryCleanupThreadForCore-collection1) [n:127.0.0.1:58979_ c:control_collection s:shard1 r:core_node1 x:collection1] o.a.s.c.SolrCore Looking for old index directories to cleanup for core collection1 in /home/jenkins/workspace/Lucene-Solr-trunk-Linux/solr/build/solr-core/test/J0/temp/solr.cloud.HttpPartitionTest_1E8E755F8FF10DA4-001/control-001/cores/collection1/data/
   [junit4]   2> 1195924 WARN  (OldIndexDirectoryCleanupThreadForCore-collection1) [n:127.0.0.1:58979_ c:control_collection s:shard1 r:core_node1 x:collection1] o.a.s.c.DirectoryFactory /home/jenkins/workspace/Lucene-Solr-trunk-Linux/solr/build/solr-core/test/J0/temp/solr.cloud.HttpPartitionTest_1E8E755F8FF10DA4-001/control-001/cores/collection1/data/ does not point to a valid data directory; skipping clean-up of old index directories.
   [junit4]   2> 1195926 INFO  (coreLoadExecutor-5757-thread-1-processing-n:127.0.0.1:58979_) [n:127.0.0.1:58979_ c:control_collection s:shard1 r:core_node1 x:collection1] o.a.s.u.p.UpdateRequestProcessorChain creating updateRequestProcessorChain "nodistrib"
   [junit4]   2> 1195926 INFO  (coreLoadExecutor-5757-thread-1-processing-n:127.0.0.1:58979_) [n:127.0.0.1:58979_ c:control_collection s:shard1 r:core_node1 x:collection1] o.a.s.u.p.UpdateRequestProcessorChain creating updateRequestProcessorChain "dedupe"
   [junit4]   2> 1195926 INFO  (coreLoadExecutor-5757-thread-1-processing-n:127.0.0.1:58979_) [n:127.0.0.1:58979_ c:control_collection s:shard1 r:core_node1 x:collection1] o.a.s.u.p.UpdateRequestProcessorChain inserting DistributedUpdateProcessorFactory into updateRequestProcessorChain "dedupe"
   [junit4]   2> 1195926 INFO  (coreLoadExecutor-5757-thread-1-processing-n:127.0.0.1:58979_) [n:127.0.0.1:58979_ c:control_collection s:shard1 r:core_node1 x:collection1] o.a.s.u.p.UpdateRequestProcessorChain creating updateRequestProcessorChain "stored_sig"
   [junit4]   2> 1195926 INFO  (coreLoadExecutor-5757-thread-1-processing-n:127.0.0.1:58979_) [n:127.0.0.1:58979_ c:control_collection s:shard1 r:core_node1 x:collection1] o.a.s.u.p.UpdateRequestProcessorChain inserting DistributedUpdateProcessorFactory into updateRequestProcessorChain "stored_sig"
   [junit4]   2> 1195926 INFO  (coreLoadExecutor-5757-thread-1-processing-n:127.0.0.1:58979_) [n:127.0.0.1:58979_ c:control_collection s:shard1 r:core_node1 x:collection1] o.a.s.u.p.UpdateRequestProcessorChain creating updateRequestProcessorChain "distrib-dup-test-chain-explicit"
   [junit4]   2> 1195926 INFO  (coreLoadExecutor-5757-thread-1-processing-n:127.0.0.1:58979_) [n:127.0.0.1:58979_ c:control_collection s:shard1 r:core_node1 x:collection1] o.a.s.u.p.UpdateRequestProcessorChain creating updateRequestProcessorChain "distrib-dup-test-chain-implicit"
   [junit4]   2> 1195927 INFO  (coreLoadExecutor-5757-thread-1-processing-n:127.0.0.1:58979_) [n:127.0.0.1:58979_ c:control_collection s:shard1 r:core_node1 x:collection1] o.a.s.u.p.UpdateRequestProcessorChain inserting DistributedUpdateProcessorFactory into updateRequestProcessorChain "distrib-dup-test-chain-implicit"
   [junit4]   2> 1195927 INFO  (coreLoadExecutor-5757-thread-1-processing-n:127.0.0.1:58979_) [n:127.0.0.1:58979_ c:control_collection s:shard1 r:core_node1 x:collection1] o.a.s.c.SolrCore no updateRequestProcessorChain defined as default, creating implicit default
   [junit4]   2> 1195927 WARN  (coreLoadExecutor-5757-thread-1-processing-n:127.0.0.1:58979_) [n:127.0.0.1:58979_ c:control_collection s:shard1 r:core_node1 x:collection1] o.a.s.c.RequestHandlers INVALID paramSet a in requestHandler {type = requestHandler,name = /dump,class = DumpRequestHandler,args = {defaults={a=A,b=B}}}
   [junit4]   2> 1195928 INFO  (coreLoadExecutor-5757-thread-1-processing-n:127.0.0.1:58979_) [n:127.0.0.1:58979_ c:control_collection s:shard1 r:core_node1 x:collection1] o.a.s.h.l.XMLLoader xsltCacheLifetimeSeconds=60
   [junit4]   2> 1195928 INFO  (coreLoadExecutor-5757-thread-1-processing-n:127.0.0.1:58979_) [n:127.0.0.1:58979_ c:control_collection s:shard1 r:core_node1 x:collection1] o.a.s.h.l.XMLLoader xsltCacheLifetimeSeconds=60
   [junit4]   2> 1195929 INFO  (coreLoadExecutor-5757-thread-1-processing-n:127.0.0.1:58979_) [n:127.0.0.1:58979_ c:control_collection s:shard1 r:core_node1 x:collection1] o.a.s.h.l.XMLLoader xsltCacheLifetimeSeconds=60
   [junit4]   2> 1195929 INFO  (coreLoadExecutor-5757-thread-1-processing-n:127.0.0.1:58979_) [n:127.0.0.1:58979_ c:control_collection s:shard1 r:core_node1 x:collection1] o.a.s.h.l.XMLLoader xsltCacheLifetimeSeconds=60
   [junit4]   2> 1195931 INFO  (coreLoadExecutor-5757-thread-1-processing-n:127.0.0.1:58979_) [n:127.0.0.1:58979_ c:control_collection s:shard1 r:core_node1 x:collection1] o.a.s.c.RequestHandlers Registered paths: /admin/mbeans,standard,/dump,/update/csv,/sql,/update/json/docs,/admin/luke,/export,/admin/segments,/get,/admin/system,/replication,/admin/properties,/config,/stream,/schema,/admin/plugins,/admin/logging,/update/json,/admin/threads,/admin/ping,/update,/admin/file
   [junit4]   2> 1195931 INFO  (coreLoadExecutor-5757-thread-1-processing-n:127.0.0.1:58979_) [n:127.0.0.1:58979_ c:control_collection s:shard1 r:core_node1 x:collection1] o.a.s.c.SolrCore Using default statsCache cache: org.apache.solr.search.stats.LocalStatsCache
   [junit4]   2> 1195932 INFO  (coreLoadExecutor-5757-thread-1-processing-n:127.0.0.1:58979_) [n:127.0.0.1:58979_ c:control_collection s:shard1 r:core_node1 x:collection1] o.a.s.u.UpdateHandler Using UpdateLog implementation: org.apache.solr.update.UpdateLog
   [junit4]   2> 1195932 INFO  (coreLoadExecutor-5757-thread-1-processing-n:127.0.0.1:58979_) [n:127.0.0.1:58979_ c:control_collection s:shard1 r:core_node1 x:collection1] o.a.s.u.UpdateLog Initializing UpdateLog: dataDir= defaultSyncLevel=FLUSH numRecordsToKeep=100 maxNumLogsToKeep=10 numVersionBuckets=65536
   [junit4]   2> 1195932 INFO  (coreLoadExecutor-5757-thread-1-processing-n:127.0.0.1:58979_) [n:127.0.0.1:58979_ c:control_collection s:shard1 r:core_node1 x:collection1] o.a.s.u.CommitTracker Hard AutoCommit: disabled
   [junit4]   2> 1195932 INFO  (coreLoadExecutor-5757-thread-1-processing-n:127.0.0.1:58979_) [n:127.0.0.1:58979_ c:control_collection s:shard1 r:core_node1 x:collection1] o.a.s.u.CommitTracker Soft AutoCommit: disabled
   [junit4]   2> 1195932 INFO  (coreLoadExecutor-5757-thread-1-processing-n:127.0.0.1:58979_) [n:127.0.0.1:58979_ c:control_collection s:shard1 r:core_node1 x:collection1] o.a.s.u.RandomMergePolicy RandomMergePolicy wrapping class org.apache.lucene.index.TieredMergePolicy: [TieredMergePolicy: maxMergeAtOnce=23, maxMergeAtOnceExplicit=32, maxMergedSegmentMB=54.359375, floorSegmentMB=0.2177734375, forceMergeDeletesPctAllowed=20.046671716254274, segmentsPerTier=39.0, maxCFSSegmentSizeMB=8.796093022207999E12, noCFSRatio=1.0
   [junit4]   2> 1195932 INFO  (coreLoadExecutor-5757-thread-1-processing-n:127.0.0.1:58979_) [n:127.0.0.1:58979_ c:control_collection s:shard1 r:core_node1 x:collection1] o.a.s.c.SolrDeletionPolicy SolrDeletionPolicy.onInit: commits: num=1
   [junit4]   2> 	commit{dir=MockDirectoryWrapper(RAMDirectory@5071d4d0 lockFactory=org.apache.lucene.store.SingleInstanceLockFactory@25e378ec),segFN=segments_1,generation=1}
   [junit4]   2> 1195933 INFO  (coreLoadExecutor-5757-thread-1-processing-n:127.0.0.1:58979_) [n:127.0.0.1:58979_ c:control_collection s:shard1 r:core_node1 x:collection1] o.a.s.c.SolrDeletionPolicy newest commit generation = 1
   [junit4]   2> 1195933 INFO  (coreLoadExecutor-5757-thread-1-processing-n:127.0.0.1:58979_) [n:127.0.0.1:58979_ c:control_collection s:shard1 r:core_node1 x:collection1] o.a.s.s.SolrIndexSearcher Opening Searcher@20303dec[collection1] main
   [junit4]   2> 1195933 INFO  (coreLoadExecutor-5757-thread-1-processing-n:127.0.0.1:58979_) [n:127.0.0.1:58979_ c:control_collection s:shard1 r:core_node1 x:collection1] o.a.s.c.c.ZkStateReader Load collection config from: [/collections/control_collection]
   [junit4]   2> 1195933 INFO  (coreLoadExecutor-5757-thread-1-processing-n:127.0.0.1:58979_) [n:127.0.0.1:58979_ c:control_collection s:shard1 r:core_node1 x:collection1] o.a.s.c.c.ZkStateReader path=[/collections/control_collection] [configName]=[conf1] specified config exists in ZooKeeper
   [junit4]   2> 1195933 INFO  (coreLoadExecutor-5757-thread-1-processing-n:127.0.0.1:58979_) [n:127.0.0.1:58979_ c:control_collection s:shard1 r:core_node1 x:collection1] o.a.s.r.ManagedResourceStorage Setting up ZooKeeper-based storage for the RestManager with znodeBase: /configs/conf1
   [junit4]   2> 1195933 INFO  (coreLoadExecutor-5757-thread-1-processing-n:127.0.0.1:58979_) [n:127.0.0.1:58979_ c:control_collection s:shard1 r:core_node1 x:collection1] o.a.s.r.ManagedResourceStorage Configured ZooKeeperStorageIO with znodeBase: /configs/conf1
   [junit4]   2> 1195933 INFO  (coreLoadExecutor-5757-thread-1-processing-n:127.0.0.1:58979_) [n:127.0.0.1:58979_ c:control_collection s:shard1 r:core_node1 x:collection1] o.a.s.r.RestManager Initializing RestManager with initArgs: {}
   [junit4]   2> 1195933 INFO  (coreLoadExecutor-5757-thread-1-processing-n:127.0.0.1:58979_) [n:127.0.0.1:58979_ c:control_collection s:shard1 r:core_node1 x:collection1] o.a.s.r.ManagedResourceStorage Reading _rest_managed.json using ZooKeeperStorageIO:path=/configs/conf1
   [junit4]   2> 1195934 INFO  (coreLoadExecutor-5757-thread-1-processing-n:127.0.0.1:58979_) [n:127.0.0.1:58979_ c:control_collection s:shard1 r:core_node1 x:collection1] o.a.s.r.ManagedResourceStorage No data found for znode /configs/conf1/_rest_managed.json
   [junit4]   2> 1195934 INFO  (coreLoadExecutor-5757-thread-1-processing-n:127.0.0.1:58979_) [n:127.0.0.1:58979_ c:control_collection s:shard1 r:core_node1 x:collection1] o.a.s.r.ManagedResourceStorage Loaded null at path _rest_managed.json using ZooKeeperStorageIO:path=/configs/conf1
   [junit4]   2> 1195934 INFO  (coreLoadExecutor-5757-thread-1-processing-n:127.0.0.1:58979_) [n:127.0.0.1:58979_ c:control_collection s:shard1 r:core_node1 x:collection1] o.a.s.r.RestManager Initializing 0 registered ManagedResources
   [junit4]   2> 1195934 INFO  (coreLoadExecutor-5757-thread-1-processing-n:127.0.0.1:58979_) [n:127.0.0.1:58979_ c:control_collection s:shard1 r:core_node1 x:collection1] o.a.s.h.ReplicationHandler Commits will be reserved for  10000
   [junit4]   2> 1195935 INFO  (searcherExecutor-5758-thread-1-processing-n:127.0.0.1:58979_ x:collection1 s:shard1 c:control_collection r:core_node1) [n:127.0.0.1:58979_ c:control_collection s:shard1 r:core_node1 x:collection1] o.a.s.c.SolrCore [collection1] Registered new searcher Searcher@20303dec[collection1] main{ExitableDirectoryReader(UninvertingDirectoryReader())}
   [junit4]   2> 1195935 INFO  (coreLoadExecutor-5757-thread-1-processing-n:127.0.0.1:58979_) [n:127.0.0.1:58979_ c:control_collection s:shard1 r:core_node1 x:collection1] o.a.s.u.UpdateLog Looking up max value of version field to seed version buckets
   [junit4]   2> 1195935 INFO  (coreLoadExecutor-5757-thread-1-processing-n:127.0.0.1:58979_) [n:127.0.0.1:58979_ c:control_collection s:shard1 r:core_node1 x:collection1] o.a.s.u.VersionInfo Refreshing highest value of _version_ for 65536 version buckets from index
   [junit4]   2> 1195935 INFO  (coreLoadExecutor-5757-thread-1-processing-n:127.0.0.1:58979_) [n:127.0.0.1:58979_ c:control_collection s:shard1 r:core_node1 x:collection1] o.a.s.u.VersionInfo No terms found for _version_, cannot seed version bucket highest value from index
   [junit4]   2> 1195935 INFO  (coreLoadExecutor-5757-thread-1-processing-n:127.0.0.1:58979_) [n:127.0.0.1:58979_ c:control_collection s:shard1 r:core_node1 x:collection1] o.a.s.u.UpdateLog Could not find max version in index or recent updates, using new clock 1522947428444012544
   [junit4]   2> 1195937 INFO  (coreLoadExecutor-5757-thread-1-processing-n:127.0.0.1:58979_) [n:127.0.0.1:58979_ c:control_collection s:shard1 r:core_node1 x:collection1] o.a.s.u.UpdateLog Took 1.0ms to seed version buckets with highest version 1522947428444012544
   [junit4]   2> 1195937 INFO  (coreLoadExecutor-5757-thread-1-processing-n:127.0.0.1:58979_) [n:127.0.0.1:58979_ c:control_collection s:shard1 r:core_node1 x:collection1] o.a.s.c.ZkController watch zkdir /configs/conf1
   [junit4]   2> 1195937 INFO  (coreLoadExecutor-5757-thread-1-processing-n:127.0.0.1:58979_) [n:127.0.0.1:58979_ c:control_collection s:shard1 r:core_node1 x:collection1] o.a.s.c.CoreContainer registering core: collection1
   [junit4]   2> 1195937 INFO  (coreZkRegister-5751-thread-1-processing-n:127.0.0.1:58979_ x:collection1 s:shard1 c:control_collection r:core_node1) [n:127.0.0.1:58979_ c:control_collection s:shard1 r:core_node1 x:collection1] o.a.s.c.ZkController Register replica - core:collection1 address:http://127.0.0.1:58979 collection:control_collection shard:shard1
   [junit4]   2> 1195937 INFO  (coreZkRegister-5751-thread-1-processing-n:127.0.0.1:58979_ x:collection1 s:shard1 c:control_collection r:core_node1) [n:127.0.0.1:58979_ c:control_collection s:shard1 r:core_node1 x:collection1] o.a.s.c.c.SolrZkClient makePath: /collections/control_collection/leader_elect/shard1/election
   [junit4]   2> 1195939 INFO  (coreZkRegister-5751-thread-1-processing-n:127.0.0.1:58979_ x:collection1 s:shard1 c:control_collection r:core_node1) [n:127.0.0.1:58979_ c:control_collection s:shard1 r:core_node1 x:collection1] o.a.s.c.LeaderElector Joined leadership election with path: /collections/control_collection/leader_elect/shard1/election/95184214179905540-core_node1-n_0000000000
   [junit4]   2> 1195939 INFO  (coreZkRegister-5751-thread-1-processing-n:127.0.0.1:58979_ x:collection1 s:shard1 c:control_collection r:core_node1) [n:127.0.0.1:58979_ c:control_collection s:shard1 r:core_node1 x:collection1] o.a.s.c.ShardLeaderElectionContext Running the leader process for shard=shard1 and weAreReplacement=false and leaderVoteWait=10000
   [junit4]   2> 1195939 INFO  (coreZkRegister-5751-thread-1-processing-n:127.0.0.1:58979_ x:collection1 s:shard1 c:control_collection r:core_node1) [n:127.0.0.1:58979_ c:control_collection s:shard1 r:core_node1 x:collection1] o.a.s.c.ShardLeaderElectionContext Enough replicas found to continue.
   [junit4]   2> 1195939 INFO  (coreZkRegister-5751-thread-1-processing-n:127.0.0.1:58979_ x:collection1 s:shard1 c:control_collection r:core_node1) [n:127.0.0.1:58979_ c:control_collection s:shard1 r:core_node1 x:collection1] o.a.s.c.ShardLeaderElectionContext I may be the new leader - try and sync
   [junit4]   2> 1195939 INFO  (coreZkRegister-5751-thread-1-processing-n:127.0.0.1:58979_ x:collection1 s:shard1 c:control_collection r:core_node1) [n:127.0.0.1:58979_ c:control_collection s:shard1 r:core_node1 x:collection1] o.a.s.c.SyncStrategy Sync replicas to http://127.0.0.1:58979/collection1/
   [junit4]   2> 1195939 INFO  (OverseerStateUpdate-95184214179905540-127.0.0.1:58979_-n_0000000000) [n:127.0.0.1:58979_    ] o.a.s.c.Overseer processMessage: queueSize: 1, message = {
   [junit4]   2>   "operation":"leader",
   [junit4]   2>   "shard":"shard1",
   [junit4]   2>   "collection":"control_collection"} current state version: 1
   [junit4]   2> 1195940 INFO  (coreZkRegister-5751-thread-1-processing-n:127.0.0.1:58979_ x:collection1 s:shard1 c:control_collection r:core_node1) [n:127.0.0.1:58979_ c:control_collection s:shard1 r:core_node1 x:collection1] o.a.s.c.SyncStrategy Sync Success - now sync replicas to me
   [junit4]   2> 1195940 INFO  (coreZkRegister-5751-thread-1-processing-n:127.0.0.1:58979_ x:collection1 s:shard1 c:control_collection r:core_node1) [n:127.0.0.1:58979_ c:control_collection s:shard1 r:core_node1 x:collection1] o.a.s.c.SyncStrategy http://127.0.0.1:58979/collection1/ has no replicas
   [junit4]   2> 1195940 INFO  (coreZkRegister-5751-thread-1-processing-n:127.0.0.1:58979_ x:collection1 s:shard1 c:control_collection r:core_node1) [n:127.0.0.1:58979_ c:control_collection s:shard1 r:core_node1 x:collection1] o.a.s.c.c.SolrZkClient makePath: /collections/control_collection/leaders/shard1
   [junit4]   2> 1195941 INFO  (coreZkRegister-5751-thread-1-processing-n:127.0.0.1:58979_ x:collection1 s:shard1 c:control_collection r:core_node1) [n:127.0.0.1:58979_ c:control_collection s:shard1 r:core_node1 x:collection1] o.a.s.c.ShardLeaderElectionContextBase Creating leader registration node
   [junit4]   2> 1195942 INFO  (coreZkRegister-5751-thread-1-processing-n:127.0.0.1:58979_ x:collection1 s:shard1 c:control_collection r:core_node1) [n:127.0.0.1:58979_ c:control_collection s:shard1 r:core_node1 x:collection1] o.a.s.c.ShardLeaderElectionContext I am the new leader: http://127.0.0.1:58979/collection1/ shard1
   [junit4]   2> 1195942 INFO  (OverseerStateUpdate-95184214179905540-127.0.0.1:58979_-n_0000000000) [n:127.0.0.1:58979_    ] o.a.s.c.Overseer processMessage: queueSize: 1, message = {
   [junit4]   2>   "operation":"leader",
   [junit4]   2>   "shard":"shard1",
   [junit4]   2>   "collection":"control_collection",
   [junit4]   2>   "base_url":"http://127.0.0.1:58979",
   [junit4]   2>   "core":"collection1",
   [junit4]   2>   "state":"active"} current state version: 1
   [junit4]   2> 1196043 INFO  (zkCallback-1884-thread-1-processing-n:127.0.0.1:58979_) [n:127.0.0.1:58979_    ] o.a.s.c.c.ZkStateReader A cluster state change: [WatchedEvent state:SyncConnected type:NodeDataChanged path:/clusterstate.json], has occurred - updating... (live nodes size: [1])
   [junit4]   2> 1196092 INFO  (coreZkRegister-5751-thread-1-processing-n:127.0.0.1:58979_ x:collection1 s:shard1 c:control_collection r:core_node1) [n:127.0.0.1:58979_ c:control_collection s:shard1 r:core_node1 x:collection1] o.a.s.c.ZkController We are http://127.0.0.1:58979/collection1/ and leader is http://127.0.0.1:58979/collection1/
   [junit4]   2> 1196093 INFO  (coreZkRegister-5751-thread-1-processing-n:127.0.0.1:58979_ x:collection1 s:shard1 c:control_collection r:core_node1) [n:127.0.0.1:58979_ c:control_collection s:shard1 r:core_node1 x:collection1] o.a.s.c.ZkController No LogReplay needed for core=collection1 baseURL=http://127.0.0.1:58979
   [junit4]   2> 1196093 INFO  (coreZkRegister-5751-thread-1-processing-n:127.0.0.1:58979_ x:collection1 s:shard1 c:control_collection r:core_node1) [n:127.0.0.1:58979_ c:control_collection s:shard1 r:core_node1 x:collection1] o.a.s.c.ZkController I am the leader, no recovery necessary
   [junit4]   2> 1196093 INFO  (coreZkRegister-5751-thread-1-processing-n:127.0.0.1:58979_ x:collection1 s:shard1 c:control_collection r:core_node1) [n:127.0.0.1:58979_ c:control_collection s:shard1 r:core_node1 x:collection1] o.a.s.c.ZkController publishing state=active
   [junit4]   2> 1196093 INFO  (coreZkRegister-5751-thread-1-processing-n:127.0.0.1:58979_ x:collection1 s:shard1 c:control_collection r:core_node1) [n:127.0.0.1:58979_ c:control_collection s:shard1 r:core_node1 x:collection1] o.a.s.c.ZkController numShards not found on descriptor - reading it from system property
   [junit4]   2> 1196094 INFO  (OverseerStateUpdate-95184214179905540-127.0.0.1:58979_-n_0000000000) [n:127.0.0.1:58979_    ] o.a.s.c.Overseer processMessage: queueSize: 1, message = {
   [junit4]   2>   "core":"collection1",
   [junit4]   2>   "core_node_name":"core_node1",
   [junit4]   2>   "roles":null,
   [junit4]   2>   "base_url":"http://127.0.0.1:58979",
   [junit4]   2>   "node_name":"127.0.0.1:58979_",
   [junit4]   2>   "numShards":"1",
   [junit4]   2>   "state":"active",
   [junit4]   2>   "shard":"shard1",
   [junit4]   2>   "collection":"control_collection",
   [junit4]   2>   "operation":"state"} current state version: 2
   [junit4]   2> 1196094 INFO  (OverseerStateUpdate-95184214179905540-127.0.0.1:58979_-n_0000000000) [n:127.0.0.1:58979_    ] o.a.s.c.o.ReplicaMutator Update state numShards=1 message={
   [junit4]   2>   "core":"collection1",
   [junit4]   2>   "core_node_name":"core_node1",
   [junit4]   2>   "roles":null,
   [junit4]   2>   "base_url":"http://127.0.0.1:58979",
   [junit4]   2>   "node_name":"127.0.0.1:58979_",
   [junit4]   2>   "numShards":"1",
   [junit4]   2>   "state":"active",
   [junit4]   2>   "shard":"shard1",
   [junit4]   2>   "collection":"control_collection",
   [junit4]   2>   "operation":"state"}
   [junit4]   2> 1196141 INFO  (TEST-HttpPartitionTest.test-seed#[1E8E755F8FF10DA4]) [    ] o.a.s.c.c.SolrZkClient Using default ZkCredentialsProvider
   [junit4]   2> 1196141 INFO  (TEST-HttpPartitionTest.test-seed#[1E8E755F8FF10DA4]) [    ] o.a.s.c.c.ConnectionManager Waiting for client to connect to ZooKeeper
   [junit4]   2> 1196142 INFO  (zkCallback-1886-thread-1) [    ] o.a.s.c.c.ConnectionManager Watcher org.apache.solr.common.cloud.ConnectionManager@53b9a19a name:ZooKeeperConnection Watcher:127.0.0.1:41992/solr got event WatchedEvent state:SyncConnected type:None path:null path:null type:None
   [junit4]   2> 1196142 INFO  (TEST-HttpPartitionTest.test-seed#[1E8E755F8FF10DA4]) [    ] o.a.s.c.c.ConnectionManager Client is connected to ZooKeeper
   [junit4]   2> 1196143 INFO  (TEST-HttpPartitionTest.test-seed#[1E8E755F8FF10DA4]) [    ] o.a.s.c.c.SolrZkClient Using default ZkACLProvider
   [junit4]   2> 1196143 INFO  (TEST-HttpPartitionTest.test-seed#[1E8E755F8FF10DA4]) [    ] o.a.s.c.c.ZkStateReader Updating cluster state from ZooKeeper... 
   [junit4]   2> 1196143 INFO  (TEST-HttpPartitionTest.test-seed#[1E8E755F8FF10DA4]) [    ] o.a.s.c.ChaosMonkey monkey: init - expire sessions:false cause connection loss:false
   [junit4]   2> 1196143 INFO  (TEST-HttpPartitionTest.test-seed#[1E8E755F8FF10DA4]) [    ] o.a.s.c.AbstractFullDistribZkTestBase Creating collection1 with stateFormat=2
   [junit4]   2> 1196144 INFO  (TEST-HttpPartitionTest.test-seed#[1E8E755F8FF10DA4]) [    ] o.a.s.c.c.SolrZkClient Using default ZkCredentialsProvider
   [junit4]   2> 1196144 INFO  (TEST-HttpPartitionTest.test-seed#[1E8E755F8FF10DA4]) [    ] o.a.s.c.c.ConnectionManager Waiting for client to connect to ZooKeeper
   [junit4]   2> 1196144 INFO  (zkCallback-1887-thread-1) [    ] o.a.s.c.c.ConnectionManager Watcher org.apache.solr.common.cloud.ConnectionManager@320bf15a name:ZooKeeperConnection Watcher:127.0.0.1:41992/solr got event WatchedEvent state:SyncConnected type:None path:null path:null type:None
   [junit4]   2> 1196144 INFO  (TEST-HttpPartitionTest.test-seed#[1E8E755F8FF10DA4]) [    ] o.a.s.c.c.ConnectionManager Client is connected to ZooKeeper
   [junit4]   2> 1196144 INFO  (TEST-HttpPartitionTest.test-seed#[1E8E755F8FF10DA4]) [    ] o.a.s.c.c.SolrZkClient Using default ZkACLProvider
   [junit4]   2> 1196145 INFO  (OverseerStateUpdate-95184214179905540-127.0.0.1:58979_-n_0000000000) [n:127.0.0.1:58979_    ] o.a.s.c.Overseer processMessage: queueSize: 1, message = {
   [junit4]   2>   "operation":"create",
   [junit4]   2>   "name":"collection1",
   [junit4]   2>   "numShards":"2",
   [junit4]   2>   "stateFormat":"2"} current state version: 2
   [junit4]   2> 1196145 INFO  (OverseerStateUpdate-95184214179905540-127.0.0.1:58979_-n_0000000000) [n:127.0.0.1:58979_    ] o.a.s.c.o.ClusterStateMutator building a new cName: collection1
   [junit4]   2> 1196146 INFO  (zkCallback-1886-thread-1) [    ] o.a.s.c.c.ZkStateReader A cluster state change: [WatchedEvent state:SyncConnected type:NodeDataChanged path:/clusterstate.json], has occurred - updating... (live nodes size: [1])
   [junit4]   2> 1196146 INFO  (zkCallback-1884-thread-2-processing-n:127.0.0.1:58979_) [n:127.0.0.1:58979_    ] o.a.s.c.c.ZkStateReader A cluster state change: [WatchedEvent state:SyncConnected type:NodeDataChanged path:/clusterstate.json], has occurred - updating... (live nodes size: [1])
   [junit4]   2> 1196231 INFO  (TEST-HttpPartitionTest.test-seed#[1E8E755F8FF10DA4]) [    ] o.a.s.SolrTestCaseJ4 Writing core.properties file to /home/jenkins/workspace/Lucene-Solr-trunk-Linux/solr/build/solr-core/test/J0/temp/solr.cloud.HttpPartitionTest_1E8E755F8FF10DA4-001/shard-1-001/cores/collection1
   [junit4]   2> 1196231 INFO  (TEST-HttpPartitionTest.test-seed#[1E8E755F8FF10DA4]) [    ] o.a.s.c.AbstractFullDistribZkTestBase create jetty 1 in directory /home/jenkins/workspace/Lucene-Solr-trunk-Linux/solr/build/solr-core/test/J0/temp/solr.cloud.HttpPartitionTest_1E8E755F8FF10DA4-001/shard-1-001
   [junit4]   2> 1196232 INFO  (TEST-HttpPartitionTest.test-seed#[1E8E755F8FF10DA4]) [    ] o.e.j.s.Server jetty-9.2.13.v20150730
   [junit4]   2> 1196233 INFO  (TEST-HttpPartitionTest.test-seed#[1E8E755F8FF10DA4]) [    ] o.e.j.s.h.ContextHandler Started o.e.j.s.ServletContextHandler@364faee0{/,null,AVAILABLE}
   [junit4]   2> 1196233 INFO  (TEST-HttpPartitionTest.test-seed#[1E8E755F8FF10DA4]) [    ] o.e.j.s.ServerConnector Started ServerConnector@79d0aee2{HTTP/1.1}{127.0.0.1:38702}
   [junit4]   2> 1196233 INFO  (TEST-HttpPartitionTest.test-seed#[1E8E755F8FF10DA4]) [    ] o.e.j.s.Server Started @1198042ms
   [junit4]   2> 1196233 INFO  (TEST-HttpPartitionTest.test-seed#[1E8E755F8FF10DA4]) [    ] o.a.s.c.s.e.JettySolrRunner Jetty properties: {solr.data.dir=/home/jenkins/workspace/Lucene-Solr-trunk-Linux/solr/build/solr-core/test/J0/temp/solr.cloud.HttpPartitionTest_1E8E755F8FF10DA4-001/tempDir-001/jetty1, solrconfig=solrconfig.xml, hostContext=/, hostPort=40878, coreRootDirectory=/home/jenkins/workspace/Lucene-Solr-trunk-Linux/solr/build/solr-core/test/J0/temp/solr.cloud.HttpPartitionTest_1E8E755F8FF10DA4-001/shard-1-001/cores}
   [junit4]   2> 1196234 INFO  (TEST-HttpPartitionTest.test-seed#[1E8E755F8FF10DA4]) [    ] o.a.s.s.SolrDispatchFilter SolrDispatchFilter.init(): sun.misc.Launcher$AppClassLoader@4e0e2f2a
   [junit4]   2> 1196234 INFO  (TEST-HttpPartitionTest.test-seed#[1E8E755F8FF10DA4]) [    ] o.a.s.c.SolrResourceLoader new SolrResourceLoader for directory: '/home/jenkins/workspace/Lucene-Solr-trunk-Linux/solr/build/solr-core/test/J0/temp/solr.cloud.HttpPartitionTest_1E8E755F8FF10DA4-001/shard-1-001'
   [junit4]   2> 1196234 INFO  (TEST-HttpPartitionTest.test-seed#[1E8E755F8FF10DA4]) [    ] o.a.s.c.SolrResourceLoader JNDI not configured for solr (NoInitialContextEx)
   [junit4]   2> 1196234 INFO  (TEST-HttpPartitionTest.test-seed#[1E8E755F8FF10DA4]) [    ] o.a.s.c.SolrResourceLoader solr home defaulted to 'solr/' (could not find system property or JNDI)
   [junit4]   2> 1196235 INFO  (TEST-HttpPartitionTest.test-seed#[1E8E755F8FF10DA4]) [    ] o.a.s.c.c.SolrZkClient Using default ZkCredentialsProvider
   [junit4]   2> 1196235 INFO  (TEST-HttpPartitionTest.test-seed#[1E8E755F8FF10DA4]) [    ] o.a.s.c.c.ConnectionManager Waiting for client to connect to ZooKeeper
   [junit4]   2> 1196236 INFO  (zkCallback-1888-thread-1) [    ] o.a.s.c.c.ConnectionManager Watcher org.apache.solr.common.cloud.ConnectionManager@77a982be name:ZooKeeperConnection Watcher:127.0.0.1:41992/solr got event WatchedEvent state:SyncConnected type:None path:null path:null type:None
   [junit4]   2> 1196236 INFO  (TEST-HttpPartitionTest.test-seed#[1E8E755F8FF10DA4]) [    ] o.a.s.c.c.ConnectionManager Client is connected to ZooKeeper
   [junit4]   2> 1196236 INFO  (TEST-HttpPartitionTest.test-seed#[1E8E755F8FF10DA4]) [    ] o.a.s.c.c.SolrZkClient Using default ZkACLProvider
   [junit4]   2> 1196236 INFO  (TEST-HttpPartitionTest.test-seed#[1E8E755F8FF10DA4]) [    ] o.a.s.s.SolrDispatchFilter Loading solr.xml from SolrHome (not found in ZooKeeper)
   [junit4]   2> 1196236 INFO  (TEST-HttpPartitionTest.test-seed#[1E8E755F8FF10DA4]) [    ] o.a.s.c.SolrXmlConfig Loading container configuration from /home/jenkins/workspace/Lucene-Solr-trunk-Linux/solr/build/solr-core/test/J0/temp/solr.cloud.HttpPartitionTest_1E8E755F8FF10DA4-001/shard-1-001/solr.xml
   [junit4]   2> 1196241 INFO  (TEST-HttpPartitionTest.test-seed#[1E8E755F8FF10DA4]) [    ] o.a.s.c.CorePropertiesLocator Config-defined core root directory: /home/jenkins/workspace/Lucene-Solr-trunk-Linux/solr/build/solr-core/test/J0/temp/solr.cloud.HttpPartitionTest_1E8E755F8FF10DA4-001/shard-1-001/cores
   [junit4]   2> 1196241 INFO  (TEST-HttpPartitionTest.test-seed#[1E8E755F8FF10DA4]) [    ] o.a.s.c.CoreContainer New CoreContainer 2119374957
   [junit4]   2> 1196241 INFO  (TEST-HttpPartitionTest.test-seed#[1E8E755F8FF10DA4]) [    ] o.a.s.c.CoreContainer Loading cores into CoreContainer [instanceDir=/home/jenkins/workspace/Lucene-Solr-trunk-Linux/solr/build/solr-core/test/J0/temp/solr.cloud.HttpPartitionTest_1E8E755F8FF10DA4-001/shard-1-001]
   [junit4]   2> 1196241 WARN  (TEST-HttpPartitionTest.test-seed#[1E8E755F8FF10DA4]) [    ] o.a.s.c.CoreContainer Couldn't add files from /home/jenkins/workspace/Lucene-Solr-trunk-Linux/solr/build/solr-core/test/J0/temp/solr.cloud.HttpPartitionTest_1E8E755F8FF10DA4-001/shard-1-001/lib to classpath: /home/jenkins/workspace/Lucene-Solr-trunk-Linux/solr/build/solr-core/test/J0/temp/solr.cloud.HttpPartitionTest_1E8E755F8FF10DA4-001/shard-1-001/lib
   [junit4]   2> 1196241 INFO  (TEST-HttpPartitionTest.test-seed#[1E8E755F8FF10DA4]) [    ] o.a.s.h.c.HttpShardHandlerFactory created with socketTimeout : 90000,urlScheme : ,connTimeout : 15000,maxConnectionsPerHost : 20,maxConnections : 10000,corePoolSize : 0,maximumPoolSize : 2147483647,maxThreadIdleTime : 5,sizeOfQueue : -1,fairnessPolicy : false,useRetries : false,
   [junit4]   2> 1196242 INFO  (TEST-HttpPartitionTest.test-seed#[1E8E755F8FF10DA4]) [    ] o.a.s.u.UpdateShardHandler Creating UpdateShardHandler HTTP client with params: socketTimeout=340000&connTimeout=45000&retry=true
   [junit4]   2> 1196243 INFO  (TEST-HttpPartitionTest.test-seed#[1E8E755F8FF10DA4]) [    ] o.a.s.l.LogWatcher SLF4J impl is org.slf4j.impl.Log4jLoggerFactory
   [junit4]   2> 1196243 INFO  (TEST-HttpPartitionTest.test-seed#[1E8E755F8FF10DA4]) [    ] o.a.s.l.LogWatcher Registering Log Listener [Log4j (org.slf4j.impl.Log4jLoggerFactory)]
   [junit4]   2> 1196243 INFO  (TEST-HttpPartitionTest.test-seed#[1E8E755F8FF10DA4]) [    ] o.a.s.c.ZkContainer Zookeeper client=127.0.0.1:41992/solr
   [junit4]   2> 1196243 INFO  (TEST-HttpPartitionTest.test-seed#[1E8E755F8FF10DA4]) [    ] o.a.s.c.ZkController zkHost includes chroot
   [junit4]   2> 1196243 INFO  (TEST-HttpPartitionTest.test-seed#[1E8E755F8FF10DA4]) [    ] o.a.s.c.c.SolrZkClient Using default ZkCredentialsProvider
   [junit4]   2> 1196243 INFO  (TEST-HttpPartitionTest.test-seed#[1E8E755F8FF10DA4]) [    ] o.a.s.c.c.ConnectionManager Waiting for client to connect to ZooKeeper
   [junit4]   2> 1196244 INFO  (zkCallback-1891-thread-1) [    ] o.a.s.c.c.ConnectionManager Watcher org.apache.solr.common.cloud.ConnectionManager@3096cc1a name:ZooKeeperConnection Watcher:127.0.0.1:41992 got event WatchedEvent state:SyncConnected type:None path:null path:null type:None
   [junit4]   2> 1196244 INFO  (TEST-HttpPartitionTest.test-seed#[1E8E755F8FF10DA4]) [    ] o.a.s.c.c.ConnectionManager Client is connected to ZooKeeper
   [junit4]   2> 1196244 INFO  (TEST-HttpPartitionTest.test-seed#[1E8E755F8FF10DA4]) [    ] o.a.s.c.c.SolrZkClient Using default ZkACLProvider
   [junit4]   2> 1196245 INFO  (TEST-HttpPartitionTest.test-seed#[1E8E755F8FF10DA4]) [n:127.0.0.1:40878_    ] o.a.s.c.c.ConnectionManager Waiting for client to connect to ZooKeeper
   [junit4]   2> 1196245 INFO  (zkCallback-1892-thread-1-processing-n:127.0.0.1:40878_) [n:127.0.0.1:40878_    ] o.a.s.c.c.ConnectionManager Watcher org.apache.solr.common.cloud.ConnectionManager@4ef7def2 name:ZooKeeperConnection Watcher:127.0.0.1:41992/solr got event WatchedEvent state:SyncConnected type:None path:null path:null type:None
   [junit4]   2> 1196245 INFO  (TEST-HttpPartitionTest.test-seed#[1E8E755F8FF10DA4]) [n:127.0.0.1:40878_    ] o.a.s.c.c.ConnectionManager Client is connected to ZooKeeper
   [junit4]   2> 1196248 INFO  (OverseerStateUpdate-95184214179905540-127.0.0.1:58979_-n_0000000000) [n:127.0.0.1:58979_    ] o.a.s.c.o.ZkStateWriter going to create_collection /collections/collection1/state.json
   [junit4]   2> 1196248 INFO  (TEST-HttpPartitionTest.test-seed#[1E8E755F8FF10DA4]) [n:127.0.0.1:40878_    ] o.a.s.c.c.ZkStateReader Updating cluster state from ZooKeeper... 
   [junit4]   2> 1197250 INFO  (TEST-HttpPartitionTest.test-seed#[1E8E755F8FF10DA4]) [n:127.0.0.1:40878_    ] o.a.s.c.ZkController Register node as live in ZooKeeper:/live_nodes/127.0.0.1:40878_
   [junit4]   2> 1197251 INFO  (TEST-HttpPartitionTest.test-seed#[1E8E755F8FF10DA4]) [n:127.0.0.1:40878_    ] o.a.s.c.c.SolrZkClient makePath: /live_nodes/127.0.0.1:40878_
   [junit4]   2> 1197251 INFO  (zkCallback-1886-thread-1) [    ] o.a.s.c.c.ZkStateReader A live node change: [WatchedEvent state:SyncConnected type:NodeChildrenChanged path:/live_nodes], has occurred - updating... (live nodes size: [1])
   [junit4]   2> 1197251 INFO  (zkCallback-1884-thread-2-processing-n:127.0.0.1:58979_) [n:127.0.0.1:58979_    ] o.a.s.c.c.ZkStateReader A live node change: [WatchedEvent state:SyncConnected type:NodeChildrenChanged path:/live_nodes], has occurred - updating... (live nodes size: [1])
   [junit4]   2> 1197251 INFO  (zkCallback-1892-thread-1-processing-n:127.0.0.1:40878_) [n:127.0.0.1:40878_    ] o.a.s.c.c.ZkStateReader A live node change: [WatchedEvent state:SyncConnected type:NodeChildrenChanged path:/live_nodes], has occurred - updating... (live nodes size: [1])
   [junit4]   2> 1197252 INFO  (TEST-HttpPartitionTest.test-seed#[1E8E755F8FF10DA4]) [n:127.0.0.1:40878_    ] o.a.s.c.Overseer Overseer (id=null) closing
   [junit4]   2> 1197253 INFO  (TEST-HttpPartitionTest.test-seed#[1E8E755F8FF10DA4]) [n:127.0.0.1:40878_    ] o.a.s.c.LeaderElector Joined leadership election with path: /overseer_elect/election/95184214179905545-127.0.0.1:40878_-n_0000000001
   [junit4]   2> 1197253 INFO  (TEST-HttpPartitionTest.test-seed#[1E8E755F8FF10DA4]) [n:127.0.0.1:40878_    ] o.a.s.c.LeaderElector Watching path /overseer_elect/election/95184214179905540-127.0.0.1:58979_-n_0000000000 to know if I could be the leader
   [junit4]   2> 1197260 INFO  (TEST-HttpPartitionTest.test-seed#[1E8E755F8FF10DA4]) [n:127.0.0.1:40878_    ] o.a.s.c.CoreContainer Security conf doesn't exist. Skipping setup for authorization module.
   [junit4]   2> 1197260 INFO  (TEST-HttpPartitionTest.test-seed#[1E8E755F8FF10DA4]) [n:127.0.0.1:40878_    ] o.a.s.c.CoreContainer No authentication plugin used.
   [junit4]   2> 1197260 INFO  (TEST-HttpPartitionTest.test-seed#[1E8E755F8FF10DA4]) [n:127.0.0.1:40878_    ] o.a.s.c.CorePropertiesLocator Looking for core definitions underneath /home/jenkins/workspace/Lucene-Solr-trunk-Linux/solr/build/solr-core/test/J0/temp/solr.cloud.HttpPartitionTest_1E8E755F8FF10DA4-001/shard-1-001/cores
   [junit4]   2> 1197261 INFO  (TEST-HttpPartitionTest.test-seed#[1E8E755F8FF10DA4]) [n:127.0.0.1:40878_    ] o.a.s.c.CoreDescriptor Created CoreDescriptor: {name=collection1, config=solrconfig.xml, transient=false, schema=schema.xml, loadOnStartup=true, configSetProperties=configsetprops.json, collection=collection1, coreNodeName=, dataDir=data/, shard=}
   [junit4]   2> 1197261 INFO  (TEST-HttpPartitionTest.test-seed#[1E8E755F8FF10DA4]) [n:127.0.0.1:40878_    ] o.a.s.c.CorePropertiesLocator Found core collection1 in /home/jenkins/workspace/Lucene-Solr-trunk-Linux/solr/build/solr-core/test/J0/temp/solr.cloud.HttpPartitionTest_1E8E755F8FF10DA4-001/shard-1-001/cores/collection1
   [junit4]   2> 1197261 INFO  (TEST-HttpPartitionTest.test-seed#[1E8E755F8FF10DA4]) [n:127.0.0.1:40878_    ] o.a.s.c.CorePropertiesLocator Found 1 core definitions
   [junit4]   2> 1197261 INFO  (TEST-HttpPartitionTest.test-seed#[1E8E755F8FF10DA4]) [n:127.0.0.1:40878_    ] o.a.s.s.SolrDispatchFilter user.dir=/home/jenkins/workspace/Lucene-Solr-trunk-Linux/solr/build/solr-core/test/J0
   [junit4]   2> 1197261 INFO  (TEST-HttpPartitionTest.test-seed#[1E8E755F8FF10DA4]) [n:127.0.0.1:40878_    ] o.a.s.s.SolrDispatchFilter SolrDispatchFilter.init() done
   [junit4]   2> 1197262 INFO  (coreLoadExecutor-5768-thread-1-processing-n:127.0.0.1:40878_) [n:127.0.0.1:40878_ c:collection1   x:collection1] o.a.s.c.ZkController publishing state=down
   [junit4]   2> 1197262 INFO  (coreLoadExecutor-5768-thread-1-processing-n:127.0.0.1:40878_) [n:127.0.0.1:40878_ c:collection1   x:collection1] o.a.s.c.ZkController numShards not found on descriptor - reading it from system property
   [junit4]   2> 1197262 INFO  (coreLoadExecutor-5768-thread-1-processing-n:127.0.0.1:40878_) [n:127.0.0.1:40878_ c:collection1   x:collection1] o.a.s.c.ZkController Registering watch for collection collection1
   [junit4]   2> 1197262 INFO  (coreLoadExecutor-5768-thread-1-processing-n:127.0.0.1:40878_) [n:127.0.0.1:40878_ c:collection1   x:collection1] o.a.s.c.c.ZkStateReader addZkWatch [collection1]
   [junit4]   2> 1197263 INFO  (OverseerStateUpdate-95184214179905540-127.0.0.1:58979_-n_0000000000) [n:127.0.0.1:58979_    ] o.a.s.c.Overseer processMessage: queueSize: 1, message = {
   [junit4]   2>   "core":"collection1",
   [junit4]   2>   "roles":null,
   [junit4]   2>   "base_url":"http://127.0.0.1:40878",
   [junit4]   2>   "node_name":"127.0.0.1:40878_",
   [junit4]   2>   "numShards":"2",
   [junit4]   2>   "state":"down",
   [junit4]   2>   "shard":null,
   [junit4]   2>   "collection":"collection1",
   [junit4]   2>   "operation":"state"} current state version: 3
   [junit4]   2> 1197263 INFO  (OverseerStateUpdate-95184214179905540-127.0.0.1:58979_-n_0000000000) [n:127.0.0.1:58979_    ] o.a.s.c.o.ReplicaMutator Update state numShards=2 message={
   [junit4]   2>   "core":"collection1",
   [junit4]   2>   "roles":null,
   [junit4]   2>   "base_url":"http://127.0.0.1:40878",
   [junit4]   2>   "node_name":"127.0.0.1:40878_",
   [junit4]   2>   "numShards":"2",
   [junit4]   2>   "state":"down",
   [junit4]   2>   "shard":null,
   [junit4]   2>   "collection":"collection1",
   [junit4]   2>   "operation":"state"}
   [junit4]   2> 1197263 INFO  (OverseerStateUpdate-95184214179905540-127.0.0.1:58979_-n_0000000000) [n:127.0.0.1:58979_    ] o.a.s.c.o.ReplicaMutator Collection already exists with numShards=2
   [junit4]   2> 1197263 INFO  (OverseerStateUpdate-95184214179905540-127.0.0.1:58979_-n_0000000000) [n:127.0.0.1:58979_    ] o.a.s.c.o.ReplicaMutator Assigning new node to shard shard=shard2
   [junit4]   2> 1197263 INFO  (coreLoadExecutor-5768-thread-1-processing-n:127.0.0.1:40878_) [n:127.0.0.1:40878_ c:collection1   x:collection1] o.a.s.c.c.ZkStateReader Add data for [collection1] ver [0]
   [junit4]   2> 1197263 INFO  (coreLoadExecutor-5768-thread-1-processing-n:127.0.0.1:40878_) [n:127.0.0.1:40878_ c:collection1   x:collection1] o.a.s.c.ZkController look for our core node name
   [junit4]   2> 1197366 INFO  (OverseerStateUpdate-95184214179905540-127.0.0.1:58979_-n_0000000000) [n:127.0.0.1:58979_    ] o.a.s.c.o.ZkStateWriter going to update_collection /collections/collection1/state.json version: 0
   [junit4]   2> 1197367 INFO  (zkCallback-1892-thread-1-processing-n:127.0.0.1:40878_) [n:127.0.0.1:40878_    ] o.a.s.c.c.ZkStateReader A cluster state change: [WatchedEvent state:SyncConnected type:NodeDataChanged path:/collections/collection1/state.json] for collection [collection1] has occurred - updating... (live nodes size: [2])
   [junit4]   2> 1197367 INFO  (zkCallback-1892-thread-1-processing-n:127.0.0.1:40878_) [n:127.0.0.1:40878_    ] o.a.s.c.c.ZkStateReader Updating data for [collection1] from [0] to [1]
   [junit4]   2> 1198263 INFO  (coreLoadExecutor-5768-thread-1-processing-n:127.0.0.1:40878_) [n:127.0.0.1:40878_ c:collection1   x:collection1] o.a.s.c.ZkController waiting to find shard id in clusterstate for collection1
   [junit4]   2> 1198263 INFO  (coreLoadExecutor-5768-thread-1-processing-n:127.0.0.1:40878_) [n:127.0.0.1:40878_ c:collection1   x:collection1] o.a.s.c.ZkController Check for collection zkNode:collection1
   [junit4]   2> 1198264 INFO  (coreLoadExecutor-5768-thread-1-processing-n:127.0.0.1:40878_) [n:127.0.0.1:40878_ c:collection1   x:collection1] o.a.s.c.ZkController Collection zkNode exists
   [junit4]   2> 1198264 INFO  (coreLoadExecutor-5768-thread-1-processing-n:127.0.0.1:40878_) [n:127.0.0.1:40878_ c:collection1   x:collection1] o.a.s.c.c.ZkStateReader Load collection config from: [/collections/collection1]
   [junit4]   2> 1198264 INFO  (coreLoadExecutor-5768-thread-1-processing-n:127.0.0.1:40878_) [n:127.0.0.1:40878_ c:collection1   x:collection1] o.a.s.c.c.ZkStateReader path=[/collections/collection1] [configName]=[conf1] specified config exists in ZooKeeper
   [junit4]   2> 1198264 INFO  (coreLoadExecutor-5768-thread-1-processing-n:127.0.0.1:40878_) [n:127.0.0.1:40878_ c:collection1   x:collection1] o.a.s.c.SolrResourceLoader new SolrResourceLoader for directory: '/home/jenkins/workspace/Lucene-Solr-trunk-Linux/solr/build/solr-core/test/J0/temp/solr.cloud.HttpPartitionTest_1E8E755F8FF10DA4-001/shard-1-001/cores/collection1'
   [junit4]   2> 1198264 INFO  (coreLoadExecutor-5768-thread-1-processing-n:127.0.0.1:40878_) [n:127.0.0.1:40878_ c:collection1   x:collection1] o.a.s.c.SolrResourceLoader JNDI not configured for solr (NoInitialContextEx)
   [junit4]   2> 1198264 INFO  (coreLoadExecutor-5768-thread-1-processing-n:127.0.0.1:40878_) [n:127.0.0.1:40878_ c:collection1   x:collection1] o.a.s.c.SolrResourceLoader solr home defaulted to 'solr/' (could not find system property or JNDI)
   [junit4]   2> 1198265 INFO  (coreLoadExecutor-5768-thread-1-processing-n:127.0.0.1:40878_) [n:127.0.0.1:40878_ c:collection1   x:collection1] o.a.s.c.Config loaded config solrconfig.xml with version 0 
   [junit4]   2> 1198269 INFO  (coreLoadExecutor-5768-thread-1-processing-n:127.0.0.1:40878_) [n:127.0.0.1:40878_ c:collection1   x:collection1] o.a.s.c.SolrConfig current version of requestparams : -1
   [junit4]   2> 1198272 INFO  (coreLoadExecutor-5768-thread-1-processing-n:127.0.0.1:40878_) [n:127.0.0.1:40878_ c:collection1   x:collection1] o.a.s.c.SolrConfig Using Lucene MatchVersion: 6.0.0
   [junit4]   2> 1198281 INFO  (coreLoadExecutor-5768-thread-1-processing-n:127.0.0.1:40878_) [n:127.0.0.1:40878_ c:collection1   x:collection1] o.a.s.c.SolrConfig Loaded SolrConfig: solrconfig.xml
   [junit4]   2> 1198287 INFO  (coreLoadExecutor-5768-thread-1-processing-n:127.0.0.1:40878_) [n:127.0.0.1:40878_ c:collection1   x:collection1] o.a.s.s.IndexSchema [collection1] Schema name=test
   [junit4]   2> 1198342 INFO  (coreLoadExecutor-5768-thread-1-processing-n:127.0.0.1:40878_) [n:127.0.0.1:40878_ c:collection1   x:collection1] o.a.s.s.OpenExchangeRatesOrgProvider Initialized with rates=open-exchange-rates.json, refreshInterval=1440.
   [junit4]   2> 1198346 INFO  (coreLoadExecutor-5768-thread-1-processing-n:127.0.0.1:40878_) [n:127.0.0.1:40878_ c:collection1   x:collection1] o.a.s.s.IndexSchema default search field in schema is text
   [junit4]   2> 1198347 INFO  (coreLoadExecutor-5768-thread-1-processing-n:127.0.0.1:40878_) [n:127.0.0.1:40878_ c:collection1   x:collection1] o.a.s.s.IndexSchema unique key field: id
   [junit4]   2> 1198351 INFO  (coreLoadExecutor-5768-thread-1-processing-n:127.0.0.1:40878_) [n:127.0.0.1:40878_ c:collection1   x:collection1] o.a.s.s.FileExchangeRateProvider Reloading exchange rates from file currency.xml
   [junit4]   2> 1198352 INFO  (coreLoadExecutor-5768-thread-1-processing-n:127.0.0.1:40878_) [n:127.0.0.1:40878_ c:collection1   x:collection1] o.a.s.s.FileExchangeRateProvider Reloading exchange rates from file currency.xml
   [junit4]   2> 1198353 INFO  (coreLoadExecutor-5768-thread-1-processing-n:127.0.0.1:40878_) [n:127.0.0.1:40878_ c:collection1   x:collection1] o.a.s.s.OpenExchangeRatesOrgProvider Reloading exchange rates from open-exchange-rates.json
   [junit4]   2> 1198353 INFO  (coreLoadExecutor-5768-thread-1-processing-n:127.0.0.1:40878_) [n:127.0.0.1:40878_ c:collection1   x:collection1] o.a.s.s.OpenExchangeRatesOrgProvider Reloading exchange rates from open-exchange-rates.json
   [junit4]   2> 1198354 INFO  (coreLoadExecutor-5768-thread-1-processing-n:127.0.0.1:40878_) [n:127.0.0.1:40878_ c:collection1   x:collection1] o.a.s.c.ConfigSetProperties Did not find ConfigSet properties, assuming default properties: Can't find resource 'configsetprops.json' in classpath or '/configs/conf1', cwd=/home/jenkins/workspace/Lucene-Solr-trunk-Linux/solr/build/solr-core/test/J0
   [junit4]   2> 1198354 INFO  (coreLoadExecutor-5768-thread-1-processing-n:127.0.0.1:40878_) [n:127.0.0.1:40878_ c:collection1   x:collection1] o.a.s.c.CoreContainer Creating SolrCore 'collection1' using configuration from collection collection1
   [junit4]   2> 1198354 INFO  (coreLoadExecutor-5768-thread-1-processing-n:127.0.0.1:40878_) [n:127.0.0.1:40878_ c:collection1 s:shard2 r:core_node1 x:collection1] o.a.s.c.SolrCore org.apache.solr.core.MockDirectoryFactory
   [junit4]   2> 1198354 INFO  (coreLoadExecutor-5768-thread-1-processing-n:127.0.0.1:40878_) [n:127.0.0.1:40878_ c:collection1 s:shard2 r:core_node1 x:collection1] o.a.s.c.SolrCore [[collection1] ] Opening new SolrCore at [/home/jenkins/workspace/Lucene-Solr-trunk-Linux/solr/build/solr-core/test/J0/temp/solr.cloud.HttpPartitionTest_1E8E755F8FF10DA4-001/shard-1-001/cores/collection1], dataDir=[/home/jenkins/workspace/Lucene-Solr-trunk-Linux/solr/build/solr-core/test/J0/temp/solr.cloud.HttpPartitionTes

[...truncated too long message...]

  >             "state":"active",
   [junit4]    >             "leader":"true"}}}},
   [junit4]    >     "router":{"name":"compositeId"},
   [junit4]    >     "maxShardsPerNode":"1",
   [junit4]    >     "autoAddReplicas":"false",
   [junit4]    >     "autoCreated":"true"},
   [junit4]    >   "c8n_1x2":{
   [junit4]    >     "replicationFactor":"2",
   [junit4]    >     "shards":{"shard1":{
   [junit4]    >         "range":"80000000-7fffffff",
   [junit4]    >         "state":"active",
   [junit4]    >         "replicas":{
   [junit4]    >           "core_node1":{
   [junit4]    >             "core":"c8n_1x2_shard1_replica2",
   [junit4]    >             "base_url":"http://127.0.0.1:58979",
   [junit4]    >             "node_name":"127.0.0.1:58979_",
   [junit4]    >             "state":"recovering"},
   [junit4]    >           "core_node2":{
   [junit4]    >             "core":"c8n_1x2_shard1_replica1",
   [junit4]    >             "base_url":"http://127.0.0.1:45602",
   [junit4]    >             "node_name":"127.0.0.1:45602_",
   [junit4]    >             "state":"active",
   [junit4]    >             "leader":"true"}}}},
   [junit4]    >     "router":{"name":"compositeId"},
   [junit4]    >     "maxShardsPerNode":"1",
   [junit4]    >     "autoAddReplicas":"false"},
   [junit4]    >   "collMinRf_1x3":{
   [junit4]    >     "replicationFactor":"3",
   [junit4]    >     "shards":{"shard1":{
   [junit4]    >         "range":"80000000-7fffffff",
   [junit4]    >         "state":"active",
   [junit4]    >         "replicas":{
   [junit4]    >           "core_node1":{
   [junit4]    >             "core":"collMinRf_1x3_shard1_replica1",
   [junit4]    >             "base_url":"http://127.0.0.1:58979",
   [junit4]    >             "node_name":"127.0.0.1:58979_",
   [junit4]    >             "state":"active"},
   [junit4]    >           "core_node2":{
   [junit4]    >             "core":"collMinRf_1x3_shard1_replica2",
   [junit4]    >             "base_url":"http://127.0.0.1:45045",
   [junit4]    >             "node_name":"127.0.0.1:45045_",
   [junit4]    >             "state":"active"},
   [junit4]    >           "core_node3":{
   [junit4]    >             "core":"collMinRf_1x3_shard1_replica3",
   [junit4]    >             "base_url":"http://127.0.0.1:40878",
   [junit4]    >             "node_name":"127.0.0.1:40878_",
   [junit4]    >             "state":"active",
   [junit4]    >             "leader":"true"}}}},
   [junit4]    >     "router":{"name":"compositeId"},
   [junit4]    >     "maxShardsPerNode":"1",
   [junit4]    >     "autoAddReplicas":"false"}}
   [junit4]    > 	at __randomizedtesting.SeedInfo.seed([1E8E755F8FF10DA4:96DA4A85210D605C]:0)
   [junit4]    > 	at org.apache.solr.cloud.AbstractFullDistribZkTestBase.ensureAllReplicasAreActive(AbstractFullDistribZkTestBase.java:1844)
   [junit4]    > 	at org.apache.solr.cloud.HttpPartitionTest.testRf2(HttpPartitionTest.java:349)
   [junit4]    > 	at org.apache.solr.cloud.HttpPartitionTest.test(HttpPartitionTest.java:109)
   [junit4]    > 	at org.apache.solr.BaseDistributedSearchTestCase$ShardsRepeatRule$ShardsFixedStatement.callStatement(BaseDistributedSearchTestCase.java:965)
   [junit4]    > 	at org.apache.solr.BaseDistributedSearchTestCase$ShardsRepeatRule$ShardsStatement.evaluate(BaseDistributedSearchTestCase.java:940)
   [junit4]    > 	at java.lang.Thread.run(Thread.java:745)
   [junit4]   2> 1334999 INFO  (SUITE-HttpPartitionTest-seed#[1E8E755F8FF10DA4]-worker) [n:127.0.0.1:45045_ c:collMinRf_1x3 s:shard1 r:core_node2 x:collMinRf_1x3_shard1_replica2] o.a.s.SolrTestCaseJ4 ###deleteCore
   [junit4]   2> NOTE: leaving temporary files on disk at: /home/jenkins/workspace/Lucene-Solr-trunk-Linux/solr/build/solr-core/test/J0/temp/solr.cloud.HttpPartitionTest_1E8E755F8FF10DA4-001
   [junit4]   2> Jan 10, 2016 3:19:46 AM com.carrotsearch.randomizedtesting.ThreadLeakControl checkThreadLeaks
   [junit4]   2> WARNING: Will linger awaiting termination of 1 leaked thread(s).
   [junit4]   2> NOTE: test params are: codec=Asserting(Lucene60): {range_facet_l_dv=PostingsFormat(name=Direct), _version_=PostingsFormat(name=MockRandom), multiDefault=PostingsFormat(name=Memory doPackFST= false), a_t=PostingsFormat(name=Memory doPackFST= false), intDefault=PostingsFormat(name=MockRandom), id=PostingsFormat(name=Direct), range_facet_i_dv=PostingsFormat(name=Memory doPackFST= false), text=BlockTreeOrds(blocksize=128), range_facet_l=PostingsFormat(name=Memory doPackFST= false), timestamp=PostingsFormat(name=Memory doPackFST= false)}, docValues:{range_facet_l_dv=DocValuesFormat(name=Direct), range_facet_i_dv=DocValuesFormat(name=Asserting), timestamp=DocValuesFormat(name=Asserting)}, sim=RandomSimilarityProvider(queryNorm=true,coord=crazy): {}, locale=zh_SG, timezone=America/Thule
   [junit4]   2> NOTE: Linux 3.19.0-42-generic amd64/Oracle Corporation 1.8.0_66 (64-bit)/cpus=12,threads=1,free=378867544,total=536870912
   [junit4]   2> NOTE: All tests run in this JVM: [TestReplicaProperties, IndexSchemaTest, TestDocSet, CloudMLTQParserTest, MultiThreadedOCPTest, BigEndianAscendingWordDeserializerTest, TestRawResponseWriter, SharedFSAutoReplicaFailoverTest, CloudExitableDirectoryReaderTest, TestMacros, InfoHandlerTest, CurrencyFieldOpenExchangeTest, RuleEngineTest, QueryElevationComponentTest, BlockJoinFacetRandomTest, AddBlockUpdateTest, TestPhraseSuggestions, TestFoldingMultitermQuery, TestNRTOpen, TestSolrQueryParserResource, ResponseLogComponentTest, DeleteInactiveReplicaTest, AtomicUpdatesTest, TestBadConfig, CdcrVersionReplicationTest, PreAnalyzedFieldTest, DistributedDebugComponentTest, QueryEqualityTest, TestRealTimeGet, SpatialRPTFieldTypeTest, TestInitQParser, VMParamsZkACLAndCredentialsProvidersTest, TestExclusionRuleCollectionAccess, TestCloudInspectUtil, TestSQLHandler, TestShortCircuitedRequests, TestRTGBase, TestScoreJoinQPNoScore, TestHighlightDedupGrouping, DistributedQueryElevationComponentTest, TestCopyFieldCollectionResource, XsltUpdateRequestHandlerTest, ExplicitHLLTest, SignatureUpdateProcessorFactoryTest, PingRequestHandlerTest, DistribJoinFromCollectionTest, SOLR749Test, CoreAdminCreateDiscoverTest, TestHighFrequencyDictionaryFactory, DeleteShardTest, BasicDistributedZkTest, TestMiniSolrCloudClusterSSL, TestSchemaNameResource, TestRecoveryHdfs, TestImplicitCoreProperties, URLClassifyProcessorTest, TestManagedSchemaFieldResource, ReplicationFactorTest, TestRemoteStreaming, ExternalFileFieldSortTest, TestUseDocValuesAsStored2, HLLUtilTest, TestBinaryField, TestFaceting, TestStressLucene, DateFieldTest, TestCryptoKeys, TestSolr4Spatial, TestHdfsUpdateLog, CursorMarkTest, TestExactSharedStatsCache, AsyncCallRequestStatusResponseTest, TestNonDefinedSimilarityFactory, AlternateDirectoryTest, SolrCloudExampleTest, SynonymTokenizerTest, LeaderInitiatedRecoveryOnCommitTest, ResourceLoaderTest, TestBlendedInfixSuggestions, TestSortingResponseWriter, TestFastOutputStream, TestConfigSetsAPI, DateRangeFieldTest, OverseerTaskQueueTest, HdfsChaosMonkeyNothingIsSafeTest, CdcrReplicationDistributedZkTest, QueryResultKeyTest, DistributedFacetPivotLongTailTest, IgnoreCommitOptimizeUpdateProcessorFactoryTest, PathHierarchyTokenizerFactoryTest, HdfsNNFailoverTest, TestRandomMergePolicy, TestMiniSolrCloudCluster, SolrRequestParserTest, UnloadDistributedZkTest, LeaderElectionIntegrationTest, TestReplicationHandler, TestDistributedGrouping, DistributedSpellCheckComponentTest, HardAutoCommitTest, TestRangeQuery, TestCoreContainer, SolrCoreTest, SpellCheckComponentTest, TestFunctionQuery, BasicFunctionalityTest, TestLazyCores, TestIndexSearcher, HighlighterTest, SoftAutoCommitTest, CurrencyFieldXmlFileTest, SimplePostToolTest, TestCoreDiscovery, AnalysisAfterCoreReloadTest, SpellCheckCollatorTest, TestTrie, PolyFieldTest, WordBreakSolrSpellCheckerTest, TestAtomicUpdateErrorCases, TestSolrDeletionPolicy1, DebugComponentTest, CacheHeaderTest, DisMaxRequestHandlerTest, StandardRequestHandlerTest, DocumentAnalysisRequestHandlerTest, TestQueryTypes, TestOmitPositions, TermsComponentTest, RequestHandlersTest, TermVectorComponentTest, RequiredFieldsTest, TestArbitraryIndexDir, LoggingHandlerTest, UpdateRequestProcessorFactoryTest, JSONWriterTest, MBeansHandlerTest, JsonLoaderTest, BinaryUpdateRequestHandlerTest, CSVRequestHandlerTest, BadComponentTest, TestStressRecovery, TestCrossCoreJoin, TestCursorMarkWithoutUniqueKey, TestDistributedMissingSort, TestSimpleTrackingShardHandler, TestEmbeddedSolrServerConstructors, TestJettySolrRunner, ActionThrottleTest, AssignTest, AsyncMigrateRouteKeyTest, CollectionsAPIAsyncDistributedZkTest, DeleteReplicaTest, HttpPartitionTest]
   [junit4] Completed [444/575 (1!)] on J0 in 140.83s, 1 test, 1 failure <<< FAILURES!

[...truncated 457 lines...]
BUILD FAILED
/home/jenkins/workspace/Lucene-Solr-trunk-Linux/build.xml:784: The following error occurred while executing this line:
/home/jenkins/workspace/Lucene-Solr-trunk-Linux/build.xml:728: The following error occurred while executing this line:
/home/jenkins/workspace/Lucene-Solr-trunk-Linux/build.xml:59: The following error occurred while executing this line:
/home/jenkins/workspace/Lucene-Solr-trunk-Linux/solr/build.xml:233: The following error occurred while executing this line:
/home/jenkins/workspace/Lucene-Solr-trunk-Linux/solr/common-build.xml:516: The following error occurred while executing this line:
/home/jenkins/workspace/Lucene-Solr-trunk-Linux/lucene/common-build.xml:1424: The following error occurred while executing this line:
/home/jenkins/workspace/Lucene-Solr-trunk-Linux/lucene/common-build.xml:981: There were test failures: 575 suites (8 ignored), 2290 tests, 1 failure, 114 ignored (70 assumptions) [seed: 1E8E755F8FF10DA4]

Total time: 47 minutes 58 seconds
Build step 'Invoke Ant' marked build as failure
Archiving artifacts
[WARNINGS] Skipping publisher since build result is FAILURE
Recording test results
Email was triggered for: Failure - Any
Sending email for trigger: Failure - Any



Mime
View raw message