lucene-dev mailing list archives

Site index · List index
Message view « Date » · « Thread »
Top « Date » · « Thread »
From Apache Jenkins Server <jenk...@builds.apache.org>
Subject [JENKINS] Lucene-Solr-SmokeRelease-trunk - Build # 388 - Failure
Date Tue, 12 Jan 2016 01:37:55 GMT
Build: https://builds.apache.org/job/Lucene-Solr-SmokeRelease-trunk/388/

No tests ran.

Build Log:
[...truncated 52679 lines...]
prepare-release-no-sign:
    [mkdir] Created dir: /x1/jenkins/jenkins-slave/workspace/Lucene-Solr-SmokeRelease-trunk/lucene/build/smokeTestRelease/dist
     [copy] Copying 461 files to /x1/jenkins/jenkins-slave/workspace/Lucene-Solr-SmokeRelease-trunk/lucene/build/smokeTestRelease/dist/lucene
     [copy] Copying 245 files to /x1/jenkins/jenkins-slave/workspace/Lucene-Solr-SmokeRelease-trunk/lucene/build/smokeTestRelease/dist/solr
   [smoker] Java 1.8 JAVA_HOME=/home/jenkins/jenkins-slave/tools/hudson.model.JDK/latest1.8
   [smoker] NOTE: output encoding is UTF-8
   [smoker] 
   [smoker] Load release URL "file:/x1/jenkins/jenkins-slave/workspace/Lucene-Solr-SmokeRelease-trunk/lucene/build/smokeTestRelease/dist/"...
   [smoker] 
   [smoker] Test Lucene...
   [smoker]   test basics...
   [smoker]   get KEYS
   [smoker]     0.2 MB in 0.01 sec (14.0 MB/sec)
   [smoker]   check changes HTML...
   [smoker]   download lucene-6.0.0-src.tgz...
   [smoker]     28.3 MB in 0.04 sec (808.0 MB/sec)
   [smoker]     verify md5/sha1 digests
   [smoker]   download lucene-6.0.0.tgz...
   [smoker]     62.6 MB in 0.08 sec (802.2 MB/sec)
   [smoker]     verify md5/sha1 digests
   [smoker]   download lucene-6.0.0.zip...
   [smoker]     73.1 MB in 0.09 sec (821.1 MB/sec)
   [smoker]     verify md5/sha1 digests
   [smoker]   unpack lucene-6.0.0.tgz...
   [smoker]     verify JAR metadata/identity/no javax.* or java.* classes...
   [smoker]     test demo with 1.8...
   [smoker]       got 5969 hits for query "lucene"
   [smoker]     checkindex with 1.8...
   [smoker]     check Lucene's javadoc JAR
   [smoker]   unpack lucene-6.0.0.zip...
   [smoker]     verify JAR metadata/identity/no javax.* or java.* classes...
   [smoker]     test demo with 1.8...
   [smoker]       got 5969 hits for query "lucene"
   [smoker]     checkindex with 1.8...
   [smoker]     check Lucene's javadoc JAR
   [smoker]   unpack lucene-6.0.0-src.tgz...
   [smoker]     make sure no JARs/WARs in src dist...
   [smoker]     run "ant validate"
   [smoker]     run tests w/ Java 8 and testArgs='-Dtests.slow=false'...
   [smoker]     test demo with 1.8...
   [smoker]       got 211 hits for query "lucene"
   [smoker]     checkindex with 1.8...
   [smoker]     generate javadocs w/ Java 8...
   [smoker] 
   [smoker] Crawl/parse...
   [smoker] 
   [smoker] Verify...
   [smoker]   confirm all releases have coverage in TestBackwardsCompatibility
   [smoker]     find all past Lucene releases...
   [smoker]     run TestBackwardsCompatibility..
   [smoker]     success!
   [smoker] 
   [smoker] Test Solr...
   [smoker]   test basics...
   [smoker]   get KEYS
   [smoker]     0.2 MB in 0.00 sec (149.8 MB/sec)
   [smoker]   check changes HTML...
   [smoker]   download solr-6.0.0-src.tgz...
   [smoker]     37.3 MB in 0.05 sec (724.7 MB/sec)
   [smoker]     verify md5/sha1 digests
   [smoker]   download solr-6.0.0.tgz...
   [smoker]     132.2 MB in 0.17 sec (762.4 MB/sec)
   [smoker]     verify md5/sha1 digests
   [smoker]   download solr-6.0.0.zip...
   [smoker]     140.6 MB in 0.18 sec (774.3 MB/sec)
   [smoker]     verify md5/sha1 digests
   [smoker]   unpack solr-6.0.0.tgz...
   [smoker]     verify JAR metadata/identity/no javax.* or java.* classes...
   [smoker]     unpack lucene-6.0.0.tgz...
   [smoker]       **WARNING**: skipping check of /x1/jenkins/jenkins-slave/workspace/Lucene-Solr-SmokeRelease-trunk/lucene/build/smokeTestRelease/tmp/unpack/solr-6.0.0/contrib/dataimporthandler-extras/lib/javax.mail-1.5.1.jar: it has javax.* classes
   [smoker]       **WARNING**: skipping check of /x1/jenkins/jenkins-slave/workspace/Lucene-Solr-SmokeRelease-trunk/lucene/build/smokeTestRelease/tmp/unpack/solr-6.0.0/contrib/dataimporthandler-extras/lib/activation-1.1.1.jar: it has javax.* classes
   [smoker]     copying unpacked distribution for Java 8 ...
   [smoker]     test solr example w/ Java 8...
   [smoker]       start Solr instance (log=/x1/jenkins/jenkins-slave/workspace/Lucene-Solr-SmokeRelease-trunk/lucene/build/smokeTestRelease/tmp/unpack/solr-6.0.0-java8/solr-example.log)...
   [smoker] No process found for Solr node running on port 8983
   [smoker]       Running techproducts example on port 8983 from /x1/jenkins/jenkins-slave/workspace/Lucene-Solr-SmokeRelease-trunk/lucene/build/smokeTestRelease/tmp/unpack/solr-6.0.0-java8
   [smoker] Creating Solr home directory /x1/jenkins/jenkins-slave/workspace/Lucene-Solr-SmokeRelease-trunk/lucene/build/smokeTestRelease/tmp/unpack/solr-6.0.0-java8/example/techproducts/solr
   [smoker] 
   [smoker] Starting up Solr on port 8983 using command:
   [smoker] bin/solr start -p 8983 -s "example/techproducts/solr"
   [smoker] 
   [smoker] Waiting up to 30 seconds to see Solr running on port 8983 [|]   [/]   [-]   [\]   [|]   [/]   [-]   [\]   [|]   [/]   [-]  
   [smoker] Started Solr server on port 8983 (pid=15031). Happy searching!
   [smoker] 
   [smoker]     
   [smoker] Copying configuration to new core instance directory:
   [smoker] /x1/jenkins/jenkins-slave/workspace/Lucene-Solr-SmokeRelease-trunk/lucene/build/smokeTestRelease/tmp/unpack/solr-6.0.0-java8/example/techproducts/solr/techproducts
   [smoker] 
   [smoker] Creating new core 'techproducts' using command:
   [smoker] http://localhost:8983/solr/admin/cores?action=CREATE&name=techproducts&instanceDir=techproducts
   [smoker] 
   [smoker] {
   [smoker]   "responseHeader":{
   [smoker]     "status":0,
   [smoker]     "QTime":1687},
   [smoker]   "core":"techproducts"}
   [smoker] 
   [smoker] 
   [smoker] Indexing tech product example docs from /x1/jenkins/jenkins-slave/workspace/Lucene-Solr-SmokeRelease-trunk/lucene/build/smokeTestRelease/tmp/unpack/solr-6.0.0-java8/example/exampledocs
   [smoker] SimplePostTool version 5.0.0
   [smoker] Posting files to [base] url http://localhost:8983/solr/techproducts/update using content-type application/xml...
   [smoker] POSTing file money.xml to [base]
   [smoker] POSTing file mem.xml to [base]
   [smoker] POSTing file vidcard.xml to [base]
   [smoker] POSTing file ipod_video.xml to [base]
   [smoker] POSTing file sd500.xml to [base]
   [smoker] POSTing file gb18030-example.xml to [base]
   [smoker] POSTing file mp500.xml to [base]
   [smoker] POSTing file monitor2.xml to [base]
   [smoker] POSTing file utf8-example.xml to [base]
   [smoker] POSTing file manufacturers.xml to [base]
   [smoker] POSTing file hd.xml to [base]
   [smoker] POSTing file solr.xml to [base]
   [smoker] POSTing file monitor.xml to [base]
   [smoker] POSTing file ipod_other.xml to [base]
   [smoker] 14 files indexed.
   [smoker] COMMITting Solr index changes to http://localhost:8983/solr/techproducts/update...
   [smoker] Time spent: 0:00:00.461
   [smoker] 
   [smoker] Solr techproducts example launched successfully. Direct your Web browser to http://localhost:8983/solr to visit the Solr Admin UI
   [smoker]       test utf8...
   [smoker]       run query...
   [smoker]       stop server using: bin/solr stop -p 8983
   [smoker] Sending stop command to Solr running on port 8983 ... waiting 5 seconds to allow Jetty process 15031 to stop gracefully.
   [smoker]  [|]   [/]   [-]   [\]   [|]   [/]   [-]   [\]   [|]   [/]        unpack solr-6.0.0.zip...
   [smoker]     verify JAR metadata/identity/no javax.* or java.* classes...
   [smoker]     unpack lucene-6.0.0.tgz...
   [smoker]       **WARNING**: skipping check of /x1/jenkins/jenkins-slave/workspace/Lucene-Solr-SmokeRelease-trunk/lucene/build/smokeTestRelease/tmp/unpack/solr-6.0.0/contrib/dataimporthandler-extras/lib/javax.mail-1.5.1.jar: it has javax.* classes
   [smoker]       **WARNING**: skipping check of /x1/jenkins/jenkins-slave/workspace/Lucene-Solr-SmokeRelease-trunk/lucene/build/smokeTestRelease/tmp/unpack/solr-6.0.0/contrib/dataimporthandler-extras/lib/activation-1.1.1.jar: it has javax.* classes
   [smoker]     copying unpacked distribution for Java 8 ...
   [smoker]     test solr example w/ Java 8...
   [smoker]       start Solr instance (log=/x1/jenkins/jenkins-slave/workspace/Lucene-Solr-SmokeRelease-trunk/lucene/build/smokeTestRelease/tmp/unpack/solr-6.0.0-java8/solr-example.log)...
   [smoker] No process found for Solr node running on port 8983
   [smoker]       Running techproducts example on port 8983 from /x1/jenkins/jenkins-slave/workspace/Lucene-Solr-SmokeRelease-trunk/lucene/build/smokeTestRelease/tmp/unpack/solr-6.0.0-java8
   [smoker] Creating Solr home directory /x1/jenkins/jenkins-slave/workspace/Lucene-Solr-SmokeRelease-trunk/lucene/build/smokeTestRelease/tmp/unpack/solr-6.0.0-java8/example/techproducts/solr
   [smoker] 
   [smoker] Starting up Solr on port 8983 using command:
   [smoker] bin/solr start -p 8983 -s "example/techproducts/solr"
   [smoker] 
   [smoker] Waiting up to 30 seconds to see Solr running on port 8983 [|]   [/]   [-]   [\]   [|]   [/]   [-]   [\]   [|]   [/]   [-]  
   [smoker] Started Solr server on port 8983 (pid=15433). Happy searching!
   [smoker] 
   [smoker]     
   [smoker] Copying configuration to new core instance directory:
   [smoker] /x1/jenkins/jenkins-slave/workspace/Lucene-Solr-SmokeRelease-trunk/lucene/build/smokeTestRelease/tmp/unpack/solr-6.0.0-java8/example/techproducts/solr/techproducts
   [smoker] 
   [smoker] Creating new core 'techproducts' using command:
   [smoker] http://localhost:8983/solr/admin/cores?action=CREATE&name=techproducts&instanceDir=techproducts
   [smoker] 
   [smoker] {
   [smoker]   "responseHeader":{
   [smoker]     "status":0,
   [smoker]     "QTime":1715},
   [smoker]   "core":"techproducts"}
   [smoker] 
   [smoker] 
   [smoker] Indexing tech product example docs from /x1/jenkins/jenkins-slave/workspace/Lucene-Solr-SmokeRelease-trunk/lucene/build/smokeTestRelease/tmp/unpack/solr-6.0.0-java8/example/exampledocs
   [smoker] SimplePostTool version 5.0.0
   [smoker] Posting files to [base] url http://localhost:8983/solr/techproducts/update using content-type application/xml...
   [smoker] POSTing file money.xml to [base]
   [smoker] POSTing file mem.xml to [base]
   [smoker] POSTing file vidcard.xml to [base]
   [smoker] POSTing file ipod_video.xml to [base]
   [smoker] POSTing file sd500.xml to [base]
   [smoker] POSTing file gb18030-example.xml to [base]
   [smoker] POSTing file mp500.xml to [base]
   [smoker] POSTing file monitor2.xml to [base]
   [smoker] POSTing file utf8-example.xml to [base]
   [smoker] POSTing file manufacturers.xml to [base]
   [smoker] POSTing file hd.xml to [base]
   [smoker] POSTing file solr.xml to [base]
   [smoker] POSTing file monitor.xml to [base]
   [smoker] POSTing file ipod_other.xml to [base]
   [smoker] 14 files indexed.
   [smoker] COMMITting Solr index changes to http://localhost:8983/solr/techproducts/update...
   [smoker] Time spent: 0:00:00.418
   [smoker] 
   [smoker] Solr techproducts example launched successfully. Direct your Web browser to http://localhost:8983/solr to visit the Solr Admin UI
   [smoker]       test utf8...
   [smoker]       run query...
   [smoker]       stop server using: bin/solr stop -p 8983
   [smoker] Sending stop command to Solr running on port 8983 ... waiting 5 seconds to allow Jetty process 15433 to stop gracefully.
   [smoker]  [|]   [/]   [-]   [\]   [|]   [/]   [-]   [\]   [|]   [/]        unpack solr-6.0.0-src.tgz...
   [smoker]     make sure no JARs/WARs in src dist...
   [smoker]     run "ant validate"
   [smoker]     run tests w/ Java 8 and testArgs='-Dtests.slow=false'...
   [smoker] 
   [smoker] command "export JAVA_HOME="/home/jenkins/jenkins-slave/tools/hudson.model.JDK/latest1.8" PATH="/home/jenkins/jenkins-slave/tools/hudson.model.JDK/latest1.8/bin:$PATH" JAVACMD="/home/jenkins/jenkins-slave/tools/hudson.model.JDK/latest1.8/bin/java"; ant clean test -Dtests.slow=false -Dtests.slow=false" failed:
   [smoker] Buildfile: /x1/jenkins/jenkins-slave/workspace/Lucene-Solr-SmokeRelease-trunk/lucene/build/smokeTestRelease/tmp/unpack/solr-6.0.0/solr/build.xml
   [smoker] 
   [smoker] clean:
   [smoker]    [delete] Deleting directory /x1/jenkins/jenkins-slave/workspace/Lucene-Solr-SmokeRelease-trunk/lucene/build/smokeTestRelease/tmp/unpack/solr-6.0.0/solr/build
   [smoker] 
   [smoker] ivy-availability-check:
   [smoker] 
   [smoker] ivy-fail:
   [smoker] 
   [smoker] ivy-configure:
   [smoker] [ivy:configure] :: Apache Ivy 2.3.0 - 20130110142753 :: http://ant.apache.org/ivy/ ::
   [smoker] [ivy:configure] :: loading settings :: file = /x1/jenkins/jenkins-slave/workspace/Lucene-Solr-SmokeRelease-trunk/lucene/build/smokeTestRelease/tmp/unpack/solr-6.0.0/lucene/ivy-settings.xml
   [smoker] 
   [smoker] resolve-groovy:
   [smoker] [ivy:cachepath] :: resolving dependencies :: org.codehaus.groovy#groovy-all-caller;working
   [smoker] [ivy:cachepath] 	confs: [default]
   [smoker] [ivy:cachepath] 	found org.codehaus.groovy#groovy-all;2.4.4 in public
   [smoker] [ivy:cachepath] :: resolution report :: resolve 238ms :: artifacts dl 2ms
   [smoker] 	---------------------------------------------------------------------
   [smoker] 	|                  |            modules            ||   artifacts   |
   [smoker] 	|       conf       | number| search|dwnlded|evicted|| number|dwnlded|
   [smoker] 	---------------------------------------------------------------------
   [smoker] 	|      default     |   1   |   0   |   0   |   0   ||   1   |   0   |
   [smoker] 	---------------------------------------------------------------------
   [smoker] 
   [smoker] -init-totals:
   [smoker]     [mkdir] Created dir: /x1/jenkins/jenkins-slave/workspace/Lucene-Solr-SmokeRelease-trunk/lucene/build/smokeTestRelease/tmp/unpack/solr-6.0.0/solr/build/solr
   [smoker] 
   [smoker] -clover.load:
   [smoker] 
   [smoker] test-solr-core:
   [smoker] 
   [smoker] test:
   [smoker] 
   [smoker] -clover.disable:
   [smoker] 
   [smoker] ivy-availability-check:
   [smoker] 
   [smoker] ivy-fail:
   [smoker] 
   [smoker] ivy-configure:
   [smoker] [ivy:configure] :: loading settings :: file = /x1/jenkins/jenkins-slave/workspace/Lucene-Solr-SmokeRelease-trunk/lucene/build/smokeTestRelease/tmp/unpack/solr-6.0.0/lucene/ivy-settings.xml
   [smoker] 
   [smoker] -clover.load:
   [smoker] 
   [smoker] -clover.classpath:
   [smoker] 
   [smoker] -clover.setup:
   [smoker] 
   [smoker] clover:
   [smoker] 
   [smoker] check-analyzers-icu-uptodate:
   [smoker] 
   [smoker] jar-analyzers-icu:
   [smoker] 
   [smoker] -compile-analysis-extras:
   [smoker] 
   [smoker] check-analyzers-icu-uptodate:
   [smoker] 
   [smoker] jar-analyzers-icu:
   [smoker] 
   [smoker] compile-solr-core:
   [smoker] 
   [smoker] compile-solrj:
   [smoker] 
   [smoker] check-lucene-core-uptodate:
   [smoker] 
   [smoker] jar-lucene-core:
   [smoker] 
   [smoker] check-backward-codecs-uptodate:
   [smoker] 
   [smoker] jar-backward-codecs:
   [smoker] 
   [smoker] check-analyzers-phonetic-uptodate:
   [smoker] 
   [smoker] jar-analyzers-phonetic:
   [smoker] 
   [smoker] check-analyzers-kuromoji-uptodate:
   [smoker] 
   [smoker] jar-analyzers-kuromoji:
   [smoker] 
   [smoker] check-codecs-uptodate:
   [smoker] 
   [smoker] jar-codecs:
   [smoker] 
   [smoker] check-expressions-uptodate:
   [smoker] 
   [smoker] jar-expressions:
   [smoker] 
   [smoker] check-suggest-uptodate:
   [smoker] 
   [smoker] jar-suggest:
   [smoker] 
   [smoker] check-highlighter-uptodate:
   [smoker] 
   [smoker] jar-highlighter:
   [smoker] 
   [smoker] check-memory-uptodate:
   [smoker] 
   [smoker] jar-memory:
   [smoker] 
   [smoker] check-misc-uptodate:
   [smoker] 
   [smoker] jar-misc:
   [smoker] 
   [smoker] check-spatial-uptodate:
   [smoker] 
   [smoker] jar-spatial:
   [smoker] 
   [smoker] check-grouping-uptodate:
   [smoker] 
   [smoker] jar-grouping:
   [smoker] 
   [smoker] check-queries-uptodate:
   [smoker] 
   [smoker] jar-queries:
   [smoker] 
   [smoker] check-queryparser-uptodate:
   [smoker] 
   [smoker] jar-queryparser:
   [smoker] 
   [smoker] check-join-uptodate:
   [smoker] 
   [smoker] jar-join:
   [smoker] 
   [smoker] check-sandbox-uptodate:
   [smoker] 
   [smoker] jar-sandbox:
   [smoker] 
   [smoker] prep-lucene-jars:
   [smoker] 
   [smoker] resolve-example:
   [smoker] 
   [smoker] ivy-availability-check:
   [smoker] 
   [smoker] ivy-fail:
   [smoker] 
   [smoker] ivy-configure:
   [smoker] [ivy:configure] :: loading settings :: file = /x1/jenkins/jenkins-slave/workspace/Lucene-Solr-SmokeRelease-trunk/lucene/build/smokeTestRelease/tmp/unpack/solr-6.0.0/lucene/ivy-settings.xml
   [smoker] 
   [smoker] resolve:
   [smoker] 
   [smoker] resolve-server:
   [smoker] 
   [smoker] ivy-availability-check:
   [smoker] 
   [smoker] ivy-fail:
   [smoker] 
   [smoker] ivy-fail:
   [smoker] 
   [smoker] ivy-configure:
   [smoker] [ivy:configure] :: loading settings :: file = /x1/jenkins/jenkins-slave/workspace/Lucene-Solr-SmokeRelease-trunk/lucene/build/smokeTestRelease/tmp/unpack/solr-6.0.0/lucene/ivy-settings.xml
   [smoker] 
   [smoker] resolve:
   [smoker] 
   [smoker] ivy-availability-check:
   [smoker] 
   [smoker] ivy-fail:
   [smoker] 
   [smoker] ivy-fail:
   [smoker] 
   [smoker] ivy-configure:
   [smoker] [ivy:configure] :: loading settings :: file = /x1/jenkins/jenkins-slave/workspace/Lucene-Solr-SmokeRelease-trunk/lucene/build/smokeTestRelease/tmp/unpack/solr-6.0.0/lucene/ivy-settings.xml
   [smoker] 
   [smoker] resolve:
   [smoker] 
   [smoker] common.init:
   [smoker] 
   [smoker] compile-lucene-core:
   [smoker] 
   [smoker] ivy-availability-check:
   [smoker] 
   [smoker] ivy-fail:
   [smoker] 
   [smoker] ivy-configure:
   [smoker] [ivy:configure] :: loading settings :: file = /x1/jenkins/jenkins-slave/workspace/Lucene-Solr-SmokeRelease-trunk/lucene/build/smokeTestRelease/tmp/unpack/solr-6.0.0/lucene/ivy-settings.xml
   [smoker] 
   [smoker] resolve:
   [smoker] 
   [smoker] init:
   [smoker] 
   [smoker] -clover.disable:
   [smoker] 
   [smoker] -clover.load:
   [smoker] 
   [smoker] -clover.classpath:
   [smoker] 
   [smoker] -clover.setup:
   [smoker] 
   [smoker] clover:
   [smoker] 
   [smoker] compile-core:
   [smoker] 
   [smoker] init:
   [smoker] 
   [smoker] -clover.disable:
   [smoker] 
   [smoker] -clover.load:
   [smoker] 
   [smoker] -clover.classpath:
   [smoker] 
   [smoker] -clover.setup:
   [smoker] 
   [smoker] clover:
   [smoker] 
   [smoker] common.compile-core:
   [smoker]     [mkdir] Created dir: /x1/jenkins/jenkins-slave/workspace/Lucene-Solr-SmokeRelease-trunk/lucene/build/smokeTestRelease/tmp/unpack/solr-6.0.0/solr/build/solr-solrj/classes/java
   [smoker]     [javac] Compiling 258 source files to /x1/jenkins/jenkins-slave/workspace/Lucene-Solr-SmokeRelease-trunk/lucene/build/smokeTestRelease/tmp/unpack/solr-6.0.0/solr/build/solr-solrj/classes/java
   [smoker]     [javac] Note: Some input files use or override a deprecated API.
   [smoker]     [javac] Note: Recompile with -Xlint:deprecation for details.
   [smoker]     [javac] Note: Some input files use unchecked or unsafe operations.
   [smoker]     [javac] Note: Recompile with -Xlint:unchecked for details.
   [smoker]     [javac] Creating empty /x1/jenkins/jenkins-slave/workspace/Lucene-Solr-SmokeRelease-trunk/lucene/build/smokeTestRelease/tmp/unpack/solr-6.0.0/solr/build/solr-solrj/classes/java/org/apache/solr/client/solrj/request/schema/package-info.class
   [smoker]     [javac] Creating empty /x1/jenkins/jenkins-slave/workspace/Lucene-Solr-SmokeRelease-trunk/lucene/build/smokeTestRelease/tmp/unpack/solr-6.0.0/solr/build/solr-solrj/classes/java/org/apache/solr/client/solrj/response/schema/package-info.class
   [smoker]     [javac] Creating empty /x1/jenkins/jenkins-slave/workspace/Lucene-Solr-SmokeRelease-trunk/lucene/build/smokeTestRelease/tmp/unpack/solr-6.0.0/solr/build/solr-solrj/classes/java/org/apache/solr/client/solrj/beans/package-info.class
   [smoker]     [javac] Creating empty /x1/jenkins/jenkins-slave/workspace/Lucene-Solr-SmokeRelease-trunk/lucene/build/smokeTestRelease/tmp/unpack/solr-6.0.0/solr/build/solr-solrj/classes/java/org/apache/solr/client/solrj/io/stream/expr/package-info.class
   [smoker]     [javac] Creating empty /x1/jenkins/jenkins-slave/workspace/Lucene-Solr-SmokeRelease-trunk/lucene/build/smokeTestRelease/tmp/unpack/solr-6.0.0/solr/build/solr-solrj/classes/java/org/apache/solr/client/solrj/response/package-info.class
   [smoker]     [javac] Creating empty /x1/jenkins/jenkins-slave/workspace/Lucene-Solr-SmokeRelease-trunk/lucene/build/smokeTestRelease/tmp/unpack/solr-6.0.0/solr/build/solr-solrj/classes/java/org/apache/solr/common/util/package-info.class
   [smoker]     [javac] Creating empty /x1/jenkins/jenkins-slave/workspace/Lucene-Solr-SmokeRelease-trunk/lucene/build/smokeTestRelease/tmp/unpack/solr-6.0.0/solr/build/solr-solrj/classes/java/org/apache/solr/client/solrj/request/package-info.class
   [smoker]     [javac] Creating empty /x1/jenkins/jenkins-slave/workspace/Lucene-Solr-SmokeRelease-trunk/lucene/build/smokeTestRelease/tmp/unpack/solr-6.0.0/solr/build/solr-solrj/classes/java/org/apache/solr/client/solrj/package-info.class
   [smoker]     [javac] Creating empty /x1/jenkins/jenkins-slave/workspace/Lucene-Solr-SmokeRelease-trunk/lucene/build/smokeTestRelease/tmp/unpack/solr-6.0.0/solr/build/solr-solrj/classes/java/org/apache/solr/common/cloud/package-info.class
   [smoker]     [javac] Creating empty /x1/jenkins/jenkins-slave/workspace/Lucene-Solr-SmokeRelease-trunk/lucene/build/smokeTestRelease/tmp/unpack/solr-6.0.0/solr/build/solr-solrj/classes/java/org/apache/solr/common/params/package-info.class
   [smoker]     [javac] Creating empty /x1/jenkins/jenkins-slave/workspace/Lucene-Solr-SmokeRelease-trunk/lucene/build/smokeTestRelease/tmp/unpack/solr-6.0.0/solr/build/solr-solrj/classes/java/org/apache/solr/client/solrj/impl/package-info.class
   [smoker]     [javac] Creating empty /x1/jenkins/jenkins-slave/workspace/Lucene-Solr-SmokeRelease-trunk/lucene/build/smokeTestRelease/tmp/unpack/solr-6.0.0/solr/build/solr-solrj/classes/java/org/apache/solr/client/solrj/io/eq/package-info.class
   [smoker]     [javac] Creating empty /x1/jenkins/jenkins-slave/workspace/Lucene-Solr-SmokeRelease-trunk/lucene/build/smokeTestRelease/tmp/unpack/solr-6.0.0/solr/build/solr-solrj/classes/java/org/apache/solr/client/solrj/io/stream/metrics/package-info.class
   [smoker]     [javac] Creating empty /x1/jenkins/jenkins-slave/workspace/Lucene-Solr-SmokeRelease-trunk/lucene/build/smokeTestRelease/tmp/unpack/solr-6.0.0/solr/build/solr-solrj/classes/java/org/apache/solr/client/solrj/io/sql/package-info.class
   [smoker]     [javac] Creating empty /x1/jenkins/jenkins-slave/workspace/Lucene-Solr-SmokeRelease-trunk/lucene/build/smokeTestRelease/tmp/unpack/solr-6.0.0/solr/build/solr-solrj/classes/java/org/apache/solr/common/luke/package-info.class
   [smoker]     [javac] Creating empty /x1/jenkins/jenkins-slave/workspace/Lucene-Solr-SmokeRelease-trunk/lucene/build/smokeTestRelease/tmp/unpack/solr-6.0.0/solr/build/solr-solrj/classes/java/org/apache/solr/client/solrj/io/package-info.class
   [smoker]     [javac] Creating empty /x1/jenkins/jenkins-slave/workspace/Lucene-Solr-SmokeRelease-trunk/lucene/build/smokeTestRelease/tmp/unpack/solr-6.0.0/solr/build/solr-solrj/classes/java/org/apache/solr/client/solrj/io/stream/package-info.class
   [smoker]     [javac] Creating empty /x1/jenkins/jenkins-slave/workspace/Lucene-Solr-SmokeRelease-trunk/lucene/build/smokeTestRelease/tmp/unpack/solr-6.0.0/solr/build/solr-solrj/classes/java/org/apache/solr/client/solrj/io/ops/package-info.class
   [smoker]     [javac] Creating empty /x1/jenkins/jenkins-slave/workspace/Lucene-Solr-SmokeRelease-trunk/lucene/build/smokeTestRelease/tmp/unpack/solr-6.0.0/solr/build/solr-solrj/classes/java/org/apache/solr/common/package-info.class
   [smoker]     [javac] Creating empty /x1/jenkins/jenkins-slave/workspace/Lucene-Solr-SmokeRelease-trunk/lucene/build/smokeTestRelease/tmp/unpack/solr-6.0.0/solr/build/solr-solrj/classes/java/org/apache/solr/client/solrj/io/comp/package-info.class
   [smoker]     [javac] Creating empty /x1/jenkins/jenkins-slave/workspace/Lucene-Solr-SmokeRelease-trunk/lucene/build/smokeTestRelease/tmp/unpack/solr-6.0.0/solr/build/solr-solrj/classes/java/org/apache/solr/client/solrj/util/package-info.class
   [smoker]      [copy] Copying 1 file to /x1/jenkins/jenkins-slave/workspace/Lucene-Solr-SmokeRelease-trunk/lucene/build/smokeTestRelease/tmp/unpack/solr-6.0.0/solr/build/solr-solrj/classes/java
   [smoker] 
   [smoker] compile-core:
   [smoker] 
   [smoker] check-lucene-core-uptodate:
   [smoker] 
   [smoker] jar-lucene-core:
   [smoker] 
   [smoker] check-backward-codecs-uptodate:
   [smoker] 
   [smoker] jar-backward-codecs:
   [smoker] 
   [smoker] check-analyzers-phonetic-uptodate:
   [smoker] 
   [smoker] jar-analyzers-phonetic:
   [smoker] 
   [smoker] check-analyzers-kuromoji-uptodate:
   [smoker] 
   [smoker] jar-analyzers-kuromoji:
   [smoker] 
   [smoker] check-codecs-uptodate:
   [smoker] 
   [smoker] jar-codecs:
   [smoker] 
   [smoker] check-expressions-uptodate:
   [smoker] 
   [smoker] jar-expressions:
   [smoker] 
   [smoker] check-suggest-uptodate:
   [smoker] 
   [smoker] jar-suggest:
   [smoker] 
   [smoker] check-highlighter-uptodate:
   [smoker] 
   [smoker] jar-highlighter:
   [smoker] 
   [smoker] check-memory-uptodate:
   [smoker] 
   [smoker] jar-memory:
   [smoker] 
   [smoker] check-misc-uptodate:
   [smoker] 
   [smoker] jar-misc:
   [smoker] 
   [smoker] check-spatial-uptodate:
   [smoker] 
   [smoker] jar-spatial:
   [smoker] 
   [smoker] check-grouping-uptodate:
   [smoker] 
   [smoker] jar-grouping:
   [smoker] 
   [smoker] check-queries-uptodate:
   [smoker] 
   [smoker] jar-queries:
   [smoker] 
   [smoker] check-queryparser-uptodate:
   [smoker] 
   [smoker] jar-queryparser:
   [smoker] 
   [smoker] check-join-uptodate:
   [smoker] 
   [smoker] jar-join:
   [smoker] 
   [smoker] check-sandbox-uptodate:
   [smoker] 
   [smoker] jar-sandbox:
   [smoker] 
   [smoker] prep-lucene-jars:
   [smoker] 
   [smoker] resolve-example:
   [smoker] 
   [smoker] ivy-availability-check:
   [smoker] 
   [smoker] ivy-fail:
   [smoker] 
   [smoker] ivy-configure:
   [smoker] [ivy:configure] :: loading settings :: file = /x1/jenkins/jenkins-slave/workspace/Lucene-Solr-SmokeRelease-trunk/lucene/build/smokeTestRelease/tmp/unpack/solr-6.0.0/lucene/ivy-settings.xml
   [smoker] 
   [smoker] resolve:
   [smoker] 
   [smoker] resolve-server:
   [smoker] 
   [smoker] ivy-availability-check:
   [smoker] 
   [smoker] ivy-fail:
   [smoker] 
   [smoker] ivy-fail:
   [smoker] 
   [smoker] ivy-configure:
   [smoker] [ivy:configure] :: loading settings :: file = /x1/jenkins/jenkins-slave/workspace/Lucene-Solr-SmokeRelease-trunk/lucene/build/smokeTestRelease/tmp/unpack/solr-6.0.0/lucene/ivy-settings.xml
   [smoker] 
   [smoker] resolve:
   [smoker] 
   [smoker] ivy-availability-check:
   [smoker] 
   [smoker] ivy-fail:
   [smoker] 
   [smoker] ivy-fail:
   [smoker] 
   [smoker] ivy-configure:
   [smoker] [ivy:configure] :: loading settings :: file = /x1/jenkins/jenkins-slave/workspace/Lucene-Solr-SmokeRelease-trunk/lucene/build/smokeTestRelease/tmp/unpack/solr-6.0.0/lucene/ivy-settings.xml
   [smoker] 
   [smoker] resolve:
   [smoker] 
   [smoker] common.init:
   [smoker] 
   [smoker] compile-lucene-core:
   [smoker] 
   [smoker] ivy-availability-check:
   [smoker] 
   [smoker] ivy-fail:
   [smoker] 
   [smoker] ivy-configure:
   [smoker] [ivy:configure] :: loading settings :: file = /x1/jenkins/jenkins-slave/workspace/Lucene-Solr-SmokeRelease-trunk/lucene/build/smokeTestRelease/tmp/unpack/solr-6.0.0/lucene/ivy-settings.xml
   [smoker] 
   [smoker] resolve:
   [smoker] 
   [smoker] init:
   [smoker] 
   [smoker] -clover.disable:
   [smoker] 
   [smoker] -clover.load:
   [smoker] 
   [smoker] -clover.classpath:
   [smoker] 
   [smoker] -clover.setup:
   [smoker] 
   [smoker] clover:
   [smoker] 
   [smoker] compile-core:
   [smoker] 
   [smoker] init:
   [smoker] 
   [smoker] -clover.disable:
   [smoker] 
   [smoker] -clover.load:
   [smoker] 
   [smoker] -clover.classpath:
   [smoker] 
   [smoker] -clover.setup:
   [smoker] 
   [smoker] clover:
   [smoker] 
   [smoker] common.compile-core:
   [smoker]     [mkdir] Created dir: /x1/jenkins/jenkins-slave/workspace/Lucene-Solr-SmokeRelease-trunk/lucene/build/smokeTestRelease/tmp/unpack/solr-6.0.0/solr/build/solr-core/classes/java
   [smoker]     [javac] Compiling 898 source files to /x1/jenkins/jenkins-slave/workspace/Lucene-Solr-SmokeRelease-trunk/lucene/build/smokeTestRelease/tmp/unpack/solr-6.0.0/solr/build/solr-core/classes/java
   [smoker]     [javac] Note: Some input files use or override a deprecated API.
   [smoker]     [javac] Note: Recompile with -Xlint:deprecation for details.
   [smoker]     [javac] Note: Some input files use unchecked or unsafe operations.
   [smoker]     [javac] Note: Recompile with -Xlint:unchecked for details.
   [smoker]     [javac] Creating empty /x1/jenkins/jenkins-slave/workspace/Lucene-Solr-SmokeRelease-trunk/lucene/build/smokeTestRelease/tmp/unpack/solr-6.0.0/solr/build/solr-core/classes/java/org/apache/solr/logging/log4j/package-info.class
   [smoker]     [javac] Creating empty /x1/jenkins/jenkins-slave/workspace/Lucene-Solr-SmokeRelease-trunk/lucene/build/smokeTestRelease/tmp/unpack/solr-6.0.0/solr/build/solr-core/classes/java/org/apache/solr/client/solrj/embedded/package-info.class
   [smoker]     [javac] Creating empty /x1/jenkins/jenkins-slave/workspace/Lucene-Solr-SmokeRelease-trunk/lucene/build/smokeTestRelease/tmp/unpack/solr-6.0.0/solr/build/solr-core/classes/java/org/apache/solr/internal/csv/package-info.class
   [smoker]     [javac] Creating empty /x1/jenkins/jenkins-slave/workspace/Lucene-Solr-SmokeRelease-trunk/lucene/build/smokeTestRelease/tmp/unpack/solr-6.0.0/solr/build/solr-core/classes/java/org/apache/solr/search/function/distance/package-info.class
   [smoker]     [javac] Creating empty /x1/jenkins/jenkins-slave/workspace/Lucene-Solr-SmokeRelease-trunk/lucene/build/smokeTestRelease/tmp/unpack/solr-6.0.0/solr/build/solr-core/classes/java/org/apache/solr/search/grouping/distributed/requestfactory/package-info.class
   [smoker]     [javac] Creating empty /x1/jenkins/jenkins-slave/workspace/Lucene-Solr-SmokeRelease-trunk/lucene/build/smokeTestRelease/tmp/unpack/solr-6.0.0/solr/build/solr-core/classes/java/org/apache/solr/search/grouping/collector/package-info.class
   [smoker]     [javac] Creating empty /x1/jenkins/jenkins-slave/workspace/Lucene-Solr-SmokeRelease-trunk/lucene/build/smokeTestRelease/tmp/unpack/solr-6.0.0/solr/build/solr-core/classes/java/org/apache/solr/search/grouping/distributed/command/package-info.class
   [smoker]     [javac] Creating empty /x1/jenkins/jenkins-slave/workspace/Lucene-Solr-SmokeRelease-trunk/lucene/build/smokeTestRelease/tmp/unpack/solr-6.0.0/solr/build/solr-core/classes/java/org/apache/solr/spelling/package-info.class
   [smoker]     [javac] Creating empty /x1/jenkins/jenkins-slave/workspace/Lucene-Solr-SmokeRelease-trunk/lucene/build/smokeTestRelease/tmp/unpack/solr-6.0.0/solr/build/solr-core/classes/java/org/apache/solr/cloud/package-info.class
   [smoker]     [javac] Creating empty /x1/jenkins/jenkins-slave/workspace/Lucene-Solr-SmokeRelease-trunk/lucene/build/smokeTestRelease/tmp/unpack/solr-6.0.0/solr/build/solr-core/classes/java/org/apache/solr/spelling/suggest/fst/package-info.class
   [smoker]     [javac] Creating empty /x1/jenkins/jenkins-slave/workspace/Lucene-Solr-SmokeRelease-trunk/lucene/build/smokeTestRelease/tmp/unpack/solr-6.0.0/solr/build/solr-core/classes/java/org/apache/solr/util/plugin/package-info.class
   [smoker]     [javac] Creating empty /x1/jenkins/jenkins-slave/workspace/Lucene-Solr-SmokeRelease-trunk/lucene/build/smokeTestRelease/tmp/unpack/solr-6.0.0/solr/build/solr-core/classes/java/org/apache/solr/search/function/package-info.class
   [smoker]     [javac] Creating empty /x1/jenkins/jenkins-slave/workspace/Lucene-Solr-SmokeRelease-trunk/lucene/build/smokeTestRelease/tmp/unpack/solr-6.0.0/solr/build/solr-core/classes/java/org/apache/solr/store/blockcache/package-info.class
   [smoker]     [javac] Creating empty /x1/jenkins/jenkins-slave/workspace/Lucene-Solr-SmokeRelease-trunk/lucene/build/smokeTestRelease/tmp/unpack/solr-6.0.0/solr/build/solr-core/classes/java/org/apache/solr/util/hll/package-info.class
   [smoker]     [javac] Creating empty /x1/jenkins/jenkins-slave/workspace/Lucene-Solr-SmokeRelease-trunk/lucene/build/smokeTestRelease/tmp/unpack/solr-6.0.0/solr/build/solr-core/classes/java/org/apache/solr/search/package-info.class
   [smoker]     [javac] Creating empty /x1/jenkins/jenkins-slave/workspace/Lucene-Solr-SmokeRelease-trunk/lucene/build/smokeTestRelease/tmp/unpack/solr-6.0.0/solr/build/solr-core/classes/java/org/apache/solr/analysis/package-info.class
   [smoker]     [javac] Creating empty /x1/jenkins/jenkins-slave/workspace/Lucene-Solr-SmokeRelease-trunk/lucene/build/smokeTestRelease/tmp/unpack/solr-6.0.0/solr/build/solr-core/classes/java/org/apache/solr/handler/package-info.class
   [smoker]     [javac] Creating empty /x1/jenkins/jenkins-slave/workspace/Lucene-Solr-SmokeRelease-trunk/lucene/build/smokeTestRelease/tmp/unpack/solr-6.0.0/solr/build/solr-core/classes/java/org/apache/solr/search/grouping/distributed/responseprocessor/package-info.class
   [smoker]     [javac] Creating empty /x1/jenkins/jenkins-slave/workspace/Lucene-Solr-SmokeRelease-trunk/lucene/build/smokeTestRelease/tmp/unpack/solr-6.0.0/solr/build/solr-core/classes/java/org/apache/solr/search/join/package-info.class
   [smoker]     [javac] Creating empty /x1/jenkins/jenkins-slave/workspace/Lucene-Solr-SmokeRelease-trunk/lucene/build/smokeTestRelease/tmp/unpack/solr-6.0.0/solr/build/solr-core/classes/java/org/apache/solr/security/package-info.class
   [smoker]     [javac] Creating empty /x1/jenkins/jenkins-slave/workspace/Lucene-Solr-SmokeRelease-trunk/lucene/build/smokeTestRelease/tmp/unpack/solr-6.0.0/solr/build/solr-core/classes/java/org/apache/solr/cloud/rule/package-info.class
   [smoker]     [javac] Creating empty /x1/jenkins/jenkins-slave/workspace/Lucene-Solr-SmokeRelease-trunk/lucene/build/smokeTestRelease/tmp/unpack/solr-6.0.0/solr/build/solr-core/classes/java/org/apache/solr/index/hdfs/package-info.class
   [smoker]     [javac] Creating empty /x1/jenkins/jenkins-slave/workspace/Lucene-Solr-SmokeRelease-trunk/lucene/build/smokeTestRelease/tmp/unpack/solr-6.0.0/solr/build/solr-core/classes/java/org/apache/solr/cloud/overseer/package-info.class
   [smoker]     [javac] Creating empty /x1/jenkins/jenkins-slave/workspace/Lucene-Solr-SmokeRelease-trunk/lucene/build/smokeTestRelease/tmp/unpack/solr-6.0.0/solr/build/solr-core/classes/java/org/apache/solr/rest/package-info.class
   [smoker]     [javac] Creating empty /x1/jenkins/jenkins-slave/workspace/Lucene-Solr-SmokeRelease-trunk/lucene/build/smokeTestRelease/tmp/unpack/solr-6.0.0/solr/build/solr-core/classes/java/org/apache/solr/spelling/suggest/jaspell/package-info.class
   [smoker]     [javac] Creating empty /x1/jenkins/jenkins-slave/workspace/Lucene-Solr-SmokeRelease-trunk/lucene/build/smokeTestRelease/tmp/unpack/solr-6.0.0/solr/build/solr-core/classes/java/org/apache/solr/search/grouping/package-info.class
   [smoker]     [javac] Creating empty /x1/jenkins/jenkins-slave/workspace/Lucene-Solr-SmokeRelease-trunk/lucene/build/smokeTestRelease/tmp/unpack/solr-6.0.0/solr/build/solr-core/classes/java/org/apache/solr/servlet/package-info.class
   [smoker]     [javac] Creating empty /x1/jenkins/jenkins-slave/workspace/Lucene-Solr-SmokeRelease-trunk/lucene/build/smokeTestRelease/tmp/unpack/solr-6.0.0/solr/build/solr-core/classes/java/org/apache/solr/schema/package-info.class
   [smoker]     [javac] Creating empty /x1/jenkins/jenkins-slave/workspace/Lucene-Solr-SmokeRelease-trunk/lucene/build/smokeTestRelease/tmp/unpack/solr-6.0.0/solr/build/solr-core/classes/java/org/apache/solr/search/grouping/distributed/package-info.class
   [smoker]     [javac] Creating empty /x1/jenkins/jenkins-slave/workspace/Lucene-Solr-SmokeRelease-trunk/lucene/build/smokeTestRelease/tmp/unpack/solr-6.0.0/solr/build/solr-core/classes/java/org/apache/solr/handler/loader/package-info.class
   [smoker]     [javac] Creating empty /x1/jenkins/jenkins-slave/workspace/Lucene-Solr-SmokeRelease-trunk/lucene/build/smokeTestRelease/tmp/unpack/solr-6.0.0/solr/build/solr-core/classes/java/org/apache/solr/response/package-info.class
   [smoker]     [javac] Creating empty /x1/jenkins/jenkins-slave/workspace/Lucene-Solr-SmokeRelease-trunk/lucene/build/smokeTestRelease/tmp/unpack/solr-6.0.0/solr/build/solr-core/classes/java/org/apache/solr/search/stats/package-info.class
   [smoker]     [javac] Creating empty /x1/jenkins/jenkins-slave/workspace/Lucene-Solr-SmokeRelease-trunk/lucene/build/smokeTestRelease/tmp/unpack/solr-6.0.0/solr/build/solr-core/classes/java/org/apache/solr/util/package-info.class
   [smoker]     [javac] Creating empty /x1/jenkins/jenkins-slave/workspace/Lucene-Solr-SmokeRelease-trunk/lucene/build/smokeTestRelease/tmp/unpack/solr-6.0.0/solr/build/solr-core/classes/java/org/apache/solr/search/grouping/endresulttransformer/package-info.class
   [smoker]     [javac] Creating empty /x1/jenkins/jenkins-slave/workspace/Lucene-Solr-SmokeRelease-trunk/lucene/build/smokeTestRelease/tmp/unpack/solr-6.0.0/solr/build/solr-core/classes/java/org/apache/solr/rest/schema/analysis/package-info.class
   [smoker]     [javac] Creating empty /x1/jenkins/jenkins-slave/workspace/Lucene-Solr-SmokeRelease-trunk/lucene/build/smokeTestRelease/tmp/unpack/solr-6.0.0/solr/build/solr-core/classes/java/org/apache/solr/handler/admin/package-info.class
   [smoker]     [javac] Creating empty /x1/jenkins/jenkins-slave/workspace/Lucene-Solr-SmokeRelease-trunk/lucene/build/smokeTestRelease/tmp/unpack/solr-6.0.0/solr/build/solr-core/classes/java/org/apache/solr/search/similarities/package-info.class
   [smoker]     [javac] Creating empty /x1/jenkins/jenkins-slave/workspace/Lucene-Solr-SmokeRelease-trunk/lucene/build/smokeTestRelease/tmp/unpack/solr-6.0.0/solr/build/solr-core/classes/java/org/apache/solr/spelling/suggest/tst/package-info.class
   [smoker]     [javac] Creating empty /x1/jenkins/jenkins-slave/workspace/Lucene-Solr-SmokeRelease-trunk/lucene/build/smokeTestRelease/tmp/unpack/solr-6.0.0/solr/build/solr-core/classes/java/org/apache/solr/util/stats/package-info.class
   [smoker]     [javac] Creating empty /x1/jenkins/jenkins-slave/workspace/Lucene-Solr-SmokeRelease-trunk/lucene/build/smokeTestRelease/tmp/unpack/solr-6.0.0/solr/build/solr-core/classes/java/org/apache/solr/response/transform/package-info.class
   [smoker]     [javac] Creating empty /x1/jenkins/jenkins-slave/workspace/Lucene-Solr-SmokeRelease-trunk/lucene/build/smokeTestRelease/tmp/unpack/solr-6.0.0/solr/build/solr-core/classes/java/org/apache/solr/search/grouping/distributed/shardresultserializer/package-info.class
   [smoker]     [javac] Creating empty /x1/jenkins/jenkins-slave/workspace/Lucene-Solr-SmokeRelease-trunk/lucene/build/smokeTestRelease/tmp/unpack/solr-6.0.0/solr/build/solr-core/classes/java/org/apache/solr/update/processor/package-info.class
   [smoker]     [javac] Creating empty /x1/jenkins/jenkins-slave/workspace/Lucene-Solr-SmokeRelease-trunk/lucene/build/smokeTestRelease/tmp/unpack/solr-6.0.0/solr/build/solr-core/classes/java/org/apache/solr/core/package-info.class
   [smoker]     [javac] Creating empty /x1/jenkins/jenkins-slave/workspace/Lucene-Solr-SmokeRelease-trunk/lucene/build/smokeTestRelease/tmp/unpack/solr-6.0.0/solr/build/solr-core/classes/java/org/apache/solr/request/package-info.class
   [smoker]     [javac] Creating empty /x1/jenkins/jenkins-slave/workspace/Lucene-Solr-SmokeRelease-trunk/lucene/build/smokeTestRelease/tmp/unpack/solr-6.0.0/solr/build/solr-core/classes/java/org/apache/solr/search/mlt/package-info.class
   [smoker]     [javac] Creating empty /x1/jenkins/jenkins-slave/workspace/Lucene-Solr-SmokeRelease-trunk/lucene/build/smokeTestRelease/tmp/unpack/solr-6.0.0/solr/build/solr-core/classes/java/org/apache/solr/logging/jul/package-info.class
   [smoker]     [javac] Creating empty /x1/jenkins/jenkins-slave/workspace/Lucene-Solr-SmokeRelease-trunk/lucene/build/smokeTestRelease/tmp/unpack/solr-6.0.0/solr/build/solr-core/classes/java/org/apache/solr/rest/schema/package-info.class
   [smoker]     [javac] Creating empty /x1/jenkins/jenkins-slave/workspace/Lucene-Solr-SmokeRelease-trunk/lucene/build/smokeTestRelease/tmp/unpack/solr-6.0.0/solr/build/solr-core/classes/java/org/apache/solr/highlight/package-info.class
   [smoker]     [javac] Creating empty /x1/jenkins/jenkins-slave/workspace/Lucene-Solr-SmokeRelease-trunk/lucene/build/smokeTestRelease/tmp/unpack/solr-6.0.0/solr/build/solr-core/classes/java/org/apache/solr/servlet/cache/package-info.class
   [smoker]     [javac] Creating empty /x1/jenkins/jenkins-slave/workspace/Lucene-Solr-SmokeRelease-trunk/lucene/build/smokeTestRelease/tmp/unpack/solr-6.0.0/solr/build/solr-core/classes/java/org/apache/solr/package-info.class
   [smoker]     [javac] Creating empty /x1/jenkins/jenkins-slave/workspace/Lucene-Solr-SmokeRelease-trunk/lucene/build/smokeTestRelease/tmp/unpack/solr-6.0.0/solr/build/solr-core/classes/java/org/apache/solr/parser/package-info.class
   [smoker]     [javac] Creating empty /x1/jenkins/jenkins-slave/workspace/Lucene-Solr-SmokeRelease-trunk/lucene/build/smokeTestRelease/tmp/unpack/solr-6.0.0/solr/build/solr-core/classes/java/org/apache/solr/store/hdfs/package-info.class
   [smoker]     [javac] Creating empty /x1/jenkins/jenkins-slave/workspace/Lucene-Solr-SmokeRelease-trunk/lucene/build/smokeTestRelease/tmp/unpack/solr-6.0.0/solr/build/solr-core/classes/java/org/apache/solr/spelling/suggest/package-info.class
   [smoker]     [javac] Creating empty /x1/jenkins/jenkins-slave/workspace/Lucene-Solr-SmokeRelease-trunk/lucene/build/smokeTestRelease/tmp/unpack/solr-6.0.0/solr/build/solr-core/classes/java/org/apache/solr/handler/component/package-info.class
   [smoker]     [javac] Creating empty /x1/jenkins/jenkins-slave/workspace/Lucene-Solr-SmokeRelease-trunk/lucene/build/smokeTestRelease/tmp/unpack/solr-6.0.0/solr/build/solr-core/classes/java/org/apache/solr/logging/package-info.class
   [smoker]     [javac] Creating empty /x1/jenkins/jenkins-slave/workspace/Lucene-Solr-SmokeRelease-trunk/lucene/build/smokeTestRelease/tmp/unpack/solr-6.0.0/solr/build/solr-core/classes/java/org/apache/solr/update/package-info.class
   [smoker]     [javac] Creating empty /x1/jenkins/jenkins-slave/workspace/Lucene-Solr-SmokeRelease-trunk/lucene/build/smokeTestRelease/tmp/unpack/solr-6.0.0/solr/build/solr-core/classes/java/org/apache/solr/internal/csv/writer/package-info.class
   [smoker]     [javac] Creating empty /x1/jenkins/jenkins-slave/workspace/Lucene-Solr-SmokeRelease-trunk/lucene/build/smokeTestRelease/tmp/unpack/solr-6.0.0/solr/build/solr-core/classes/java/org/apache/solr/util/xslt/package-info.class
   [smoker] 
   [smoker] common-solr.compile-core:
   [smoker] 
   [smoker] compile-core:
   [smoker] 
   [smoker] compile-solrj:
   [smoker] 
   [smoker] check-lucene-core-uptodate:
   [smoker] 
   [smoker] jar-lucene-core:
   [smoker] 
   [smoker] check-backward-codecs-uptodate:
   [smoker] 
   [smoker] jar-backward-codecs:
   [smoker] 
   [smoker] check-analyzers-phonetic-uptodate:
   [smoker] 
   [smoker] jar-analyzers-phonetic:
   [smoker] 
   [smoker] check-analyzers-kuromoji-uptodate:
   [smoker] 
   [smoker] jar-analyzers-kuromoji:
   [smoker] 
   [smoker] check-codecs-uptodate:
   [smoker] 
   [smoker] jar-codecs:
   [smoker] 
   [smoker] check-expressions-uptodate:
   [smoker] 
   [smoker] jar-expressions:
   [smoker] 
   [smoker] check-suggest-uptodate:
   [smoker] 
   [smoker] jar-suggest:
   [smoker] 
   [smoker] check-highlighter-uptodate:
   [smoker] 
   [smoker] jar-highlighter:
   [smoker] 
   [smoker] check-memory-uptodate:
   [smoker] 
   [smoker] jar-memory:
   [smoker] 
   [smoker] check-misc-uptodate:
   [smoker] 
   [smoker] jar-misc:
   [smoker] 
   [smoker] check-spatial-uptodate:
   [smoker] 
   [smoker] jar-spatial:
   [smoker] 
   [smoker] check-grouping-uptodate:
   [smoker] 
   [smoker] jar-grouping:
   [smoker] 
   [smoker] check-queries-uptodate:
   [smoker] 
   [smoker] jar-queries:
   [smoker] 
   [smoker] check-queryparser-uptodate:
   [smoker] 
   [smoker] jar-queryparser:
   [smoker] 
   [smoker] check-join-uptodate:
   [smoker] 
   [smoker] jar-join:
   [smoker] 
   [smoker] check-sandbox-uptodate:
   [smoker] 
   [smoker] jar-sandbox:
   [smoker] 
   [smoker] prep-lucene-jars:
   [smoker] 
   [smoker] resolve-example:
   [smoker] 
   [smoker] ivy-availability-check:
   [smoker] 
   [smoker] ivy-fail:
   [smoker] 
   [smoker] ivy-configure:
   [smoker] [ivy:configure] :: loading settings :: file = /x1/jenkins/jenkins-slave/workspace/Lucene-Solr-SmokeRelease-trunk/lucene/build/smokeTestRelease/tmp/unpack/solr-6.0.0/lucene/ivy-settings.xml
   [smoker] 
   [smoker] resolve:
   [smoker] 
   [smoker] resolve-server:
   [smoker] 
   [smoker] ivy-availability-check:
   [smoker] 
   [smoker] ivy-fail:
   [smoker] 
   [smoker] ivy-fail:
   [smoker] 
   [smoker] ivy-configure:
   [smoker] [ivy:configure] :: loading settings :: file = /x1/jenkins/jenkins-slave/workspace/Lucene-Solr-SmokeRelease-trunk/lucene/build/smokeTestRelease/tmp/unpack/solr-6.0.0/lucene/ivy-settings.xml
   [smoker] 
   [smoker] resolve:
   [smoker] 
   [smoker] ivy-availability-check:
   [smoker] 
   [smoker] ivy-fail:
   [smoker] 
   [smoker] ivy-fail:
   [smoker] 
   [smoker] ivy-configure:
   [smoker] [ivy:configure] :: loading settings :: file = /x1/jenkins/jenkins-slave/workspace/Lucene-Solr-SmokeRelease-trunk/lucene/build/smokeTestRelease/tmp/unpack/solr-6.0.0/lucene/ivy-settings.xml
   [smoker] 
   [smoker] resolve:
   [smoker] 
   [smoker] common.init:
   [smoker] 
   [smoker] compile-lucene-core:
   [smoker] 
   [smoker] ivy-availability-check:
   [smoker] 
   [smoker] ivy-fail:
   [smoker] 
   [smoker] ivy-configure:
   [smoker] [ivy:configure] :: loading settings :: file = /x1/jenkins/jenkins-slave/workspace/Lucene-Solr-SmokeRelease-trunk/lucene/build/smokeTestRelease/tmp/unpack/solr-6.0.0/lucene/ivy-settings.xml
   [smoker] 
   [smoker] resolve:
   [smoker] 
   [smoker] init:
   [smoker] 
   [smoker] -clover.disable:
   [smoker] 
   [smoker] -clover.load:
   [smoker] 
   [smoker] -clover.classpath:
   [smoker] 
   [smoker] -clover.setup:
   [smoker] 
   [smoker] clover:
   [smoker] 
   [smoker] compile-core:
   [smoker] 
   [smoker] init:
   [smoker] 
   [smoker] -clover.disable:
   [smoker] 
   [smoker] -clover.load:
   [smoker] 
   [smoker] -clover.classpath:
   [smoker] 
   [smoker] -clover.setup:
   [smoker] 
   [smoker] clover:
   [smoker] 
   [smoker] common.compile-core:
   [smoker] 
   [smoker] compile-core:
   [smoker] 
   [smoker] check-lucene-core-uptodate:
   [smoker] 
   [smoker] jar-lucene-core:
   [smoker] 
   [smoker] check-backward-codecs-uptodate:
   [smoker] 
   [smoker] jar-backward-codecs:
   [smoker] 
   [smoker] check-analyzers-phonetic-uptodate:
   [smoker] 
   [smoker] jar-analyzers-phonetic:
   [smoker] 
   [smoker] check-analyzers-kuromoji-uptodate:
   [smoker] 
   [smoker] jar-analyzers-kuromoji:
   [smoker] 
   [smoker] check-codecs-uptodate:
   [smoker] 
   [smoker] jar-codecs:
   [smoker] 
   [smoker] check-expressions-uptodate:
   [smoker] 
   [smoker] jar-expressions:
   [smoker] 
   [smoker] check-suggest-uptodate:
   [smoker] 
   [smoker] jar-suggest:
   [smoker] 
   [smoker] check-highlighter-uptodate:
   [smoker] 
   [smoker] jar-highlighter:
   [smoker] 
   [smoker] check-memory-uptodate:
   [smoker] 
   [smoker] jar-memory:
   [smoker] 
   [smoker] check-misc-uptodate:
   [smoker] 
   [smoker] jar-misc:
   [smoker] 
   [smoker] check-spatial-uptodate:
   [smoker] 
   [smoker] jar-spatial:
   [smoker] 
   [smoker] check-grouping-uptodate:
   [smoker] 
   [smoker] jar-grouping:
   [smoker] 
   [smoker] check-queries-uptodate:
   [smoker] 
   [smoker] jar-queries:
   [smoker] 
   [smoker] check-queryparser-uptodate:
   [smoker] 
   [smoker] jar-queryparser:
   [smoker] 
   [smoker] check-join-uptodate:
   [smoker] 
   [smoker] jar-join:
   [smoker] 
   [smoker] check-sandbox-uptodate:
   [smoker] 
   [smoker] jar-sandbox:
   [smoker] 
   [smoker] prep-lucene-jars:
   [smoker] 
   [smoker] resolve-example:
   [smoker] 
   [smoker] ivy-availability-check:
   [smoker] 
   [smoker] ivy-fail:
   [smoker] 
   [smoker] ivy-configure:
   [smoker] [ivy:configure] :: loading settings :: file = /x1/jenkins/jenkins-slave/workspace/Lucene-Solr-SmokeRelease-trunk/lucene/build/smokeTestRelease/tmp/unpack/solr-6.0.0/lucene/ivy-settings.xml
   [smoker] 
   [smoker] resolve:
   [smoker] 
   [smoker] resolve-server:
   [smoker] 
   [smoker] ivy-availability-check:
   [smoker] 
   [smoker] ivy-fail:
   [smoker] 
   [smoker] ivy-fail:
   [smoker] 
   [smoker] ivy-configure:
   [smoker] [ivy:configure] :: loading settings :: file = /x1/jenkins/jenkins-slave/workspace/Lucene-Solr-SmokeRelease-trunk/lucene/build/smokeTestRelease/tmp/unpack/solr-6.0.0/lucene/ivy-settings.xml
   [smoker] 
   [smoker] resolve:
   [smoker] 
   [smoker] ivy-availability-check:
   [smoker] 
   [smoker] ivy-fail:
   [smoker] 
   [smoker] ivy-fail:
   [smoker] 
   [smoker] ivy-configure:
   [smoker] [ivy:configure] :: loading settings :: file = /x1/jenkins/jenkins-slave/workspace/Lucene-Solr-SmokeRelease-trunk/lucene/build/smokeTestRelease/tmp/unpack/solr-6.0.0/lucene/ivy-settings.xml
   [smoker] 
   [smoker] resolve:
   [smoker] 
   [smoker] common.init:
   [smoker] 
   [smoker] compile-lucene-core:
   [smoker] 
   [smoker] ivy-availability-check:
   [smoker] 
   [smoker] ivy-fail:
   [smoker] 
   [smoker] ivy-configure:
   [smoker] [ivy:configure] :: loading settings :: file = /x1/jenkins/jenkins-slave/workspace/Lucene-Solr-SmokeRelease-trunk/lucene/build/smokeTestRelease/tmp/unpack/solr-6.0.0/lucene/ivy-settings.xml
   [smoker] 
   [smoker] resolve:
   [smoker] 
   [smoker] init:
   [smoker] 
   [smoker] -clover.disable:
   [smoker] 
   [smoker] -clover.load:
   [smoker] 
   [smoker] -clover.classpath:
   [smoker] 
   [smoker] -clover.setup:
   [smoker] 
   [smoker] clover:
   [smoker] 
   [smoker] compile-core:
   [smoker] 
   [smoker] init:
   [smoker] 
   [smoker] -clover.disable:
   [smoker] 
   [smoker] -clover.load:
   [smoker] 
   [smoker] -clover.classpath:
   [smoker] 
   [smoker] -clover.setup:
   [smoker] 
   [smoker] clover:
   [smoker] 
   [smoker] common.compile-core:
   [smoker]     [mkdir] Created dir: /x1/jenkins/jenkins-slave/workspace/Lucene-Solr-SmokeRelease-trunk/lucene/build/smokeTestRelease/tmp/unpack/solr-6.0.0/solr/build/contrib/solr-analysis-extras/classes/java
   [smoker]     [javac] Compiling 1 source file to /x1/jenkins/jenkins-slave/workspace/Lucene-Solr-SmokeRelease-trunk/lucene/build/smokeTestRelease/tmp/unpack/solr-6.0.0/solr/build/contrib/solr-analysis-extras/classes/java
   [smoker]     [javac] Note: /x1/jenkins/jenkins-slave/workspace/Lucene-Solr-SmokeRelease-trunk/lucene/build/smokeTestRelease/tmp/unpack/solr-6.0.0/solr/contrib/analysis-extras/src/java/org/apache/solr/schema/ICUCollationField.java uses or overrides a deprecated API.
   [smoker]     [javac] Note: Recompile with -Xlint:deprecation for details.
   [smoker] 
   [smoker] common-solr.compile-core:
   [smoker] 
   [smoker] solr-contrib-build.compile-core:
   [smoker] 
   [smoker] compile-core:
   [smoker] 
   [smoker] compile:
   [smoker] 
   [smoker] compile-solr-test-framework:
   [smoker] 
   [smoker] ivy-availability-check:
   [smoker] 
   [smoker] ivy-fail:
   [smoker] 
   [smoker] ivy-configure:
   [smoker] [ivy:configure] :: loading settings :: file = /x1/jenkins/jenkins-slave/workspace/Lucene-Solr-SmokeRelease-trunk/lucene/build/smokeTestRelease/tmp/unpack/solr-6.0.0/lucene/ivy-settings.xml
   [smoker] 
   [smoker] resolve:
   [smoker] 
   [smoker] compile-solr-core:
   [smoker] 
   [smoker] compile-solrj:
   [smoker] 
   [smoker] check-lucene-core-uptodate:
   [smoker] 
   [smoker] jar-lucene-core:
   [smoker] 
   [smoker] check-backward-codecs-uptodate:
   [smoker] 
   [smoker] jar-backward-codecs:
   [smoker] 
   [smoker] check-analyzers-phonetic-uptodate:
   [smoker] 
   [smoker] jar-analyzers-phonetic:
   [smoker] 
   [smoker] check-analyzers-kuromoji-uptodate:
   [smoker] 
   [smoker] jar-analyzers-kuromoji:
   [smoker] 
   [smoker] check-codecs-uptodate:
   [smoker] 
   [smoker] jar-codecs:
   [smoker] 
   [smoker] check-expressions-uptodate:
   [smoker] 
   [smoker] jar-expressions:
   [smoker] 
   [smoker] check-suggest-uptodate:
   [smoker] 
   [smoker] jar-suggest:
   [smoker] 
   [smoker] check-highlighter-uptodate:
   [smoker] 
   [smoker] jar-highlighter:
   [smoker] 
   [smoker] check-memory-uptodate:
   [smoker] 
   [smoker] jar-memory:
   [smoker] 
   [smoker] check-misc-uptodate:
   [smoker] 
   [smoker] jar-misc:
   [smoker] 
   [smoker] check-spatial-uptodate:
   [smoker] 
   [smoker] jar-spatial:
   [smoker] 
   [smoker] check-grouping-uptodate:
   [smoker] 
   [smoker] jar-grouping:
   [smoker] 
   [smoker] check-queries-uptodate:
   [smoker] 
   [smoker] jar-queries:
   [smoker] 
   [smoker] check-queryparser-uptodate:
   [smoker] 
   [smoker] jar-queryparser:
   [smoker] 
   [smoker] check-join-uptodate:
   [smoker] 
   [smoker] jar-join:
   [smoker] 
   [smoker] check-sandbox-uptodate:
   [smoker] 
   [smoker] jar-sandbox:
   [smoker] 
   [smoker] prep-lucene-jars:
   [smoker] 
   [smoker] resolve-example:
   [smoker] 
   [smoker] ivy-availability-check:
   [smoker] 
   [smoker] ivy-fail:
   [smoker] 
   [smoker] ivy-configure:
   [smoker] [ivy:configure] :: loading settings :: file = /x1/jenkins/jenkins-slave/workspace/Lucene-Solr-SmokeRelease-trunk/lucene/build/smokeTestRelease/tmp/unpack/solr-6.0.0/lucene/ivy-settings.xml
   [smoker] 
   [smoker] resolve:
   [smoker] 
   [smoker] resolve-server:
   [smoker] 
   [smoker] ivy-availability-check:
   [smoker] 
   [smoker] ivy-fail:
   [smoker] 
   [smoker] ivy-fail:
   [smoker] 
   [smoker] ivy-configure:
   [smoker] [ivy:configure] :: loading settings :: file = /x1/jenkins/jenkins-slave/workspace/Lucene-Solr-SmokeRelease-trunk/lucene/build/smokeTestRelease/tmp/unpack/solr-6.0.0/lucene/ivy-settings.xml
   [smoker] 
   [smoker] resolve:
   [smoker] 
   [smoker] ivy-availability-check:
   [smoker] 
   [smoker] ivy-fail:
   [smoker] 
   [smoker] ivy-fail:
   [smoker] 
   [smoker] ivy-configure:
   [smoker] [ivy:configure] :: loading settings :: file = /x1/jenkins/jenkins-slave/workspace/Lucene-Solr-SmokeRelease-trunk/lucene/build/smokeTestRelease/tmp/unpack/solr-6.0.0/lucene/ivy-settings.xml
   [smoker] 
   [smoker] resolve:
   [smoker] 
   [smoker] common.init:
   [smoker] 
   [smoker] compile-lucene-core:
   [smoker] 
   [smoker] ivy-availability-check:
   [smoker] 
   [smoker] ivy-fail:
   [smoker] 
   [smoker] ivy-configure:
   [smoker] [ivy:configure] :: loading settings :: file = /x1/jenkins/jenkins-slave/workspace/Lucene-Solr-SmokeRelease-trunk/lucene/build/smokeTestRelease/tmp/unpack/solr-6.0.0/lucene/ivy-settings.xml
   [smoker] 
   [smoker] resolve:
   [smoker] 
   [smoker] init:
   [smoker] 
   [smoker] -clover.disable:
   [smoker] 
   [smoker] -clover.load:
   [smoker] 
   [smoker] -clover.classpath:
   [smoker] 
   [smoker] -clover.setup:
   [smoker] 
   [smoker] clover:
   [smoker] 
   [smoker] compile-core:
   [smoker] 
   [smoker] init:
   [smoker] 
   [smoker] -clover.disable:
   [smoker] 
   [smoker] -clover.load:
   [smoker] 
   [smoker] -clover.classpath:
   [smoker] 
   [smoker] -clover.setup:
   [smoker] 
   [smoker] clover:
   [smoker] 
   [smoker] common.compile-core:
   [smoker] 
   [smoker] compile-core:
   [smoker] 
   [smoker] check-lucene-core-uptodate:
   [smoker] 
   [smoker] jar-lucene-core:
   [smoker] 
   [smoker] check-backward-codecs-uptodate:
   [smoker] 
   [smoker] jar-backward-codecs:
   [smoker] 
   [smoker] check-analyzers-phonetic-uptodate:
   [smoker] 
   [smoker] jar-analyzers-phonetic:
   [smoker] 
   [smoker] check-analyzers-kuromoji-uptodate:
   [smoker] 
   [smoker] jar-analyzers-kuromoji:
   [smoker] 
   [smoker] check-codecs-uptodate:
   [smoker] 
   [smoker] jar-codecs:
   [smoker] 
   [smoker] check-expressions-uptodate:
   [smoker] 
   [smoker] jar-expressions:
   [smoker] 
   [smoker] check-suggest-uptodate:
   [smoker] 
   [smoker] jar-suggest:
   [smoker] 
   [smoker] check-highlighter-uptodate:
   [smoker] 
   [smoker] jar-highlighter:
   [smoker] 
   [smoker] check-memory-uptodate:
   [smoker] 
   [smoker] jar-memory:
   [smoker] 
   [smoker] check-misc-uptodate:
   [smoker] 
   [smoker] jar-misc:
   [smoker] 
   [smoker] check-spatial-uptodate:
   [smoker] 
   [smoker] jar-spatial:
   [smoker] 
   [smoker] check-grouping-uptodate:
   [smoker] 
   [smoker] jar-grouping:
   [smoker] 
   [smoker] check-queries-uptodate:
   [smoker] 
   [smoker] jar-queries:
   [smoker] 
   [smoker] check-queryparser-uptodate:
   [smoker] 
   [smoker] jar-queryparser:
   [smoker] 
   [smoker] check-join-uptodate:
   [smoker] 
   [smoker] jar-join:
   [smoker] 
   [smoker] check-sandbox-uptodate:
   [smoker] 
   [smoker] jar-sandbox:
   [smoker] 
   [smoker] prep-lucene-jars:
   [smoker] 
   [smoker] resolve-example:
   [smoker] 
   [smoker] ivy-availability-check:
   [smoker] 
   [smoker] ivy-fail:
   [smoker] 
   [smoker] ivy-configure:
   [smoker] [ivy:configure] :: loading settings :: file = /x1/jenkins/jenkins-slave/workspace/Lucene-Solr-SmokeRelease-trunk/lucene/build/smokeTestRelease/tmp/unpack/solr-6.0.0/lucene/ivy-settings.xml
   [smoker] 
   [smoker] resolve:
   [smoker] 
   [smoker] resolve-server:
   [smoker] 
   [smoker] ivy-availability-check:
   [smoker] 
   [smoker] ivy-fail:
   [smoker] 
   [smoker] ivy-fail:
   [smoker] 
   [smoker] ivy-configure:
   [smoker] [ivy:configure] :: loading settings :: file = /x1/jenkins/jenkins-slave/workspace/Lucene-Solr-SmokeRelease-trunk/lucene/build/smokeTestRelease/tmp/unpack/solr-6.0.0/lucene/ivy-settings.xml
   [smoker] 
   [smoker] resolve:
   [smoker] 
   [smoker] ivy-availability-check:
   [smoker] 
   [smoker] ivy-fail:
   [smoker] 
   [smoker] ivy-fail:
   [smoker] 
   [smoker] ivy-configure:
   [smoker] [ivy:configure] :: loading settings :: file = /x1/jenkins/jenkins-slave/workspace/Lucene-Solr-SmokeRelease-trunk/lucene/build/smokeTestRelease/tmp/unpack/solr-6.0.0/lucene/ivy-settings.xml
   [smoker] 
   [smoker] resolve:
   [smoker] 
   [smoker] common.init:
   [smoker] 
   [smoker] compile-lucene-core:
   [smoker] 
   [smoker] ivy-availability-check:
   [smoker] 
   [smoker] ivy-fail:
   [smoker] 
   [smoker] ivy-configure:
   [smoker] [ivy:configure] :: loading settings :: file = /x1/jenkins/jenkins-slave/workspace/Lucene-Solr-SmokeRelease-trunk/lucene/build/smokeTestRelease/tmp/unpack/solr-6.0.0/lucene/ivy-settings.xml
   [smoker] 
   [smoker] resolve:
   [smoker] 
   [smoker] init:
   [smoker] 
   [smoker] -clover.disable:
   [smoker] 
   [smoker] -clover.load:
   [smoker] 
   [smoker] -clover.classpath:
   [smoker] 
   [smoker] -clover.setup:
   [smoker] 
   [smoker] clover:
   [smoker] 
   [smoker] compile-core:
   [smoker] 
   [smoker] init:
   [smoker] 
   [smoker] -clover.disable:
   [smoker] 
   [smoker] -clover.load:
   [smoker] 
   [smoker] -clover.classpath:
   [smoker] 
   [smoker] -clover.setup:
   [smoker] 
   [smoker] clover:
   [smoker] 
   [smoker] common.compile-core:
   [smoker] 
   [smoker] common-solr.compile-core:
   [smoker] 
   [smoker] compile-core:
   [smoker] 
   [smoker] compile-test-framework:
   [smoker] 
   [smoker] compile-test-framework:
   [smoker] 
   [smoker] ivy-availability-check:
   [smoker] 
   [smoker] ivy-fail:
   [smoker] 
   [smoker] ivy-configure:
   [smoker] [ivy:configure] :: loading settings :: file = /x1/jenkins/jenkins-slave/workspace/Lucene-Solr-SmokeRelease-trunk/lucene/build/smokeTestRelease/tmp/unpack/solr-6.0.0/lucene/ivy-settings.xml
   [smoker] 
   [smoker] resolve:
   [smoker] 
   [smoker] init:
   [smoker] 
   [smoker] compile-lucene-core:
   [smoker] 
   [smoker] ivy-availability-check:
   [smoker] 
   [smoker] ivy-fail:
   [smoker] 
   [smoker] ivy-configure:
   [smoker] [ivy:configure] :: loading settings :: file = /x1/jenkins/jenkins-slave/workspace/Lucene-Solr-SmokeRelease-trunk/lucene/build/smokeTestRelease/tmp/unpack/solr-6.0.0/lucene/ivy-settings.xml
   [smoker] 
   [smoker] resolve:
   [smoker] 
   [smoker] init:
   [smoker] 
   [smoker] -clover.disable:
   [smoker] 
   [smoker] -clover.load:
   [smoker] 
   [smoker] -clover.classpath:
   [smoker] 
   [smoker] -clover.setup:
   [smoker] 
   [smoker] clover:
   [smoker] 
   [smoker] compile-core:
   [smoker] 
   [smoker] compile-codecs:
   [smoker] 
   [smoker] ivy-availability-check:
   [smoker] 
   [smoker] ivy-fail:
   [smoker] 
   [smoker] ivy-configure:
   [smoker] [ivy:configure] :: loading settings :: file = /x1/jenkins/jenkins-slave/workspace/Lucene-Solr-SmokeRelease-trunk/lucene/build/smokeTestRelease/tmp/unpack/solr-6.0.0/lucene/ivy-settings.xml
   [smoker] 
   [smoker] resolve:
   [smoker] 
   [smoker] common.init:
   [smoker] 
   [smoker] compile-lucene-core:
   [smoker] 
   [smoker] init:
   [smoker] 
   [smoker] -clover.disable:
   [smoker] 
   [smoker] -clover.load:
   [smoker] 
   [smoker] -clover.classpath:
   [smoker] 
   [smoker] -clover.setup:
   [smoker] 
   [smoker] clover:
   [smoker] 
   [smoker] compile-core:
   [smoker] 
   [smoker] -clover.disable:
   [smoker] 
   [smoker] -clover.load:
   [smoker] 
   [smoker] -clover.classpath:
   [smoker] 
   [smoker] -clover.setup:
   [smoker] 
   [smoker] clover:
   [smoker] 
   [smoker] common.compile-core:
   [smoker] 
   [smoker] compile-core:
   [smoker] 
   [smoker] compile-core:
   [smoker]     [mkdir] Created dir: /x1/jenkins/jenkins-slave/workspace/Lucene-Solr-SmokeRelease-trunk/lucene/build/smokeTestRelease/tmp/unpack/solr-6.0.0/solr/build/solr-test-framework/classes/java
   [smoker]     [javac] Compiling 44 source files to /x1/jenkins/jenkins-slave/workspace/Lucene-Solr-SmokeRelease-trunk/lucene/build/smokeTestRelease/tmp/unpack/solr-6.0.0/solr/build/solr-test-framework/classes/java
   [smoker]     [javac] Note: Some input files use or override a deprecated API.
   [smoker]     [javac] Note: Recompile with -Xlint:deprecation for details.
   [smoker]     [javac] Note: Some input files use unchecked or unsafe operations.
   [smoker]     [javac] Note: Recompile with -Xlint:unchecked for details.
   [smoker] 
   [smoker] compile-solrj:
   [smoker] 
   [smoker] check-lucene-core-uptodate:
   [smoker] 
   [smoker] jar-lucene-core:
   [smoker] 
   [smoker] check-backward-codecs-uptodate:
   [smoker] 
   [smoker] jar-backward-codecs:
   [smoker] 
   [smoker] check-analyzers-phonetic-uptodate:
   [smoker] 
   [smoker] jar-analyzers-phonetic:
   [smoker] 
   [smoker] check-analyzers-kuromoji-uptodate:
   [smoker] 
   [smoker] jar-analyzers-kuromoji:
   [smoker] 
   [smoker] check-codecs-uptodate:
   [smoker] 
   [smoker] jar-codecs:
   [smoker] 
   [smoker] check-expressions-uptodate:
   [smoker] 
   [smoker] jar-expressions:
   [smoker] 
   [smoker] check-suggest-uptodate:
   [smoker] 
   [smoker] jar-suggest:
   [smoker] 
   [smoker] check-highlighter-uptodate:
   [smoker] 
   [smoker] jar-highlighter:
   [smoker] 
   [smoker] check-memory-uptodate:
   [smoker] 
   [smoker] jar-memory:
   [smoker] 
   [smoker] check-misc-uptodate:
   [smoker] 
   [smoker] jar-misc:
   [smoker] 
   [smoker] check-spatial-uptodate:
   [smoker] 
   [smoker] jar-spatial:
   [smoker] 
   [smoker] check-grouping-uptodate:
   [smoker] 
   [smoker] jar-grouping:
   [smoker] 
   [smoker] check-queries-uptodate:
   [smoker] 
   [smoker] jar-queries:
   [smoker] 
   [smoker] check-queryparser-uptodate:
   [smoker] 
   [smoker] jar-queryparser:
   [smoker] 
   [smoker] check-join-uptodate:
   [smoker] 
   [smoker] jar-join:
   [smoker] 
   [smoker] check-sandbox-uptodate:
   [smoker] 
   [smoker] jar-sandbox:
   [smoker] 
   [smoker] prep-lucene-jars:
   [smoker] 
   [smoker] resolve-example:
   [smoker] 
   [smoker] ivy-availability-check:
   [smoker] 
   [smoker] ivy-fail:
   [smoker] 
   [smoker] ivy-configure:
   [smoker] [ivy:configure] :: loading settings :: file = /x1/jenkins/jenkins-slave/workspace/Lucene-Solr-SmokeRelease-trunk/lucene/build/smokeTestRelease/tmp/unpack/solr-6.0.0/lucene/ivy-settings.xml
   [smoker] 
   [smoker] resolve:
   [smoker] 
   [smoker] resolve-server:
   [smoker] 
   [smoker] ivy-availability-check:
   [smoker] 
   [smoker] ivy-fail:
   [smoker] 
   [smoker] ivy-fail:
   [smoker] 
   [smoker] ivy-configure:
   [smoker] [ivy:configure] :: loading settings :: file = /x1/jenkins/jenkins-slave/workspace/Lucene-Solr-SmokeRelease-trunk/lucene/build/smokeTestRelease/tmp/unpack/solr-6.0.0/lucene/ivy-settings.xml
   [smoker] 
   [smoker] resolve:
   [smoker] 
   [smoker] ivy-availability-check:
   [smoker] 
   [smoker] ivy-fail:
   [smoker] 
   [smoker] ivy-fail:
   [smoker] 
   [smoker] ivy-configure:
   [smoker] [ivy:configure] :: loading settings :: file = /x1/jenkins/jenkins-slave/workspace/Lucene-Solr-SmokeRelease-trunk/lucene/build/smokeTestRelease/tmp/unpack/solr-6.0.0/lucene/ivy-settings.xml
   [smoker] 
   [smoker] resolve:
   [smoker] 
   [smoker] common.init:
   [smoker] 
   [smoker] compile-lucene-core:
   [smoker] 
   [smoker] ivy-availability-check:
   [smoker] 
   [smoker] ivy-fail:
   [smoker] 
   [smoker] ivy-configure:
   [smoker] [ivy:configure] :: loading settings :: file = /x1/jenkins/jenkins-slave/workspace/Lucene-Solr-SmokeRelease-trunk/lucene/build/smokeTestRelease/tmp/unpack/solr-6.0.0/lucene/ivy-settings.xml
   [smoker] 
   [smoker] resolve:
   [smoker] 
   [smoker] init:
   [smoker] 
   [smoker] -clover.disable:
   [smoker] 
   [smoker] -clover.load:
   [smoker] 
   [smoker] -clover.classpath:
   [smoker] 
   [smoker] -clover.setup:
   [smoker] 
   [smoker] clover:
   [smoker] 
   [smoker] compile-core:
   [smoker] 
   [smoker] init:
   [smoker] 
   [smoker] -clover.disable:
   [smoker] 
   [smoker] -clover.load:
   [smoker] 
   [smoker] -clover.classpath:
   [smoker] 
   [smoker] -clover.setup:
   [smoker] 
   [smoker] clover:
   [smoker] 
   [smoker] common.compile-core:
   [smoker] 
   [smoker] compile-core:
   [smoker] 
   [smoker] check-lucene-core-uptodate:
   [smoker] 
   [smoker] jar-lucene-core:
   [smoker] 
   [smoker] check-backward-codecs-uptodate:
   [smoker] 
   [smoker] jar-backward-codecs:
   [smoker] 
   [smoker] check-analyzers-phonetic-uptodate:
   [smoker] 
   [smoker] jar-analyzers-phonetic:
   [smoker] 
   [smoker] check-analyzers-kuromoji-uptodate:
   [smoker] 
   [smoker] jar-analyzers-kuromoji:
   [smoker] 
   [smoker] check-codecs-uptodate:
   [smoker] 
   [smoker] jar-codecs:
   [smoker] 
   [smoker] check-expressions-uptodate:
   [smoker] 
   [smoker] jar-expressions:
   [smoker] 
   [smoker] check-suggest-uptodate:
   [smoker] 
   [smoker] jar-suggest:
   [smoker] 
   [smoker] check-highlighter-uptodate:
   [smoker] 
   [smoker] jar-highlighter:
   [smoker] 
   [smoker] check-memory-uptodate:
   [smoker] 
   [smoker] jar-memory:
   [smoker] 
   [smoker] check-misc-uptodate:
   [smoker] 
   [smoker] jar-misc:
   [smoker] 
   [smoker] check-spatial-uptodate:
   [smoker] 
   [smoker] jar-spatial:
   [smoker] 
   [smoker] check-grouping-uptodate:
   [smoker] 
   [smoker] jar-grouping:
   [smoker] 
   [smoker] check-queries-uptodate:
   [smoker] 
   [smoker] jar-queries:
   [smoker] 
   [smoker] check-queryparser-uptodate:
   [smoker] 
   [smoker] jar-queryparser:
   [smoker] 
   [smoker] check-join-uptodate:
   [smoker] 
   [smoker] jar-join:
   [smoker] 
   [smoker] check-sandbox-uptodate:
   [smoker] 
   [smoker] jar-sandbox:
   [smoker] 
   [smoker] prep-lucene-jars:
   [smoker] 
   [smoker] resolve-example:
   [smoker] 
   [smoker] ivy-availability-check:
   [smoker] 
   [smoker] ivy-fail:
   [smoker] 
   [smoker] ivy-configure:
   [smoker] [ivy:configure] :: loading settings :: file = /x1/jenkins/jenkins-slave/workspace/Lucene-Solr-SmokeRelease-trunk/lucene/build/smokeTestRelease/tmp/unpack/solr-6.0.0/lucene/ivy-settings.xml
   [smoker] 
   [smoker] resolve:
   [smoker] 
   [smoker] resolve-server:
   [smoker] 
   [smoker] ivy-availability-check:
   [smoker] 
   [smoker] ivy-fail:
   [smoker] 
   [smoker] ivy-fail:
   [smoker] 
   [smoker] ivy-configure:
   [smoker] [ivy:configure] :: loading settings :: file = /x1/jenkins/jenkins-slave/workspace/Lucene-Solr-SmokeRelease-trunk/lucene/build/smokeTestRelease/tmp/unpack/solr-6.0.0/lucene/ivy-settings.xml
   [smoker] 
   [smoker] resolve:
   [smoker] 
   [smoker] ivy-fail:
   [smoker] 
   [smoker] resolve:
   [smoker] 
   [smoker] common.init:
   [smoker] 
   [smoker] compile-lucene-core:
   [smoker] 
   [smoker] ivy-availability-check:
   [smoker] 
   [smoker] ivy-fail:
   [smoker] 
   [smoker] ivy-configure:
   [smoker] [ivy:configure] :: loading settings :: file = /x1/jenkins/jenkins-slave/workspace/Lucene-Solr-SmokeRelease-trunk/lucene/build/smokeTestRelease/tmp/unpack/solr-6.0.0/lucene/ivy-settings.xml
   [smoker] 
   [smoker] resolve:
   [smoker] 
   [smoker] init:
   [smoker] 
   [smoker] -clover.disable:
   [smoker] 
   [smoker] -clover.load:
   [smoker] 
   [smoker] -clover.classpath:
   [smoker] 
   [smoker] -clover.setup:
   [smoker] 
   [smoker] clover:
   [smoker] 
   [smoker] compile-core:
   [smoker] 
   [smoker] init:
   [smoker] 
   [smoker] common.compile-core:
   [smoker] 
   [smoker] common-solr.compile-core:
   [smoker] 
   [smoker] compile-core:
   [smoker] 
   [smoker] compile-test-framework:
   [smoker] 
   [smoker] ivy-availability-check:
   [smoker] 
   [smoker] ivy-fail:
   [smoker] 
   [smoker] ivy-configure:
   [smoker] [ivy:configure] :: loading settings :: file = /x1/jenkins/jenkins-slave/workspace/Lucene-Solr-SmokeRelease-trunk/lucene/build/smokeTestRelease/tmp/unpack/solr-6.0.0/lucene/ivy-settings.xml
   [smoker] 
   [smoker] resolve:
   [smoker] 
   [smoker] init:
   [smoker] 
   [smoker] compile-lucene-core:
   [smoker] 
   [smoker] compile-codecs:
   [smoker] 
   [smoker] ivy-availability-check:
   [smoker] 
   [smoker] ivy-fail:
   [smoker] 
   [smoker] ivy-configure:
   [smoker] [ivy:configure] :: loading settings :: file = /x1/jenkins/jenkins-slave/workspace/Lucene-Solr-SmokeRelease-trunk/lucene/build/smokeTestRelease/tmp/unpack/solr-6.0.0/lucene/ivy-settings.xml
   [smoker] 
   [smoker] resolve:
   [smoker] 
   [smoker] common.init:
   [smoker] 
   [smoker] compile-lucene-core:
   [smoker] 
   [smoker] init:
   [smoker] 
   [smoker] -clover.disable:
   [smoker] 
   [smoker] -clover.load:
   [smoker] 
   [smoker] -clover.classpath:
   [smoker] 
   [smoker] -clover.setup:
   [smoker] 
   [smoker] clover:
   [smoker] 
   [smoker] compile-core:
   [smoker] 
   [smoker] -clover.disable:
   [smoker] 
   [smoker] -clover.load:
   [smoker] 
   [smoker] -clover.classpath:
   [smoker] 
   [smoker] -clover.setup:
   [smoker] 
   [smoker] clover:
   [smoker] 
   [smoker] common.compile-core:
   [smoker] 
   [smoker] compile-core:
   [smoker] 
   [smoker] common.compile-test:
   [smoker]     [mkdir] Created dir: /x1/jenkins/jenkins-slave/workspace/Lucene-Solr-SmokeRelease-trunk/lucene/build/smokeTestRelease/tmp/unpack/solr-6.0.0/solr/build/solr-core/classes/test
   [smoker]     [javac] Compiling 625 source files to /x1/jenkins/jenkins-slave/workspace/Lucene-Solr-SmokeRelease-trunk/lucene/build/smokeTestRelease/tmp/unpack/solr-6.0.0/solr/build/solr-core/classes/test
   [smoker]     [javac] Note: Some input files use or override a deprecated API.
   [smoker]     [javac] Note: Recompile with -Xlint:deprecation for details.
   [smoker]     [javac] Note: Some input files use unchecked or unsafe operations.
   [smoker]     [javac] Note: Recompile with -Xlint:unchecked for details.
   [smoker]      [copy] Copying 1 file to /x1/jenkins/jenkins-slave/workspace/Lucene-Solr-SmokeRelease-trunk/lucene/build/smokeTestRelease/tmp/unpack/solr-6.0.0/solr/build/solr-core/classes/test
   [smoker] 
   [smoker] common-solr.compile-test:
   [smoker] 
   [smoker] compile-test:
   [smoker] 
   [smoker] install-junit4-taskdef:
   [smoker] 
   [smoker] compile-tools:
   [smoker] 
   [smoker] ivy-availability-check:
   [smoker] 
   [smoker] ivy-fail:
   [smoker] 
   [smoker] ivy-configure:
   [smoker] [ivy:configure] :: loading settings :: file = /x1/jenkins/jenkins-slave/workspace/Lucene-Solr-SmokeRelease-trunk/lucene/build/smokeTestRelease/tmp/unpack/solr-6.0.0/lucene/ivy-settings.xml
   [smoker] 
   [smoker] resolve:
   [smoker] 
   [smoker] init:
   [smoker] 
   [smoker] compile-core:
   [smoker] 
   [smoker] validate:
   [smoker] 
   [smoker] resolve-groovy:
   [smoker] 
   [smoker] -init-totals:
   [smoker] 
   [smoker] -test:
   [smoker]     [mkdir] Created dir: /x1/jenkins/jenkins-slave/workspace/Lucene-Solr-SmokeRelease-trunk/lucene/build/smokeTestRelease/tmp/unpack/solr-6.0.0/solr/build/solr-core/test
   [smoker] [loadresource] Do not set property tests.explicitclass as its length is 0.
   [smoker]     [mkdir] Created dir: /x1/jenkins/jenkins-slave/workspace/Lucene-Solr-SmokeRelease-trunk/lucene/build/smokeTestRelease/tmp/unpack/solr-6.0.0/solr/build/solr-core/test/temp
   [smoker]     [mkdir] Created dir: /x1/jenkins/jenkins-slave/workspace/Lucene-Solr-SmokeRelease-trunk/lucene/build/smokeTestRelease/tmp/unpack/solr-6.0.0/.caches/test-stats/solr-core
   [smoker]    [junit4] <JUnit4> says hallo! Master seed: 19B007EF44910484
   [smoker]    [junit4] Executing 575 suites with 3 JVMs.
   [smoker]    [junit4] 
   [smoker]    [junit4] Started J1 PID(16300@lucene1-us-west).
   [smoker]    [junit4] Started J2 PID(16301@lucene1-us-west).
   [smoker]    [junit4] Started J0 PID(16302@lucene1-us-west).
   [smoker]    [junit4] Suite: org.apache.solr.cloud.rule.RulesTest
   [smoker]    [junit4] IGNOR/A 0.01s J1 | RulesTest.testModifyColl
   [smoker]    [junit4]    > Assumption #1: 'slow' test group is disabled (@Slow())
   [smoker]    [junit4] IGNOR/A 0.00s J1 | RulesTest.testPortRule
   [smoker]    [junit4]    > Assumption #1: 'slow' test group is disabled (@Slow())
   [smoker]    [junit4] IGNOR/A 0.00s J1 | RulesTest.doIntegrationTest
   [smoker]    [junit4]    > Assumption #1: 'slow' test group is disabled (@Slow())
   [smoker]    [junit4] Completed [1/575] on J1 in 0.83s, 3 tests, 3 skipped
   [smoker]    [junit4] 
   [smoker]    [junit4] Suite: org.apache.solr.core.RAMDirectoryFactoryTest
   [smoker]    [junit4] Completed [2/575] on J0 in 1.73s, 1 test
   [smoker]    [junit4] 
   [smoker]    [junit4] Suite: org.apache.solr.handler.component.TestPivotHelperCode
   [smoker]    [junit4] Completed [3/575] on J1 in 1.73s, 3 tests
   [smoker]    [junit4] 
   [smoker]    [junit4] Suite: org.apache.solr.schema.BadIndexSchemaTest
   [smoker]    [junit4] Completed [4/575] on J2 in 10.72s, 19 tests
   [smoker]    [junit4] 
   [smoker]    [junit4] Suite: org.apache.solr.core.TestReloadAndDeleteDocs
   [smoker]    [junit4] Completed [5/575] on J1 in 11.21s, 2 tests
   [smoker]    [junit4] 
   [smoker]    [junit4] Suite: org.apache.solr.util.SolrPluginUtilsTest
   [smoker]    [junit4] Completed [6/575] on J1 in 2.45s, 8 tests
   [smoker]    [junit4] 
   [smoker]    [junit4] Suite: org.apache.solr.core.TestCodecSupport
   [smoker]    [junit4] Completed [7/575] on J1 in 3.25s, 8 tests
   [smoker]    [junit4] 
   [smoker]    [junit4] Suite: org.apache.solr.handler.component.QueryElevationComponentTest
   [smoker]    [junit4] Completed [8/575] on J0 in 18.12s, 9 tests
   [smoker]    [junit4] 
   [smoker]    [junit4] Suite: org.apache.solr.spelling.SpellingQueryConverterTest
   [smoker]    [junit4] Completed [9/575] on J1 in 0.08s, 6 tests
   [smoker]    [junit4] 
   [smoker]    [junit4] Suite: org.apache.solr.search.join.BJQParserTest
   [smoker]    [junit4] Completed [10/575] on J1 in 2.01s, 13 tests
   [smoker]    [junit4] 
   [smoker]    [junit4] Suite: org.apache.solr.core.TestMergePolicyConfig
   [smoker]    [junit4] Completed [11/575] on J0 in 2.16s, 5 tests
   [smoker]    [junit4] 
   [smoker]    [junit4] Suite: org.apache.solr.update.processor.URLClassifyProcessorTest
   [smoker]    [junit4] Completed [12/575] on J0 in 0.30s, 7 tests
   [smoker]    [junit4] 
   [smoker]    [junit4] Suite: org.apache.solr.update.processor.StatelessScriptUpdateProcessorFactoryTest
   [smoker]    [junit4] Completed [13/575] on J2 in 11.91s, 8 tests
   [smoker]    [junit4] 
   [smoker]    [junit4] Suite: org.apache.solr.cloud.hdfs.HdfsRecoveryZkTest
   [smoker]    [junit4] IGNOR/A 0.02s J2 | HdfsRecoveryZkTest.test
   [smoker]    [junit4]    > Assumption #1: 'nightly' test group is disabled (@Nightly(value=))
   [smoker]    [junit4] Completed [14/575] on J2 in 0.03s, 1 test, 1 skipped
   [smoker]    [junit4] 
   [smoker]    [junit4] Suite: org.apache.solr.search.TestQueryTypes
   [smoker]    [junit4] Completed [15/575] on J1 in 2.02s, 1 test
   [smoker]    [junit4] 
   [smoker]    [junit4] Suite: org.apache.solr.spelling.SpellCheckCollatorTest
   [smoker]    [junit4] IGNOR/A 0.00s J1 | SpellCheckCollatorTest.testExtendedCollate
   [smoker]    [junit4]    > Assumption #1: 'slow' test group is disabled (@Slow())
   [smoker]    [junit4] IGNOR/A 0.00s J1 | SpellCheckCollatorTest.testContextSensitiveCollate
   [smoker]    [junit4]    > Assumption #1: 'slow' test group is disabled (@Slow())
   [smoker]    [junit4] IGNOR/A 0.00s J1 | SpellCheckCollatorTest.testCollateWithFilter
   [smoker]    [junit4]    > Assumption #1: 'slow' test group is disabled (@Slow())
   [smoker]    [junit4] IGNOR/A 0.00s J1 | SpellCheckCollatorTest.testCollateWithMultipleRequestHandlers
   [smoker]    [junit4]    > Assumption #1: 'slow' test group is disabled (@Slow())
   [smoker]    [junit4] IGNOR/A 0.00s J1 | SpellCheckCollatorTest.testCollationWithHypens
   [smoker]    [junit4]    > Assumption #1: 'slow' test group is disabled (@Slow())
   [smoker]    [junit4] IGNOR/A 0.00s J1 | SpellCheckCollatorTest.testCollationWithRangeQuery
   [smoker]    [junit4]    > Assumption #1: 'slow' test group is disabled (@Slow())
   [smoker]    [junit4] IGNOR/A 0.00s J1 | SpellCheckCollatorTest.testZeroTries
   [smoker]    [junit4]    > Assumption #1: 'slow' test group is disabled (@Slow())
   [smoker]    [junit4] IGNOR/A 0.00s J1 | SpellCheckCollatorTest.testEstimatedHitCounts
   [smoker]    [junit4]    > Assumption #1: 'slow' test group is disabled (@Slow())
   [smoker]    [junit4] IGNOR/A 0.00s J1 | SpellCheckCollatorTest.testCollateWithGrouping
   [smoker]    [junit4]    > Assumption #1: 'slow' test group is disabled (@Slow())
   [smoker]    [junit4] IGNOR/A 0.00s J1 | SpellCheckCollatorTest.testCollateWithOverride
   [smoker]    [junit4]    > Assumption #1: 'slow' test group is disabled (@Slow())
   [smoker]    [junit4] Completed [16/575] on J1 in 0.02s, 10 tests, 10 skipped
   [smoker]    [junit4] 
   [smoker]    [junit4] Suite: org.apache.solr.servlet.NoCacheHeaderTest
   [smoker]    [junit4] Completed [17/575] on J2 in 4.11s, 3 tests
   [smoker]    [junit4] 
   [smoker]    [junit4] Suite: org.apache.solr.core.SolrCoreTest
   [smoker]    [junit4] Completed [18/575] on J0 in 8.21s, 6 tests
   [smoker]    [junit4] 
   [smoker]    [junit4] Suite: org.apache.solr.search.similarities.TestNonDefinedSimilarityFactory
   [smoker]    [junit4] Completed [19/575] on J0 in 0.48s, 2 tests
   [smoker]    [junit4] 
   [smoker]    [junit4] Suite: org.apache.solr.handler.component.DistributedFacetPivotSmallAdvancedTest
   [smoker]    [junit4] Completed [20/575] on J1 in 8.70s, 1 test
   [smoker]    [junit4] 
   [smoker]    [junit4] Suite: org.apache.solr.cloud.TestLeaderElectionZkExpiry
   [smoker]    [junit4] Completed [21/575] on J1 in 15.55s, 1 test
   [smoker]    [junit4] 
   [smoker]    [junit4] Suite: org.apache.solr.cloud.TestRandomRequestDistribution
   [smoker]    [junit4] IGNOR/A 0.00s J1 | TestRandomRequestDistribution.test
   [smoker]    [junit4]    > Assumption #1: 'slow' test group is disabled (@Slow())
   [smoker]    [junit4] Completed [23/575] on J1 in 0.02s, 1 test, 1 skipped
   [smoker]    [junit4] 
   [smoker]    [junit4] Suite: org.apache.solr.spelling.suggest.TestFileDictionaryLookup
   [smoker]    [junit4] Completed [24/575] on J1 in 2.67s, 1 test
   [smoker]    [junit4] 
   [smoker]    [junit4] Suite: org.apache.solr.handler.component.DistributedFacetPivotLargeTest
   [smoker]    [junit4] Completed [25/575] on J2 in 24.61s, 1 test
   [smoker]    [junit4] 
   [smoker]    [junit4] Suite: org.apache.solr.search.TestOverriddenPrefixQueryForCustomFieldType
   [smoker]    [junit4] Completed [26/575] on J1 in 1.17s, 2 tests
   [smoker]    [junit4] 
   [smoker]    [junit4] Suite: org.apache.solr.schema.NotRequiredUniqueKeyTest
   [smoker]    [junit4] Completed [27/575] on J1 in 0.89s, 1 test
   [smoker]    [junit4] 
   [smoker]    [junit4] Suite: org.apache.solr.search.similarities.TestPerFieldSimilarityClassic
   [smoker]    [junit4] Completed [28/575] on J1 in 0.57s, 7 tests
   [smoker]    [junit4] 
   [smoker]    [junit4] Suite: org.apache.solr.response.TestCSVResponseWriter
   [smoker]    [junit4] Completed [29/575] on J2 in 2.09s, 2 tests
   [smoker]    [junit4] 
   [smoker]    [junit4] Suite: org.apache.solr.spelling.TestSuggestSpellingConverter
   [smoker]    [junit4] Completed [30/575] on J2 in 0.20s, 2 tests
   [smoker]    [junit4] 
   [smoker]    [junit4] Suite: org.apache.solr.BasicFunctionalityTest
   [smoker]    [junit4] Completed [31/575] on J1 in 4.22s, 23 tests
   [smoker]    [junit4] 
   [smoker]    [junit4] Suite: org.apache.solr.search.TestMissingGroups
   [smoker]    [junit4] Completed [32/575] on J2 in 4.96s, 1 test
   [smoker]    [junit4] 
   [smoker]    [junit4] Suite: org.apache.solr.cloud.hdfs.StressHdfsTest
   [smoker]    [junit4] IGNOR/A 0.00s J2 | StressHdfsTest.test
   [smoker]    [junit4]    > Assumption #1: 'slow' test group is disabled (@Slow())
   [smoker]    [junit4] Completed [33/575] on J2 in 0.01s, 1 test, 1 skipped
   [smoker]    [junit4] 
   [smoker]    [junit4] Suite: org.apache.solr.core.PluginInfoTest
   [smoker]    [junit4] Completed [35/575] on J2 in 0.13s, 9 tests
   [smoker]    [junit4] 
   [smoker]    [junit4] Suite: org.apache.solr.cloud.DeleteReplicaTest
   [smoker]    [junit4] IGNOR/A 0.00s J2 | DeleteReplicaTest.deleteLiveReplicaTest
   [smoker]    [junit4]    > Assumption #1: 'slow' test group is disabled (@Slow())
   [smoker]    [junit4] Completed [36/575] on J2 in 0.01s, 1 test, 1 skipped
   [smoker]    [junit4] 
   [smoker]    [junit4] Suite: org.apache.solr.handler.component.FacetPivotSmallTest
   [smoker]    [junit4] Completed [37/575] on J1 in 2.43s, 11 tests
   [smoker]    [junit4] 
   [smoker]    [junit4] Suite: org.apache.solr.search.TestTrieFacet
   [smoker]    [junit4] Completed [38/575] on J2 in 2.84s, 12 tests
   [smoker]    [junit4] 
   [smoker]    [junit4] Suite: org.apache.solr.schema.SchemaVersionSpecificBehaviorTest
   [smoker]    [junit4] Completed [39/575] on J1 in 2.63s, 1 test
   [smoker]    [junit4] 
   [smoker]    [junit4] Suite: org.apache.solr.handler.component.TermVectorComponentTest
   [smoker]    [junit4] Completed [40/575] on J1 in 1.29s, 4 tests
   [smoker]    [junit4] 
   [smoker]    [junit4] Suite: org.apache.solr.search.TestExtendedDismaxParser
   [smoker]    [junit4] Completed [41/575] on J2 in 2.63s, 20 tests
   [smoker]    [junit4] 
   [smoker]    [junit4] Suite: org.apache.solr.highlight.HighlighterConfigTest
   [smoker]    [junit4] Completed [42/575] on J2 in 1.17s, 1 test
   [smoker]    [junit4] 
   [smoker]    [junit4] Suite: org.apache.solr.spelling.WordBreakSolrSpellCheckerTest
   [smoker]    [junit4] Completed [43/575] on J1 in 2.03s, 3 tests
   [smoker]    [junit4] 
   [smoker]    [junit4] Suite: org.apache.solr.search.similarities.TestDFRSimilarityFactory
   [smoker]    [junit4] Completed [44/575] on J1 in 0.34s, 3 tests
   [smoker]    [junit4] 
   [smoker]    [junit4] Suite: org.apache.solr.cloud.AsyncMigrateRouteKeyTest
   [smoker]    [junit4] IGNOR/A 0.00s J1 | AsyncMigrateRouteKeyTest.test
   [smoker]    [junit4]    > Assumption #1: 'slow' test group is disabled (@Slow())
   [smoker]    [junit4] Completed [45/575] on J1 in 0.01s, 1 test, 1 skipped
   [smoker]    [junit4] 
   [smoker]    [junit4] Suite: org.apache.solr.cloud.OutOfBoxZkACLAndCredentialsProvidersTest
   [smoker]    [junit4] Completed [46/575] on J1 in 1.21s, 2 tests
   [smoker]    [junit4] 
   [smoker]    [junit4] Suite: org.apache.solr.handler.admin.MBeansHandlerTest
   [smoker]    [junit4] Completed [47/575] on J1 in 1.44s, 2 tests
   [smoker]    [junit4] 
   [smoker]    [junit4] Suite: org.apache.solr.update.SolrIndexConfigTest
   [smoker]    [junit4] Completed [48/575] on J1 in 1.75s, 4 tests
   [smoker]    [junit4] 
   [smoker]    [junit4] Suite: org.apache.solr.search.MergeStrategyTest
   [smoker]    [junit4] Completed [49/575] on J1 in 6.75s, 1 test
   [smoker]    [junit4] 
   [smoker]    [junit4] Suite: org.apache.solr.security.PKIAuthenticationIntegrationTest
   [smoker]    [junit4] IGNOR/A 0.00s J1 | PKIAuthenticationIntegrationTest.testPkiAuth
   [smoker]    [junit4]    > Assumption #1: 'slow' test group is disabled (@Slow())
   [smoker]    [junit4] Completed [50/575] on J1 in 0.00s, 1 test, 1 skipped
   [smoker]    [junit4] 
   [smoker]    [junit4] Suite: org.apache.solr.search.TestRandomCollapseQParserPlugin
   [smoker]    [junit4] Completed [51/575] on J0 in 46.79s, 2 tests
   [smoker]    [junit4] 
   [smoker]    [junit4] Suite: org.apache.solr.search.SortSpecParsingTest
   [smoker]    [junit4] Completed [52/575] on J0 in 1.34s, 2 tests
   [smoker]    [junit4] 
   [smoker]    [junit4] Suite: org.apache.solr.search.similarities.TestIBSimilarityFactory
   [smoker]    [junit4] Completed [53/575] on J0 in 0.42s, 2 tests
   [smoker]    [junit4] 
   [smoker]    [junit4] Suite: org.apache.solr.handler.admin.CoreAdminCreateDiscoverTest
   [smoker]    [junit4] Completed [54/575] on J0 in 1.12s, 4 tests
   [smoker]    [junit4] 
   [smoker]    [junit4] Suite: org.apache.solr.search.TestRecovery
   [smoker]    [junit4] Completed [55/575] on J2 in 15.85s, 12 tests
   [smoker]    [junit4] 
   [smoker]    [junit4] Suite: org.apache.solr.util.hll.HLLSerializationTest
   [smoker]    [junit4] IGNOR/A 0.00s J2 | HLLSerializationTest.serializationSmokeTest
   [smoker]    [junit4]    > Assumption #1: 'nightly' test group is disabled (@Nightly())
   [smoker]    [junit4] IGNOR/A 0.00s J2 | HLLSerializationTest.monsterHLLSerializationTest
   [smoker]    [junit4]    > Assumption #1: 'slow' test group is disabled (@Slow())
   [smoker]    [junit4] IGNOR/A 0.00s J2 | HLLSerializationTest.manyValuesMonsterHLLSerializationTest
   [smoker]    [junit4]    > Assumption #1: 'slow' test group is disabled (@Slow())
   [smoker]    [junit4] IGNOR/A 0.00s J2 | HLLSerializationTest.manyValuesHLLSerializationTest
   [smoker]    [junit4]    > Assumption #1: 'slow' test group is disabled (@Slow())
   [smoker]    [junit4] Completed [56/575] on J2 in 0.00s, 4 tests, 4 skipped
   [smoker]    [junit4] 
   [smoker]    [junit4] Suite: org.apache.solr.update.TestExceedMaxTermLength
   [smoker]    [junit4] Completed [57/575] on J2 in 0.43s, 2 tests
   [smoker]    [junit4] 
   [smoker]    [junit4] Suite: org.apache.solr.search.TestSearcherReuse
   [smoker]    [junit4] Completed [58/575] on J2 in 0.27s, 1 test
   [smoker]    [junit4] 
   [smoker]    [junit4] Suite: org.apache.solr.search.TestSolr4Spatial2
   [smoker]    [junit4] Completed [59/575] on J2 in 0.63s, 3 tests
   [smoker]    [junit4] 
   [smoker]    [junit4] Suite: org.apache.solr.search.AnalyticsMergeStrategyTest
   [smoker]    [junit4] Completed [60/575] on J1 in 5.83s, 1 test
   [smoker]    [junit4] 
   [smoker]    [junit4] Suite: org.apache.solr.core.TestConfigOverlay
   [smoker]    [junit4] Completed [61/575] on J1 in 0.02s, 2 tests
   [smoker]    [junit4] 
   [smoker]    [junit4] Suite: org.apache.solr.TestDistributedGrouping
   [smoker]    [junit4] IGNOR/A 0.00s J1 | TestDistributedGrouping.test
   [smoker]    [junit4]    > Assumption #1: 'slow' test group is disabled (@Slow())
   [smoker]    [junit4] Completed [62/575] on J1 in 0.02s, 1 test, 1 skipped
   [smoker]    [junit4] 
   [smoker]    [junit4] Suite: org.apache.solr.util.TimeZoneUtilsTest
   [smoker]    [junit4] Completed [63/575] on J1 in 0.19s, 5 tests
   [smoker]    [junit4] 
   [smoker]    [junit4] Suite: org.apache.solr.cloud.OverriddenZkACLAndCredentialsProvidersTest
   [smoker]    [junit4] Completed [64/575] on J2 in 5.29s, 8 tests
   [smoker]    [junit4] 
   [smoker]    [junit4] Suite: org.apache.solr.cloud.TestMiniSolrCloudClusterSSL
   [smoker]    [junit4] Completed [65/575] on J0 in 7.92s, 1 test
   [smoker]    [junit4] 
   [smoker]    [junit4] Suite: org.apache.solr.search.TestComponentsName
   [smoker]    [junit4] Completed [66/575] on J0 in 1.39s, 1 test
   [smoker]    [junit4] 
   [smoker]    [junit4] Suite: org.apache.solr.cloud.TestShortCircuitedRequests
   [smoker]    [junit4] IGNOR/A 0.01s J0 | TestShortCircuitedRequests.test
   [smoker]    [junit4]    > Assumption #1: 'slow' test group is disabled (@Slow())
   [smoker]    [junit4] Completed [67/575] on J0 in 0.05s, 1 test, 1 skipped
   [smoker]    [junit4] 
   [smoker]    [junit4] Suite: org.apache.solr.cloud.TestMiniSolrCloudClusterBase
   [smoker]    [junit4] Completed [68/575] on J1 in 20.75s, 1 t

[...truncated too long message...]

1 skipped
   [smoker]    [junit4] 
   [smoker]    [junit4] Suite: org.apache.solr.security.TestPKIAuthenticationPlugin
   [smoker]    [junit4] Completed [547/575 (1!)] on J2 in 0.01s, 1 test, 1 skipped
   [smoker]    [junit4] 
   [smoker]    [junit4] Suite: org.apache.solr.security.TestSha256AuthenticationProvider
   [smoker]    [junit4] Completed [548/575 (1!)] on J2 in 0.00s, 2 tests, 2 skipped
   [smoker]    [junit4] 
   [smoker]    [junit4] Suite: org.apache.solr.servlet.ResponseHeaderTest
   [smoker]    [junit4] Completed [549/575 (1!)] on J2 in 0.01s, 1 test, 1 skipped
   [smoker]    [junit4] 
   [smoker]    [junit4] Suite: org.apache.solr.spelling.suggest.TestAnalyzeInfixSuggestions
   [smoker]    [junit4] Completed [550/575 (1!)] on J2 in 0.00s, 4 tests, 4 skipped
   [smoker]    [junit4] 
   [smoker]    [junit4] Suite: org.apache.solr.rest.schema.TestManagedSchemaFieldResource
   [smoker]    [junit4] Completed [551/575 (1!)] on J0 in 8.24s, 10 tests
   [smoker]    [junit4] 
   [smoker]    [junit4] Suite: org.apache.solr.store.blockcache.BlockCacheTest
   [smoker]    [junit4] Completed [552/575 (1!)] on J2 in 0.00s, 2 tests, 2 skipped
   [smoker]    [junit4] 
   [smoker]    [junit4] Suite: org.apache.solr.store.blockcache.BufferStoreTest
   [smoker]    [junit4] Completed [553/575 (1!)] on J2 in 0.02s, 1 test, 1 skipped
   [smoker]    [junit4] 
   [smoker]    [junit4] Suite: org.apache.solr.store.hdfs.HdfsDirectoryTest
   [smoker]    [junit4] Completed [554/575 (1!)] on J2 in 0.01s, 4 tests, 4 skipped
   [smoker]    [junit4] 
   [smoker]    [junit4] Suite: org.apache.solr.update.AddBlockUpdateTest
   [smoker]    [junit4] Completed [555/575 (1!)] on J2 in 0.01s, 6 tests, 6 skipped
   [smoker]    [junit4] 
   [smoker]    [junit4] Suite: org.apache.solr.update.AnalysisErrorHandlingTest
   [smoker]    [junit4] Completed [556/575 (1!)] on J2 in 0.02s, 1 test, 1 skipped
   [smoker]    [junit4] 
   [smoker]    [junit4] Suite: org.apache.solr.update.DataDrivenBlockJoinTest
   [smoker]    [junit4] Completed [557/575 (1!)] on J2 in 0.00s, 1 test, 1 skipped
   [smoker]    [junit4] 
   [smoker]    [junit4] Suite: org.apache.solr.update.TestDocBasedVersionConstraints
   [smoker]    [junit4] Completed [558/575 (1!)] on J2 in 0.02s, 6 tests, 6 skipped
   [smoker]    [junit4] 
   [smoker]    [junit4] Suite: org.apache.solr.update.TestHdfsUpdateLog
   [smoker]    [junit4] Completed [559/575 (1!)] on J2 in 0.00s, 1 test, 1 skipped
   [smoker]    [junit4] 
   [smoker]    [junit4] Suite: org.apache.solr.update.VersionInfoTest
   [smoker]    [junit4] Completed [560/575 (1!)] on J2 in 0.01s, 2 tests, 2 skipped
   [smoker]    [junit4] 
   [smoker]    [junit4] Suite: org.apache.solr.update.processor.AddSchemaFieldsUpdateProcessorFactoryTest
   [smoker]    [junit4] Completed [561/575 (1!)] on J2 in 0.00s, 6 tests, 6 skipped
   [smoker]    [junit4] 
   [smoker]    [junit4] Suite: org.apache.solr.update.processor.AtomicUpdatesTest
   [smoker]    [junit4] Completed [562/575 (1!)] on J2 in 0.03s, 18 tests, 18 skipped
   [smoker]    [junit4] 
   [smoker]    [junit4] Suite: org.apache.solr.update.processor.CloneFieldUpdateProcessorFactoryTest
   [smoker]    [junit4] Completed [563/575 (1!)] on J2 in 0.00s, 9 tests, 9 skipped
   [smoker]    [junit4] 
   [smoker]    [junit4] Suite: org.apache.solr.update.processor.PreAnalyzedUpdateProcessorTest
   [smoker]    [junit4] Completed [564/575 (1!)] on J2 in 0.01s, 2 tests, 2 skipped
   [smoker]    [junit4] 
   [smoker]    [junit4] Suite: org.apache.solr.update.processor.UUIDUpdateProcessorFallbackTest
   [smoker]    [junit4] Completed [565/575 (1!)] on J2 in 0.00s, 1 test, 1 skipped
   [smoker]    [junit4] 
   [smoker]    [junit4] Suite: org.apache.solr.util.TestObjectReleaseTracker
   [smoker]    [junit4] Completed [566/575 (1!)] on J2 in 0.00s, 1 test, 1 skipped
   [smoker]    [junit4] 
   [smoker]    [junit4] Suite: org.apache.solr.util.TestRTimerTree
   [smoker]    [junit4] Completed [567/575 (1!)] on J2 in 0.00s, 1 test, 1 skipped
   [smoker]    [junit4] 
   [smoker]    [junit4] Suite: org.apache.solr.util.TestRandomForceMergePolicy
   [smoker]    [junit4] Completed [568/575 (1!)] on J2 in 0.01s, 3 tests, 3 skipped
   [smoker]    [junit4] 
   [smoker]    [junit4] Suite: org.apache.solr.util.TestSolrCLIRunExample
   [smoker]    [junit4] IGNOR/A 0.00s J2 | TestSolrCLIRunExample.testSchemalessExample
   [smoker]    [junit4]    > Assumption #1: 'slow' test group is disabled (@Slow())
   [smoker]    [junit4] IGNOR/A 0.00s J2 | TestSolrCLIRunExample.testInteractiveSolrCloudExample
   [smoker]    [junit4]    > Assumption #1: 'slow' test group is disabled (@Slow())
   [smoker]    [junit4] Completed [569/575 (1!)] on J2 in 0.01s, 3 tests, 3 skipped
   [smoker]    [junit4] 
   [smoker]    [junit4] Suite: org.apache.solr.util.hll.ExplicitHLLTest
   [smoker]    [junit4] Completed [570/575 (1!)] on J2 in 0.01s, 6 tests, 6 skipped
   [smoker]    [junit4] 
   [smoker]    [junit4] Suite: org.apache.solr.util.hll.FullHLLTest
   [smoker]    [junit4] Completed [571/575 (1!)] on J2 in 0.00s, 6 tests, 6 skipped
   [smoker]    [junit4] 
   [smoker]    [junit4] Suite: org.apache.solr.util.hll.HLLUtilTest
   [smoker]    [junit4] Completed [572/575 (1!)] on J2 in 0.00s, 1 test, 1 skipped
   [smoker]    [junit4] 
   [smoker]    [junit4] Suite: org.apache.solr.util.hll.SparseHLLTest
   [smoker]    [junit4] Completed [573/575 (1!)] on J2 in 0.00s, 8 tests, 8 skipped
   [smoker]    [junit4] 
   [smoker]    [junit4] Suite: org.apache.solr.search.facet.TestJsonFacets
   [smoker]    [junit4] Completed [574/575 (1!)] on J1 in 10.90s, 7 tests
   [smoker]    [junit4] 
   [smoker]    [junit4] Suite: org.apache.solr.store.blockcache.BlockDirectoryTest
   [smoker]    [junit4] Completed [575/575 (1!)] on J0 in 8.68s, 4 tests
   [smoker]    [junit4] 
   [smoker]    [junit4] 
   [smoker]    [junit4] Tests with failures [seed: 19B007EF44910484]:
   [smoker]    [junit4]   - org.apache.solr.core.TestLazyCores (suite)
   [smoker]    [junit4] 
   [smoker]    [junit4] 
   [smoker]    [junit4] JVM J0:     1.01 ..   528.30 =   527.29s
   [smoker]    [junit4] JVM J1:     0.76 ..   527.14 =   526.38s
   [smoker]    [junit4] JVM J2:     1.01 ..   524.92 =   523.92s
   [smoker]    [junit4] Execution time total: 8 minutes 48 seconds
   [smoker]    [junit4] Tests summary: 575 suites (8 ignored), 2291 tests, 3 suite-level errors, 457 ignored (245 assumptions)
   [smoker] 
   [smoker] BUILD FAILED
   [smoker] /x1/jenkins/jenkins-slave/workspace/Lucene-Solr-SmokeRelease-trunk/lucene/build/smokeTestRelease/tmp/unpack/solr-6.0.0/solr/build.xml:233: The following error occurred while executing this line:
   [smoker] /x1/jenkins/jenkins-slave/workspace/Lucene-Solr-SmokeRelease-trunk/lucene/build/smokeTestRelease/tmp/unpack/solr-6.0.0/solr/common-build.xml:516: The following error occurred while executing this line:
   [smoker] /x1/jenkins/jenkins-slave/workspace/Lucene-Solr-SmokeRelease-trunk/lucene/build/smokeTestRelease/tmp/unpack/solr-6.0.0/lucene/common-build.xml:1424: The following error occurred while executing this line:
   [smoker] /x1/jenkins/jenkins-slave/workspace/Lucene-Solr-SmokeRelease-trunk/lucene/build/smokeTestRelease/tmp/unpack/solr-6.0.0/lucene/common-build.xml:981: There were test failures: 575 suites (8 ignored), 2291 tests, 3 suite-level errors, 457 ignored (245 assumptions) [seed: 19B007EF44910484]
   [smoker] 
   [smoker] Total time: 9 minutes 24 seconds
   [smoker] 
   [smoker] 
   [smoker] Traceback (most recent call last):
   [smoker]   File "/x1/jenkins/jenkins-slave/workspace/Lucene-Solr-SmokeRelease-trunk/dev-tools/scripts/smokeTestRelease.py", line 1427, in <module>
   [smoker]     main()
   [smoker]   File "/x1/jenkins/jenkins-slave/workspace/Lucene-Solr-SmokeRelease-trunk/dev-tools/scripts/smokeTestRelease.py", line 1372, in main
   [smoker]     smokeTest(c.java, c.url, c.revision, c.version, c.tmp_dir, c.is_signed, ' '.join(c.test_args))
   [smoker]   File "/x1/jenkins/jenkins-slave/workspace/Lucene-Solr-SmokeRelease-trunk/dev-tools/scripts/smokeTestRelease.py", line 1417, in smokeTest
   [smoker]     unpackAndVerify(java, 'solr', tmpDir, 'solr-%s-src.tgz' % version, svnRevision, version, testArgs, baseURL)
   [smoker]   File "/x1/jenkins/jenkins-slave/workspace/Lucene-Solr-SmokeRelease-trunk/dev-tools/scripts/smokeTestRelease.py", line 588, in unpackAndVerify
   [smoker]     verifyUnpacked(java, project, artifact, unpackPath, svnRevision, version, testArgs, tmpDir, baseURL)
   [smoker]   File "/x1/jenkins/jenkins-slave/workspace/Lucene-Solr-SmokeRelease-trunk/dev-tools/scripts/smokeTestRelease.py", line 692, in verifyUnpacked
   [smoker]     java.run_java8('ant clean test -Dtests.slow=false %s' % testArgs, '%s/test.log' % unpackPath)
   [smoker]   File "/x1/jenkins/jenkins-slave/workspace/Lucene-Solr-SmokeRelease-trunk/dev-tools/scripts/smokeTestRelease.py", line 1197, in run_java
   [smoker]     run('%s; %s' % (cmd_prefix, cmd), logfile)
   [smoker]   File "/x1/jenkins/jenkins-slave/workspace/Lucene-Solr-SmokeRelease-trunk/dev-tools/scripts/smokeTestRelease.py", line 513, in run
   [smoker]     raise RuntimeError('command "%s" failed; see log file %s' % (command, logPath))
   [smoker] RuntimeError: command "export JAVA_HOME="/home/jenkins/jenkins-slave/tools/hudson.model.JDK/latest1.8" PATH="/home/jenkins/jenkins-slave/tools/hudson.model.JDK/latest1.8/bin:$PATH" JAVACMD="/home/jenkins/jenkins-slave/tools/hudson.model.JDK/latest1.8/bin/java"; ant clean test -Dtests.slow=false -Dtests.slow=false" failed; see log file /x1/jenkins/jenkins-slave/workspace/Lucene-Solr-SmokeRelease-trunk/lucene/build/smokeTestRelease/tmp/unpack/solr-6.0.0/test.log

BUILD FAILED
/x1/jenkins/jenkins-slave/workspace/Lucene-Solr-SmokeRelease-trunk/build.xml:536: exec returned: 1

Total time: 53 minutes 6 seconds
Build step 'Invoke Ant' marked build as failure
Email was triggered for: Failure - Any
Sending email for trigger: Failure - Any



Mime
View raw message