lucene-dev mailing list archives

Site index · List index
Message view « Date » · « Thread »
Top « Date » · « Thread »
From Apache Jenkins Server <jenk...@builds.apache.org>
Subject [JENKINS] Lucene-Solr-NightlyTests-trunk - Build # 912 - Still Failing
Date Sat, 16 Jan 2016 03:36:20 GMT
Build: https://builds.apache.org/job/Lucene-Solr-NightlyTests-trunk/912/

1 tests failed.
FAILED:  org.apache.solr.handler.TestReplicationHandler.doTestReplicateAfterCoreReload

Error Message:
expected:<[{indexVersion=1452914081261,generation=2,filelist=[_mgx.cfe, _mgx.cfs, _mgx.si, _mj5.fdt, _mj5.fdx, _mj5.fnm, _mj5.nvd, _mj5.nvm, _mj5.si, _mj5_Lucene50_0.doc, _mj5_Lucene50_0.tim, _mj5_Lucene50_0.tip, _mj6.cfe, _mj6.cfs, _mj6.si, _mj7.fdt, _mj7.fdx, _mj7.fnm, _mj7.nvd, _mj7.nvm, _mj7.si, _mj7_Lucene50_0.doc, _mj7_Lucene50_0.tim, _mj7_Lucene50_0.tip, _mj8.fdt, _mj8.fdx, _mj8.fnm, _mj8.nvd, _mj8.nvm, _mj8.si, _mj8_Lucene50_0.doc, _mj8_Lucene50_0.tim, _mj8_Lucene50_0.tip, _mj9.fdt, _mj9.fdx, _mj9.fnm, _mj9.nvd, _mj9.nvm, _mj9.si, _mj9_Lucene50_0.doc, _mj9_Lucene50_0.tim, _mj9_Lucene50_0.tip, _mja.fdt, _mja.fdx, _mja.fnm, _mja.nvd, _mja.nvm, _mja.si, _mja_Lucene50_0.doc, _mja_Lucene50_0.tim, _mja_Lucene50_0.tip, _mjb.fdt, _mjb.fdx, _mjb.fnm, _mjb.nvd, _mjb.nvm, _mjb.si, _mjb_Lucene50_0.doc, _mjb_Lucene50_0.tim, _mjb_Lucene50_0.tip, _mjc.fdt, _mjc.fdx, _mjc.fnm, _mjc.nvd, _mjc.nvm, _mjc.si, _mjc_Lucene50_0.doc, _mjc_Lucene50_0.tim, _mjc_Lucene50_0.tip, _mjd.fdt, _mjd.fdx, _mjd.fnm, _mjd.nvd, _mjd.nvm, _mjd.si, _mjd_Lucene50_0.doc, _mjd_Lucene50_0.tim, _mjd_Lucene50_0.tip, _mje.fdt, _mje.fdx, _mje.fnm, _mje.nvd, _mje.nvm, _mje.si, _mje_Lucene50_0.doc, _mje_Lucene50_0.tim, _mje_Lucene50_0.tip, _mjf.fdt, _mjf.fdx, _mjf.fnm, _mjf.nvd, _mjf.nvm, _mjf.si, _mjf_Lucene50_0.doc, _mjf_Lucene50_0.tim, _mjf_Lucene50_0.tip, _mjg.fdt, _mjg.fdx, _mjg.fnm, _mjg.nvd, _mjg.nvm, _mjg.si, _mjg_Lucene50_0.doc, _mjg_Lucene50_0.tim, _mjg_Lucene50_0.tip, _mjh.fdt, _mjh.fdx, _mjh.fnm, _mjh.nvd, _mjh.nvm, _mjh.si, _mjh_Lucene50_0.doc, _mjh_Lucene50_0.tim, _mjh_Lucene50_0.tip, _mji.fdt, _mji.fdx, _mji.fnm, _mji.nvd, _mji.nvm, _mji.si, _mji_Lucene50_0.doc, _mji_Lucene50_0.tim, _mji_Lucene50_0.tip, _mjj.fdt, _mjj.fdx, _mjj.fnm, _mjj.nvd, _mjj.nvm, _mjj.si, _mjj_Lucene50_0.doc, _mjj_Lucene50_0.tim, _mjj_Lucene50_0.tip, _mjk.fdt, _mjk.fdx, _mjk.fnm, _mjk.nvd, _mjk.nvm, _mjk.si, _mjk_Lucene50_0.doc, _mjk_Lucene50_0.tim, _mjk_Lucene50_0.tip, _mjl.fdt, _mjl.fdx, _mjl.fnm, _mjl.nvd, _mjl.nvm, _mjl.si, _mjl_Lucene50_0.doc, _mjl_Lucene50_0.tim, _mjl_Lucene50_0.tip, _mjm.fdt, _mjm.fdx, _mjm.fnm, _mjm.nvd, _mjm.nvm, _mjm.si, _mjm_Lucene50_0.doc, _mjm_Lucene50_0.tim, _mjm_Lucene50_0.tip, _mjn.fdt, _mjn.fdx, _mjn.fnm, _mjn.nvd, _mjn.nvm, _mjn.si, _mjn_Lucene50_0.doc, _mjn_Lucene50_0.tim, _mjn_Lucene50_0.tip, _mjo.fdt, _mjo.fdx, _mjo.fnm, _mjo.nvd, _mjo.nvm, _mjo.si, _mjo_Lucene50_0.doc, _mjo_Lucene50_0.tim, _mjo_Lucene50_0.tip, _mjp.fdt, _mjp.fdx, _mjp.fnm, _mjp.nvd, _mjp.nvm, _mjp.si, _mjp_Lucene50_0.doc, _mjp_Lucene50_0.tim, _mjp_Lucene50_0.tip, _mjq.fdt, _mjq.fdx, _mjq.fnm, _mjq.nvd, _mjq.nvm, _mjq.si, _mjq_Lucene50_0.doc, _mjq_Lucene50_0.tim, _mjq_Lucene50_0.tip, _mjr.fdt, _mjr.fdx, _mjr.fnm, _mjr.nvd, _mjr.nvm, _mjr.si, _mjr_Lucene50_0.doc, _mjr_Lucene50_0.tim, _mjr_Lucene50_0.tip, _mjs.fdt, _mjs.fdx, _mjs.fnm, _mjs.nvd, _mjs.nvm, _mjs.si, _mjs_Lucene50_0.doc, _mjs_Lucene50_0.tim, _mjs_Lucene50_0.tip, _mjt.fdt, _mjt.fdx, _mjt.fnm, _mjt.nvd, _mjt.nvm, _mjt.si, _mjt_Lucene50_0.doc, _mjt_Lucene50_0.tim, _mjt_Lucene50_0.tip, _mju.fdt, _mju.fdx, _mju.fnm, _mju.nvd, _mju.nvm, _mju.si, _mju_Lucene50_0.doc, _mju_Lucene50_0.tim, _mju_Lucene50_0.tip, _mjv.fdt, _mjv.fdx, _mjv.fnm, _mjv.nvd, _mjv.nvm, _mjv.si, _mjv_Lucene50_0.doc, _mjv_Lucene50_0.tim, _mjv_Lucene50_0.tip, _mjw.fdt, _mjw.fdx, _mjw.fnm, _mjw.nvd, _mjw.nvm, _mjw.si, _mjw_Lucene50_0.doc, _mjw_Lucene50_0.tim, _mjw_Lucene50_0.tip, _mjx.fdt, _mjx.fdx, _mjx.fnm, _mjx.nvd, _mjx.nvm, _mjx.si, _mjx_Lucene50_0.doc, _mjx_Lucene50_0.tim, _mjx_Lucene50_0.tip, _mjy.fdt, _mjy.fdx, _mjy.fnm, _mjy.nvd, _mjy.nvm, _mjy.si, _mjy_Lucene50_0.doc, _mjy_Lucene50_0.tim, _mjy_Lucene50_0.tip, _mjz.fdt, _mjz.fdx, _mjz.fnm, _mjz.nvd, _mjz.nvm, _mjz.si, _mjz_Lucene50_0.doc, _mjz_Lucene50_0.tim, _mjz_Lucene50_0.tip, _mk0.fdt, _mk0.fdx, _mk0.fnm, _mk0.nvd, _mk0.nvm, _mk0.si, _mk0_Lucene50_0.doc, _mk0_Lucene50_0.tim, _mk0_Lucene50_0.tip, _mk1.fdt, _mk1.fdx, _mk1.fnm, _mk1.nvd, _mk1.nvm, _mk1.si, _mk1_Lucene50_0.doc, _mk1_Lucene50_0.tim, _mk1_Lucene50_0.tip, _mk2.fdt, _mk2.fdx, _mk2.fnm, _mk2.nvd, _mk2.nvm, _mk2.si, _mk2_Lucene50_0.doc, _mk2_Lucene50_0.tim, _mk2_Lucene50_0.tip, _mk3.fdt, _mk3.fdx, _mk3.fnm, _mk3.nvd, _mk3.nvm, _mk3.si, _mk3_Lucene50_0.doc, _mk3_Lucene50_0.tim, _mk3_Lucene50_0.tip, _mk4.fdt, _mk4.fdx, _mk4.fnm, _mk4.nvd, _mk4.nvm, _mk4.si, _mk4_Lucene50_0.doc, _mk4_Lucene50_0.tim, _mk4_Lucene50_0.tip, _mk5.fdt, _mk5.fdx, _mk5.fnm, _mk5.nvd, _mk5.nvm, _mk5.si, _mk5_Lucene50_0.doc, _mk5_Lucene50_0.tim, _mk5_Lucene50_0.tip, _mk6.fdt, _mk6.fdx, _mk6.fnm, _mk6.nvd, _mk6.nvm, _mk6.si, _mk6_Lucene50_0.doc, _mk6_Lucene50_0.tim, _mk6_Lucene50_0.tip, _mk7.fdt, _mk7.fdx, _mk7.fnm, _mk7.nvd, _mk7.nvm, _mk7.si, _mk7_Lucene50_0.doc, _mk7_Lucene50_0.tim, _mk7_Lucene50_0.tip, _mld.fdt, _mld.fdx, _mld.fnm, _mld.nvd, _mld.nvm, _mld.si, _mld_Lucene50_0.doc, _mld_Lucene50_0.tim, _mld_Lucene50_0.tip, _mle.cfe, _mle.cfs, _mle.si, _mlf.fdt, _mlf.fdx, _mlf.fnm, _mlf.nvd, _mlf.nvm, _mlf.si, _mlf_Lucene50_0.doc, _mlf_Lucene50_0.tim, _mlf_Lucene50_0.tip, _mlg.fdt, _mlg.fdx, _mlg.fnm, _mlg.nvd, _mlg.nvm, _mlg.si, _mlg_Lucene50_0.doc, _mlg_Lucene50_0.tim, _mlg_Lucene50_0.tip, _mlh.fdt, _mlh.fdx, _mlh.fnm, _mlh.nvd, _mlh.nvm, _mlh.si, _mlh_Lucene50_0.doc, _mlh_Lucene50_0.tim, _mlh_Lucene50_0.tip, _mli.fdt, _mli.fdx, _mli.fnm, _mli.nvd, _mli.nvm, _mli.si, _mli_Lucene50_0.doc, _mli_Lucene50_0.tim, _mli_Lucene50_0.tip, _mlj.fdt, _mlj.fdx, _mlj.fnm, _mlj.nvd, _mlj.nvm, _mlj.si, _mlj_Lucene50_0.doc, _mlj_Lucene50_0.tim, _mlj_Lucene50_0.tip, _mlk.fdt, _mlk.fdx, _mlk.fnm, _mlk.nvd, _mlk.nvm, _mlk.si, _mlk_Lucene50_0.doc, _mlk_Lucene50_0.tim, _mlk_Lucene50_0.tip, _mll.fdt, _mll.fdx, _mll.fnm, _mll.nvd, _mll.nvm, _mll.si, _mll_Lucene50_0.doc, _mll_Lucene50_0.tim, _mll_Lucene50_0.tip, _mlm.fdt, _mlm.fdx, _mlm.fnm, _mlm.nvd, _mlm.nvm, _mlm.si, _mlm_Lucene50_0.doc, _mlm_Lucene50_0.tim, _mlm_Lucene50_0.tip, _mln.fdt, _mln.fdx, _mln.fnm, _mln.nvd, _mln.nvm, _mln.si, _mln_Lucene50_0.doc, _mln_Lucene50_0.tim, _mln_Lucene50_0.tip, _mlo.fdt, _mlo.fdx, _mlo.fnm, _mlo.nvd, _mlo.nvm, _mlo.si, _mlo_Lucene50_0.doc, _mlo_Lucene50_0.tim, _mlo_Lucene50_0.tip, _mlp.fdt, _mlp.fdx, _mlp.fnm, _mlp.nvd, _mlp.nvm, _mlp.si, _mlp_Lucene50_0.doc, _mlp_Lucene50_0.tim, _mlp_Lucene50_0.tip, _mlq.fdt, _mlq.fdx, _mlq.fnm, _mlq.nvd, _mlq.nvm, _mlq.si, _mlq_Lucene50_0.doc, _mlq_Lucene50_0.tim, _mlq_Lucene50_0.tip, _mlr.fdt, _mlr.fdx, _mlr.fnm, _mlr.nvd, _mlr.nvm, _mlr.si, _mlr_Lucene50_0.doc, _mlr_Lucene50_0.tim, _mlr_Lucene50_0.tip, _mls.fdt, _mls.fdx, _mls.fnm, _mls.nvd, _mls.nvm, _mls.si, _mls_Lucene50_0.doc, _mls_Lucene50_0.tim, _mls_Lucene50_0.tip, _mlt.fdt, _mlt.fdx, _mlt.fnm, _mlt.nvd, _mlt.nvm, _mlt.si, _mlt_Lucene50_0.doc, _mlt_Lucene50_0.tim, _mlt_Lucene50_0.tip, _mlu.fdt, _mlu.fdx, _mlu.fnm, _mlu.nvd, _mlu.nvm, _mlu.si, _mlu_Lucene50_0.doc, _mlu_Lucene50_0.tim, _mlu_Lucene50_0.tip, _mlv.fdt, _mlv.fdx, _mlv.fnm, _mlv.nvd, _mlv.nvm, _mlv.si, _mlv_Lucene50_0.doc, _mlv_Lucene50_0.tim, _mlv_Lucene50_0.tip, _mlw.fdt, _mlw.fdx, _mlw.fnm, _mlw.nvd, _mlw.nvm, _mlw.si, _mlw_Lucene50_0.doc, _mlw_Lucene50_0.tim, _mlw_Lucene50_0.tip, _mlx.fdt, _mlx.fdx, _mlx.fnm, _mlx.nvd, _mlx.nvm, _mlx.si, _mlx_Lucene50_0.doc, _mlx_Lucene50_0.tim, _mlx_Lucene50_0.tip, _mly.fdt, _mly.fdx, _mly.fnm, _mly.nvd, _mly.nvm, _mly.si, _mly_Lucene50_0.doc, _mly_Lucene50_0.tim, _mly_Lucene50_0.tip, _mlz.fdt, _mlz.fdx, _mlz.fnm, _mlz.nvd, _mlz.nvm, _mlz.si, _mlz_Lucene50_0.doc, _mlz_Lucene50_0.tim, _mlz_Lucene50_0.tip, segments_2]}]> but was:<[{indexVersion=1452914081261,generation=2,filelist=[_mgx.cfe, _mgx.cfs, _mgx.si, _mj5.fdt, _mj5.fdx, _mj5.fnm, _mj5.nvd, _mj5.nvm, _mj5.si, _mj5_Lucene50_0.doc, _mj5_Lucene50_0.tim, _mj5_Lucene50_0.tip, _mj6.cfe, _mj6.cfs, _mj6.si, _mj7.fdt, _mj7.fdx, _mj7.fnm, _mj7.nvd, _mj7.nvm, _mj7.si, _mj7_Lucene50_0.doc, _mj7_Lucene50_0.tim, _mj7_Lucene50_0.tip, _mj8.fdt, _mj8.fdx, _mj8.fnm, _mj8.nvd, _mj8.nvm, _mj8.si, _mj8_Lucene50_0.doc, _mj8_Lucene50_0.tim, _mj8_Lucene50_0.tip, _mj9.fdt, _mj9.fdx, _mj9.fnm, _mj9.nvd, _mj9.nvm, _mj9.si, _mj9_Lucene50_0.doc, _mj9_Lucene50_0.tim, _mj9_Lucene50_0.tip, _mja.fdt, _mja.fdx, _mja.fnm, _mja.nvd, _mja.nvm, _mja.si, _mja_Lucene50_0.doc, _mja_Lucene50_0.tim, _mja_Lucene50_0.tip, _mjb.fdt, _mjb.fdx, _mjb.fnm, _mjb.nvd, _mjb.nvm, _mjb.si, _mjb_Lucene50_0.doc, _mjb_Lucene50_0.tim, _mjb_Lucene50_0.tip, _mjc.fdt, _mjc.fdx, _mjc.fnm, _mjc.nvd, _mjc.nvm, _mjc.si, _mjc_Lucene50_0.doc, _mjc_Lucene50_0.tim, _mjc_Lucene50_0.tip, _mjd.fdt, _mjd.fdx, _mjd.fnm, _mjd.nvd, _mjd.nvm, _mjd.si, _mjd_Lucene50_0.doc, _mjd_Lucene50_0.tim, _mjd_Lucene50_0.tip, _mje.fdt, _mje.fdx, _mje.fnm, _mje.nvd, _mje.nvm, _mje.si, _mje_Lucene50_0.doc, _mje_Lucene50_0.tim, _mje_Lucene50_0.tip, _mjf.fdt, _mjf.fdx, _mjf.fnm, _mjf.nvd, _mjf.nvm, _mjf.si, _mjf_Lucene50_0.doc, _mjf_Lucene50_0.tim, _mjf_Lucene50_0.tip, _mjg.fdt, _mjg.fdx, _mjg.fnm, _mjg.nvd, _mjg.nvm, _mjg.si, _mjg_Lucene50_0.doc, _mjg_Lucene50_0.tim, _mjg_Lucene50_0.tip, _mjh.fdt, _mjh.fdx, _mjh.fnm, _mjh.nvd, _mjh.nvm, _mjh.si, _mjh_Lucene50_0.doc, _mjh_Lucene50_0.tim, _mjh_Lucene50_0.tip, _mji.fdt, _mji.fdx, _mji.fnm, _mji.nvd, _mji.nvm, _mji.si, _mji_Lucene50_0.doc, _mji_Lucene50_0.tim, _mji_Lucene50_0.tip, _mjj.fdt, _mjj.fdx, _mjj.fnm, _mjj.nvd, _mjj.nvm, _mjj.si, _mjj_Lucene50_0.doc, _mjj_Lucene50_0.tim, _mjj_Lucene50_0.tip, _mjk.fdt, _mjk.fdx, _mjk.fnm, _mjk.nvd, _mjk.nvm, _mjk.si, _mjk_Lucene50_0.doc, _mjk_Lucene50_0.tim, _mjk_Lucene50_0.tip, _mjl.fdt, _mjl.fdx, _mjl.fnm, _mjl.nvd, _mjl.nvm, _mjl.si, _mjl_Lucene50_0.doc, _mjl_Lucene50_0.tim, _mjl_Lucene50_0.tip, _mjm.fdt, _mjm.fdx, _mjm.fnm, _mjm.nvd, _mjm.nvm, _mjm.si, _mjm_Lucene50_0.doc, _mjm_Lucene50_0.tim, _mjm_Lucene50_0.tip, _mjn.fdt, _mjn.fdx, _mjn.fnm, _mjn.nvd, _mjn.nvm, _mjn.si, _mjn_Lucene50_0.doc, _mjn_Lucene50_0.tim, _mjn_Lucene50_0.tip, _mjo.fdt, _mjo.fdx, _mjo.fnm, _mjo.nvd, _mjo.nvm, _mjo.si, _mjo_Lucene50_0.doc, _mjo_Lucene50_0.tim, _mjo_Lucene50_0.tip, _mjp.fdt, _mjp.fdx, _mjp.fnm, _mjp.nvd, _mjp.nvm, _mjp.si, _mjp_Lucene50_0.doc, _mjp_Lucene50_0.tim, _mjp_Lucene50_0.tip, _mjq.fdt, _mjq.fdx, _mjq.fnm, _mjq.nvd, _mjq.nvm, _mjq.si, _mjq_Lucene50_0.doc, _mjq_Lucene50_0.tim, _mjq_Lucene50_0.tip, _mjr.fdt, _mjr.fdx, _mjr.fnm, _mjr.nvd, _mjr.nvm, _mjr.si, _mjr_Lucene50_0.doc, _mjr_Lucene50_0.tim, _mjr_Lucene50_0.tip, _mjs.fdt, _mjs.fdx, _mjs.fnm, _mjs.nvd, _mjs.nvm, _mjs.si, _mjs_Lucene50_0.doc, _mjs_Lucene50_0.tim, _mjs_Lucene50_0.tip, _mjt.fdt, _mjt.fdx, _mjt.fnm, _mjt.nvd, _mjt.nvm, _mjt.si, _mjt_Lucene50_0.doc, _mjt_Lucene50_0.tim, _mjt_Lucene50_0.tip, _mju.fdt, _mju.fdx, _mju.fnm, _mju.nvd, _mju.nvm, _mju.si, _mju_Lucene50_0.doc, _mju_Lucene50_0.tim, _mju_Lucene50_0.tip, _mjv.fdt, _mjv.fdx, _mjv.fnm, _mjv.nvd, _mjv.nvm, _mjv.si, _mjv_Lucene50_0.doc, _mjv_Lucene50_0.tim, _mjv_Lucene50_0.tip, _mjw.fdt, _mjw.fdx, _mjw.fnm, _mjw.nvd, _mjw.nvm, _mjw.si, _mjw_Lucene50_0.doc, _mjw_Lucene50_0.tim, _mjw_Lucene50_0.tip, _mjx.fdt, _mjx.fdx, _mjx.fnm, _mjx.nvd, _mjx.nvm, _mjx.si, _mjx_Lucene50_0.doc, _mjx_Lucene50_0.tim, _mjx_Lucene50_0.tip, _mjy.fdt, _mjy.fdx, _mjy.fnm, _mjy.nvd, _mjy.nvm, _mjy.si, _mjy_Lucene50_0.doc, _mjy_Lucene50_0.tim, _mjy_Lucene50_0.tip, _mjz.fdt, _mjz.fdx, _mjz.fnm, _mjz.nvd, _mjz.nvm, _mjz.si, _mjz_Lucene50_0.doc, _mjz_Lucene50_0.tim, _mjz_Lucene50_0.tip, _mk0.fdt, _mk0.fdx, _mk0.fnm, _mk0.nvd, _mk0.nvm, _mk0.si, _mk0_Lucene50_0.doc, _mk0_Lucene50_0.tim, _mk0_Lucene50_0.tip, _mk1.fdt, _mk1.fdx, _mk1.fnm, _mk1.nvd, _mk1.nvm, _mk1.si, _mk1_Lucene50_0.doc, _mk1_Lucene50_0.tim, _mk1_Lucene50_0.tip, _mk2.fdt, _mk2.fdx, _mk2.fnm, _mk2.nvd, _mk2.nvm, _mk2.si, _mk2_Lucene50_0.doc, _mk2_Lucene50_0.tim, _mk2_Lucene50_0.tip, _mk3.fdt, _mk3.fdx, _mk3.fnm, _mk3.nvd, _mk3.nvm, _mk3.si, _mk3_Lucene50_0.doc, _mk3_Lucene50_0.tim, _mk3_Lucene50_0.tip, _mk4.fdt, _mk4.fdx, _mk4.fnm, _mk4.nvd, _mk4.nvm, _mk4.si, _mk4_Lucene50_0.doc, _mk4_Lucene50_0.tim, _mk4_Lucene50_0.tip, _mk5.fdt, _mk5.fdx, _mk5.fnm, _mk5.nvd, _mk5.nvm, _mk5.si, _mk5_Lucene50_0.doc, _mk5_Lucene50_0.tim, _mk5_Lucene50_0.tip, _mk6.fdt, _mk6.fdx, _mk6.fnm, _mk6.nvd, _mk6.nvm, _mk6.si, _mk6_Lucene50_0.doc, _mk6_Lucene50_0.tim, _mk6_Lucene50_0.tip, _mk7.fdt, _mk7.fdx, _mk7.fnm, _mk7.nvd, _mk7.nvm, _mk7.si, _mk7_Lucene50_0.doc, _mk7_Lucene50_0.tim, _mk7_Lucene50_0.tip, _mld.fdt, _mld.fdx, _mld.fnm, _mld.nvd, _mld.nvm, _mld.si, _mld_Lucene50_0.doc, _mld_Lucene50_0.tim, _mld_Lucene50_0.tip, _mle.cfe, _mle.cfs, _mle.si, _mlf.fdt, _mlf.fdx, _mlf.fnm, _mlf.nvd, _mlf.nvm, _mlf.si, _mlf_Lucene50_0.doc, _mlf_Lucene50_0.tim, _mlf_Lucene50_0.tip, _mlg.fdt, _mlg.fdx, _mlg.fnm, _mlg.nvd, _mlg.nvm, _mlg.si, _mlg_Lucene50_0.doc, _mlg_Lucene50_0.tim, _mlg_Lucene50_0.tip, _mlh.fdt, _mlh.fdx, _mlh.fnm, _mlh.nvd, _mlh.nvm, _mlh.si, _mlh_Lucene50_0.doc, _mlh_Lucene50_0.tim, _mlh_Lucene50_0.tip, _mli.fdt, _mli.fdx, _mli.fnm, _mli.nvd, _mli.nvm, _mli.si, _mli_Lucene50_0.doc, _mli_Lucene50_0.tim, _mli_Lucene50_0.tip, _mlj.fdt, _mlj.fdx, _mlj.fnm, _mlj.nvd, _mlj.nvm, _mlj.si, _mlj_Lucene50_0.doc, _mlj_Lucene50_0.tim, _mlj_Lucene50_0.tip, _mlk.fdt, _mlk.fdx, _mlk.fnm, _mlk.nvd, _mlk.nvm, _mlk.si, _mlk_Lucene50_0.doc, _mlk_Lucene50_0.tim, _mlk_Lucene50_0.tip, _mll.fdt, _mll.fdx, _mll.fnm, _mll.nvd, _mll.nvm, _mll.si, _mll_Lucene50_0.doc, _mll_Lucene50_0.tim, _mll_Lucene50_0.tip, _mlm.fdt, _mlm.fdx, _mlm.fnm, _mlm.nvd, _mlm.nvm, _mlm.si, _mlm_Lucene50_0.doc, _mlm_Lucene50_0.tim, _mlm_Lucene50_0.tip, _mln.fdt, _mln.fdx, _mln.fnm, _mln.nvd, _mln.nvm, _mln.si, _mln_Lucene50_0.doc, _mln_Lucene50_0.tim, _mln_Lucene50_0.tip, _mlo.fdt, _mlo.fdx, _mlo.fnm, _mlo.nvd, _mlo.nvm, _mlo.si, _mlo_Lucene50_0.doc, _mlo_Lucene50_0.tim, _mlo_Lucene50_0.tip, _mlp.fdt, _mlp.fdx, _mlp.fnm, _mlp.nvd, _mlp.nvm, _mlp.si, _mlp_Lucene50_0.doc, _mlp_Lucene50_0.tim, _mlp_Lucene50_0.tip, _mlq.fdt, _mlq.fdx, _mlq.fnm, _mlq.nvd, _mlq.nvm, _mlq.si, _mlq_Lucene50_0.doc, _mlq_Lucene50_0.tim, _mlq_Lucene50_0.tip, _mlr.fdt, _mlr.fdx, _mlr.fnm, _mlr.nvd, _mlr.nvm, _mlr.si, _mlr_Lucene50_0.doc, _mlr_Lucene50_0.tim, _mlr_Lucene50_0.tip, _mls.fdt, _mls.fdx, _mls.fnm, _mls.nvd, _mls.nvm, _mls.si, _mls_Lucene50_0.doc, _mls_Lucene50_0.tim, _mls_Lucene50_0.tip, _mlt.fdt, _mlt.fdx, _mlt.fnm, _mlt.nvd, _mlt.nvm, _mlt.si, _mlt_Lucene50_0.doc, _mlt_Lucene50_0.tim, _mlt_Lucene50_0.tip, _mlu.fdt, _mlu.fdx, _mlu.fnm, _mlu.nvd, _mlu.nvm, _mlu.si, _mlu_Lucene50_0.doc, _mlu_Lucene50_0.tim, _mlu_Lucene50_0.tip, _mlv.fdt, _mlv.fdx, _mlv.fnm, _mlv.nvd, _mlv.nvm, _mlv.si, _mlv_Lucene50_0.doc, _mlv_Lucene50_0.tim, _mlv_Lucene50_0.tip, _mlw.fdt, _mlw.fdx, _mlw.fnm, _mlw.nvd, _mlw.nvm, _mlw.si, _mlw_Lucene50_0.doc, _mlw_Lucene50_0.tim, _mlw_Lucene50_0.tip, _mlx.fdt, _mlx.fdx, _mlx.fnm, _mlx.nvd, _mlx.nvm, _mlx.si, _mlx_Lucene50_0.doc, _mlx_Lucene50_0.tim, _mlx_Lucene50_0.tip, _mly.fdt, _mly.fdx, _mly.fnm, _mly.nvd, _mly.nvm, _mly.si, _mly_Lucene50_0.doc, _mly_Lucene50_0.tim, _mly_Lucene50_0.tip, _mlz.fdt, _mlz.fdx, _mlz.fnm, _mlz.nvd, _mlz.nvm, _mlz.si, _mlz_Lucene50_0.doc, _mlz_Lucene50_0.tim, _mlz_Lucene50_0.tip, segments_2]}, {indexVersion=1452914081261,generation=3,filelist=[_mk9.cfe, _mk9.cfs, _mk9.si, _mld.fdt, _mld.fdx, _mld.fnm, _mld.nvd, _mld.nvm, _mld.si, _mld_Lucene50_0.doc, _mld_Lucene50_0.tim, _mld_Lucene50_0.tip, _mle.cfe, _mle.cfs, _mle.si, _mlf.fdt, _mlf.fdx, _mlf.fnm, _mlf.nvd, _mlf.nvm, _mlf.si, _mlf_Lucene50_0.doc, _mlf_Lucene50_0.tim, _mlf_Lucene50_0.tip, _mlg.fdt, _mlg.fdx, _mlg.fnm, _mlg.nvd, _mlg.nvm, _mlg.si, _mlg_Lucene50_0.doc, _mlg_Lucene50_0.tim, _mlg_Lucene50_0.tip, _mlh.fdt, _mlh.fdx, _mlh.fnm, _mlh.nvd, _mlh.nvm, _mlh.si, _mlh_Lucene50_0.doc, _mlh_Lucene50_0.tim, _mlh_Lucene50_0.tip, _mli.fdt, _mli.fdx, _mli.fnm, _mli.nvd, _mli.nvm, _mli.si, _mli_Lucene50_0.doc, _mli_Lucene50_0.tim, _mli_Lucene50_0.tip, _mlj.fdt, _mlj.fdx, _mlj.fnm, _mlj.nvd, _mlj.nvm, _mlj.si, _mlj_Lucene50_0.doc, _mlj_Lucene50_0.tim, _mlj_Lucene50_0.tip, _mlk.fdt, _mlk.fdx, _mlk.fnm, _mlk.nvd, _mlk.nvm, _mlk.si, _mlk_Lucene50_0.doc, _mlk_Lucene50_0.tim, _mlk_Lucene50_0.tip, _mll.fdt, _mll.fdx, _mll.fnm, _mll.nvd, _mll.nvm, _mll.si, _mll_Lucene50_0.doc, _mll_Lucene50_0.tim, _mll_Lucene50_0.tip, _mlm.fdt, _mlm.fdx, _mlm.fnm, _mlm.nvd, _mlm.nvm, _mlm.si, _mlm_Lucene50_0.doc, _mlm_Lucene50_0.tim, _mlm_Lucene50_0.tip, _mln.fdt, _mln.fdx, _mln.fnm, _mln.nvd, _mln.nvm, _mln.si, _mln_Lucene50_0.doc, _mln_Lucene50_0.tim, _mln_Lucene50_0.tip, _mlo.fdt, _mlo.fdx, _mlo.fnm, _mlo.nvd, _mlo.nvm, _mlo.si, _mlo_Lucene50_0.doc, _mlo_Lucene50_0.tim, _mlo_Lucene50_0.tip, _mlp.fdt, _mlp.fdx, _mlp.fnm, _mlp.nvd, _mlp.nvm, _mlp.si, _mlp_Lucene50_0.doc, _mlp_Lucene50_0.tim, _mlp_Lucene50_0.tip, _mlq.fdt, _mlq.fdx, _mlq.fnm, _mlq.nvd, _mlq.nvm, _mlq.si, _mlq_Lucene50_0.doc, _mlq_Lucene50_0.tim, _mlq_Lucene50_0.tip, _mlr.fdt, _mlr.fdx, _mlr.fnm, _mlr.nvd, _mlr.nvm, _mlr.si, _mlr_Lucene50_0.doc, _mlr_Lucene50_0.tim, _mlr_Lucene50_0.tip, _mls.fdt, _mls.fdx, _mls.fnm, _mls.nvd, _mls.nvm, _mls.si, _mls_Lucene50_0.doc, _mls_Lucene50_0.tim, _mls_Lucene50_0.tip, _mlt.fdt, _mlt.fdx, _mlt.fnm, _mlt.nvd, _mlt.nvm, _mlt.si, _mlt_Lucene50_0.doc, _mlt_Lucene50_0.tim, _mlt_Lucene50_0.tip, _mlu.fdt, _mlu.fdx, _mlu.fnm, _mlu.nvd, _mlu.nvm, _mlu.si, _mlu_Lucene50_0.doc, _mlu_Lucene50_0.tim, _mlu_Lucene50_0.tip, _mlv.fdt, _mlv.fdx, _mlv.fnm, _mlv.nvd, _mlv.nvm, _mlv.si, _mlv_Lucene50_0.doc, _mlv_Lucene50_0.tim, _mlv_Lucene50_0.tip, _mlw.fdt, _mlw.fdx, _mlw.fnm, _mlw.nvd, _mlw.nvm, _mlw.si, _mlw_Lucene50_0.doc, _mlw_Lucene50_0.tim, _mlw_Lucene50_0.tip, _mlx.fdt, _mlx.fdx, _mlx.fnm, _mlx.nvd, _mlx.nvm, _mlx.si, _mlx_Lucene50_0.doc, _mlx_Lucene50_0.tim, _mlx_Lucene50_0.tip, _mly.fdt, _mly.fdx, _mly.fnm, _mly.nvd, _mly.nvm, _mly.si, _mly_Lucene50_0.doc, _mly_Lucene50_0.tim, _mly_Lucene50_0.tip, _mlz.fdt, _mlz.fdx, _mlz.fnm, _mlz.nvd, _mlz.nvm, _mlz.si, _mlz_Lucene50_0.doc, _mlz_Lucene50_0.tim, _mlz_Lucene50_0.tip, segments_3]}]>

Stack Trace:
java.lang.AssertionError: expected:<[{indexVersion=1452914081261,generation=2,filelist=[_mgx.cfe, _mgx.cfs, _mgx.si, _mj5.fdt, _mj5.fdx, _mj5.fnm, _mj5.nvd, _mj5.nvm, _mj5.si, _mj5_Lucene50_0.doc, _mj5_Lucene50_0.tim, _mj5_Lucene50_0.tip, _mj6.cfe, _mj6.cfs, _mj6.si, _mj7.fdt, _mj7.fdx, _mj7.fnm, _mj7.nvd, _mj7.nvm, _mj7.si, _mj7_Lucene50_0.doc, _mj7_Lucene50_0.tim, _mj7_Lucene50_0.tip, _mj8.fdt, _mj8.fdx, _mj8.fnm, _mj8.nvd, _mj8.nvm, _mj8.si, _mj8_Lucene50_0.doc, _mj8_Lucene50_0.tim, _mj8_Lucene50_0.tip, _mj9.fdt, _mj9.fdx, _mj9.fnm, _mj9.nvd, _mj9.nvm, _mj9.si, _mj9_Lucene50_0.doc, _mj9_Lucene50_0.tim, _mj9_Lucene50_0.tip, _mja.fdt, _mja.fdx, _mja.fnm, _mja.nvd, _mja.nvm, _mja.si, _mja_Lucene50_0.doc, _mja_Lucene50_0.tim, _mja_Lucene50_0.tip, _mjb.fdt, _mjb.fdx, _mjb.fnm, _mjb.nvd, _mjb.nvm, _mjb.si, _mjb_Lucene50_0.doc, _mjb_Lucene50_0.tim, _mjb_Lucene50_0.tip, _mjc.fdt, _mjc.fdx, _mjc.fnm, _mjc.nvd, _mjc.nvm, _mjc.si, _mjc_Lucene50_0.doc, _mjc_Lucene50_0.tim, _mjc_Lucene50_0.tip, _mjd.fdt, _mjd.fdx, _mjd.fnm, _mjd.nvd, _mjd.nvm, _mjd.si, _mjd_Lucene50_0.doc, _mjd_Lucene50_0.tim, _mjd_Lucene50_0.tip, _mje.fdt, _mje.fdx, _mje.fnm, _mje.nvd, _mje.nvm, _mje.si, _mje_Lucene50_0.doc, _mje_Lucene50_0.tim, _mje_Lucene50_0.tip, _mjf.fdt, _mjf.fdx, _mjf.fnm, _mjf.nvd, _mjf.nvm, _mjf.si, _mjf_Lucene50_0.doc, _mjf_Lucene50_0.tim, _mjf_Lucene50_0.tip, _mjg.fdt, _mjg.fdx, _mjg.fnm, _mjg.nvd, _mjg.nvm, _mjg.si, _mjg_Lucene50_0.doc, _mjg_Lucene50_0.tim, _mjg_Lucene50_0.tip, _mjh.fdt, _mjh.fdx, _mjh.fnm, _mjh.nvd, _mjh.nvm, _mjh.si, _mjh_Lucene50_0.doc, _mjh_Lucene50_0.tim, _mjh_Lucene50_0.tip, _mji.fdt, _mji.fdx, _mji.fnm, _mji.nvd, _mji.nvm, _mji.si, _mji_Lucene50_0.doc, _mji_Lucene50_0.tim, _mji_Lucene50_0.tip, _mjj.fdt, _mjj.fdx, _mjj.fnm, _mjj.nvd, _mjj.nvm, _mjj.si, _mjj_Lucene50_0.doc, _mjj_Lucene50_0.tim, _mjj_Lucene50_0.tip, _mjk.fdt, _mjk.fdx, _mjk.fnm, _mjk.nvd, _mjk.nvm, _mjk.si, _mjk_Lucene50_0.doc, _mjk_Lucene50_0.tim, _mjk_Lucene50_0.tip, _mjl.fdt, _mjl.fdx, _mjl.fnm, _mjl.nvd, _mjl.nvm, _mjl.si, _mjl_Lucene50_0.doc, _mjl_Lucene50_0.tim, _mjl_Lucene50_0.tip, _mjm.fdt, _mjm.fdx, _mjm.fnm, _mjm.nvd, _mjm.nvm, _mjm.si, _mjm_Lucene50_0.doc, _mjm_Lucene50_0.tim, _mjm_Lucene50_0.tip, _mjn.fdt, _mjn.fdx, _mjn.fnm, _mjn.nvd, _mjn.nvm, _mjn.si, _mjn_Lucene50_0.doc, _mjn_Lucene50_0.tim, _mjn_Lucene50_0.tip, _mjo.fdt, _mjo.fdx, _mjo.fnm, _mjo.nvd, _mjo.nvm, _mjo.si, _mjo_Lucene50_0.doc, _mjo_Lucene50_0.tim, _mjo_Lucene50_0.tip, _mjp.fdt, _mjp.fdx, _mjp.fnm, _mjp.nvd, _mjp.nvm, _mjp.si, _mjp_Lucene50_0.doc, _mjp_Lucene50_0.tim, _mjp_Lucene50_0.tip, _mjq.fdt, _mjq.fdx, _mjq.fnm, _mjq.nvd, _mjq.nvm, _mjq.si, _mjq_Lucene50_0.doc, _mjq_Lucene50_0.tim, _mjq_Lucene50_0.tip, _mjr.fdt, _mjr.fdx, _mjr.fnm, _mjr.nvd, _mjr.nvm, _mjr.si, _mjr_Lucene50_0.doc, _mjr_Lucene50_0.tim, _mjr_Lucene50_0.tip, _mjs.fdt, _mjs.fdx, _mjs.fnm, _mjs.nvd, _mjs.nvm, _mjs.si, _mjs_Lucene50_0.doc, _mjs_Lucene50_0.tim, _mjs_Lucene50_0.tip, _mjt.fdt, _mjt.fdx, _mjt.fnm, _mjt.nvd, _mjt.nvm, _mjt.si, _mjt_Lucene50_0.doc, _mjt_Lucene50_0.tim, _mjt_Lucene50_0.tip, _mju.fdt, _mju.fdx, _mju.fnm, _mju.nvd, _mju.nvm, _mju.si, _mju_Lucene50_0.doc, _mju_Lucene50_0.tim, _mju_Lucene50_0.tip, _mjv.fdt, _mjv.fdx, _mjv.fnm, _mjv.nvd, _mjv.nvm, _mjv.si, _mjv_Lucene50_0.doc, _mjv_Lucene50_0.tim, _mjv_Lucene50_0.tip, _mjw.fdt, _mjw.fdx, _mjw.fnm, _mjw.nvd, _mjw.nvm, _mjw.si, _mjw_Lucene50_0.doc, _mjw_Lucene50_0.tim, _mjw_Lucene50_0.tip, _mjx.fdt, _mjx.fdx, _mjx.fnm, _mjx.nvd, _mjx.nvm, _mjx.si, _mjx_Lucene50_0.doc, _mjx_Lucene50_0.tim, _mjx_Lucene50_0.tip, _mjy.fdt, _mjy.fdx, _mjy.fnm, _mjy.nvd, _mjy.nvm, _mjy.si, _mjy_Lucene50_0.doc, _mjy_Lucene50_0.tim, _mjy_Lucene50_0.tip, _mjz.fdt, _mjz.fdx, _mjz.fnm, _mjz.nvd, _mjz.nvm, _mjz.si, _mjz_Lucene50_0.doc, _mjz_Lucene50_0.tim, _mjz_Lucene50_0.tip, _mk0.fdt, _mk0.fdx, _mk0.fnm, _mk0.nvd, _mk0.nvm, _mk0.si, _mk0_Lucene50_0.doc, _mk0_Lucene50_0.tim, _mk0_Lucene50_0.tip, _mk1.fdt, _mk1.fdx, _mk1.fnm, _mk1.nvd, _mk1.nvm, _mk1.si, _mk1_Lucene50_0.doc, _mk1_Lucene50_0.tim, _mk1_Lucene50_0.tip, _mk2.fdt, _mk2.fdx, _mk2.fnm, _mk2.nvd, _mk2.nvm, _mk2.si, _mk2_Lucene50_0.doc, _mk2_Lucene50_0.tim, _mk2_Lucene50_0.tip, _mk3.fdt, _mk3.fdx, _mk3.fnm, _mk3.nvd, _mk3.nvm, _mk3.si, _mk3_Lucene50_0.doc, _mk3_Lucene50_0.tim, _mk3_Lucene50_0.tip, _mk4.fdt, _mk4.fdx, _mk4.fnm, _mk4.nvd, _mk4.nvm, _mk4.si, _mk4_Lucene50_0.doc, _mk4_Lucene50_0.tim, _mk4_Lucene50_0.tip, _mk5.fdt, _mk5.fdx, _mk5.fnm, _mk5.nvd, _mk5.nvm, _mk5.si, _mk5_Lucene50_0.doc, _mk5_Lucene50_0.tim, _mk5_Lucene50_0.tip, _mk6.fdt, _mk6.fdx, _mk6.fnm, _mk6.nvd, _mk6.nvm, _mk6.si, _mk6_Lucene50_0.doc, _mk6_Lucene50_0.tim, _mk6_Lucene50_0.tip, _mk7.fdt, _mk7.fdx, _mk7.fnm, _mk7.nvd, _mk7.nvm, _mk7.si, _mk7_Lucene50_0.doc, _mk7_Lucene50_0.tim, _mk7_Lucene50_0.tip, _mld.fdt, _mld.fdx, _mld.fnm, _mld.nvd, _mld.nvm, _mld.si, _mld_Lucene50_0.doc, _mld_Lucene50_0.tim, _mld_Lucene50_0.tip, _mle.cfe, _mle.cfs, _mle.si, _mlf.fdt, _mlf.fdx, _mlf.fnm, _mlf.nvd, _mlf.nvm, _mlf.si, _mlf_Lucene50_0.doc, _mlf_Lucene50_0.tim, _mlf_Lucene50_0.tip, _mlg.fdt, _mlg.fdx, _mlg.fnm, _mlg.nvd, _mlg.nvm, _mlg.si, _mlg_Lucene50_0.doc, _mlg_Lucene50_0.tim, _mlg_Lucene50_0.tip, _mlh.fdt, _mlh.fdx, _mlh.fnm, _mlh.nvd, _mlh.nvm, _mlh.si, _mlh_Lucene50_0.doc, _mlh_Lucene50_0.tim, _mlh_Lucene50_0.tip, _mli.fdt, _mli.fdx, _mli.fnm, _mli.nvd, _mli.nvm, _mli.si, _mli_Lucene50_0.doc, _mli_Lucene50_0.tim, _mli_Lucene50_0.tip, _mlj.fdt, _mlj.fdx, _mlj.fnm, _mlj.nvd, _mlj.nvm, _mlj.si, _mlj_Lucene50_0.doc, _mlj_Lucene50_0.tim, _mlj_Lucene50_0.tip, _mlk.fdt, _mlk.fdx, _mlk.fnm, _mlk.nvd, _mlk.nvm, _mlk.si, _mlk_Lucene50_0.doc, _mlk_Lucene50_0.tim, _mlk_Lucene50_0.tip, _mll.fdt, _mll.fdx, _mll.fnm, _mll.nvd, _mll.nvm, _mll.si, _mll_Lucene50_0.doc, _mll_Lucene50_0.tim, _mll_Lucene50_0.tip, _mlm.fdt, _mlm.fdx, _mlm.fnm, _mlm.nvd, _mlm.nvm, _mlm.si, _mlm_Lucene50_0.doc, _mlm_Lucene50_0.tim, _mlm_Lucene50_0.tip, _mln.fdt, _mln.fdx, _mln.fnm, _mln.nvd, _mln.nvm, _mln.si, _mln_Lucene50_0.doc, _mln_Lucene50_0.tim, _mln_Lucene50_0.tip, _mlo.fdt, _mlo.fdx, _mlo.fnm, _mlo.nvd, _mlo.nvm, _mlo.si, _mlo_Lucene50_0.doc, _mlo_Lucene50_0.tim, _mlo_Lucene50_0.tip, _mlp.fdt, _mlp.fdx, _mlp.fnm, _mlp.nvd, _mlp.nvm, _mlp.si, _mlp_Lucene50_0.doc, _mlp_Lucene50_0.tim, _mlp_Lucene50_0.tip, _mlq.fdt, _mlq.fdx, _mlq.fnm, _mlq.nvd, _mlq.nvm, _mlq.si, _mlq_Lucene50_0.doc, _mlq_Lucene50_0.tim, _mlq_Lucene50_0.tip, _mlr.fdt, _mlr.fdx, _mlr.fnm, _mlr.nvd, _mlr.nvm, _mlr.si, _mlr_Lucene50_0.doc, _mlr_Lucene50_0.tim, _mlr_Lucene50_0.tip, _mls.fdt, _mls.fdx, _mls.fnm, _mls.nvd, _mls.nvm, _mls.si, _mls_Lucene50_0.doc, _mls_Lucene50_0.tim, _mls_Lucene50_0.tip, _mlt.fdt, _mlt.fdx, _mlt.fnm, _mlt.nvd, _mlt.nvm, _mlt.si, _mlt_Lucene50_0.doc, _mlt_Lucene50_0.tim, _mlt_Lucene50_0.tip, _mlu.fdt, _mlu.fdx, _mlu.fnm, _mlu.nvd, _mlu.nvm, _mlu.si, _mlu_Lucene50_0.doc, _mlu_Lucene50_0.tim, _mlu_Lucene50_0.tip, _mlv.fdt, _mlv.fdx, _mlv.fnm, _mlv.nvd, _mlv.nvm, _mlv.si, _mlv_Lucene50_0.doc, _mlv_Lucene50_0.tim, _mlv_Lucene50_0.tip, _mlw.fdt, _mlw.fdx, _mlw.fnm, _mlw.nvd, _mlw.nvm, _mlw.si, _mlw_Lucene50_0.doc, _mlw_Lucene50_0.tim, _mlw_Lucene50_0.tip, _mlx.fdt, _mlx.fdx, _mlx.fnm, _mlx.nvd, _mlx.nvm, _mlx.si, _mlx_Lucene50_0.doc, _mlx_Lucene50_0.tim, _mlx_Lucene50_0.tip, _mly.fdt, _mly.fdx, _mly.fnm, _mly.nvd, _mly.nvm, _mly.si, _mly_Lucene50_0.doc, _mly_Lucene50_0.tim, _mly_Lucene50_0.tip, _mlz.fdt, _mlz.fdx, _mlz.fnm, _mlz.nvd, _mlz.nvm, _mlz.si, _mlz_Lucene50_0.doc, _mlz_Lucene50_0.tim, _mlz_Lucene50_0.tip, segments_2]}]> but was:<[{indexVersion=1452914081261,generation=2,filelist=[_mgx.cfe, _mgx.cfs, _mgx.si, _mj5.fdt, _mj5.fdx, _mj5.fnm, _mj5.nvd, _mj5.nvm, _mj5.si, _mj5_Lucene50_0.doc, _mj5_Lucene50_0.tim, _mj5_Lucene50_0.tip, _mj6.cfe, _mj6.cfs, _mj6.si, _mj7.fdt, _mj7.fdx, _mj7.fnm, _mj7.nvd, _mj7.nvm, _mj7.si, _mj7_Lucene50_0.doc, _mj7_Lucene50_0.tim, _mj7_Lucene50_0.tip, _mj8.fdt, _mj8.fdx, _mj8.fnm, _mj8.nvd, _mj8.nvm, _mj8.si, _mj8_Lucene50_0.doc, _mj8_Lucene50_0.tim, _mj8_Lucene50_0.tip, _mj9.fdt, _mj9.fdx, _mj9.fnm, _mj9.nvd, _mj9.nvm, _mj9.si, _mj9_Lucene50_0.doc, _mj9_Lucene50_0.tim, _mj9_Lucene50_0.tip, _mja.fdt, _mja.fdx, _mja.fnm, _mja.nvd, _mja.nvm, _mja.si, _mja_Lucene50_0.doc, _mja_Lucene50_0.tim, _mja_Lucene50_0.tip, _mjb.fdt, _mjb.fdx, _mjb.fnm, _mjb.nvd, _mjb.nvm, _mjb.si, _mjb_Lucene50_0.doc, _mjb_Lucene50_0.tim, _mjb_Lucene50_0.tip, _mjc.fdt, _mjc.fdx, _mjc.fnm, _mjc.nvd, _mjc.nvm, _mjc.si, _mjc_Lucene50_0.doc, _mjc_Lucene50_0.tim, _mjc_Lucene50_0.tip, _mjd.fdt, _mjd.fdx, _mjd.fnm, _mjd.nvd, _mjd.nvm, _mjd.si, _mjd_Lucene50_0.doc, _mjd_Lucene50_0.tim, _mjd_Lucene50_0.tip, _mje.fdt, _mje.fdx, _mje.fnm, _mje.nvd, _mje.nvm, _mje.si, _mje_Lucene50_0.doc, _mje_Lucene50_0.tim, _mje_Lucene50_0.tip, _mjf.fdt, _mjf.fdx, _mjf.fnm, _mjf.nvd, _mjf.nvm, _mjf.si, _mjf_Lucene50_0.doc, _mjf_Lucene50_0.tim, _mjf_Lucene50_0.tip, _mjg.fdt, _mjg.fdx, _mjg.fnm, _mjg.nvd, _mjg.nvm, _mjg.si, _mjg_Lucene50_0.doc, _mjg_Lucene50_0.tim, _mjg_Lucene50_0.tip, _mjh.fdt, _mjh.fdx, _mjh.fnm, _mjh.nvd, _mjh.nvm, _mjh.si, _mjh_Lucene50_0.doc, _mjh_Lucene50_0.tim, _mjh_Lucene50_0.tip, _mji.fdt, _mji.fdx, _mji.fnm, _mji.nvd, _mji.nvm, _mji.si, _mji_Lucene50_0.doc, _mji_Lucene50_0.tim, _mji_Lucene50_0.tip, _mjj.fdt, _mjj.fdx, _mjj.fnm, _mjj.nvd, _mjj.nvm, _mjj.si, _mjj_Lucene50_0.doc, _mjj_Lucene50_0.tim, _mjj_Lucene50_0.tip, _mjk.fdt, _mjk.fdx, _mjk.fnm, _mjk.nvd, _mjk.nvm, _mjk.si, _mjk_Lucene50_0.doc, _mjk_Lucene50_0.tim, _mjk_Lucene50_0.tip, _mjl.fdt, _mjl.fdx, _mjl.fnm, _mjl.nvd, _mjl.nvm, _mjl.si, _mjl_Lucene50_0.doc, _mjl_Lucene50_0.tim, _mjl_Lucene50_0.tip, _mjm.fdt, _mjm.fdx, _mjm.fnm, _mjm.nvd, _mjm.nvm, _mjm.si, _mjm_Lucene50_0.doc, _mjm_Lucene50_0.tim, _mjm_Lucene50_0.tip, _mjn.fdt, _mjn.fdx, _mjn.fnm, _mjn.nvd, _mjn.nvm, _mjn.si, _mjn_Lucene50_0.doc, _mjn_Lucene50_0.tim, _mjn_Lucene50_0.tip, _mjo.fdt, _mjo.fdx, _mjo.fnm, _mjo.nvd, _mjo.nvm, _mjo.si, _mjo_Lucene50_0.doc, _mjo_Lucene50_0.tim, _mjo_Lucene50_0.tip, _mjp.fdt, _mjp.fdx, _mjp.fnm, _mjp.nvd, _mjp.nvm, _mjp.si, _mjp_Lucene50_0.doc, _mjp_Lucene50_0.tim, _mjp_Lucene50_0.tip, _mjq.fdt, _mjq.fdx, _mjq.fnm, _mjq.nvd, _mjq.nvm, _mjq.si, _mjq_Lucene50_0.doc, _mjq_Lucene50_0.tim, _mjq_Lucene50_0.tip, _mjr.fdt, _mjr.fdx, _mjr.fnm, _mjr.nvd, _mjr.nvm, _mjr.si, _mjr_Lucene50_0.doc, _mjr_Lucene50_0.tim, _mjr_Lucene50_0.tip, _mjs.fdt, _mjs.fdx, _mjs.fnm, _mjs.nvd, _mjs.nvm, _mjs.si, _mjs_Lucene50_0.doc, _mjs_Lucene50_0.tim, _mjs_Lucene50_0.tip, _mjt.fdt, _mjt.fdx, _mjt.fnm, _mjt.nvd, _mjt.nvm, _mjt.si, _mjt_Lucene50_0.doc, _mjt_Lucene50_0.tim, _mjt_Lucene50_0.tip, _mju.fdt, _mju.fdx, _mju.fnm, _mju.nvd, _mju.nvm, _mju.si, _mju_Lucene50_0.doc, _mju_Lucene50_0.tim, _mju_Lucene50_0.tip, _mjv.fdt, _mjv.fdx, _mjv.fnm, _mjv.nvd, _mjv.nvm, _mjv.si, _mjv_Lucene50_0.doc, _mjv_Lucene50_0.tim, _mjv_Lucene50_0.tip, _mjw.fdt, _mjw.fdx, _mjw.fnm, _mjw.nvd, _mjw.nvm, _mjw.si, _mjw_Lucene50_0.doc, _mjw_Lucene50_0.tim, _mjw_Lucene50_0.tip, _mjx.fdt, _mjx.fdx, _mjx.fnm, _mjx.nvd, _mjx.nvm, _mjx.si, _mjx_Lucene50_0.doc, _mjx_Lucene50_0.tim, _mjx_Lucene50_0.tip, _mjy.fdt, _mjy.fdx, _mjy.fnm, _mjy.nvd, _mjy.nvm, _mjy.si, _mjy_Lucene50_0.doc, _mjy_Lucene50_0.tim, _mjy_Lucene50_0.tip, _mjz.fdt, _mjz.fdx, _mjz.fnm, _mjz.nvd, _mjz.nvm, _mjz.si, _mjz_Lucene50_0.doc, _mjz_Lucene50_0.tim, _mjz_Lucene50_0.tip, _mk0.fdt, _mk0.fdx, _mk0.fnm, _mk0.nvd, _mk0.nvm, _mk0.si, _mk0_Lucene50_0.doc, _mk0_Lucene50_0.tim, _mk0_Lucene50_0.tip, _mk1.fdt, _mk1.fdx, _mk1.fnm, _mk1.nvd, _mk1.nvm, _mk1.si, _mk1_Lucene50_0.doc, _mk1_Lucene50_0.tim, _mk1_Lucene50_0.tip, _mk2.fdt, _mk2.fdx, _mk2.fnm, _mk2.nvd, _mk2.nvm, _mk2.si, _mk2_Lucene50_0.doc, _mk2_Lucene50_0.tim, _mk2_Lucene50_0.tip, _mk3.fdt, _mk3.fdx, _mk3.fnm, _mk3.nvd, _mk3.nvm, _mk3.si, _mk3_Lucene50_0.doc, _mk3_Lucene50_0.tim, _mk3_Lucene50_0.tip, _mk4.fdt, _mk4.fdx, _mk4.fnm, _mk4.nvd, _mk4.nvm, _mk4.si, _mk4_Lucene50_0.doc, _mk4_Lucene50_0.tim, _mk4_Lucene50_0.tip, _mk5.fdt, _mk5.fdx, _mk5.fnm, _mk5.nvd, _mk5.nvm, _mk5.si, _mk5_Lucene50_0.doc, _mk5_Lucene50_0.tim, _mk5_Lucene50_0.tip, _mk6.fdt, _mk6.fdx, _mk6.fnm, _mk6.nvd, _mk6.nvm, _mk6.si, _mk6_Lucene50_0.doc, _mk6_Lucene50_0.tim, _mk6_Lucene50_0.tip, _mk7.fdt, _mk7.fdx, _mk7.fnm, _mk7.nvd, _mk7.nvm, _mk7.si, _mk7_Lucene50_0.doc, _mk7_Lucene50_0.tim, _mk7_Lucene50_0.tip, _mld.fdt, _mld.fdx, _mld.fnm, _mld.nvd, _mld.nvm, _mld.si, _mld_Lucene50_0.doc, _mld_Lucene50_0.tim, _mld_Lucene50_0.tip, _mle.cfe, _mle.cfs, _mle.si, _mlf.fdt, _mlf.fdx, _mlf.fnm, _mlf.nvd, _mlf.nvm, _mlf.si, _mlf_Lucene50_0.doc, _mlf_Lucene50_0.tim, _mlf_Lucene50_0.tip, _mlg.fdt, _mlg.fdx, _mlg.fnm, _mlg.nvd, _mlg.nvm, _mlg.si, _mlg_Lucene50_0.doc, _mlg_Lucene50_0.tim, _mlg_Lucene50_0.tip, _mlh.fdt, _mlh.fdx, _mlh.fnm, _mlh.nvd, _mlh.nvm, _mlh.si, _mlh_Lucene50_0.doc, _mlh_Lucene50_0.tim, _mlh_Lucene50_0.tip, _mli.fdt, _mli.fdx, _mli.fnm, _mli.nvd, _mli.nvm, _mli.si, _mli_Lucene50_0.doc, _mli_Lucene50_0.tim, _mli_Lucene50_0.tip, _mlj.fdt, _mlj.fdx, _mlj.fnm, _mlj.nvd, _mlj.nvm, _mlj.si, _mlj_Lucene50_0.doc, _mlj_Lucene50_0.tim, _mlj_Lucene50_0.tip, _mlk.fdt, _mlk.fdx, _mlk.fnm, _mlk.nvd, _mlk.nvm, _mlk.si, _mlk_Lucene50_0.doc, _mlk_Lucene50_0.tim, _mlk_Lucene50_0.tip, _mll.fdt, _mll.fdx, _mll.fnm, _mll.nvd, _mll.nvm, _mll.si, _mll_Lucene50_0.doc, _mll_Lucene50_0.tim, _mll_Lucene50_0.tip, _mlm.fdt, _mlm.fdx, _mlm.fnm, _mlm.nvd, _mlm.nvm, _mlm.si, _mlm_Lucene50_0.doc, _mlm_Lucene50_0.tim, _mlm_Lucene50_0.tip, _mln.fdt, _mln.fdx, _mln.fnm, _mln.nvd, _mln.nvm, _mln.si, _mln_Lucene50_0.doc, _mln_Lucene50_0.tim, _mln_Lucene50_0.tip, _mlo.fdt, _mlo.fdx, _mlo.fnm, _mlo.nvd, _mlo.nvm, _mlo.si, _mlo_Lucene50_0.doc, _mlo_Lucene50_0.tim, _mlo_Lucene50_0.tip, _mlp.fdt, _mlp.fdx, _mlp.fnm, _mlp.nvd, _mlp.nvm, _mlp.si, _mlp_Lucene50_0.doc, _mlp_Lucene50_0.tim, _mlp_Lucene50_0.tip, _mlq.fdt, _mlq.fdx, _mlq.fnm, _mlq.nvd, _mlq.nvm, _mlq.si, _mlq_Lucene50_0.doc, _mlq_Lucene50_0.tim, _mlq_Lucene50_0.tip, _mlr.fdt, _mlr.fdx, _mlr.fnm, _mlr.nvd, _mlr.nvm, _mlr.si, _mlr_Lucene50_0.doc, _mlr_Lucene50_0.tim, _mlr_Lucene50_0.tip, _mls.fdt, _mls.fdx, _mls.fnm, _mls.nvd, _mls.nvm, _mls.si, _mls_Lucene50_0.doc, _mls_Lucene50_0.tim, _mls_Lucene50_0.tip, _mlt.fdt, _mlt.fdx, _mlt.fnm, _mlt.nvd, _mlt.nvm, _mlt.si, _mlt_Lucene50_0.doc, _mlt_Lucene50_0.tim, _mlt_Lucene50_0.tip, _mlu.fdt, _mlu.fdx, _mlu.fnm, _mlu.nvd, _mlu.nvm, _mlu.si, _mlu_Lucene50_0.doc, _mlu_Lucene50_0.tim, _mlu_Lucene50_0.tip, _mlv.fdt, _mlv.fdx, _mlv.fnm, _mlv.nvd, _mlv.nvm, _mlv.si, _mlv_Lucene50_0.doc, _mlv_Lucene50_0.tim, _mlv_Lucene50_0.tip, _mlw.fdt, _mlw.fdx, _mlw.fnm, _mlw.nvd, _mlw.nvm, _mlw.si, _mlw_Lucene50_0.doc, _mlw_Lucene50_0.tim, _mlw_Lucene50_0.tip, _mlx.fdt, _mlx.fdx, _mlx.fnm, _mlx.nvd, _mlx.nvm, _mlx.si, _mlx_Lucene50_0.doc, _mlx_Lucene50_0.tim, _mlx_Lucene50_0.tip, _mly.fdt, _mly.fdx, _mly.fnm, _mly.nvd, _mly.nvm, _mly.si, _mly_Lucene50_0.doc, _mly_Lucene50_0.tim, _mly_Lucene50_0.tip, _mlz.fdt, _mlz.fdx, _mlz.fnm, _mlz.nvd, _mlz.nvm, _mlz.si, _mlz_Lucene50_0.doc, _mlz_Lucene50_0.tim, _mlz_Lucene50_0.tip, segments_2]}, {indexVersion=1452914081261,generation=3,filelist=[_mk9.cfe, _mk9.cfs, _mk9.si, _mld.fdt, _mld.fdx, _mld.fnm, _mld.nvd, _mld.nvm, _mld.si, _mld_Lucene50_0.doc, _mld_Lucene50_0.tim, _mld_Lucene50_0.tip, _mle.cfe, _mle.cfs, _mle.si, _mlf.fdt, _mlf.fdx, _mlf.fnm, _mlf.nvd, _mlf.nvm, _mlf.si, _mlf_Lucene50_0.doc, _mlf_Lucene50_0.tim, _mlf_Lucene50_0.tip, _mlg.fdt, _mlg.fdx, _mlg.fnm, _mlg.nvd, _mlg.nvm, _mlg.si, _mlg_Lucene50_0.doc, _mlg_Lucene50_0.tim, _mlg_Lucene50_0.tip, _mlh.fdt, _mlh.fdx, _mlh.fnm, _mlh.nvd, _mlh.nvm, _mlh.si, _mlh_Lucene50_0.doc, _mlh_Lucene50_0.tim, _mlh_Lucene50_0.tip, _mli.fdt, _mli.fdx, _mli.fnm, _mli.nvd, _mli.nvm, _mli.si, _mli_Lucene50_0.doc, _mli_Lucene50_0.tim, _mli_Lucene50_0.tip, _mlj.fdt, _mlj.fdx, _mlj.fnm, _mlj.nvd, _mlj.nvm, _mlj.si, _mlj_Lucene50_0.doc, _mlj_Lucene50_0.tim, _mlj_Lucene50_0.tip, _mlk.fdt, _mlk.fdx, _mlk.fnm, _mlk.nvd, _mlk.nvm, _mlk.si, _mlk_Lucene50_0.doc, _mlk_Lucene50_0.tim, _mlk_Lucene50_0.tip, _mll.fdt, _mll.fdx, _mll.fnm, _mll.nvd, _mll.nvm, _mll.si, _mll_Lucene50_0.doc, _mll_Lucene50_0.tim, _mll_Lucene50_0.tip, _mlm.fdt, _mlm.fdx, _mlm.fnm, _mlm.nvd, _mlm.nvm, _mlm.si, _mlm_Lucene50_0.doc, _mlm_Lucene50_0.tim, _mlm_Lucene50_0.tip, _mln.fdt, _mln.fdx, _mln.fnm, _mln.nvd, _mln.nvm, _mln.si, _mln_Lucene50_0.doc, _mln_Lucene50_0.tim, _mln_Lucene50_0.tip, _mlo.fdt, _mlo.fdx, _mlo.fnm, _mlo.nvd, _mlo.nvm, _mlo.si, _mlo_Lucene50_0.doc, _mlo_Lucene50_0.tim, _mlo_Lucene50_0.tip, _mlp.fdt, _mlp.fdx, _mlp.fnm, _mlp.nvd, _mlp.nvm, _mlp.si, _mlp_Lucene50_0.doc, _mlp_Lucene50_0.tim, _mlp_Lucene50_0.tip, _mlq.fdt, _mlq.fdx, _mlq.fnm, _mlq.nvd, _mlq.nvm, _mlq.si, _mlq_Lucene50_0.doc, _mlq_Lucene50_0.tim, _mlq_Lucene50_0.tip, _mlr.fdt, _mlr.fdx, _mlr.fnm, _mlr.nvd, _mlr.nvm, _mlr.si, _mlr_Lucene50_0.doc, _mlr_Lucene50_0.tim, _mlr_Lucene50_0.tip, _mls.fdt, _mls.fdx, _mls.fnm, _mls.nvd, _mls.nvm, _mls.si, _mls_Lucene50_0.doc, _mls_Lucene50_0.tim, _mls_Lucene50_0.tip, _mlt.fdt, _mlt.fdx, _mlt.fnm, _mlt.nvd, _mlt.nvm, _mlt.si, _mlt_Lucene50_0.doc, _mlt_Lucene50_0.tim, _mlt_Lucene50_0.tip, _mlu.fdt, _mlu.fdx, _mlu.fnm, _mlu.nvd, _mlu.nvm, _mlu.si, _mlu_Lucene50_0.doc, _mlu_Lucene50_0.tim, _mlu_Lucene50_0.tip, _mlv.fdt, _mlv.fdx, _mlv.fnm, _mlv.nvd, _mlv.nvm, _mlv.si, _mlv_Lucene50_0.doc, _mlv_Lucene50_0.tim, _mlv_Lucene50_0.tip, _mlw.fdt, _mlw.fdx, _mlw.fnm, _mlw.nvd, _mlw.nvm, _mlw.si, _mlw_Lucene50_0.doc, _mlw_Lucene50_0.tim, _mlw_Lucene50_0.tip, _mlx.fdt, _mlx.fdx, _mlx.fnm, _mlx.nvd, _mlx.nvm, _mlx.si, _mlx_Lucene50_0.doc, _mlx_Lucene50_0.tim, _mlx_Lucene50_0.tip, _mly.fdt, _mly.fdx, _mly.fnm, _mly.nvd, _mly.nvm, _mly.si, _mly_Lucene50_0.doc, _mly_Lucene50_0.tim, _mly_Lucene50_0.tip, _mlz.fdt, _mlz.fdx, _mlz.fnm, _mlz.nvd, _mlz.nvm, _mlz.si, _mlz_Lucene50_0.doc, _mlz_Lucene50_0.tim, _mlz_Lucene50_0.tip, segments_3]}]>
	at __randomizedtesting.SeedInfo.seed([181748B72164BC05:3DC05387512CB206]:0)
	at org.junit.Assert.fail(Assert.java:93)
	at org.junit.Assert.failNotEquals(Assert.java:647)
	at org.junit.Assert.assertEquals(Assert.java:128)
	at org.junit.Assert.assertEquals(Assert.java:147)
	at org.apache.solr.handler.TestReplicationHandler.doTestReplicateAfterCoreReload(TestReplicationHandler.java:1140)
	at sun.reflect.NativeMethodAccessorImpl.invoke0(Native Method)
	at sun.reflect.NativeMethodAccessorImpl.invoke(NativeMethodAccessorImpl.java:62)
	at sun.reflect.DelegatingMethodAccessorImpl.invoke(DelegatingMethodAccessorImpl.java:43)
	at java.lang.reflect.Method.invoke(Method.java:497)
	at com.carrotsearch.randomizedtesting.RandomizedRunner.invoke(RandomizedRunner.java:1764)
	at com.carrotsearch.randomizedtesting.RandomizedRunner$8.evaluate(RandomizedRunner.java:871)
	at com.carrotsearch.randomizedtesting.RandomizedRunner$9.evaluate(RandomizedRunner.java:907)
	at com.carrotsearch.randomizedtesting.RandomizedRunner$10.evaluate(RandomizedRunner.java:921)
	at com.carrotsearch.randomizedtesting.rules.SystemPropertiesRestoreRule$1.evaluate(SystemPropertiesRestoreRule.java:57)
	at org.apache.lucene.util.TestRuleSetupTeardownChained$1.evaluate(TestRuleSetupTeardownChained.java:50)
	at org.apache.lucene.util.AbstractBeforeAfterRule$1.evaluate(AbstractBeforeAfterRule.java:46)
	at org.apache.lucene.util.TestRuleThreadAndTestName$1.evaluate(TestRuleThreadAndTestName.java:49)
	at org.apache.lucene.util.TestRuleIgnoreAfterMaxFailures$1.evaluate(TestRuleIgnoreAfterMaxFailures.java:65)
	at org.apache.lucene.util.TestRuleMarkFailure$1.evaluate(TestRuleMarkFailure.java:48)
	at com.carrotsearch.randomizedtesting.rules.StatementAdapter.evaluate(StatementAdapter.java:36)
	at com.carrotsearch.randomizedtesting.ThreadLeakControl$StatementRunner.run(ThreadLeakControl.java:367)
	at com.carrotsearch.randomizedtesting.ThreadLeakControl.forkTimeoutingTask(ThreadLeakControl.java:809)
	at com.carrotsearch.randomizedtesting.ThreadLeakControl$3.evaluate(ThreadLeakControl.java:460)
	at com.carrotsearch.randomizedtesting.RandomizedRunner.runSingleTest(RandomizedRunner.java:880)
	at com.carrotsearch.randomizedtesting.RandomizedRunner$5.evaluate(RandomizedRunner.java:781)
	at com.carrotsearch.randomizedtesting.RandomizedRunner$6.evaluate(RandomizedRunner.java:816)
	at com.carrotsearch.randomizedtesting.RandomizedRunner$7.evaluate(RandomizedRunner.java:827)
	at com.carrotsearch.randomizedtesting.rules.StatementAdapter.evaluate(StatementAdapter.java:36)
	at com.carrotsearch.randomizedtesting.rules.SystemPropertiesRestoreRule$1.evaluate(SystemPropertiesRestoreRule.java:57)
	at org.apache.lucene.util.AbstractBeforeAfterRule$1.evaluate(AbstractBeforeAfterRule.java:46)
	at com.carrotsearch.randomizedtesting.rules.StatementAdapter.evaluate(StatementAdapter.java:36)
	at org.apache.lucene.util.TestRuleStoreClassName$1.evaluate(TestRuleStoreClassName.java:42)
	at com.carrotsearch.randomizedtesting.rules.NoShadowingOrOverridesOnMethodsRule$1.evaluate(NoShadowingOrOverridesOnMethodsRule.java:40)
	at com.carrotsearch.randomizedtesting.rules.NoShadowingOrOverridesOnMethodsRule$1.evaluate(NoShadowingOrOverridesOnMethodsRule.java:40)
	at com.carrotsearch.randomizedtesting.rules.StatementAdapter.evaluate(StatementAdapter.java:36)
	at com.carrotsearch.randomizedtesting.rules.StatementAdapter.evaluate(StatementAdapter.java:36)
	at com.carrotsearch.randomizedtesting.rules.StatementAdapter.evaluate(StatementAdapter.java:36)
	at org.apache.lucene.util.TestRuleAssertionsRequired$1.evaluate(TestRuleAssertionsRequired.java:54)
	at org.apache.lucene.util.TestRuleMarkFailure$1.evaluate(TestRuleMarkFailure.java:48)
	at org.apache.lucene.util.TestRuleIgnoreAfterMaxFailures$1.evaluate(TestRuleIgnoreAfterMaxFailures.java:65)
	at org.apache.lucene.util.TestRuleIgnoreTestSuites$1.evaluate(TestRuleIgnoreTestSuites.java:55)
	at com.carrotsearch.randomizedtesting.rules.StatementAdapter.evaluate(StatementAdapter.java:36)
	at com.carrotsearch.randomizedtesting.ThreadLeakControl$StatementRunner.run(ThreadLeakControl.java:367)
	at java.lang.Thread.run(Thread.java:745)




Build Log:
[...truncated 11334 lines...]
   [junit4] Suite: org.apache.solr.handler.TestReplicationHandler
   [junit4]   2> Creating dataDir: /x1/jenkins/jenkins-slave/workspace/Lucene-Solr-NightlyTests-trunk/solr/build/solr-core/test/J1/temp/solr.handler.TestReplicationHandler_181748B72164BC05-001/init-core-data-001
   [junit4]   2> 2403910 INFO  (TEST-TestReplicationHandler.doTestIndexAndConfigAliasReplication-seed#[181748B72164BC05]) [    ] o.a.s.SolrTestCaseJ4 ###Starting doTestIndexAndConfigAliasReplication
   [junit4]   2> 2403911 INFO  (TEST-TestReplicationHandler.doTestIndexAndConfigAliasReplication-seed#[181748B72164BC05]) [    ] o.a.s.SolrTestCaseJ4 Writing core.properties file to /x1/jenkins/jenkins-slave/workspace/Lucene-Solr-NightlyTests-trunk/solr/build/solr-core/test/J1/temp/solr.handler.TestReplicationHandler_181748B72164BC05-001/solr-instance-001/collection1
   [junit4]   2> 2403915 INFO  (TEST-TestReplicationHandler.doTestIndexAndConfigAliasReplication-seed#[181748B72164BC05]) [    ] o.e.j.s.Server jetty-9.2.13.v20150730
   [junit4]   2> 2403916 INFO  (TEST-TestReplicationHandler.doTestIndexAndConfigAliasReplication-seed#[181748B72164BC05]) [    ] o.e.j.s.h.ContextHandler Started o.e.j.s.ServletContextHandler@6aa6b002{/solr,null,AVAILABLE}
   [junit4]   2> 2403917 INFO  (TEST-TestReplicationHandler.doTestIndexAndConfigAliasReplication-seed#[181748B72164BC05]) [    ] o.e.j.s.ServerConnector Started ServerConnector@79b3ce18{HTTP/1.1}{127.0.0.1:49765}
   [junit4]   2> 2403917 INFO  (TEST-TestReplicationHandler.doTestIndexAndConfigAliasReplication-seed#[181748B72164BC05]) [    ] o.e.j.s.Server Started @2407655ms
   [junit4]   2> 2403917 INFO  (TEST-TestReplicationHandler.doTestIndexAndConfigAliasReplication-seed#[181748B72164BC05]) [    ] o.a.s.c.s.e.JettySolrRunner Jetty properties: {solr.data.dir=/x1/jenkins/jenkins-slave/workspace/Lucene-Solr-NightlyTests-trunk/solr/build/solr-core/test/J1/temp/solr.handler.TestReplicationHandler_181748B72164BC05-001/solr-instance-001/collection1/data, hostContext=/solr, hostPort=49765}
   [junit4]   2> 2403918 INFO  (TEST-TestReplicationHandler.doTestIndexAndConfigAliasReplication-seed#[181748B72164BC05]) [    ] o.a.s.s.SolrDispatchFilter SolrDispatchFilter.init(): sun.misc.Launcher$AppClassLoader@4e0e2f2a
   [junit4]   2> 2403918 INFO  (TEST-TestReplicationHandler.doTestIndexAndConfigAliasReplication-seed#[181748B72164BC05]) [    ] o.a.s.c.SolrResourceLoader new SolrResourceLoader for directory: '/x1/jenkins/jenkins-slave/workspace/Lucene-Solr-NightlyTests-trunk/solr/build/solr-core/test/J1/temp/solr.handler.TestReplicationHandler_181748B72164BC05-001/solr-instance-001'
   [junit4]   2> 2403918 INFO  (TEST-TestReplicationHandler.doTestIndexAndConfigAliasReplication-seed#[181748B72164BC05]) [    ] o.a.s.c.SolrResourceLoader JNDI not configured for solr (NoInitialContextEx)
   [junit4]   2> 2403918 INFO  (TEST-TestReplicationHandler.doTestIndexAndConfigAliasReplication-seed#[181748B72164BC05]) [    ] o.a.s.c.SolrResourceLoader solr home defaulted to 'solr/' (could not find system property or JNDI)
   [junit4]   2> 2403918 INFO  (TEST-TestReplicationHandler.doTestIndexAndConfigAliasReplication-seed#[181748B72164BC05]) [    ] o.a.s.c.SolrXmlConfig Loading container configuration from /x1/jenkins/jenkins-slave/workspace/Lucene-Solr-NightlyTests-trunk/solr/build/solr-core/test/J1/temp/solr.handler.TestReplicationHandler_181748B72164BC05-001/solr-instance-001/solr.xml
   [junit4]   2> 2403923 INFO  (TEST-TestReplicationHandler.doTestIndexAndConfigAliasReplication-seed#[181748B72164BC05]) [    ] o.a.s.c.CorePropertiesLocator Config-defined core root directory: /x1/jenkins/jenkins-slave/workspace/Lucene-Solr-NightlyTests-trunk/solr/build/solr-core/test/J1/temp/solr.handler.TestReplicationHandler_181748B72164BC05-001/solr-instance-001/.
   [junit4]   2> 2403923 INFO  (TEST-TestReplicationHandler.doTestIndexAndConfigAliasReplication-seed#[181748B72164BC05]) [    ] o.a.s.c.CoreContainer New CoreContainer 286942688
   [junit4]   2> 2403923 INFO  (TEST-TestReplicationHandler.doTestIndexAndConfigAliasReplication-seed#[181748B72164BC05]) [    ] o.a.s.c.CoreContainer Loading cores into CoreContainer [instanceDir=/x1/jenkins/jenkins-slave/workspace/Lucene-Solr-NightlyTests-trunk/solr/build/solr-core/test/J1/temp/solr.handler.TestReplicationHandler_181748B72164BC05-001/solr-instance-001]
   [junit4]   2> 2403924 WARN  (TEST-TestReplicationHandler.doTestIndexAndConfigAliasReplication-seed#[181748B72164BC05]) [    ] o.a.s.c.CoreContainer Couldn't add files from /x1/jenkins/jenkins-slave/workspace/Lucene-Solr-NightlyTests-trunk/solr/build/solr-core/test/J1/temp/solr.handler.TestReplicationHandler_181748B72164BC05-001/solr-instance-001/lib to classpath: /x1/jenkins/jenkins-slave/workspace/Lucene-Solr-NightlyTests-trunk/solr/build/solr-core/test/J1/temp/solr.handler.TestReplicationHandler_181748B72164BC05-001/solr-instance-001/lib
   [junit4]   2> 2403924 INFO  (TEST-TestReplicationHandler.doTestIndexAndConfigAliasReplication-seed#[181748B72164BC05]) [    ] o.a.s.h.c.HttpShardHandlerFactory created with socketTimeout : 90000,urlScheme : ,connTimeout : 15000,maxConnectionsPerHost : 20,maxConnections : 10000,corePoolSize : 0,maximumPoolSize : 2147483647,maxThreadIdleTime : 5,sizeOfQueue : -1,fairnessPolicy : false,useRetries : false,
   [junit4]   2> 2403925 INFO  (TEST-TestReplicationHandler.doTestIndexAndConfigAliasReplication-seed#[181748B72164BC05]) [    ] o.a.s.u.UpdateShardHandler Creating UpdateShardHandler HTTP client with params: socketTimeout=340000&connTimeout=45000&retry=true
   [junit4]   2> 2403925 INFO  (TEST-TestReplicationHandler.doTestIndexAndConfigAliasReplication-seed#[181748B72164BC05]) [    ] o.a.s.l.LogWatcher SLF4J impl is org.slf4j.impl.Log4jLoggerFactory
   [junit4]   2> 2403925 INFO  (TEST-TestReplicationHandler.doTestIndexAndConfigAliasReplication-seed#[181748B72164BC05]) [    ] o.a.s.l.LogWatcher Registering Log Listener [Log4j (org.slf4j.impl.Log4jLoggerFactory)]
   [junit4]   2> 2403926 INFO  (TEST-TestReplicationHandler.doTestIndexAndConfigAliasReplication-seed#[181748B72164BC05]) [    ] o.a.s.c.CoreContainer Security conf doesn't exist. Skipping setup for authorization module.
   [junit4]   2> 2403926 INFO  (TEST-TestReplicationHandler.doTestIndexAndConfigAliasReplication-seed#[181748B72164BC05]) [    ] o.a.s.c.CoreContainer No authentication plugin used.
   [junit4]   2> 2403926 INFO  (TEST-TestReplicationHandler.doTestIndexAndConfigAliasReplication-seed#[181748B72164BC05]) [    ] o.a.s.c.CorePropertiesLocator Looking for core definitions underneath /x1/jenkins/jenkins-slave/workspace/Lucene-Solr-NightlyTests-trunk/solr/build/solr-core/test/J1/temp/solr.handler.TestReplicationHandler_181748B72164BC05-001/solr-instance-001/.
   [junit4]   2> 2403928 INFO  (TEST-TestReplicationHandler.doTestIndexAndConfigAliasReplication-seed#[181748B72164BC05]) [    ] o.a.s.c.CoreDescriptor Created CoreDescriptor: {name=collection1, config=solrconfig.xml, loadOnStartup=true, schema=schema.xml, configSetProperties=configsetprops.json, transient=false, dataDir=data/}
   [junit4]   2> 2403928 INFO  (TEST-TestReplicationHandler.doTestIndexAndConfigAliasReplication-seed#[181748B72164BC05]) [    ] o.a.s.c.CorePropertiesLocator Found core collection1 in /x1/jenkins/jenkins-slave/workspace/Lucene-Solr-NightlyTests-trunk/solr/build/solr-core/test/J1/temp/solr.handler.TestReplicationHandler_181748B72164BC05-001/solr-instance-001/./collection1
   [junit4]   2> 2403928 INFO  (TEST-TestReplicationHandler.doTestIndexAndConfigAliasReplication-seed#[181748B72164BC05]) [    ] o.a.s.c.CorePropertiesLocator Found 1 core definitions
   [junit4]   2> 2403928 INFO  (coreLoadExecutor-3518-thread-1) [    ] o.a.s.c.SolrResourceLoader new SolrResourceLoader for directory: '/x1/jenkins/jenkins-slave/workspace/Lucene-Solr-NightlyTests-trunk/solr/build/solr-core/test/J1/temp/solr.handler.TestReplicationHandler_181748B72164BC05-001/solr-instance-001/collection1'
   [junit4]   2> 2403928 INFO  (coreLoadExecutor-3518-thread-1) [    ] o.a.s.c.SolrResourceLoader JNDI not configured for solr (NoInitialContextEx)
   [junit4]   2> 2403928 INFO  (coreLoadExecutor-3518-thread-1) [    ] o.a.s.c.SolrResourceLoader solr home defaulted to 'solr/' (could not find system property or JNDI)
   [junit4]   2> 2403934 INFO  (coreLoadExecutor-3518-thread-1) [    ] o.a.s.c.SolrConfig current version of requestparams : -1
   [junit4]   2> 2403935 INFO  (TEST-TestReplicationHandler.doTestIndexAndConfigAliasReplication-seed#[181748B72164BC05]) [    ] o.a.s.s.SolrDispatchFilter user.dir=/x1/jenkins/jenkins-slave/workspace/Lucene-Solr-NightlyTests-trunk/solr/build/solr-core/test/J1
   [junit4]   2> 2403935 INFO  (TEST-TestReplicationHandler.doTestIndexAndConfigAliasReplication-seed#[181748B72164BC05]) [    ] o.a.s.s.SolrDispatchFilter SolrDispatchFilter.init() done
   [junit4]   2> 2403947 INFO  (coreLoadExecutor-3518-thread-1) [    ] o.a.s.c.SolrConfig Using Lucene MatchVersion: 6.0.0
   [junit4]   2> 2403953 INFO  (coreLoadExecutor-3518-thread-1) [    ] o.a.s.c.SolrConfig Loaded SolrConfig: solrconfig.xml
   [junit4]   2> 2403956 INFO  (coreLoadExecutor-3518-thread-1) [    ] o.a.s.s.IndexSchema [collection1] Schema name=test
   [junit4]   2> 2403959 INFO  (coreLoadExecutor-3518-thread-1) [    ] o.a.s.s.IndexSchema unique key field: id
   [junit4]   2> 2403961 INFO  (coreLoadExecutor-3518-thread-1) [    ] o.a.s.c.ConfigSetProperties Did not find ConfigSet properties, assuming default properties: Can't find resource 'configsetprops.json' in classpath or '/x1/jenkins/jenkins-slave/workspace/Lucene-Solr-NightlyTests-trunk/solr/build/solr-core/test/J1/temp/solr.handler.TestReplicationHandler_181748B72164BC05-001/solr-instance-001/collection1'
   [junit4]   2> 2403961 INFO  (coreLoadExecutor-3518-thread-1) [    ] o.a.s.c.CoreContainer Creating SolrCore 'collection1' using configuration from instancedir /x1/jenkins/jenkins-slave/workspace/Lucene-Solr-NightlyTests-trunk/solr/build/solr-core/test/J1/temp/solr.handler.TestReplicationHandler_181748B72164BC05-001/solr-instance-001/./collection1
   [junit4]   2> 2403961 INFO  (coreLoadExecutor-3518-thread-1) [    x:collection1] o.a.s.c.SolrCore org.apache.solr.core.MockDirectoryFactory
   [junit4]   2> 2403961 INFO  (coreLoadExecutor-3518-thread-1) [    x:collection1] o.a.s.c.SolrCore [[collection1] ] Opening new SolrCore at [/x1/jenkins/jenkins-slave/workspace/Lucene-Solr-NightlyTests-trunk/solr/build/solr-core/test/J1/temp/solr.handler.TestReplicationHandler_181748B72164BC05-001/solr-instance-001/collection1], dataDir=[/x1/jenkins/jenkins-slave/workspace/Lucene-Solr-NightlyTests-trunk/solr/build/solr-core/test/J1/temp/solr.handler.TestReplicationHandler_181748B72164BC05-001/solr-instance-001/./collection1/data/]
   [junit4]   2> 2403961 INFO  (coreLoadExecutor-3518-thread-1) [    x:collection1] o.a.s.c.SolrCore JMX monitoring not detected for core: collection1
   [junit4]   2> 2403961 INFO  (coreLoadExecutor-3518-thread-1) [    x:collection1] o.a.s.c.CachingDirectoryFactory return new directory for /x1/jenkins/jenkins-slave/workspace/Lucene-Solr-NightlyTests-trunk/solr/build/solr-core/test/J1/temp/solr.handler.TestReplicationHandler_181748B72164BC05-001/solr-instance-001/./collection1/data
   [junit4]   2> 2403962 INFO  (coreLoadExecutor-3518-thread-1) [    x:collection1] o.a.s.c.SolrCore New index directory detected: old=null new=/x1/jenkins/jenkins-slave/workspace/Lucene-Solr-NightlyTests-trunk/solr/build/solr-core/test/J1/temp/solr.handler.TestReplicationHandler_181748B72164BC05-001/solr-instance-001/./collection1/data/index/
   [junit4]   2> 2403962 WARN  (coreLoadExecutor-3518-thread-1) [    x:collection1] o.a.s.c.SolrCore [collection1] Solr index directory '/x1/jenkins/jenkins-slave/workspace/Lucene-Solr-NightlyTests-trunk/solr/build/solr-core/test/J1/temp/solr.handler.TestReplicationHandler_181748B72164BC05-001/solr-instance-001/./collection1/data/index' doesn't exist. Creating new index...
   [junit4]   2> 2403962 INFO  (coreLoadExecutor-3518-thread-1) [    x:collection1] o.a.s.c.CachingDirectoryFactory return new directory for /x1/jenkins/jenkins-slave/workspace/Lucene-Solr-NightlyTests-trunk/solr/build/solr-core/test/J1/temp/solr.handler.TestReplicationHandler_181748B72164BC05-001/solr-instance-001/./collection1/data/index
   [junit4]   2> 2403962 INFO  (coreLoadExecutor-3518-thread-1) [    x:collection1] o.a.s.u.RandomMergePolicy RandomMergePolicy wrapping class org.apache.lucene.index.TieredMergePolicy: [TieredMergePolicy: maxMergeAtOnce=15, maxMergeAtOnceExplicit=47, maxMergedSegmentMB=83.0146484375, floorSegmentMB=0.447265625, forceMergeDeletesPctAllowed=15.49594441434048, segmentsPerTier=18.0, maxCFSSegmentSizeMB=8.796093022207999E12, noCFSRatio=0.0
   [junit4]   2> 2403963 INFO  (coreLoadExecutor-3518-thread-1) [    x:collection1] o.a.s.c.SolrDeletionPolicy SolrDeletionPolicy.onCommit: commits: num=1
   [junit4]   2> 	commit{dir=MockDirectoryWrapper(NRTCachingDirectory(RAMDirectory@2540400f lockFactory=org.apache.lucene.store.SingleInstanceLockFactory@30a977b1; maxCacheMB=0.9013671875 maxMergeSizeMB=0.2255859375)),segFN=segments_1,generation=1}
   [junit4]   2> 2403963 INFO  (coreLoadExecutor-3518-thread-1) [    x:collection1] o.a.s.c.SolrDeletionPolicy newest commit generation = 1
   [junit4]   2> 2403963 INFO  (OldIndexDirectoryCleanupThreadForCore-collection1) [    x:collection1] o.a.s.c.SolrCore Looking for old index directories to cleanup for core collection1 in /x1/jenkins/jenkins-slave/workspace/Lucene-Solr-NightlyTests-trunk/solr/build/solr-core/test/J1/temp/solr.handler.TestReplicationHandler_181748B72164BC05-001/solr-instance-001/./collection1/data/
   [junit4]   2> 2403964 INFO  (coreLoadExecutor-3518-thread-1) [    x:collection1] o.a.s.c.SolrCore no updateRequestProcessorChain defined as default, creating implicit default
   [junit4]   2> 2403966 INFO  (coreLoadExecutor-3518-thread-1) [    x:collection1] o.a.s.h.l.XMLLoader xsltCacheLifetimeSeconds=60
   [junit4]   2> 2403967 INFO  (coreLoadExecutor-3518-thread-1) [    x:collection1] o.a.s.h.l.XMLLoader xsltCacheLifetimeSeconds=60
   [junit4]   2> 2403967 INFO  (coreLoadExecutor-3518-thread-1) [    x:collection1] o.a.s.h.l.XMLLoader xsltCacheLifetimeSeconds=60
   [junit4]   2> 2403968 INFO  (coreLoadExecutor-3518-thread-1) [    x:collection1] o.a.s.h.l.XMLLoader xsltCacheLifetimeSeconds=60
   [junit4]   2> 2403973 INFO  (coreLoadExecutor-3518-thread-1) [    x:collection1] o.a.s.c.PluginBag requestHandler : 'lazy' created with startup=lazy 
   [junit4]   2> 2403973 INFO  (coreLoadExecutor-3518-thread-1) [    x:collection1] o.a.s.c.RequestHandlers Registered paths: /admin/mbeans,standard,lazy,/update/json/docs,/admin/luke,/export,/get,/admin/properties,/update/json,/admin/threads,/update/csv,/sql,/admin/segments,/admin/system,/replication,defaults,/config,/stream,/schema,/admin/plugins,/admin/logging,/admin/ping,/update,/admin/file
   [junit4]   2> 2403973 INFO  (coreLoadExecutor-3518-thread-1) [    x:collection1] o.a.s.c.SolrCore Using default statsCache cache: org.apache.solr.search.stats.LocalStatsCache
   [junit4]   2> 2403973 INFO  (coreLoadExecutor-3518-thread-1) [    x:collection1] o.a.s.u.CommitTracker Hard AutoCommit: disabled
   [junit4]   2> 2403973 INFO  (coreLoadExecutor-3518-thread-1) [    x:collection1] o.a.s.u.CommitTracker Soft AutoCommit: disabled
   [junit4]   2> 2403975 INFO  (coreLoadExecutor-3518-thread-1) [    x:collection1] o.a.s.u.RandomMergePolicy RandomMergePolicy wrapping class org.apache.lucene.index.TieredMergePolicy: [TieredMergePolicy: maxMergeAtOnce=40, maxMergeAtOnceExplicit=34, maxMergedSegmentMB=97.7529296875, floorSegmentMB=1.9365234375, forceMergeDeletesPctAllowed=28.03063570063777, segmentsPerTier=31.0, maxCFSSegmentSizeMB=8.796093022207999E12, noCFSRatio=1.0
   [junit4]   2> 2403975 INFO  (coreLoadExecutor-3518-thread-1) [    x:collection1] o.a.s.c.SolrDeletionPolicy SolrDeletionPolicy.onInit: commits: num=1
   [junit4]   2> 	commit{dir=MockDirectoryWrapper(NRTCachingDirectory(RAMDirectory@2540400f lockFactory=org.apache.lucene.store.SingleInstanceLockFactory@30a977b1; maxCacheMB=0.9013671875 maxMergeSizeMB=0.2255859375)),segFN=segments_1,generation=1}
   [junit4]   2> 2403975 INFO  (coreLoadExecutor-3518-thread-1) [    x:collection1] o.a.s.c.SolrDeletionPolicy newest commit generation = 1
   [junit4]   2> 2403975 INFO  (coreLoadExecutor-3518-thread-1) [    x:collection1] o.a.s.s.SolrIndexSearcher Opening [Searcher@42407bda[collection1] main]
   [junit4]   2> 2403976 INFO  (coreLoadExecutor-3518-thread-1) [    x:collection1] o.a.s.r.ManagedResourceStorage File-based storage initialized to use dir: /x1/jenkins/jenkins-slave/workspace/Lucene-Solr-NightlyTests-trunk/solr/build/solr-core/test/J1/temp/solr.handler.TestReplicationHandler_181748B72164BC05-001/solr-instance-001/collection1/conf
   [junit4]   2> 2403976 INFO  (coreLoadExecutor-3518-thread-1) [    x:collection1] o.a.s.r.RestManager Initializing RestManager with initArgs: {storageDir=/x1/jenkins/jenkins-slave/workspace/Lucene-Solr-NightlyTests-trunk/solr/build/solr-core/test/J1/temp/solr.handler.TestReplicationHandler_181748B72164BC05-001/solr-instance-001/collection1/conf}
   [junit4]   2> 2403976 INFO  (coreLoadExecutor-3518-thread-1) [    x:collection1] o.a.s.r.ManagedResourceStorage Reading _rest_managed.json using file:dir=/x1/jenkins/jenkins-slave/workspace/Lucene-Solr-NightlyTests-trunk/solr/build/solr-core/test/J1/temp/solr.handler.TestReplicationHandler_181748B72164BC05-001/solr-instance-001/collection1/conf
   [junit4]   2> 2403976 INFO  (coreLoadExecutor-3518-thread-1) [    x:collection1] o.a.s.r.RestManager Initializing 0 registered ManagedResources
   [junit4]   2> 2403976 INFO  (coreLoadExecutor-3518-thread-1) [    x:collection1] o.a.s.h.ReplicationHandler Replication enabled for following config files: schema.xml,xslt/dummy.xsl
   [junit4]   2> 2403976 INFO  (coreLoadExecutor-3518-thread-1) [    x:collection1] o.a.s.h.ReplicationHandler Commits will be reserved for  10000
   [junit4]   2> 2403977 INFO  (coreLoadExecutor-3518-thread-1) [    x:collection1] o.a.s.c.CoreContainer registering core: collection1
   [junit4]   2> 2403977 INFO  (searcherExecutor-3519-thread-1-processing-x:collection1) [    x:collection1] o.a.s.c.SolrCore [collection1] Registered new searcher Searcher@42407bda[collection1] main{ExitableDirectoryReader(UninvertingDirectoryReader())}
   [junit4]   2> 2404436 INFO  (TEST-TestReplicationHandler.doTestIndexAndConfigAliasReplication-seed#[181748B72164BC05]) [    ] o.a.s.SolrTestCaseJ4 Writing core.properties file to /x1/jenkins/jenkins-slave/workspace/Lucene-Solr-NightlyTests-trunk/solr/build/solr-core/test/J1/temp/solr.handler.TestReplicationHandler_181748B72164BC05-001/solr-instance-002/collection1
   [junit4]   2> 2404440 INFO  (TEST-TestReplicationHandler.doTestIndexAndConfigAliasReplication-seed#[181748B72164BC05]) [    ] o.e.j.s.Server jetty-9.2.13.v20150730
   [junit4]   2> 2404441 INFO  (TEST-TestReplicationHandler.doTestIndexAndConfigAliasReplication-seed#[181748B72164BC05]) [    ] o.e.j.s.h.ContextHandler Started o.e.j.s.ServletContextHandler@5a20fed5{/solr,null,AVAILABLE}
   [junit4]   2> 2404442 INFO  (TEST-TestReplicationHandler.doTestIndexAndConfigAliasReplication-seed#[181748B72164BC05]) [    ] o.e.j.s.ServerConnector Started ServerConnector@31fea924{HTTP/1.1}{127.0.0.1:47198}
   [junit4]   2> 2404442 INFO  (TEST-TestReplicationHandler.doTestIndexAndConfigAliasReplication-seed#[181748B72164BC05]) [    ] o.e.j.s.Server Started @2408180ms
   [junit4]   2> 2404442 INFO  (TEST-TestReplicationHandler.doTestIndexAndConfigAliasReplication-seed#[181748B72164BC05]) [    ] o.a.s.c.s.e.JettySolrRunner Jetty properties: {solr.data.dir=/x1/jenkins/jenkins-slave/workspace/Lucene-Solr-NightlyTests-trunk/solr/build/solr-core/test/J1/temp/solr.handler.TestReplicationHandler_181748B72164BC05-001/solr-instance-002/collection1/data, hostContext=/solr, hostPort=47198}
   [junit4]   2> 2404442 INFO  (TEST-TestReplicationHandler.doTestIndexAndConfigAliasReplication-seed#[181748B72164BC05]) [    ] o.a.s.s.SolrDispatchFilter SolrDispatchFilter.init(): sun.misc.Launcher$AppClassLoader@4e0e2f2a
   [junit4]   2> 2404442 INFO  (TEST-TestReplicationHandler.doTestIndexAndConfigAliasReplication-seed#[181748B72164BC05]) [    ] o.a.s.c.SolrResourceLoader new SolrResourceLoader for directory: '/x1/jenkins/jenkins-slave/workspace/Lucene-Solr-NightlyTests-trunk/solr/build/solr-core/test/J1/temp/solr.handler.TestReplicationHandler_181748B72164BC05-001/solr-instance-002'
   [junit4]   2> 2404442 INFO  (TEST-TestReplicationHandler.doTestIndexAndConfigAliasReplication-seed#[181748B72164BC05]) [    ] o.a.s.c.SolrResourceLoader JNDI not configured for solr (NoInitialContextEx)
   [junit4]   2> 2404442 INFO  (TEST-TestReplicationHandler.doTestIndexAndConfigAliasReplication-seed#[181748B72164BC05]) [    ] o.a.s.c.SolrResourceLoader solr home defaulted to 'solr/' (could not find system property or JNDI)
   [junit4]   2> 2404443 INFO  (TEST-TestReplicationHandler.doTestIndexAndConfigAliasReplication-seed#[181748B72164BC05]) [    ] o.a.s.c.SolrXmlConfig Loading container configuration from /x1/jenkins/jenkins-slave/workspace/Lucene-Solr-NightlyTests-trunk/solr/build/solr-core/test/J1/temp/solr.handler.TestReplicationHandler_181748B72164BC05-001/solr-instance-002/solr.xml
   [junit4]   2> 2404447 INFO  (TEST-TestReplicationHandler.doTestIndexAndConfigAliasReplication-seed#[181748B72164BC05]) [    ] o.a.s.c.CorePropertiesLocator Config-defined core root directory: /x1/jenkins/jenkins-slave/workspace/Lucene-Solr-NightlyTests-trunk/solr/build/solr-core/test/J1/temp/solr.handler.TestReplicationHandler_181748B72164BC05-001/solr-instance-002/.
   [junit4]   2> 2404447 INFO  (TEST-TestReplicationHandler.doTestIndexAndConfigAliasReplication-seed#[181748B72164BC05]) [    ] o.a.s.c.CoreContainer New CoreContainer 816058870
   [junit4]   2> 2404447 INFO  (TEST-TestReplicationHandler.doTestIndexAndConfigAliasReplication-seed#[181748B72164BC05]) [    ] o.a.s.c.CoreContainer Loading cores into CoreContainer [instanceDir=/x1/jenkins/jenkins-slave/workspace/Lucene-Solr-NightlyTests-trunk/solr/build/solr-core/test/J1/temp/solr.handler.TestReplicationHandler_181748B72164BC05-001/solr-instance-002]
   [junit4]   2> 2404447 WARN  (TEST-TestReplicationHandler.doTestIndexAndConfigAliasReplication-seed#[181748B72164BC05]) [    ] o.a.s.c.CoreContainer Couldn't add files from /x1/jenkins/jenkins-slave/workspace/Lucene-Solr-NightlyTests-trunk/solr/build/solr-core/test/J1/temp/solr.handler.TestReplicationHandler_181748B72164BC05-001/solr-instance-002/lib to classpath: /x1/jenkins/jenkins-slave/workspace/Lucene-Solr-NightlyTests-trunk/solr/build/solr-core/test/J1/temp/solr.handler.TestReplicationHandler_181748B72164BC05-001/solr-instance-002/lib
   [junit4]   2> 2404448 INFO  (TEST-TestReplicationHandler.doTestIndexAndConfigAliasReplication-seed#[181748B72164BC05]) [    ] o.a.s.h.c.HttpShardHandlerFactory created with socketTimeout : 90000,urlScheme : ,connTimeout : 15000,maxConnectionsPerHost : 20,maxConnections : 10000,corePoolSize : 0,maximumPoolSize : 2147483647,maxThreadIdleTime : 5,sizeOfQueue : -1,fairnessPolicy : false,useRetries : false,
   [junit4]   2> 2404448 INFO  (TEST-TestReplicationHandler.doTestIndexAndConfigAliasReplication-seed#[181748B72164BC05]) [    ] o.a.s.u.UpdateShardHandler Creating UpdateShardHandler HTTP client with params: socketTimeout=340000&connTimeout=45000&retry=true
   [junit4]   2> 2404449 INFO  (TEST-TestReplicationHandler.doTestIndexAndConfigAliasReplication-seed#[181748B72164BC05]) [    ] o.a.s.l.LogWatcher SLF4J impl is org.slf4j.impl.Log4jLoggerFactory
   [junit4]   2> 2404449 INFO  (TEST-TestReplicationHandler.doTestIndexAndConfigAliasReplication-seed#[181748B72164BC05]) [    ] o.a.s.l.LogWatcher Registering Log Listener [Log4j (org.slf4j.impl.Log4jLoggerFactory)]
   [junit4]   2> 2404449 INFO  (TEST-TestReplicationHandler.doTestIndexAndConfigAliasReplication-seed#[181748B72164BC05]) [    ] o.a.s.c.CoreContainer Security conf doesn't exist. Skipping setup for authorization module.
   [junit4]   2> 2404449 INFO  (TEST-TestReplicationHandler.doTestIndexAndConfigAliasReplication-seed#[181748B72164BC05]) [    ] o.a.s.c.CoreContainer No authentication plugin used.
   [junit4]   2> 2404450 INFO  (TEST-TestReplicationHandler.doTestIndexAndConfigAliasReplication-seed#[181748B72164BC05]) [    ] o.a.s.c.CorePropertiesLocator Looking for core definitions underneath /x1/jenkins/jenkins-slave/workspace/Lucene-Solr-NightlyTests-trunk/solr/build/solr-core/test/J1/temp/solr.handler.TestReplicationHandler_181748B72164BC05-001/solr-instance-002/.
   [junit4]   2> 2404451 INFO  (TEST-TestReplicationHandler.doTestIndexAndConfigAliasReplication-seed#[181748B72164BC05]) [    ] o.a.s.c.CoreDescriptor Created CoreDescriptor: {name=collection1, config=solrconfig.xml, loadOnStartup=true, schema=schema.xml, configSetProperties=configsetprops.json, transient=false, dataDir=data/}
   [junit4]   2> 2404451 INFO  (TEST-TestReplicationHandler.doTestIndexAndConfigAliasReplication-seed#[181748B72164BC05]) [    ] o.a.s.c.CorePropertiesLocator Found core collection1 in /x1/jenkins/jenkins-slave/workspace/Lucene-Solr-NightlyTests-trunk/solr/build/solr-core/test/J1/temp/solr.handler.TestReplicationHandler_181748B72164BC05-001/solr-instance-002/./collection1
   [junit4]   2> 2404451 INFO  (TEST-TestReplicationHandler.doTestIndexAndConfigAliasReplication-seed#[181748B72164BC05]) [    ] o.a.s.c.CorePropertiesLocator Found 1 core definitions
   [junit4]   2> 2404457 INFO  (coreLoadExecutor-3528-thread-1) [    ] o.a.s.c.SolrResourceLoader new SolrResourceLoader for directory: '/x1/jenkins/jenkins-slave/workspace/Lucene-Solr-NightlyTests-trunk/solr/build/solr-core/test/J1/temp/solr.handler.TestReplicationHandler_181748B72164BC05-001/solr-instance-002/collection1'
   [junit4]   2> 2404457 INFO  (coreLoadExecutor-3528-thread-1) [    ] o.a.s.c.SolrResourceLoader JNDI not configured for solr (NoInitialContextEx)
   [junit4]   2> 2404458 INFO  (coreLoadExecutor-3528-thread-1) [    ] o.a.s.c.SolrResourceLoader solr home defaulted to 'solr/' (could not find system property or JNDI)
   [junit4]   2> 2404463 INFO  (coreLoadExecutor-3528-thread-1) [    ] o.a.s.c.SolrConfig current version of requestparams : -1
   [junit4]   2> 2404466 INFO  (coreLoadExecutor-3528-thread-1) [    ] o.a.s.c.SolrConfig Using Lucene MatchVersion: 6.0.0
   [junit4]   2> 2404471 INFO  (TEST-TestReplicationHandler.doTestIndexAndConfigAliasReplication-seed#[181748B72164BC05]) [    ] o.a.s.s.SolrDispatchFilter user.dir=/x1/jenkins/jenkins-slave/workspace/Lucene-Solr-NightlyTests-trunk/solr/build/solr-core/test/J1
   [junit4]   2> 2404471 INFO  (TEST-TestReplicationHandler.doTestIndexAndConfigAliasReplication-seed#[181748B72164BC05]) [    ] o.a.s.s.SolrDispatchFilter SolrDispatchFilter.init() done
   [junit4]   2> 2404472 INFO  (coreLoadExecutor-3528-thread-1) [    ] o.a.s.c.SolrConfig Loaded SolrConfig: solrconfig.xml
   [junit4]   2> 2404476 INFO  (coreLoadExecutor-3528-thread-1) [    ] o.a.s.s.IndexSchema [collection1] Schema name=test
   [junit4]   2> 2404478 INFO  (coreLoadExecutor-3528-thread-1) [    ] o.a.s.s.IndexSchema unique key field: id
   [junit4]   2> 2404479 INFO  (coreLoadExecutor-3528-thread-1) [    ] o.a.s.c.ConfigSetProperties Did not find ConfigSet properties, assuming default properties: Can't find resource 'configsetprops.json' in classpath or '/x1/jenkins/jenkins-slave/workspace/Lucene-Solr-NightlyTests-trunk/solr/build/solr-core/test/J1/temp/solr.handler.TestReplicationHandler_181748B72164BC05-001/solr-instance-002/collection1'
   [junit4]   2> 2404479 INFO  (coreLoadExecutor-3528-thread-1) [    ] o.a.s.c.CoreContainer Creating SolrCore 'collection1' using configuration from instancedir /x1/jenkins/jenkins-slave/workspace/Lucene-Solr-NightlyTests-trunk/solr/build/solr-core/test/J1/temp/solr.handler.TestReplicationHandler_181748B72164BC05-001/solr-instance-002/./collection1
   [junit4]   2> 2404480 INFO  (coreLoadExecutor-3528-thread-1) [    x:collection1] o.a.s.c.SolrCore org.apache.solr.core.MockDirectoryFactory
   [junit4]   2> 2404480 INFO  (coreLoadExecutor-3528-thread-1) [    x:collection1] o.a.s.c.SolrCore [[collection1] ] Opening new SolrCore at [/x1/jenkins/jenkins-slave/workspace/Lucene-Solr-NightlyTests-trunk/solr/build/solr-core/test/J1/temp/solr.handler.TestReplicationHandler_181748B72164BC05-001/solr-instance-002/collection1], dataDir=[/x1/jenkins/jenkins-slave/workspace/Lucene-Solr-NightlyTests-trunk/solr/build/solr-core/test/J1/temp/solr.handler.TestReplicationHandler_181748B72164BC05-001/solr-instance-002/./collection1/data/]
   [junit4]   2> 2404480 INFO  (coreLoadExecutor-3528-thread-1) [    x:collection1] o.a.s.c.SolrCore JMX monitoring not detected for core: collection1
   [junit4]   2> 2404480 INFO  (coreLoadExecutor-3528-thread-1) [    x:collection1] o.a.s.c.CachingDirectoryFactory return new directory for /x1/jenkins/jenkins-slave/workspace/Lucene-Solr-NightlyTests-trunk/solr/build/solr-core/test/J1/temp/solr.handler.TestReplicationHandler_181748B72164BC05-001/solr-instance-002/./collection1/data
   [junit4]   2> 2404480 INFO  (coreLoadExecutor-3528-thread-1) [    x:collection1] o.a.s.c.SolrCore New index directory detected: old=null new=/x1/jenkins/jenkins-slave/workspace/Lucene-Solr-NightlyTests-trunk/solr/build/solr-core/test/J1/temp/solr.handler.TestReplicationHandler_181748B72164BC05-001/solr-instance-002/./collection1/data/index/
   [junit4]   2> 2404480 WARN  (coreLoadExecutor-3528-thread-1) [    x:collection1] o.a.s.c.SolrCore [collection1] Solr index directory '/x1/jenkins/jenkins-slave/workspace/Lucene-Solr-NightlyTests-trunk/solr/build/solr-core/test/J1/temp/solr.handler.TestReplicationHandler_181748B72164BC05-001/solr-instance-002/./collection1/data/index' doesn't exist. Creating new index...
   [junit4]   2> 2404481 INFO  (coreLoadExecutor-3528-thread-1) [    x:collection1] o.a.s.c.CachingDirectoryFactory return new directory for /x1/jenkins/jenkins-slave/workspace/Lucene-Solr-NightlyTests-trunk/solr/build/solr-core/test/J1/temp/solr.handler.TestReplicationHandler_181748B72164BC05-001/solr-instance-002/./collection1/data/index
   [junit4]   2> 2404481 INFO  (coreLoadExecutor-3528-thread-1) [    x:collection1] o.a.s.u.RandomMergePolicy RandomMergePolicy wrapping class org.apache.lucene.index.TieredMergePolicy: [TieredMergePolicy: maxMergeAtOnce=15, maxMergeAtOnceExplicit=47, maxMergedSegmentMB=83.0146484375, floorSegmentMB=0.447265625, forceMergeDeletesPctAllowed=15.49594441434048, segmentsPerTier=18.0, maxCFSSegmentSizeMB=8.796093022207999E12, noCFSRatio=0.0
   [junit4]   2> 2404481 INFO  (coreLoadExecutor-3528-thread-1) [    x:collection1] o.a.s.c.SolrDeletionPolicy SolrDeletionPolicy.onCommit: commits: num=1
   [junit4]   2> 	commit{dir=MockDirectoryWrapper(NRTCachingDirectory(RAMDirectory@1cff5835 lockFactory=org.apache.lucene.store.SingleInstanceLockFactory@907deab; maxCacheMB=0.9013671875 maxMergeSizeMB=0.2255859375)),segFN=segments_1,generation=1}
   [junit4]   2> 2404482 INFO  (coreLoadExecutor-3528-thread-1) [    x:collection1] o.a.s.c.SolrDeletionPolicy newest commit generation = 1
   [junit4]   2> 2404482 INFO  (OldIndexDirectoryCleanupThreadForCore-collection1) [    x:collection1] o.a.s.c.SolrCore Looking for old index directories to cleanup for core collection1 in /x1/jenkins/jenkins-slave/workspace/Lucene-Solr-NightlyTests-trunk/solr/build/solr-core/test/J1/temp/solr.handler.TestReplicationHandler_181748B72164BC05-001/solr-instance-002/./collection1/data/
   [junit4]   2> 2404484 INFO  (coreLoadExecutor-3528-thread-1) [    x:collection1] o.a.s.c.SolrCore no updateRequestProcessorChain defined as default, creating implicit default
   [junit4]   2> 2404485 INFO  (coreLoadExecutor-3528-thread-1) [    x:collection1] o.a.s.h.l.XMLLoader xsltCacheLifetimeSeconds=60
   [junit4]   2> 2404485 INFO  (coreLoadExecutor-3528-thread-1) [    x:collection1] o.a.s.h.l.XMLLoader xsltCacheLifetimeSeconds=60
   [junit4]   2> 2404486 INFO  (coreLoadExecutor-3528-thread-1) [    x:collection1] o.a.s.h.l.XMLLoader xsltCacheLifetimeSeconds=60
   [junit4]   2> 2404487 INFO  (coreLoadExecutor-3528-thread-1) [    x:collection1] o.a.s.h.l.XMLLoader xsltCacheLifetimeSeconds=60
   [junit4]   2> 2404488 INFO  (coreLoadExecutor-3528-thread-1) [    x:collection1] o.a.s.c.PluginBag requestHandler : 'lazy' created with startup=lazy 
   [junit4]   2> 2404488 INFO  (coreLoadExecutor-3528-thread-1) [    x:collection1] o.a.s.c.RequestHandlers Registered paths: /admin/mbeans,standard,lazy,/update/json/docs,/admin/luke,/export,/get,/admin/properties,/update/json,/admin/threads,/update/csv,/sql,/admin/segments,/admin/system,/replication,defaults,/config,/stream,/schema,/admin/plugins,/admin/logging,/admin/ping,/update,/admin/file
   [junit4]   2> 2404488 INFO  (coreLoadExecutor-3528-thread-1) [    x:collection1] o.a.s.c.SolrCore Using default statsCache cache: org.apache.solr.search.stats.LocalStatsCache
   [junit4]   2> 2404489 INFO  (coreLoadExecutor-3528-thread-1) [    x:collection1] o.a.s.u.CommitTracker Hard AutoCommit: disabled
   [junit4]   2> 2404489 INFO  (coreLoadExecutor-3528-thread-1) [    x:collection1] o.a.s.u.CommitTracker Soft AutoCommit: disabled
   [junit4]   2> 2404489 INFO  (coreLoadExecutor-3528-thread-1) [    x:collection1] o.a.s.u.RandomMergePolicy RandomMergePolicy wrapping class org.apache.lucene.index.TieredMergePolicy: [TieredMergePolicy: maxMergeAtOnce=40, maxMergeAtOnceExplicit=34, maxMergedSegmentMB=97.7529296875, floorSegmentMB=1.9365234375, forceMergeDeletesPctAllowed=28.03063570063777, segmentsPerTier=31.0, maxCFSSegmentSizeMB=8.796093022207999E12, noCFSRatio=1.0
   [junit4]   2> 2404489 INFO  (coreLoadExecutor-3528-thread-1) [    x:collection1] o.a.s.c.SolrDeletionPolicy SolrDeletionPolicy.onInit: commits: num=1
   [junit4]   2> 	commit{dir=MockDirectoryWrapper(NRTCachingDirectory(RAMDirectory@1cff5835 lockFactory=org.apache.lucene.store.SingleInstanceLockFactory@907deab; maxCacheMB=0.9013671875 maxMergeSizeMB=0.2255859375)),segFN=segments_1,generation=1}
   [junit4]   2> 2404489 INFO  (coreLoadExecutor-3528-thread-1) [    x:collection1] o.a.s.c.SolrDeletionPolicy newest commit generation = 1
   [junit4]   2> 2404489 INFO  (coreLoadExecutor-3528-thread-1) [    x:collection1] o.a.s.s.SolrIndexSearcher Opening [Searcher@624ddf2c[collection1] main]
   [junit4]   2> 2404490 INFO  (coreLoadExecutor-3528-thread-1) [    x:collection1] o.a.s.r.ManagedResourceStorage File-based storage initialized to use dir: /x1/jenkins/jenkins-slave/workspace/Lucene-Solr-NightlyTests-trunk/solr/build/solr-core/test/J1/temp/solr.handler.TestReplicationHandler_181748B72164BC05-001/solr-instance-002/collection1/conf
   [junit4]   2> 2404490 INFO  (coreLoadExecutor-3528-thread-1) [    x:collection1] o.a.s.r.RestManager Initializing RestManager with initArgs: {storageDir=/x1/jenkins/jenkins-slave/workspace/Lucene-Solr-NightlyTests-trunk/solr/build/solr-core/test/J1/temp/solr.handler.TestReplicationHandler_181748B72164BC05-001/solr-instance-002/collection1/conf}
   [junit4]   2> 2404490 INFO  (coreLoadExecutor-3528-thread-1) [    x:collection1] o.a.s.r.ManagedResourceStorage Reading _rest_managed.json using file:dir=/x1/jenkins/jenkins-slave/workspace/Lucene-Solr-NightlyTests-trunk/solr/build/solr-core/test/J1/temp/solr.handler.TestReplicationHandler_181748B72164BC05-001/solr-instance-002/collection1/conf
   [junit4]   2> 2404490 INFO  (coreLoadExecutor-3528-thread-1) [    x:collection1] o.a.s.r.RestManager Initializing 0 registered ManagedResources
   [junit4]   2> 2404491 INFO  (coreLoadExecutor-3528-thread-1) [    x:collection1] o.a.s.h.ReplicationHandler Poll scheduled at an interval of 1000ms
   [junit4]   2> 2404492 INFO  (searcherExecutor-3529-thread-1-processing-x:collection1) [    x:collection1] o.a.s.c.SolrCore [collection1] Registered new searcher Searcher@624ddf2c[collection1] main{ExitableDirectoryReader(UninvertingDirectoryReader())}
   [junit4]   2> 2404492 INFO  (coreLoadExecutor-3528-thread-1) [    x:collection1] o.a.s.c.CoreContainer registering core: collection1
   [junit4]   2> 2404494 INFO  (qtp154664561-21503) [    x:collection1] o.a.s.c.S.Request [collection1]  webapp=/solr path=/replication params={qt=/replication&wt=javabin&version=2&command=indexversion} status=0 QTime=0
   [junit4]   2> 2404974 INFO  (qtp154664561-21504) [    x:collection1] o.a.s.c.S.Request [collection1]  webapp=/solr path=/select params={q=*:*&sort=id+desc&wt=javabin&version=2} hits=0 status=0 QTime=0
   [junit4]   2> 2404977 INFO  (qtp154664561-21505) [    x:collection1] o.a.s.u.p.LogUpdateProcessorFactory [collection1]  webapp=/solr path=/update params={wt=javabin&version=2}{add=[0]} 0 1
   [junit4]   2> 2404979 INFO  (qtp154664561-21506) [    x:collection1] o.a.s.u.p.LogUpdateProcessorFactory [collection1]  webapp=/solr path=/update params={wt=javabin&version=2}{add=[1]} 0 0
   [junit4]   2> 2404981 INFO  (qtp154664561-21507) [    x:collection1] o.a.s.u.p.LogUpdateProcessorFactory [collection1]  webapp=/solr path=/update params={wt=javabin&version=2}{add=[2]} 0 0
   [junit4]   2> 2404983 INFO  (qtp154664561-21503) [    x:collection1] o.a.s.u.p.LogUpdateProcessorFactory [collection1]  webapp=/solr path=/update params={wt=javabin&version=2}{add=[3]} 0 0
   [junit4]   2> 2404985 INFO  (qtp154664561-21504) [    x:collection1] o.a.s.u.p.LogUpdateProcessorFactory [collection1]  webapp=/solr path=/update params={wt=javabin&version=2}{add=[4]} 0 0
   [junit4]   2> 2404986 INFO  (qtp154664561-21505) [    x:collection1] o.a.s.u.p.LogUpdateProcessorFactory [collection1]  webapp=/solr path=/update params={wt=javabin&version=2}{add=[5]} 0 0
   [junit4]   2> 2404990 INFO  (qtp154664561-21506) [    x:collection1] o.a.s.u.p.LogUpdateProcessorFactory [collection1]  webapp=/solr path=/update params={wt=javabin&version=2}{add=[6]} 0 2
   [junit4]   2> 2404993 INFO  (qtp154664561-21507) [    x:collection1] o.a.s.u.p.LogUpdateProcessorFactory [collection1]  webapp=/solr path=/update params={wt=javabin&version=2}{add=[7]} 0 0
   [junit4]   2> 2404994 INFO  (qtp154664561-21503) [    x:collection1] o.a.s.u.p.LogUpdateProcessorFactory [collection1]  webapp=/solr path=/update params={wt=javabin&version=2}{add=[8]} 0 0
   [junit4]   2> 2404996 INFO  (qtp154664561-21504) [    x:collection1] o.a.s.u.p.LogUpdateProcessorFactory [collection1]  webapp=/solr path=/update params={wt=javabin&version=2}{add=[9]} 0 0
   [junit4]   2> 2404998 INFO  (qtp154664561-21505) [    x:collection1] o.a.s.u.p.LogUpdateProcessorFactory [collection1]  webapp=/solr path=/update params={wt=javabin&version=2}{add=[10]} 0 0
   [junit4]   2> 2405000 INFO  (qtp154664561-21506) [    x:collection1] o.a.s.u.p.LogUpdateProcessorFactory [collection1]  webapp=/solr path=/update params={wt=javabin&version=2}{add=[11]} 0 0
   [junit4]   2> 2405001 INFO  (qtp154664561-21507) [    x:collection1] o.a.s.u.p.LogUpdateProcessorFactory [collection1]  webapp=/solr path=/update params={wt=javabin&version=2}{add=[12]} 0 0
   [junit4]   2> 2405007 INFO  (qtp154664561-21503) [    x:collection1] o.a.s.u.p.LogUpdateProcessorFactory [collection1]  webapp=/solr path=/update params={wt=javabin&version=2}{add=[13]} 0 4
   [junit4]   2> 2405009 INFO  (qtp154664561-21504) [    x:collection1] o.a.s.u.p.LogUpdateProcessorFactory [collection1]  webapp=/solr path=/update params={wt=javabin&version=2}{add=[14]} 0 0
   [junit4]   2> 2405011 INFO  (qtp154664561-21505) [    x:collection1] o.a.s.u.p.LogUpdateProcessorFactory [collection1]  webapp=/solr path=/update params={wt=javabin&version=2}{add=[15]} 0 0
   [junit4]   2> 2405013 INFO  (qtp154664561-21506) [    x:collection1] o.a.s.u.p.LogUpdateProcessorFactory [collection1]  webapp=/solr path=/update params={wt=javabin&version=2}{add=[16]} 0 0
   [junit4]   2> 2405015 INFO  (qtp154664561-21507) [    x:collection1] o.a.s.u.p.LogUpdateProcessorFactory [collection1]  webapp=/solr path=/update params={wt=javabin&version=2}{add=[17]} 0 0
   [junit4]   2> 2405016 INFO  (qtp154664561-21503) [    x:collection1] o.a.s.u.p.LogUpdateProcessorFactory [collection1]  webapp=/solr path=/update params={wt=javabin&version=2}{add=[18]} 0 0
   [junit4]   2> 2405018 INFO  (qtp154664561-21504) [    x:collection1] o.a.s.u.p.LogUpdateProcessorFactory [collection1]  webapp=/solr path=/update params={wt=javabin&version=2}{add=[19]} 0 0
   [junit4]   2> 2405021 INFO  (qtp154664561-21505) [    x:collection1] o.a.s.u.p.LogUpdateProcessorFactory [collection1]  webapp=/solr path=/update params={wt=javabin&version=2}{add=[20]} 0 1
   [junit4]   2> 2405023 INFO  (qtp154664561-21506) [    x:collection1] o.a.s.u.p.LogUpdateProcessorFactory [collection1]  webapp=/solr path=/update params={wt=javabin&version=2}{add=[21]} 0 0
   [junit4]   2> 2405031 INFO  (qtp154664561-21507) [    x:collection1] o.a.s.u.p.LogUpdateProcessorFactory [collection1]  webapp=/solr path=/update params={wt=javabin&version=2}{add=[22]} 0 0
   [junit4]   2> 2405033 INFO  (qtp154664561-21503) [    x:collection1] o.a.s.u.p.LogUpdateProcessorFactory [collection1]  webapp=/solr path=/update params={wt=javabin&version=2}{add=[23]} 0 0
   [junit4]   2> 2405034 INFO  (qtp154664561-21504) [    x:collection1] o.a.s.u.p.LogUpdateProcessorFactory [collection1]  webapp=/solr path=/update params={wt=javabin&version=2}{add=[24]} 0 0
   [junit4]   2> 2405036 INFO  (qtp154664561-21505) [    x:collection1] o.a.s.u.p.LogUpdateProcessorFactory [collection1]  webapp=/solr path=/update params={wt=javabin&version=2}{add=[25]} 0 0
   [junit4]   2> 2405047 INFO  (qtp154664561-21506) [    x:collection1] o.a.s.u.p.LogUpdateProcessorFactory [collection1]  webapp=/solr path=/update params={wt=javabin&version=2}{add=[26]} 0 0
   [junit4]   2> 2405055 INFO  (qtp154664561-21507) [    x:collection1] o.a.s.u.p.LogUpdateProcessorFactory [collection1]  webapp=/solr path=/update params={wt=javabin&version=2}{add=[27]} 0 3
   [junit4]   2> 2405057 INFO  (qtp154664561-21503) [    x:collection1] o.a.s.u.p.LogUpdateProcessorFactory [collection1]  webapp=/solr path=/update params={wt=javabin&version=2}{add=[28]} 0 0
   [junit4]   2> 2405058 INFO  (qtp154664561-21504) [    x:collection1] o.a.s.u.p.LogUpdateProcessorFactory [collection1]  webapp=/solr path=/update params={wt=javabin&version=2}{add=[29]} 0 0
   [junit4]   2> 2405060 INFO  (qtp154664561-21505) [    x:collection1] o.a.s.u.p.LogUpdateProcessorFactory [collection1]  webapp=/solr path=/update params={wt=javabin&version=2}{add=[30]} 0 0
   [junit4]   2> 2405062 INFO  (qtp154664561-21506) [    x:collection1] o.a.s.u.p.LogUpdateProcessorFactory [collection1]  webapp=/solr path=/update params={wt=javabin&version=2}{add=[31]} 0 0
   [junit4]   2> 2405064 INFO  (qtp154664561-21507) [    x:collection1] o.a.s.u.p.LogUpdateProcessorFactory [collection1]  webapp=/solr path=/update params={wt=javabin&version=2}{add=[32]} 0 0
   [junit4]   2> 2405065 INFO  (qtp154664561-21503) [    x:collection1] o.a.s.u.p.LogUpdateProcessorFactory [collection1]  webapp=/solr path=/update params={wt=javabin&version=2}{add=[33]} 0 0
   [junit4]   2> 2405068 INFO  (qtp154664561-21504) [    x:collection1] o.a.s.u.p.LogUpdateProcessorFactory [collection1]  webapp=/solr path=/update params={wt=javabin&version=2}{add=[34]} 0 1
   [junit4]   2> 2405070 INFO  (qtp154664561-21505) [    x:collection1] o.a.s.u.p.LogUpdateProcessorFactory [collection1]  webapp=/solr path=/update params={wt=javabin&version=2}{add=[35]} 0 0
   [junit4]   2> 2405072 INFO  (qtp154664561-21506) [    x:collection1] o.a.s.u.p.LogUpdateProcessorFactory [collection1]  webapp=/solr path=/update params={wt=javabin&version=2}{add=[36]} 0 0
   [junit4]   2> 2405074 INFO  (qtp154664561-21507) [    x:collection1] o.a.s.u.p.LogUpdateProcessorFactory [collection1]  webapp=/solr path=/update params={wt=javabin&version=2}{add=[37]} 0 0
   [junit4]   2> 2405075 INFO  (qtp154664561-21503) [    x:collection1] o.a.s.u.p.LogUpdateProcessorFactory [collection1]  webapp=/solr path=/update params={wt=javabin&version=2}{add=[38]} 0 0
   [junit4]   2> 2405077 INFO  (qtp154664561-21504) [    x:collection1] o.a.s.u.p.LogUpdateProcessorFactory [collection1]  webapp=/solr path=/update params={wt=javabin&version=2}{add=[39]} 0 0
   [junit4]   2> 2405079 INFO  (qtp154664561-21505) [    x:collection1] o.a.s.u.p.LogUpdateProcessorFactory [collection1]  webapp=/solr path=/update params={wt=javabin&version=2}{add=[40]} 0 0
   [junit4]   2> 2405082 INFO  (qtp154664561-21506) [    x:collection1] o.a.s.u.p.LogUpdateProcessorFactory [collection1]  webapp=/solr path=/update params={wt=javabin&version=2}{add=[41]} 0 1
   [junit4]   2> 2405084 INFO  (qtp154664561-21507) [    x:collection1] o.a.s.u.p.LogUpdateProcessorFactory [collection1]  webapp=/solr path=/update params={wt=javabin&version=2}{add=[42]} 0 0
   [junit4]   2> 2405086 INFO  (qtp154664561-21503) [    x:collection1] o.a.s.u.p.LogUpdateProcessorFactory [collection1]  webapp=/solr path=/update params={wt=javabin&version=2}{add=[43]} 0 0
   [junit4]   2> 2405088 INFO  (qtp154664561-21504) [    x:collection1] o.a.s.u.p.LogUpdateProcessorFactory [collection1]  webapp=/solr path=/update params={wt=javabin&version=2}{add=[44]} 0 0
   [junit4]   2> 2405090 INFO  (qtp154664561-21505) [    x:collection1] o.a.s.u.p.LogUpdateProcessorFactory [collection1]  webapp=/solr path=/update params={wt=javabin&version=2}{add=[45]} 0 0
   [junit4]   2> 2405091 INFO  (qtp154664561-21506) [    x:collection1] o.a.s.u.p.LogUpdateProcessorFactory [collection1]  webapp=/solr path=/update params={wt=javabin&version=2}{add=[46]} 0 0
   [junit4]   2> 2405093 INFO  (qtp154664561-21507) [    x:collection1] o.a.s.u.p.LogUpdateProcessorFactory [collection1]  webapp=/solr path=/update params={wt=javabin&version=2}{add=[47]} 0 0
   [junit4]   2> 2405096 INFO  (qtp154664561-21503) [    x:collection1] o.a.s.u.p.LogUpdateProcessorFactory [collection1]  webapp=/solr path=/update params={wt=javabin&version=2}{add=[48]} 0 1
   [junit4]   2> 2405098 INFO  (qtp154664561-21504) [    x:collection1] o.a.s.u.p.LogUpdateProcessorFactory [collection1]  webapp=/solr path=/update params={wt=javabin&version=2}{add=[49]} 0 0
   [junit4]   2> 2405100 INFO  (qtp154664561-21505) [    x:collection1] o.a.s.u.p.LogUpdateProcessorFactory [collection1]  webapp=/solr path=/update params={wt=javabin&version=2}{add=[50]} 0 0
   [junit4]   2> 2405101 INFO  (qtp154664561-21506) [    x:collection1] o.a.s.u.p.LogUpdateProcessorFactory [collection1]  webapp=/solr path=/update params={wt=javabin&version=2}{add=[51]} 0 0
   [junit4]   2> 2405103 INFO  (qtp154664561-21507) [    x:collection1] o.a.s.u.p.LogUpdateProcessorFactory [collection1]  webapp=/solr path=/update params={wt=javabin&version=2}{add=[52]} 0 0
   [junit4]   2> 2405105 INFO  (qtp154664561-21503) [    x:collection1] o.a.s.u.p.LogUpdateProcessorFactory [collection1]  webapp=/solr path=/update params={wt=javabin&version=2}{add=[53]} 0 0
   [junit4]   2> 2405107 INFO  (qtp154664561-21504) [    x:collection1] o.a.s.u.p.LogUpdateProcessorFactory [collection1]  webapp=/solr path=/update params={wt=javabin&version=2}{add=[54]} 0 0
   [junit4]   2> 2405109 INFO  (qtp154664561-21505) [    x:collection1] o.a.s.u.p.LogUpdateProcessorFactory [collection1]  webapp=/solr path=/update params={wt=javabin&version=2}{add=[55]} 0 1
   [junit4]   2> 2405112 INFO  (qtp154664561-21506) [    x:collection1] o.a.s.u.p.LogUpdateProcessorFactory [collection1]  webapp=/solr path=/update params={wt=javabin&version=2}{add=[56]} 0 0
   [junit4]   2> 2405113 INFO  (qtp154664561-21507) [    x:collection1] o.a.s.u.p.LogUpdateProcessorFactory [collection1]  webapp=/solr path=/update params={wt=javabin&version=2}{add=[57]} 0 0
   [junit4]   2> 2405115 INFO  (qtp154664561-21503) [    x:collection1] o.a.s.u.p.LogUpdateProcessorFactory [collection1]  webapp=/solr path=/update params={wt=javabin&version=2}{add=[58]} 0 0
   [junit4]   2> 2405117 INFO  (qtp154664561-21504) [    x:collection1] o.a.s.u.p.LogUpdateProcessorFactory [collection1]  webapp=/solr path=/update params={wt=javabin&version=2}{add=[59]} 0 0
   [junit4]   2> 2405119 INFO  (qtp154664561-21505) [    x:collection1] o.a.s.u.p.LogUpdateProcessorFactory [collection1]  webapp=/solr path=/update params={wt=javabin&version=2}{add=[60]} 0 0
   [junit4]   2> 2405120 INFO  (qtp154664561-21506) [    x:collection1] o.a.s.u.p.LogUpdateProcessorFactory [collection1]  webapp=/solr path=/update params={wt=javabin&version=2}{add=[61]} 0 0
   [junit4]   2> 2405123 INFO  (qtp154664561-21507) [    x:collection1] o.a.s.u.p.LogUpdateProcessorFactory [collection1]  webapp=/solr path=/update params={wt=javabin&version=2}{add=[62]} 0 1
   [junit4]   2> 2405125 INFO  (qtp154664561-21503) [    x:collection1] o.a.s.u.p.LogUpdateProcessorFactory [collection1]  webapp=/solr path=/update params={wt=javabin&version=2}{add=[63]} 0 0
   [junit4]   2> 2405127 INFO  (qtp154664561-21504) [    x:collection1] o.a.s.u.p.LogUpdateProcessorFactory [collection1]  webapp=/solr path=/update params={wt=javabin&version=2}{add=[64]} 0 0
   [junit4]   2> 2405129 INFO  (qtp154664561-21505) [    x:collection1] o.a.s.u.p.LogUpdateProcessorFactory [collection1]  webapp=/solr path=/update params={wt=javabin&version=2}{add=[65]} 0 0
   [junit4]   2> 2405131 INFO  (qtp154664561-21506) [    x:collection1] o.a.s.u.p.LogUpdateProcessorFactory [collection1]  webapp=/solr path=/update params={wt=javabin&version=2}{add=[66]} 0 0
   [junit4]   2> 2405133 INFO  (qtp154664561-21507) [    x:collection1] o.a.s.u.p.LogUpdateProcessorFactory [collection1]  webapp=/solr path=/update params={wt=javabin&version=2}{add=[67]} 0 0
   [junit4]   2> 2405134 INFO  (qtp154664561-21503) [    x:collection1] o.a.s.u.p.LogUpdateProcessorFactory [collection1]  webapp=/solr path=/update params={wt=javabin&v

[...truncated too long message...]

54 INFO  (TEST-TestReplicationHandler.doTestStopPoll-seed#[181748B72164BC05]) [    x:collection1] o.a.s.c.CachingDirectoryFactory looking to close /x1/jenkins/jenkins-slave/workspace/Lucene-Solr-NightlyTests-trunk/solr/build/solr-core/test/J1/temp/solr.handler.TestReplicationHandler_181748B72164BC05-001/solr-instance-027/./collection1/data [CachedDir<<refCount=0;path=/x1/jenkins/jenkins-slave/workspace/Lucene-Solr-NightlyTests-trunk/solr/build/solr-core/test/J1/temp/solr.handler.TestReplicationHandler_181748B72164BC05-001/solr-instance-027/./collection1/data;done=false>>]
   [junit4]   2> 3221754 INFO  (TEST-TestReplicationHandler.doTestStopPoll-seed#[181748B72164BC05]) [    x:collection1] o.a.s.c.CachingDirectoryFactory Closing directory: /x1/jenkins/jenkins-slave/workspace/Lucene-Solr-NightlyTests-trunk/solr/build/solr-core/test/J1/temp/solr.handler.TestReplicationHandler_181748B72164BC05-001/solr-instance-027/./collection1/data
   [junit4]   2> 3221755 INFO  (TEST-TestReplicationHandler.doTestStopPoll-seed#[181748B72164BC05]) [    x:collection1] o.e.j.s.h.ContextHandler Stopped o.e.j.s.ServletContextHandler@7c34c5e0{/solr,null,UNAVAILABLE}
   [junit4]   2> 3221760 INFO  (TEST-TestReplicationHandler.doTestStopPoll-seed#[181748B72164BC05]) [    ] o.e.j.s.ServerConnector Stopped ServerConnector@23216e02{HTTP/1.1}{127.0.0.1:0}
   [junit4]   2> 3221760 INFO  (TEST-TestReplicationHandler.doTestStopPoll-seed#[181748B72164BC05]) [    ] o.a.s.c.CoreContainer Shutting down CoreContainer instance=1001429698
   [junit4]   2> 3221760 INFO  (TEST-TestReplicationHandler.doTestStopPoll-seed#[181748B72164BC05]) [    x:collection1] o.a.s.c.SolrCore [collection1]  CLOSING SolrCore org.apache.solr.core.SolrCore@6800ba89
   [junit4]   2> 3221760 INFO  (TEST-TestReplicationHandler.doTestStopPoll-seed#[181748B72164BC05]) [    x:collection1] o.a.s.u.DirectUpdateHandler2 closing DirectUpdateHandler2{commits=0,autocommits=0,soft autocommits=0,optimizes=0,rollbacks=0,expungeDeletes=0,docsPending=0,adds=0,deletesById=0,deletesByQuery=0,errors=0,cumulative_adds=0,cumulative_deletesById=0,cumulative_deletesByQuery=0,cumulative_errors=0}
   [junit4]   2> 3221760 INFO  (TEST-TestReplicationHandler.doTestStopPoll-seed#[181748B72164BC05]) [    x:collection1] o.a.s.u.SolrCoreState Closing SolrCoreState
   [junit4]   2> 3221761 INFO  (TEST-TestReplicationHandler.doTestStopPoll-seed#[181748B72164BC05]) [    x:collection1] o.a.s.u.DefaultSolrCoreState SolrCoreState ref count has reached 0 - closing IndexWriter
   [junit4]   2> 3221761 INFO  (TEST-TestReplicationHandler.doTestStopPoll-seed#[181748B72164BC05]) [    x:collection1] o.a.s.u.DefaultSolrCoreState closing IndexWriter with IndexWriterCloser
   [junit4]   2> 3221762 INFO  (TEST-TestReplicationHandler.doTestStopPoll-seed#[181748B72164BC05]) [    x:collection1] o.a.s.c.SolrCore [collection1] Closing main searcher on request.
   [junit4]   2> 3221762 INFO  (TEST-TestReplicationHandler.doTestStopPoll-seed#[181748B72164BC05]) [    x:collection1] o.a.s.c.CachingDirectoryFactory Closing MockDirectoryFactory - 2 directories currently being tracked
   [junit4]   2> 3221762 INFO  (TEST-TestReplicationHandler.doTestStopPoll-seed#[181748B72164BC05]) [    x:collection1] o.a.s.c.CachingDirectoryFactory looking to close /x1/jenkins/jenkins-slave/workspace/Lucene-Solr-NightlyTests-trunk/solr/build/solr-core/test/J1/temp/solr.handler.TestReplicationHandler_181748B72164BC05-001/solr-instance-028/./collection1/data/index [CachedDir<<refCount=0;path=/x1/jenkins/jenkins-slave/workspace/Lucene-Solr-NightlyTests-trunk/solr/build/solr-core/test/J1/temp/solr.handler.TestReplicationHandler_181748B72164BC05-001/solr-instance-028/./collection1/data/index;done=false>>]
   [junit4]   2> 3221762 INFO  (TEST-TestReplicationHandler.doTestStopPoll-seed#[181748B72164BC05]) [    x:collection1] o.a.s.c.CachingDirectoryFactory Closing directory: /x1/jenkins/jenkins-slave/workspace/Lucene-Solr-NightlyTests-trunk/solr/build/solr-core/test/J1/temp/solr.handler.TestReplicationHandler_181748B72164BC05-001/solr-instance-028/./collection1/data/index
   [junit4]   2> 3221762 INFO  (TEST-TestReplicationHandler.doTestStopPoll-seed#[181748B72164BC05]) [    x:collection1] o.a.s.c.CachingDirectoryFactory looking to close /x1/jenkins/jenkins-slave/workspace/Lucene-Solr-NightlyTests-trunk/solr/build/solr-core/test/J1/temp/solr.handler.TestReplicationHandler_181748B72164BC05-001/solr-instance-028/./collection1/data [CachedDir<<refCount=0;path=/x1/jenkins/jenkins-slave/workspace/Lucene-Solr-NightlyTests-trunk/solr/build/solr-core/test/J1/temp/solr.handler.TestReplicationHandler_181748B72164BC05-001/solr-instance-028/./collection1/data;done=false>>]
   [junit4]   2> 3221762 INFO  (TEST-TestReplicationHandler.doTestStopPoll-seed#[181748B72164BC05]) [    x:collection1] o.a.s.c.CachingDirectoryFactory Closing directory: /x1/jenkins/jenkins-slave/workspace/Lucene-Solr-NightlyTests-trunk/solr/build/solr-core/test/J1/temp/solr.handler.TestReplicationHandler_181748B72164BC05-001/solr-instance-028/./collection1/data
   [junit4]   2> 3221763 INFO  (TEST-TestReplicationHandler.doTestStopPoll-seed#[181748B72164BC05]) [    x:collection1] o.e.j.s.h.ContextHandler Stopped o.e.j.s.ServletContextHandler@74345ebf{/solr,null,UNAVAILABLE}
   [junit4]   2> 3221765 INFO  (SUITE-TestReplicationHandler-seed#[181748B72164BC05]-worker) [    ] o.a.s.SolrTestCaseJ4 ###deleteCore
   [junit4]   2> NOTE: leaving temporary files on disk at: /x1/jenkins/jenkins-slave/workspace/Lucene-Solr-NightlyTests-trunk/solr/build/solr-core/test/J1/temp/solr.handler.TestReplicationHandler_181748B72164BC05-001
   [junit4]   2> NOTE: test params are: codec=Asserting(Lucene60): {name=Lucene50(blocksize=128), id=Lucene50(blocksize=128), newname=Lucene50(blocksize=128)}, docValues:{}, sim=RandomSimilarityProvider(queryNorm=false,coord=yes): {}, locale=sl-SI, timezone=America/Port_of_Spain
   [junit4]   2> NOTE: Linux 3.13.0-52-generic amd64/Oracle Corporation 1.8.0_66 (64-bit)/cpus=4,threads=1,free=261463312,total=531103744
   [junit4]   2> NOTE: All tests run in this JVM: [TestUpdate, TestConfigOverlay, HdfsBasicDistributedZk2Test, AliasIntegrationTest, DocValuesMissingTest, SuggestComponentTest, SolrPluginUtilsTest, ShardRoutingTest, FileUtilsTest, TestLeaderElectionZkExpiry, TestDFRSimilarityFactory, DocValuesTest, RecoveryAfterSoftCommitTest, TestCodecSupport, OpenExchangeRatesOrgProviderTest, SpellCheckCollatorTest, TestHdfsUpdateLog, TestReqParamsAPI, TestLFUCache, ExitableDirectoryReaderTest, DistributedExpandComponentTest, CloudMLTQParserTest, OverseerRolesTest, BasicFunctionalityTest, SchemaVersionSpecificBehaviorTest, HdfsWriteToMultipleCollectionsTest, FastVectorHighlighterTest, TestBlobHandler, RestartWhileUpdatingTest, TestFieldTypeResource, UniqFieldsUpdateProcessorFactoryTest, TestReloadDeadlock, AddBlockUpdateTest, TestOverriddenPrefixQueryForCustomFieldType, TestCursorMarkWithoutUniqueKey, TestStressVersions, TestRandomMergePolicy, MultiTermTest, TestPKIAuthenticationPlugin, TestHashPartitioner, SpellingQueryConverterTest, TermVectorComponentTest, TestExactSharedStatsCache, TestQuerySenderNoQuery, TestPivotHelperCode, DistanceFunctionTest, TestAddFieldRealTimeGet, TestLMJelinekMercerSimilarityFactory, SpellPossibilityIteratorTest, TestConfigSetsAPIExclusivity, SimplePostToolTest, TestRandomRequestDistribution, IndexBasedSpellCheckerTest, TestSchemaManager, OpenCloseCoreStressTest, TestFiltering, TestScoreJoinQPNoScore, HighlighterTest, HdfsRecoverLeaseTest, TestManagedSchemaFieldTypeResource, TestBM25SimilarityFactory, NotRequiredUniqueKeyTest, SharedFSAutoReplicaFailoverUtilsTest, IgnoreCommitOptimizeUpdateProcessorFactoryTest, ChaosMonkeyNothingIsSafeTest, TestSimpleTrackingShardHandler, DistributedMLTComponentTest, TestInfoStreamLogging, MergeStrategyTest, WordBreakSolrSpellCheckerTest, BlockJoinFacetRandomTest, TestCloudPivotFacet, AnalyticsMergeStrategyTest, SolrInfoMBeanTest, DOMUtilTest, ClusterStateUpdateTest, TestDistributedGrouping, DistributedIntervalFacetingTest, MoreLikeThisHandlerTest, TestSerializedLuceneMatchVersion, SmileWriterTest, DistributedQueueTest, TestMiniSolrCloudClusterBase, SolrIndexConfigTest, TestReloadAndDeleteDocs, TestChildDocTransformer, DistribCursorPagingTest, DataDrivenBlockJoinTest, TestCoreContainer, CdcrReplicationHandlerTest, TestSolrCloudWithKerberosAlt, TestPartialUpdateDeduplication, LeaderElectionIntegrationTest, BasicZkTest, RecoveryZkTest, TestReplicationHandler]
   [junit4] Completed [423/576 (1!)] on J1 in 817.87s, 13 tests, 1 failure <<< FAILURES!

[...truncated 506 lines...]
BUILD FAILED
/x1/jenkins/jenkins-slave/workspace/Lucene-Solr-NightlyTests-trunk/build.xml:791: The following error occurred while executing this line:
/x1/jenkins/jenkins-slave/workspace/Lucene-Solr-NightlyTests-trunk/build.xml:728: The following error occurred while executing this line:
/x1/jenkins/jenkins-slave/workspace/Lucene-Solr-NightlyTests-trunk/build.xml:59: The following error occurred while executing this line:
/x1/jenkins/jenkins-slave/workspace/Lucene-Solr-NightlyTests-trunk/solr/build.xml:233: The following error occurred while executing this line:
/x1/jenkins/jenkins-slave/workspace/Lucene-Solr-NightlyTests-trunk/solr/common-build.xml:524: The following error occurred while executing this line:
/x1/jenkins/jenkins-slave/workspace/Lucene-Solr-NightlyTests-trunk/lucene/common-build.xml:1424: The following error occurred while executing this line:
/x1/jenkins/jenkins-slave/workspace/Lucene-Solr-NightlyTests-trunk/lucene/common-build.xml:981: There were test failures: 576 suites (8 ignored), 2310 tests, 1 failure, 33 ignored (18 assumptions) [seed: 181748B72164BC05]

Total time: 233 minutes 7 seconds
Build step 'Invoke Ant' marked build as failure
Archiving artifacts
No prior successful build to compare, so performing full copy of artifacts
Recording test results
Email was triggered for: Failure - Any
Sending email for trigger: Failure - Any



Mime
View raw message