lucene-dev mailing list archives

Site index · List index
Message view « Date » · « Thread »
Top « Date » · « Thread »
From Policeman Jenkins Server <jenk...@thetaphi.de>
Subject [JENKINS] Lucene-Solr-5.x-Linux (32bit/jdk1.7.0_80) - Build # 15112 - Failure!
Date Sat, 02 Jan 2016 09:55:30 GMT
Build: http://jenkins.thetaphi.de/job/Lucene-Solr-5.x-Linux/15112/
Java: 32bit/jdk1.7.0_80 -server -XX:+UseSerialGC

2 tests failed.
FAILED:  org.apache.solr.cloud.RecoveryAfterSoftCommitTest.test

Error Message:
Didn't see all replicas for shard shard1 in collection1 come up within 30000 ms! ClusterState: {   "collection1":{     "autoCreated":"true",     "router":{"name":"compositeId"},     "maxShardsPerNode":"1",     "autoAddReplicas":"false",     "shards":{"shard1":{         "range":"80000000-7fffffff",         "state":"active",         "replicas":{           "core_node1":{             "state":"active",             "node_name":"127.0.0.1:38633_f_tg%2Ff",             "base_url":"http://127.0.0.1:38633/f_tg/f",             "core":"collection1",             "leader":"true"},           "core_node2":{             "state":"recovering",             "node_name":"127.0.0.1:37240_f_tg%2Ff",             "base_url":"http://127.0.0.1:37240/f_tg/f",             "core":"collection1"}}}},     "replicationFactor":"1"},   "control_collection":{     "autoCreated":"true",     "router":{"name":"compositeId"},     "maxShardsPerNode":"1",     "autoAddReplicas":"false",     "shards":{"shard1":{         "range":"80000000-7fffffff",         "state":"active",         "replicas":{"core_node1":{             "state":"active",             "node_name":"127.0.0.1:55558_f_tg%2Ff",             "base_url":"http://127.0.0.1:55558/f_tg/f",             "core":"collection1",             "leader":"true"}}}},     "replicationFactor":"1"}}

Stack Trace:
java.lang.AssertionError: Didn't see all replicas for shard shard1 in collection1 come up within 30000 ms! ClusterState: {
  "collection1":{
    "autoCreated":"true",
    "router":{"name":"compositeId"},
    "maxShardsPerNode":"1",
    "autoAddReplicas":"false",
    "shards":{"shard1":{
        "range":"80000000-7fffffff",
        "state":"active",
        "replicas":{
          "core_node1":{
            "state":"active",
            "node_name":"127.0.0.1:38633_f_tg%2Ff",
            "base_url":"http://127.0.0.1:38633/f_tg/f",
            "core":"collection1",
            "leader":"true"},
          "core_node2":{
            "state":"recovering",
            "node_name":"127.0.0.1:37240_f_tg%2Ff",
            "base_url":"http://127.0.0.1:37240/f_tg/f",
            "core":"collection1"}}}},
    "replicationFactor":"1"},
  "control_collection":{
    "autoCreated":"true",
    "router":{"name":"compositeId"},
    "maxShardsPerNode":"1",
    "autoAddReplicas":"false",
    "shards":{"shard1":{
        "range":"80000000-7fffffff",
        "state":"active",
        "replicas":{"core_node1":{
            "state":"active",
            "node_name":"127.0.0.1:55558_f_tg%2Ff",
            "base_url":"http://127.0.0.1:55558/f_tg/f",
            "core":"collection1",
            "leader":"true"}}}},
    "replicationFactor":"1"}}
	at __randomizedtesting.SeedInfo.seed([C3B555BF024816B0:4BE16A65ACB47B48]:0)
	at org.junit.Assert.fail(Assert.java:93)
	at org.apache.solr.cloud.AbstractFullDistribZkTestBase.ensureAllReplicasAreActive(AbstractFullDistribZkTestBase.java:1844)
	at org.apache.solr.cloud.RecoveryAfterSoftCommitTest.test(RecoveryAfterSoftCommitTest.java:115)
	at sun.reflect.NativeMethodAccessorImpl.invoke0(Native Method)
	at sun.reflect.NativeMethodAccessorImpl.invoke(NativeMethodAccessorImpl.java:57)
	at sun.reflect.DelegatingMethodAccessorImpl.invoke(DelegatingMethodAccessorImpl.java:43)
	at java.lang.reflect.Method.invoke(Method.java:606)
	at com.carrotsearch.randomizedtesting.RandomizedRunner.invoke(RandomizedRunner.java:1764)
	at com.carrotsearch.randomizedtesting.RandomizedRunner$8.evaluate(RandomizedRunner.java:871)
	at com.carrotsearch.randomizedtesting.RandomizedRunner$9.evaluate(RandomizedRunner.java:907)
	at com.carrotsearch.randomizedtesting.RandomizedRunner$10.evaluate(RandomizedRunner.java:921)
	at org.apache.solr.BaseDistributedSearchTestCase$ShardsRepeatRule$ShardsFixedStatement.callStatement(BaseDistributedSearchTestCase.java:965)
	at org.apache.solr.BaseDistributedSearchTestCase$ShardsRepeatRule$ShardsStatement.evaluate(BaseDistributedSearchTestCase.java:940)
	at com.carrotsearch.randomizedtesting.rules.SystemPropertiesRestoreRule$1.evaluate(SystemPropertiesRestoreRule.java:57)
	at org.apache.lucene.util.TestRuleSetupTeardownChained$1.evaluate(TestRuleSetupTeardownChained.java:50)
	at org.apache.lucene.util.AbstractBeforeAfterRule$1.evaluate(AbstractBeforeAfterRule.java:46)
	at org.apache.lucene.util.TestRuleThreadAndTestName$1.evaluate(TestRuleThreadAndTestName.java:49)
	at org.apache.lucene.util.TestRuleIgnoreAfterMaxFailures$1.evaluate(TestRuleIgnoreAfterMaxFailures.java:65)
	at org.apache.lucene.util.TestRuleMarkFailure$1.evaluate(TestRuleMarkFailure.java:48)
	at com.carrotsearch.randomizedtesting.rules.StatementAdapter.evaluate(StatementAdapter.java:36)
	at com.carrotsearch.randomizedtesting.ThreadLeakControl$StatementRunner.run(ThreadLeakControl.java:367)
	at com.carrotsearch.randomizedtesting.ThreadLeakControl.forkTimeoutingTask(ThreadLeakControl.java:809)
	at com.carrotsearch.randomizedtesting.ThreadLeakControl$3.evaluate(ThreadLeakControl.java:460)
	at com.carrotsearch.randomizedtesting.RandomizedRunner.runSingleTest(RandomizedRunner.java:880)
	at com.carrotsearch.randomizedtesting.RandomizedRunner$5.evaluate(RandomizedRunner.java:781)
	at com.carrotsearch.randomizedtesting.RandomizedRunner$6.evaluate(RandomizedRunner.java:816)
	at com.carrotsearch.randomizedtesting.RandomizedRunner$7.evaluate(RandomizedRunner.java:827)
	at com.carrotsearch.randomizedtesting.rules.StatementAdapter.evaluate(StatementAdapter.java:36)
	at com.carrotsearch.randomizedtesting.rules.SystemPropertiesRestoreRule$1.evaluate(SystemPropertiesRestoreRule.java:57)
	at org.apache.lucene.util.AbstractBeforeAfterRule$1.evaluate(AbstractBeforeAfterRule.java:46)
	at com.carrotsearch.randomizedtesting.rules.StatementAdapter.evaluate(StatementAdapter.java:36)
	at org.apache.lucene.util.TestRuleStoreClassName$1.evaluate(TestRuleStoreClassName.java:42)
	at com.carrotsearch.randomizedtesting.rules.NoShadowingOrOverridesOnMethodsRule$1.evaluate(NoShadowingOrOverridesOnMethodsRule.java:40)
	at com.carrotsearch.randomizedtesting.rules.NoShadowingOrOverridesOnMethodsRule$1.evaluate(NoShadowingOrOverridesOnMethodsRule.java:40)
	at com.carrotsearch.randomizedtesting.rules.StatementAdapter.evaluate(StatementAdapter.java:36)
	at com.carrotsearch.randomizedtesting.rules.StatementAdapter.evaluate(StatementAdapter.java:36)
	at com.carrotsearch.randomizedtesting.rules.StatementAdapter.evaluate(StatementAdapter.java:36)
	at org.apache.lucene.util.TestRuleAssertionsRequired$1.evaluate(TestRuleAssertionsRequired.java:54)
	at org.apache.lucene.util.TestRuleMarkFailure$1.evaluate(TestRuleMarkFailure.java:48)
	at org.apache.lucene.util.TestRuleIgnoreAfterMaxFailures$1.evaluate(TestRuleIgnoreAfterMaxFailures.java:65)
	at org.apache.lucene.util.TestRuleIgnoreTestSuites$1.evaluate(TestRuleIgnoreTestSuites.java:55)
	at com.carrotsearch.randomizedtesting.rules.StatementAdapter.evaluate(StatementAdapter.java:36)
	at com.carrotsearch.randomizedtesting.ThreadLeakControl$StatementRunner.run(ThreadLeakControl.java:367)
	at java.lang.Thread.run(Thread.java:745)


FAILED:  org.apache.solr.cloud.TestMiniSolrCloudClusterBase.testBasics

Error Message:
expected:<1> but was:<0>

Stack Trace:
java.lang.AssertionError: expected:<1> but was:<0>
	at __randomizedtesting.SeedInfo.seed([C3B555BF024816B0:FE6DFB933AA648C0]:0)
	at org.junit.Assert.fail(Assert.java:93)
	at org.junit.Assert.failNotEquals(Assert.java:647)
	at org.junit.Assert.assertEquals(Assert.java:128)
	at org.junit.Assert.assertEquals(Assert.java:472)
	at org.junit.Assert.assertEquals(Assert.java:456)
	at org.apache.solr.cloud.TestMiniSolrCloudClusterBase.testCollectionCreateSearchDelete(TestMiniSolrCloudClusterBase.java:149)
	at org.apache.solr.cloud.TestMiniSolrCloudClusterBase.testBasics(TestMiniSolrCloudClusterBase.java:78)
	at sun.reflect.NativeMethodAccessorImpl.invoke0(Native Method)
	at sun.reflect.NativeMethodAccessorImpl.invoke(NativeMethodAccessorImpl.java:57)
	at sun.reflect.DelegatingMethodAccessorImpl.invoke(DelegatingMethodAccessorImpl.java:43)
	at java.lang.reflect.Method.invoke(Method.java:606)
	at com.carrotsearch.randomizedtesting.RandomizedRunner.invoke(RandomizedRunner.java:1764)
	at com.carrotsearch.randomizedtesting.RandomizedRunner$8.evaluate(RandomizedRunner.java:871)
	at com.carrotsearch.randomizedtesting.RandomizedRunner$9.evaluate(RandomizedRunner.java:907)
	at com.carrotsearch.randomizedtesting.RandomizedRunner$10.evaluate(RandomizedRunner.java:921)
	at com.carrotsearch.randomizedtesting.rules.SystemPropertiesRestoreRule$1.evaluate(SystemPropertiesRestoreRule.java:57)
	at org.apache.lucene.util.TestRuleSetupTeardownChained$1.evaluate(TestRuleSetupTeardownChained.java:50)
	at org.apache.lucene.util.AbstractBeforeAfterRule$1.evaluate(AbstractBeforeAfterRule.java:46)
	at org.apache.lucene.util.TestRuleThreadAndTestName$1.evaluate(TestRuleThreadAndTestName.java:49)
	at org.apache.lucene.util.TestRuleIgnoreAfterMaxFailures$1.evaluate(TestRuleIgnoreAfterMaxFailures.java:65)
	at org.apache.lucene.util.TestRuleMarkFailure$1.evaluate(TestRuleMarkFailure.java:48)
	at com.carrotsearch.randomizedtesting.rules.StatementAdapter.evaluate(StatementAdapter.java:36)
	at com.carrotsearch.randomizedtesting.ThreadLeakControl$StatementRunner.run(ThreadLeakControl.java:367)
	at com.carrotsearch.randomizedtesting.ThreadLeakControl.forkTimeoutingTask(ThreadLeakControl.java:809)
	at com.carrotsearch.randomizedtesting.ThreadLeakControl$3.evaluate(ThreadLeakControl.java:460)
	at com.carrotsearch.randomizedtesting.RandomizedRunner.runSingleTest(RandomizedRunner.java:880)
	at com.carrotsearch.randomizedtesting.RandomizedRunner$5.evaluate(RandomizedRunner.java:781)
	at com.carrotsearch.randomizedtesting.RandomizedRunner$6.evaluate(RandomizedRunner.java:816)
	at com.carrotsearch.randomizedtesting.RandomizedRunner$7.evaluate(RandomizedRunner.java:827)
	at com.carrotsearch.randomizedtesting.rules.StatementAdapter.evaluate(StatementAdapter.java:36)
	at com.carrotsearch.randomizedtesting.rules.SystemPropertiesRestoreRule$1.evaluate(SystemPropertiesRestoreRule.java:57)
	at org.apache.lucene.util.AbstractBeforeAfterRule$1.evaluate(AbstractBeforeAfterRule.java:46)
	at com.carrotsearch.randomizedtesting.rules.StatementAdapter.evaluate(StatementAdapter.java:36)
	at org.apache.lucene.util.TestRuleStoreClassName$1.evaluate(TestRuleStoreClassName.java:42)
	at com.carrotsearch.randomizedtesting.rules.NoShadowingOrOverridesOnMethodsRule$1.evaluate(NoShadowingOrOverridesOnMethodsRule.java:40)
	at com.carrotsearch.randomizedtesting.rules.NoShadowingOrOverridesOnMethodsRule$1.evaluate(NoShadowingOrOverridesOnMethodsRule.java:40)
	at com.carrotsearch.randomizedtesting.rules.StatementAdapter.evaluate(StatementAdapter.java:36)
	at com.carrotsearch.randomizedtesting.rules.StatementAdapter.evaluate(StatementAdapter.java:36)
	at com.carrotsearch.randomizedtesting.rules.StatementAdapter.evaluate(StatementAdapter.java:36)
	at org.apache.lucene.util.TestRuleAssertionsRequired$1.evaluate(TestRuleAssertionsRequired.java:54)
	at org.apache.lucene.util.TestRuleMarkFailure$1.evaluate(TestRuleMarkFailure.java:48)
	at org.apache.lucene.util.TestRuleIgnoreAfterMaxFailures$1.evaluate(TestRuleIgnoreAfterMaxFailures.java:65)
	at org.apache.lucene.util.TestRuleIgnoreTestSuites$1.evaluate(TestRuleIgnoreTestSuites.java:55)
	at com.carrotsearch.randomizedtesting.rules.StatementAdapter.evaluate(StatementAdapter.java:36)
	at com.carrotsearch.randomizedtesting.ThreadLeakControl$StatementRunner.run(ThreadLeakControl.java:367)
	at java.lang.Thread.run(Thread.java:745)




Build Log:
[...truncated 10983 lines...]
   [junit4] Suite: org.apache.solr.cloud.RecoveryAfterSoftCommitTest
   [junit4]   2> Creating dataDir: /home/jenkins/workspace/Lucene-Solr-5.x-Linux/solr/build/solr-core/test/J1/temp/solr.cloud.RecoveryAfterSoftCommitTest_C3B555BF024816B0-001/init-core-data-001
   [junit4]   2> 1442872 INFO  (SUITE-RecoveryAfterSoftCommitTest-seed#[C3B555BF024816B0]-worker) [    ] o.a.s.BaseDistributedSearchTestCase Setting hostContext system property: /f_tg/f
   [junit4]   2> 1442875 INFO  (TEST-RecoveryAfterSoftCommitTest.test-seed#[C3B555BF024816B0]) [    ] o.a.s.c.ZkTestServer STARTING ZK TEST SERVER
   [junit4]   2> 1442875 INFO  (Thread-1687) [    ] o.a.s.c.ZkTestServer client port:0.0.0.0/0.0.0.0:0
   [junit4]   2> 1442875 INFO  (Thread-1687) [    ] o.a.s.c.ZkTestServer Starting server
   [junit4]   2> 1442975 INFO  (TEST-RecoveryAfterSoftCommitTest.test-seed#[C3B555BF024816B0]) [    ] o.a.s.c.ZkTestServer start zk server on port:45527
   [junit4]   2> 1442975 INFO  (TEST-RecoveryAfterSoftCommitTest.test-seed#[C3B555BF024816B0]) [    ] o.a.s.c.c.SolrZkClient Using default ZkCredentialsProvider
   [junit4]   2> 1442975 INFO  (TEST-RecoveryAfterSoftCommitTest.test-seed#[C3B555BF024816B0]) [    ] o.a.s.c.c.ConnectionManager Waiting for client to connect to ZooKeeper
   [junit4]   2> 1442976 INFO  (zkCallback-1126-thread-1) [    ] o.a.s.c.c.ConnectionManager Watcher org.apache.solr.common.cloud.ConnectionManager@3beacd name:ZooKeeperConnection Watcher:127.0.0.1:45527 got event WatchedEvent state:SyncConnected type:None path:null path:null type:None
   [junit4]   2> 1442977 INFO  (TEST-RecoveryAfterSoftCommitTest.test-seed#[C3B555BF024816B0]) [    ] o.a.s.c.c.ConnectionManager Client is connected to ZooKeeper
   [junit4]   2> 1442977 INFO  (TEST-RecoveryAfterSoftCommitTest.test-seed#[C3B555BF024816B0]) [    ] o.a.s.c.c.SolrZkClient Using default ZkACLProvider
   [junit4]   2> 1442977 INFO  (TEST-RecoveryAfterSoftCommitTest.test-seed#[C3B555BF024816B0]) [    ] o.a.s.c.c.SolrZkClient makePath: /solr
   [junit4]   2> 1442978 INFO  (TEST-RecoveryAfterSoftCommitTest.test-seed#[C3B555BF024816B0]) [    ] o.a.s.c.c.SolrZkClient Using default ZkCredentialsProvider
   [junit4]   2> 1442978 INFO  (TEST-RecoveryAfterSoftCommitTest.test-seed#[C3B555BF024816B0]) [    ] o.a.s.c.c.ConnectionManager Waiting for client to connect to ZooKeeper
   [junit4]   2> 1442979 INFO  (zkCallback-1127-thread-1) [    ] o.a.s.c.c.ConnectionManager Watcher org.apache.solr.common.cloud.ConnectionManager@17c55ea name:ZooKeeperConnection Watcher:127.0.0.1:45527/solr got event WatchedEvent state:SyncConnected type:None path:null path:null type:None
   [junit4]   2> 1442979 INFO  (TEST-RecoveryAfterSoftCommitTest.test-seed#[C3B555BF024816B0]) [    ] o.a.s.c.c.ConnectionManager Client is connected to ZooKeeper
   [junit4]   2> 1442979 INFO  (TEST-RecoveryAfterSoftCommitTest.test-seed#[C3B555BF024816B0]) [    ] o.a.s.c.c.SolrZkClient Using default ZkACLProvider
   [junit4]   2> 1442979 INFO  (TEST-RecoveryAfterSoftCommitTest.test-seed#[C3B555BF024816B0]) [    ] o.a.s.c.c.SolrZkClient makePath: /collections/collection1
   [junit4]   2> 1442980 INFO  (TEST-RecoveryAfterSoftCommitTest.test-seed#[C3B555BF024816B0]) [    ] o.a.s.c.c.SolrZkClient makePath: /collections/collection1/shards
   [junit4]   2> 1442980 INFO  (TEST-RecoveryAfterSoftCommitTest.test-seed#[C3B555BF024816B0]) [    ] o.a.s.c.c.SolrZkClient makePath: /collections/control_collection
   [junit4]   2> 1442981 INFO  (TEST-RecoveryAfterSoftCommitTest.test-seed#[C3B555BF024816B0]) [    ] o.a.s.c.c.SolrZkClient makePath: /collections/control_collection/shards
   [junit4]   2> 1442981 INFO  (TEST-RecoveryAfterSoftCommitTest.test-seed#[C3B555BF024816B0]) [    ] o.a.s.c.AbstractZkTestCase put /home/jenkins/workspace/Lucene-Solr-5.x-Linux/solr/core/src/test-files/solr/collection1/conf/solrconfig-tlog.xml to /configs/conf1/solrconfig.xml
   [junit4]   2> 1442981 INFO  (TEST-RecoveryAfterSoftCommitTest.test-seed#[C3B555BF024816B0]) [    ] o.a.s.c.c.SolrZkClient makePath: /configs/conf1/solrconfig.xml
   [junit4]   2> 1442982 INFO  (TEST-RecoveryAfterSoftCommitTest.test-seed#[C3B555BF024816B0]) [    ] o.a.s.c.AbstractZkTestCase put /home/jenkins/workspace/Lucene-Solr-5.x-Linux/solr/core/src/test-files/solr/collection1/conf/schema.xml to /configs/conf1/schema.xml
   [junit4]   2> 1442982 INFO  (TEST-RecoveryAfterSoftCommitTest.test-seed#[C3B555BF024816B0]) [    ] o.a.s.c.c.SolrZkClient makePath: /configs/conf1/schema.xml
   [junit4]   2> 1442983 INFO  (TEST-RecoveryAfterSoftCommitTest.test-seed#[C3B555BF024816B0]) [    ] o.a.s.c.AbstractZkTestCase put /home/jenkins/workspace/Lucene-Solr-5.x-Linux/solr/core/src/test-files/solr/collection1/conf/solrconfig.snippet.randomindexconfig.xml to /configs/conf1/solrconfig.snippet.randomindexconfig.xml
   [junit4]   2> 1442983 INFO  (TEST-RecoveryAfterSoftCommitTest.test-seed#[C3B555BF024816B0]) [    ] o.a.s.c.c.SolrZkClient makePath: /configs/conf1/solrconfig.snippet.randomindexconfig.xml
   [junit4]   2> 1442983 INFO  (TEST-RecoveryAfterSoftCommitTest.test-seed#[C3B555BF024816B0]) [    ] o.a.s.c.AbstractZkTestCase put /home/jenkins/workspace/Lucene-Solr-5.x-Linux/solr/core/src/test-files/solr/collection1/conf/stopwords.txt to /configs/conf1/stopwords.txt
   [junit4]   2> 1442983 INFO  (TEST-RecoveryAfterSoftCommitTest.test-seed#[C3B555BF024816B0]) [    ] o.a.s.c.c.SolrZkClient makePath: /configs/conf1/stopwords.txt
   [junit4]   2> 1442984 INFO  (TEST-RecoveryAfterSoftCommitTest.test-seed#[C3B555BF024816B0]) [    ] o.a.s.c.AbstractZkTestCase put /home/jenkins/workspace/Lucene-Solr-5.x-Linux/solr/core/src/test-files/solr/collection1/conf/protwords.txt to /configs/conf1/protwords.txt
   [junit4]   2> 1442984 INFO  (TEST-RecoveryAfterSoftCommitTest.test-seed#[C3B555BF024816B0]) [    ] o.a.s.c.c.SolrZkClient makePath: /configs/conf1/protwords.txt
   [junit4]   2> 1442984 INFO  (TEST-RecoveryAfterSoftCommitTest.test-seed#[C3B555BF024816B0]) [    ] o.a.s.c.AbstractZkTestCase put /home/jenkins/workspace/Lucene-Solr-5.x-Linux/solr/core/src/test-files/solr/collection1/conf/currency.xml to /configs/conf1/currency.xml
   [junit4]   2> 1442985 INFO  (TEST-RecoveryAfterSoftCommitTest.test-seed#[C3B555BF024816B0]) [    ] o.a.s.c.c.SolrZkClient makePath: /configs/conf1/currency.xml
   [junit4]   2> 1442985 INFO  (TEST-RecoveryAfterSoftCommitTest.test-seed#[C3B555BF024816B0]) [    ] o.a.s.c.AbstractZkTestCase put /home/jenkins/workspace/Lucene-Solr-5.x-Linux/solr/core/src/test-files/solr/collection1/conf/enumsConfig.xml to /configs/conf1/enumsConfig.xml
   [junit4]   2> 1442985 INFO  (TEST-RecoveryAfterSoftCommitTest.test-seed#[C3B555BF024816B0]) [    ] o.a.s.c.c.SolrZkClient makePath: /configs/conf1/enumsConfig.xml
   [junit4]   2> 1442986 INFO  (TEST-RecoveryAfterSoftCommitTest.test-seed#[C3B555BF024816B0]) [    ] o.a.s.c.AbstractZkTestCase put /home/jenkins/workspace/Lucene-Solr-5.x-Linux/solr/core/src/test-files/solr/collection1/conf/open-exchange-rates.json to /configs/conf1/open-exchange-rates.json
   [junit4]   2> 1442986 INFO  (TEST-RecoveryAfterSoftCommitTest.test-seed#[C3B555BF024816B0]) [    ] o.a.s.c.c.SolrZkClient makePath: /configs/conf1/open-exchange-rates.json
   [junit4]   2> 1442986 INFO  (TEST-RecoveryAfterSoftCommitTest.test-seed#[C3B555BF024816B0]) [    ] o.a.s.c.AbstractZkTestCase put /home/jenkins/workspace/Lucene-Solr-5.x-Linux/solr/core/src/test-files/solr/collection1/conf/mapping-ISOLatin1Accent.txt to /configs/conf1/mapping-ISOLatin1Accent.txt
   [junit4]   2> 1442986 INFO  (TEST-RecoveryAfterSoftCommitTest.test-seed#[C3B555BF024816B0]) [    ] o.a.s.c.c.SolrZkClient makePath: /configs/conf1/mapping-ISOLatin1Accent.txt
   [junit4]   2> 1442987 INFO  (TEST-RecoveryAfterSoftCommitTest.test-seed#[C3B555BF024816B0]) [    ] o.a.s.c.AbstractZkTestCase put /home/jenkins/workspace/Lucene-Solr-5.x-Linux/solr/core/src/test-files/solr/collection1/conf/old_synonyms.txt to /configs/conf1/old_synonyms.txt
   [junit4]   2> 1442987 INFO  (TEST-RecoveryAfterSoftCommitTest.test-seed#[C3B555BF024816B0]) [    ] o.a.s.c.c.SolrZkClient makePath: /configs/conf1/old_synonyms.txt
   [junit4]   2> 1442987 INFO  (TEST-RecoveryAfterSoftCommitTest.test-seed#[C3B555BF024816B0]) [    ] o.a.s.c.AbstractZkTestCase put /home/jenkins/workspace/Lucene-Solr-5.x-Linux/solr/core/src/test-files/solr/collection1/conf/synonyms.txt to /configs/conf1/synonyms.txt
   [junit4]   2> 1442987 INFO  (TEST-RecoveryAfterSoftCommitTest.test-seed#[C3B555BF024816B0]) [    ] o.a.s.c.c.SolrZkClient makePath: /configs/conf1/synonyms.txt
   [junit4]   2> 1443036 INFO  (TEST-RecoveryAfterSoftCommitTest.test-seed#[C3B555BF024816B0]) [    ] o.a.s.SolrTestCaseJ4 Writing core.properties file to /home/jenkins/workspace/Lucene-Solr-5.x-Linux/solr/build/solr-core/test/J1/temp/solr.cloud.RecoveryAfterSoftCommitTest_C3B555BF024816B0-001/control-001/cores/collection1
   [junit4]   2> 1443038 INFO  (TEST-RecoveryAfterSoftCommitTest.test-seed#[C3B555BF024816B0]) [    ] o.e.j.s.Server jetty-9.2.13.v20150730
   [junit4]   2> 1443039 INFO  (TEST-RecoveryAfterSoftCommitTest.test-seed#[C3B555BF024816B0]) [    ] o.e.j.s.h.ContextHandler Started o.e.j.s.ServletContextHandler@1c5b480{/f_tg/f,null,AVAILABLE}
   [junit4]   2> 1443040 INFO  (TEST-RecoveryAfterSoftCommitTest.test-seed#[C3B555BF024816B0]) [    ] o.e.j.s.ServerConnector Started ServerConnector@246c8c{HTTP/1.1}{127.0.0.1:35389}
   [junit4]   2> 1443040 INFO  (TEST-RecoveryAfterSoftCommitTest.test-seed#[C3B555BF024816B0]) [    ] o.e.j.s.Server Started @1444616ms
   [junit4]   2> 1443040 INFO  (TEST-RecoveryAfterSoftCommitTest.test-seed#[C3B555BF024816B0]) [    ] o.a.s.c.s.e.JettySolrRunner Jetty properties: {coreRootDirectory=/home/jenkins/workspace/Lucene-Solr-5.x-Linux/solr/build/solr-core/test/J1/temp/solr.cloud.RecoveryAfterSoftCommitTest_C3B555BF024816B0-001/control-001/cores, hostPort=55558, solr.data.dir=/home/jenkins/workspace/Lucene-Solr-5.x-Linux/solr/build/solr-core/test/J1/temp/solr.cloud.RecoveryAfterSoftCommitTest_C3B555BF024816B0-001/tempDir-001/control/data, hostContext=/f_tg/f}
   [junit4]   2> 1443040 INFO  (TEST-RecoveryAfterSoftCommitTest.test-seed#[C3B555BF024816B0]) [    ] o.a.s.s.SolrDispatchFilter SolrDispatchFilter.init(): sun.misc.Launcher$AppClassLoader@752144
   [junit4]   2> 1443040 INFO  (TEST-RecoveryAfterSoftCommitTest.test-seed#[C3B555BF024816B0]) [    ] o.a.s.c.SolrResourceLoader new SolrResourceLoader for directory: '/home/jenkins/workspace/Lucene-Solr-5.x-Linux/solr/build/solr-core/test/J1/temp/solr.cloud.RecoveryAfterSoftCommitTest_C3B555BF024816B0-001/control-001'
   [junit4]   2> 1443040 INFO  (TEST-RecoveryAfterSoftCommitTest.test-seed#[C3B555BF024816B0]) [    ] o.a.s.c.SolrResourceLoader JNDI not configured for solr (NoInitialContextEx)
   [junit4]   2> 1443040 INFO  (TEST-RecoveryAfterSoftCommitTest.test-seed#[C3B555BF024816B0]) [    ] o.a.s.c.SolrResourceLoader solr home defaulted to 'solr/' (could not find system property or JNDI)
   [junit4]   2> 1443040 INFO  (TEST-RecoveryAfterSoftCommitTest.test-seed#[C3B555BF024816B0]) [    ] o.a.s.c.c.SolrZkClient Using default ZkCredentialsProvider
   [junit4]   2> 1443041 INFO  (TEST-RecoveryAfterSoftCommitTest.test-seed#[C3B555BF024816B0]) [    ] o.a.s.c.c.ConnectionManager Waiting for client to connect to ZooKeeper
   [junit4]   2> 1443042 INFO  (zkCallback-1128-thread-1) [    ] o.a.s.c.c.ConnectionManager Watcher org.apache.solr.common.cloud.ConnectionManager@c6ce69 name:ZooKeeperConnection Watcher:127.0.0.1:45527/solr got event WatchedEvent state:SyncConnected type:None path:null path:null type:None
   [junit4]   2> 1443042 INFO  (TEST-RecoveryAfterSoftCommitTest.test-seed#[C3B555BF024816B0]) [    ] o.a.s.c.c.ConnectionManager Client is connected to ZooKeeper
   [junit4]   2> 1443042 INFO  (TEST-RecoveryAfterSoftCommitTest.test-seed#[C3B555BF024816B0]) [    ] o.a.s.c.c.SolrZkClient Using default ZkACLProvider
   [junit4]   2> 1443042 INFO  (TEST-RecoveryAfterSoftCommitTest.test-seed#[C3B555BF024816B0]) [    ] o.a.s.s.SolrDispatchFilter Loading solr.xml from SolrHome (not found in ZooKeeper)
   [junit4]   2> 1443042 INFO  (TEST-RecoveryAfterSoftCommitTest.test-seed#[C3B555BF024816B0]) [    ] o.a.s.c.SolrXmlConfig Loading container configuration from /home/jenkins/workspace/Lucene-Solr-5.x-Linux/solr/build/solr-core/test/J1/temp/solr.cloud.RecoveryAfterSoftCommitTest_C3B555BF024816B0-001/control-001/solr.xml
   [junit4]   2> 1443050 INFO  (TEST-RecoveryAfterSoftCommitTest.test-seed#[C3B555BF024816B0]) [    ] o.a.s.c.CorePropertiesLocator Config-defined core root directory: /home/jenkins/workspace/Lucene-Solr-5.x-Linux/solr/build/solr-core/test/J1/temp/solr.cloud.RecoveryAfterSoftCommitTest_C3B555BF024816B0-001/control-001/cores
   [junit4]   2> 1443051 INFO  (TEST-RecoveryAfterSoftCommitTest.test-seed#[C3B555BF024816B0]) [    ] o.a.s.c.CoreContainer New CoreContainer 23284266
   [junit4]   2> 1443051 INFO  (TEST-RecoveryAfterSoftCommitTest.test-seed#[C3B555BF024816B0]) [    ] o.a.s.c.CoreContainer Loading cores into CoreContainer [instanceDir=/home/jenkins/workspace/Lucene-Solr-5.x-Linux/solr/build/solr-core/test/J1/temp/solr.cloud.RecoveryAfterSoftCommitTest_C3B555BF024816B0-001/control-001]
   [junit4]   2> 1443051 WARN  (TEST-RecoveryAfterSoftCommitTest.test-seed#[C3B555BF024816B0]) [    ] o.a.s.c.CoreContainer Couldn't add files from /home/jenkins/workspace/Lucene-Solr-5.x-Linux/solr/build/solr-core/test/J1/temp/solr.cloud.RecoveryAfterSoftCommitTest_C3B555BF024816B0-001/control-001/lib to classpath: /home/jenkins/workspace/Lucene-Solr-5.x-Linux/solr/build/solr-core/test/J1/temp/solr.cloud.RecoveryAfterSoftCommitTest_C3B555BF024816B0-001/control-001/lib
   [junit4]   2> 1443051 INFO  (TEST-RecoveryAfterSoftCommitTest.test-seed#[C3B555BF024816B0]) [    ] o.a.s.h.c.HttpShardHandlerFactory created with socketTimeout : 90000,urlScheme : ,connTimeout : 15000,maxConnectionsPerHost : 20,maxConnections : 10000,corePoolSize : 0,maximumPoolSize : 2147483647,maxThreadIdleTime : 5,sizeOfQueue : -1,fairnessPolicy : false,useRetries : false,
   [junit4]   2> 1443051 INFO  (TEST-RecoveryAfterSoftCommitTest.test-seed#[C3B555BF024816B0]) [    ] o.a.s.u.UpdateShardHandler Creating UpdateShardHandler HTTP client with params: socketTimeout=340000&connTimeout=45000&retry=true
   [junit4]   2> 1443052 INFO  (TEST-RecoveryAfterSoftCommitTest.test-seed#[C3B555BF024816B0]) [    ] o.a.s.l.LogWatcher SLF4J impl is org.slf4j.impl.Log4jLoggerFactory
   [junit4]   2> 1443052 INFO  (TEST-RecoveryAfterSoftCommitTest.test-seed#[C3B555BF024816B0]) [    ] o.a.s.l.LogWatcher Registering Log Listener [Log4j (org.slf4j.impl.Log4jLoggerFactory)]
   [junit4]   2> 1443052 INFO  (TEST-RecoveryAfterSoftCommitTest.test-seed#[C3B555BF024816B0]) [    ] o.a.s.c.ZkContainer Zookeeper client=127.0.0.1:45527/solr
   [junit4]   2> 1443052 INFO  (TEST-RecoveryAfterSoftCommitTest.test-seed#[C3B555BF024816B0]) [    ] o.a.s.c.ZkController zkHost includes chroot
   [junit4]   2> 1443052 INFO  (TEST-RecoveryAfterSoftCommitTest.test-seed#[C3B555BF024816B0]) [    ] o.a.s.c.c.SolrZkClient Using default ZkCredentialsProvider
   [junit4]   2> 1443052 INFO  (TEST-RecoveryAfterSoftCommitTest.test-seed#[C3B555BF024816B0]) [    ] o.a.s.c.c.ConnectionManager Waiting for client to connect to ZooKeeper
   [junit4]   2> 1443053 INFO  (zkCallback-1130-thread-1) [    ] o.a.s.c.c.ConnectionManager Watcher org.apache.solr.common.cloud.ConnectionManager@8d4473 name:ZooKeeperConnection Watcher:127.0.0.1:45527 got event WatchedEvent state:SyncConnected type:None path:null path:null type:None
   [junit4]   2> 1443053 INFO  (TEST-RecoveryAfterSoftCommitTest.test-seed#[C3B555BF024816B0]) [    ] o.a.s.c.c.ConnectionManager Client is connected to ZooKeeper
   [junit4]   2> 1443053 INFO  (TEST-RecoveryAfterSoftCommitTest.test-seed#[C3B555BF024816B0]) [    ] o.a.s.c.c.SolrZkClient Using default ZkACLProvider
   [junit4]   2> 1443054 INFO  (TEST-RecoveryAfterSoftCommitTest.test-seed#[C3B555BF024816B0]) [n:127.0.0.1:55558_f_tg%2Ff    ] o.a.s.c.c.ConnectionManager Waiting for client to connect to ZooKeeper
   [junit4]   2> 1443055 INFO  (zkCallback-1131-thread-1-processing-n:127.0.0.1:55558_f_tg%2Ff) [n:127.0.0.1:55558_f_tg%2Ff    ] o.a.s.c.c.ConnectionManager Watcher org.apache.solr.common.cloud.ConnectionManager@11e9f99 name:ZooKeeperConnection Watcher:127.0.0.1:45527/solr got event WatchedEvent state:SyncConnected type:None path:null path:null type:None
   [junit4]   2> 1443055 INFO  (TEST-RecoveryAfterSoftCommitTest.test-seed#[C3B555BF024816B0]) [n:127.0.0.1:55558_f_tg%2Ff    ] o.a.s.c.c.ConnectionManager Client is connected to ZooKeeper
   [junit4]   2> 1443056 INFO  (TEST-RecoveryAfterSoftCommitTest.test-seed#[C3B555BF024816B0]) [n:127.0.0.1:55558_f_tg%2Ff    ] o.a.s.c.c.SolrZkClient makePath: /overseer/queue
   [junit4]   2> 1443056 INFO  (TEST-RecoveryAfterSoftCommitTest.test-seed#[C3B555BF024816B0]) [n:127.0.0.1:55558_f_tg%2Ff    ] o.a.s.c.c.SolrZkClient makePath: /overseer/collection-queue-work
   [junit4]   2> 1443057 INFO  (TEST-RecoveryAfterSoftCommitTest.test-seed#[C3B555BF024816B0]) [n:127.0.0.1:55558_f_tg%2Ff    ] o.a.s.c.c.SolrZkClient makePath: /overseer/collection-map-running
   [junit4]   2> 1443058 INFO  (TEST-RecoveryAfterSoftCommitTest.test-seed#[C3B555BF024816B0]) [n:127.0.0.1:55558_f_tg%2Ff    ] o.a.s.c.c.SolrZkClient makePath: /overseer/collection-map-completed
   [junit4]   2> 1443059 INFO  (TEST-RecoveryAfterSoftCommitTest.test-seed#[C3B555BF024816B0]) [n:127.0.0.1:55558_f_tg%2Ff    ] o.a.s.c.c.SolrZkClient makePath: /overseer/collection-map-failure
   [junit4]   2> 1443059 INFO  (TEST-RecoveryAfterSoftCommitTest.test-seed#[C3B555BF024816B0]) [n:127.0.0.1:55558_f_tg%2Ff    ] o.a.s.c.c.SolrZkClient makePath: /live_nodes
   [junit4]   2> 1443060 INFO  (TEST-RecoveryAfterSoftCommitTest.test-seed#[C3B555BF024816B0]) [n:127.0.0.1:55558_f_tg%2Ff    ] o.a.s.c.c.SolrZkClient makePath: /aliases.json
   [junit4]   2> 1443060 INFO  (TEST-RecoveryAfterSoftCommitTest.test-seed#[C3B555BF024816B0]) [n:127.0.0.1:55558_f_tg%2Ff    ] o.a.s.c.c.SolrZkClient makePath: /clusterstate.json
   [junit4]   2> 1443060 INFO  (TEST-RecoveryAfterSoftCommitTest.test-seed#[C3B555BF024816B0]) [n:127.0.0.1:55558_f_tg%2Ff    ] o.a.s.c.c.SolrZkClient makePath: /security.json
   [junit4]   2> 1443061 INFO  (TEST-RecoveryAfterSoftCommitTest.test-seed#[C3B555BF024816B0]) [n:127.0.0.1:55558_f_tg%2Ff    ] o.a.s.c.ZkController Register node as live in ZooKeeper:/live_nodes/127.0.0.1:55558_f_tg%2Ff
   [junit4]   2> 1443061 INFO  (TEST-RecoveryAfterSoftCommitTest.test-seed#[C3B555BF024816B0]) [n:127.0.0.1:55558_f_tg%2Ff    ] o.a.s.c.c.SolrZkClient makePath: /live_nodes/127.0.0.1:55558_f_tg%2Ff
   [junit4]   2> 1443061 INFO  (TEST-RecoveryAfterSoftCommitTest.test-seed#[C3B555BF024816B0]) [n:127.0.0.1:55558_f_tg%2Ff    ] o.a.s.c.c.SolrZkClient makePath: /overseer_elect
   [junit4]   2> 1443062 INFO  (TEST-RecoveryAfterSoftCommitTest.test-seed#[C3B555BF024816B0]) [n:127.0.0.1:55558_f_tg%2Ff    ] o.a.s.c.c.SolrZkClient makePath: /overseer_elect/election
   [junit4]   2> 1443062 INFO  (TEST-RecoveryAfterSoftCommitTest.test-seed#[C3B555BF024816B0]) [n:127.0.0.1:55558_f_tg%2Ff    ] o.a.s.c.Overseer Overseer (id=null) closing
   [junit4]   2> 1443063 INFO  (TEST-RecoveryAfterSoftCommitTest.test-seed#[C3B555BF024816B0]) [n:127.0.0.1:55558_f_tg%2Ff    ] o.a.s.c.LeaderElector Joined leadership election with path: /overseer_elect/election/95140421839749124-127.0.0.1:55558_f_tg%2Ff-n_0000000000
   [junit4]   2> 1443063 INFO  (TEST-RecoveryAfterSoftCommitTest.test-seed#[C3B555BF024816B0]) [n:127.0.0.1:55558_f_tg%2Ff    ] o.a.s.c.OverseerElectionContext I am going to be the leader 127.0.0.1:55558_f_tg%2Ff
   [junit4]   2> 1443063 INFO  (TEST-RecoveryAfterSoftCommitTest.test-seed#[C3B555BF024816B0]) [n:127.0.0.1:55558_f_tg%2Ff    ] o.a.s.c.c.SolrZkClient makePath: /overseer_elect/leader
   [junit4]   2> 1443063 INFO  (TEST-RecoveryAfterSoftCommitTest.test-seed#[C3B555BF024816B0]) [n:127.0.0.1:55558_f_tg%2Ff    ] o.a.s.c.Overseer Overseer (id=95140421839749124-127.0.0.1:55558_f_tg%2Ff-n_0000000000) starting
   [junit4]   2> 1443064 INFO  (TEST-RecoveryAfterSoftCommitTest.test-seed#[C3B555BF024816B0]) [n:127.0.0.1:55558_f_tg%2Ff    ] o.a.s.c.c.SolrZkClient makePath: /overseer/queue-work
   [junit4]   2> 1443066 INFO  (TEST-RecoveryAfterSoftCommitTest.test-seed#[C3B555BF024816B0]) [n:127.0.0.1:55558_f_tg%2Ff    ] o.a.s.c.OverseerAutoReplicaFailoverThread Starting OverseerAutoReplicaFailoverThread autoReplicaFailoverWorkLoopDelay=10000 autoReplicaFailoverWaitAfterExpiration=30000 autoReplicaFailoverBadNodeExpiration=60000
   [junit4]   2> 1443066 INFO  (OverseerCollectionConfigSetProcessor-95140421839749124-127.0.0.1:55558_f_tg%2Ff-n_0000000000) [n:127.0.0.1:55558_f_tg%2Ff    ] o.a.s.c.OverseerTaskProcessor Process current queue of overseer operations
   [junit4]   2> 1443066 INFO  (TEST-RecoveryAfterSoftCommitTest.test-seed#[C3B555BF024816B0]) [n:127.0.0.1:55558_f_tg%2Ff    ] o.a.s.c.c.ZkStateReader Updating cluster state from ZooKeeper... 
   [junit4]   2> 1443066 INFO  (OverseerStateUpdate-95140421839749124-127.0.0.1:55558_f_tg%2Ff-n_0000000000) [n:127.0.0.1:55558_f_tg%2Ff    ] o.a.s.c.Overseer Starting to work on the main queue
   [junit4]   2> 1443081 INFO  (TEST-RecoveryAfterSoftCommitTest.test-seed#[C3B555BF024816B0]) [n:127.0.0.1:55558_f_tg%2Ff    ] o.a.s.c.CoreContainer Security conf doesn't exist. Skipping setup for authorization module.
   [junit4]   2> 1443081 INFO  (TEST-RecoveryAfterSoftCommitTest.test-seed#[C3B555BF024816B0]) [n:127.0.0.1:55558_f_tg%2Ff    ] o.a.s.c.CoreContainer No authentication plugin used.
   [junit4]   2> 1443081 INFO  (TEST-RecoveryAfterSoftCommitTest.test-seed#[C3B555BF024816B0]) [n:127.0.0.1:55558_f_tg%2Ff    ] o.a.s.c.CorePropertiesLocator Looking for core definitions underneath /home/jenkins/workspace/Lucene-Solr-5.x-Linux/solr/build/solr-core/test/J1/temp/solr.cloud.RecoveryAfterSoftCommitTest_C3B555BF024816B0-001/control-001/cores
   [junit4]   2> 1443082 INFO  (TEST-RecoveryAfterSoftCommitTest.test-seed#[C3B555BF024816B0]) [n:127.0.0.1:55558_f_tg%2Ff    ] o.a.s.c.CoreDescriptor Created CoreDescriptor: {coreNodeName=, name=collection1, configSetProperties=configsetprops.json, loadOnStartup=true, config=solrconfig.xml, shard=, transient=false, collection=control_collection, schema=schema.xml, dataDir=data/}
   [junit4]   2> 1443082 INFO  (TEST-RecoveryAfterSoftCommitTest.test-seed#[C3B555BF024816B0]) [n:127.0.0.1:55558_f_tg%2Ff    ] o.a.s.c.CorePropertiesLocator Found core collection1 in /home/jenkins/workspace/Lucene-Solr-5.x-Linux/solr/build/solr-core/test/J1/temp/solr.cloud.RecoveryAfterSoftCommitTest_C3B555BF024816B0-001/control-001/cores/collection1
   [junit4]   2> 1443082 INFO  (TEST-RecoveryAfterSoftCommitTest.test-seed#[C3B555BF024816B0]) [n:127.0.0.1:55558_f_tg%2Ff    ] o.a.s.c.CorePropertiesLocator Found 1 core definitions
   [junit4]   2> 1443082 INFO  (TEST-RecoveryAfterSoftCommitTest.test-seed#[C3B555BF024816B0]) [n:127.0.0.1:55558_f_tg%2Ff    ] o.a.s.s.SolrDispatchFilter user.dir=/home/jenkins/workspace/Lucene-Solr-5.x-Linux/solr/build/solr-core/test/J1
   [junit4]   2> 1443082 INFO  (TEST-RecoveryAfterSoftCommitTest.test-seed#[C3B555BF024816B0]) [n:127.0.0.1:55558_f_tg%2Ff    ] o.a.s.s.SolrDispatchFilter SolrDispatchFilter.init() done
   [junit4]   2> 1443082 INFO  (coreLoadExecutor-1726-thread-1-processing-n:127.0.0.1:55558_f_tg%2Ff) [n:127.0.0.1:55558_f_tg%2Ff c:control_collection   x:collection1] o.a.s.c.ZkController publishing state=down
   [junit4]   2> 1443082 INFO  (coreLoadExecutor-1726-thread-1-processing-n:127.0.0.1:55558_f_tg%2Ff) [n:127.0.0.1:55558_f_tg%2Ff c:control_collection   x:collection1] o.a.s.c.ZkController numShards not found on descriptor - reading it from system property
   [junit4]   2> 1443083 INFO  (OverseerStateUpdate-95140421839749124-127.0.0.1:55558_f_tg%2Ff-n_0000000000) [n:127.0.0.1:55558_f_tg%2Ff    ] o.a.s.c.Overseer processMessage: queueSize: 1, message = {
   [junit4]   2>   "collection":"control_collection",
   [junit4]   2>   "shard":null,
   [junit4]   2>   "state":"down",
   [junit4]   2>   "operation":"state",
   [junit4]   2>   "node_name":"127.0.0.1:55558_f_tg%2Ff",
   [junit4]   2>   "base_url":"http://127.0.0.1:55558/f_tg/f",
   [junit4]   2>   "roles":null,
   [junit4]   2>   "core":"collection1",
   [junit4]   2>   "numShards":"1"} current state version: 0
   [junit4]   2> 1443083 INFO  (coreLoadExecutor-1726-thread-1-processing-n:127.0.0.1:55558_f_tg%2Ff) [n:127.0.0.1:55558_f_tg%2Ff c:control_collection   x:collection1] o.a.s.c.ZkController look for our core node name
   [junit4]   2> 1443083 INFO  (OverseerStateUpdate-95140421839749124-127.0.0.1:55558_f_tg%2Ff-n_0000000000) [n:127.0.0.1:55558_f_tg%2Ff    ] o.a.s.c.o.ReplicaMutator Update state numShards=1 message={
   [junit4]   2>   "collection":"control_collection",
   [junit4]   2>   "shard":null,
   [junit4]   2>   "state":"down",
   [junit4]   2>   "operation":"state",
   [junit4]   2>   "node_name":"127.0.0.1:55558_f_tg%2Ff",
   [junit4]   2>   "base_url":"http://127.0.0.1:55558/f_tg/f",
   [junit4]   2>   "roles":null,
   [junit4]   2>   "core":"collection1",
   [junit4]   2>   "numShards":"1"}
   [junit4]   2> 1443083 INFO  (OverseerStateUpdate-95140421839749124-127.0.0.1:55558_f_tg%2Ff-n_0000000000) [n:127.0.0.1:55558_f_tg%2Ff    ] o.a.s.c.o.ClusterStateMutator building a new cName: control_collection
   [junit4]   2> 1443084 INFO  (OverseerStateUpdate-95140421839749124-127.0.0.1:55558_f_tg%2Ff-n_0000000000) [n:127.0.0.1:55558_f_tg%2Ff    ] o.a.s.c.o.ReplicaMutator Assigning new node to shard shard=shard1
   [junit4]   2> 1443084 INFO  (zkCallback-1131-thread-1-processing-n:127.0.0.1:55558_f_tg%2Ff) [n:127.0.0.1:55558_f_tg%2Ff    ] o.a.s.c.c.ZkStateReader A cluster state change: [WatchedEvent state:SyncConnected type:NodeDataChanged path:/clusterstate.json], has occurred - updating... (live nodes size: [1])
   [junit4]   2> 1444083 INFO  (coreLoadExecutor-1726-thread-1-processing-n:127.0.0.1:55558_f_tg%2Ff) [n:127.0.0.1:55558_f_tg%2Ff c:control_collection   x:collection1] o.a.s.c.ZkController waiting to find shard id in clusterstate for collection1
   [junit4]   2> 1444083 INFO  (coreLoadExecutor-1726-thread-1-processing-n:127.0.0.1:55558_f_tg%2Ff) [n:127.0.0.1:55558_f_tg%2Ff c:control_collection   x:collection1] o.a.s.c.ZkController Check for collection zkNode:control_collection
   [junit4]   2> 1444084 INFO  (coreLoadExecutor-1726-thread-1-processing-n:127.0.0.1:55558_f_tg%2Ff) [n:127.0.0.1:55558_f_tg%2Ff c:control_collection   x:collection1] o.a.s.c.ZkController Collection zkNode exists
   [junit4]   2> 1444084 INFO  (coreLoadExecutor-1726-thread-1-processing-n:127.0.0.1:55558_f_tg%2Ff) [n:127.0.0.1:55558_f_tg%2Ff c:control_collection   x:collection1] o.a.s.c.c.ZkStateReader Load collection config from: [/collections/control_collection]
   [junit4]   2> 1444084 INFO  (coreLoadExecutor-1726-thread-1-processing-n:127.0.0.1:55558_f_tg%2Ff) [n:127.0.0.1:55558_f_tg%2Ff c:control_collection   x:collection1] o.a.s.c.c.ZkStateReader path=[/collections/control_collection] [configName]=[conf1] specified config exists in ZooKeeper
   [junit4]   2> 1444084 INFO  (coreLoadExecutor-1726-thread-1-processing-n:127.0.0.1:55558_f_tg%2Ff) [n:127.0.0.1:55558_f_tg%2Ff c:control_collection   x:collection1] o.a.s.c.SolrResourceLoader new SolrResourceLoader for directory: '/home/jenkins/workspace/Lucene-Solr-5.x-Linux/solr/build/solr-core/test/J1/temp/solr.cloud.RecoveryAfterSoftCommitTest_C3B555BF024816B0-001/control-001/cores/collection1'
   [junit4]   2> 1444084 INFO  (coreLoadExecutor-1726-thread-1-processing-n:127.0.0.1:55558_f_tg%2Ff) [n:127.0.0.1:55558_f_tg%2Ff c:control_collection   x:collection1] o.a.s.c.SolrResourceLoader JNDI not configured for solr (NoInitialContextEx)
   [junit4]   2> 1444084 INFO  (coreLoadExecutor-1726-thread-1-processing-n:127.0.0.1:55558_f_tg%2Ff) [n:127.0.0.1:55558_f_tg%2Ff c:control_collection   x:collection1] o.a.s.c.SolrResourceLoader solr home defaulted to 'solr/' (could not find system property or JNDI)
   [junit4]   2> 1444085 INFO  (coreLoadExecutor-1726-thread-1-processing-n:127.0.0.1:55558_f_tg%2Ff) [n:127.0.0.1:55558_f_tg%2Ff c:control_collection   x:collection1] o.a.s.c.Config loaded config solrconfig.xml with version 0 
   [junit4]   2> 1444089 INFO  (coreLoadExecutor-1726-thread-1-processing-n:127.0.0.1:55558_f_tg%2Ff) [n:127.0.0.1:55558_f_tg%2Ff c:control_collection   x:collection1] o.a.s.c.SolrConfig current version of requestparams : -1
   [junit4]   2> 1444107 INFO  (coreLoadExecutor-1726-thread-1-processing-n:127.0.0.1:55558_f_tg%2Ff) [n:127.0.0.1:55558_f_tg%2Ff c:control_collection   x:collection1] o.a.s.c.SolrConfig Using Lucene MatchVersion: 5.5.0
   [junit4]   2> 1444122 INFO  (coreLoadExecutor-1726-thread-1-processing-n:127.0.0.1:55558_f_tg%2Ff) [n:127.0.0.1:55558_f_tg%2Ff c:control_collection   x:collection1] o.a.s.c.SolrConfig Loaded SolrConfig: solrconfig.xml
   [junit4]   2> 1444126 INFO  (coreLoadExecutor-1726-thread-1-processing-n:127.0.0.1:55558_f_tg%2Ff) [n:127.0.0.1:55558_f_tg%2Ff c:control_collection   x:collection1] o.a.s.s.IndexSchema [collection1] Schema name=test
   [junit4]   2> 1444264 INFO  (coreLoadExecutor-1726-thread-1-processing-n:127.0.0.1:55558_f_tg%2Ff) [n:127.0.0.1:55558_f_tg%2Ff c:control_collection   x:collection1] o.a.s.s.OpenExchangeRatesOrgProvider Initialized with rates=open-exchange-rates.json, refreshInterval=1440.
   [junit4]   2> 1444268 INFO  (coreLoadExecutor-1726-thread-1-processing-n:127.0.0.1:55558_f_tg%2Ff) [n:127.0.0.1:55558_f_tg%2Ff c:control_collection   x:collection1] o.a.s.s.IndexSchema default search field in schema is text
   [junit4]   2> 1444270 INFO  (coreLoadExecutor-1726-thread-1-processing-n:127.0.0.1:55558_f_tg%2Ff) [n:127.0.0.1:55558_f_tg%2Ff c:control_collection   x:collection1] o.a.s.s.IndexSchema unique key field: id
   [junit4]   2> 1444274 INFO  (coreLoadExecutor-1726-thread-1-processing-n:127.0.0.1:55558_f_tg%2Ff) [n:127.0.0.1:55558_f_tg%2Ff c:control_collection   x:collection1] o.a.s.s.FileExchangeRateProvider Reloading exchange rates from file currency.xml
   [junit4]   2> 1444275 INFO  (coreLoadExecutor-1726-thread-1-processing-n:127.0.0.1:55558_f_tg%2Ff) [n:127.0.0.1:55558_f_tg%2Ff c:control_collection   x:collection1] o.a.s.s.FileExchangeRateProvider Reloading exchange rates from file currency.xml
   [junit4]   2> 1444276 INFO  (coreLoadExecutor-1726-thread-1-processing-n:127.0.0.1:55558_f_tg%2Ff) [n:127.0.0.1:55558_f_tg%2Ff c:control_collection   x:collection1] o.a.s.s.OpenExchangeRatesOrgProvider Reloading exchange rates from open-exchange-rates.json
   [junit4]   2> 1444277 WARN  (coreLoadExecutor-1726-thread-1-processing-n:127.0.0.1:55558_f_tg%2Ff) [n:127.0.0.1:55558_f_tg%2Ff c:control_collection   x:collection1] o.a.s.s.OpenExchangeRatesOrgProvider Unknown key IMPORTANT NOTE
   [junit4]   2> 1444277 WARN  (coreLoadExecutor-1726-thread-1-processing-n:127.0.0.1:55558_f_tg%2Ff) [n:127.0.0.1:55558_f_tg%2Ff c:control_collection   x:collection1] o.a.s.s.OpenExchangeRatesOrgProvider Expected key, got STRING
   [junit4]   2> 1444277 INFO  (coreLoadExecutor-1726-thread-1-processing-n:127.0.0.1:55558_f_tg%2Ff) [n:127.0.0.1:55558_f_tg%2Ff c:control_collection   x:collection1] o.a.s.s.OpenExchangeRatesOrgProvider Reloading exchange rates from open-exchange-rates.json
   [junit4]   2> 1444277 WARN  (coreLoadExecutor-1726-thread-1-processing-n:127.0.0.1:55558_f_tg%2Ff) [n:127.0.0.1:55558_f_tg%2Ff c:control_collection   x:collection1] o.a.s.s.OpenExchangeRatesOrgProvider Unknown key IMPORTANT NOTE
   [junit4]   2> 1444277 WARN  (coreLoadExecutor-1726-thread-1-processing-n:127.0.0.1:55558_f_tg%2Ff) [n:127.0.0.1:55558_f_tg%2Ff c:control_collection   x:collection1] o.a.s.s.OpenExchangeRatesOrgProvider Expected key, got STRING
   [junit4]   2> 1444277 INFO  (coreLoadExecutor-1726-thread-1-processing-n:127.0.0.1:55558_f_tg%2Ff) [n:127.0.0.1:55558_f_tg%2Ff c:control_collection   x:collection1] o.a.s.c.ConfigSetProperties Did not find ConfigSet properties, assuming default properties: Can't find resource 'configsetprops.json' in classpath or '/configs/conf1', cwd=/home/jenkins/workspace/Lucene-Solr-5.x-Linux/solr/build/solr-core/test/J1
   [junit4]   2> 1444277 INFO  (coreLoadExecutor-1726-thread-1-processing-n:127.0.0.1:55558_f_tg%2Ff) [n:127.0.0.1:55558_f_tg%2Ff c:control_collection   x:collection1] o.a.s.c.CoreContainer Creating SolrCore 'collection1' using configuration from collection control_collection
   [junit4]   2> 1444278 INFO  (coreLoadExecutor-1726-thread-1-processing-n:127.0.0.1:55558_f_tg%2Ff) [n:127.0.0.1:55558_f_tg%2Ff c:control_collection s:shard1 r:core_node1 x:collection1] o.a.s.c.SolrCore org.apache.solr.core.MockDirectoryFactory
   [junit4]   2> 1444278 INFO  (coreLoadExecutor-1726-thread-1-processing-n:127.0.0.1:55558_f_tg%2Ff) [n:127.0.0.1:55558_f_tg%2Ff c:control_collection s:shard1 r:core_node1 x:collection1] o.a.s.c.SolrCore [[collection1] ] Opening new SolrCore at [/home/jenkins/workspace/Lucene-Solr-5.x-Linux/solr/build/solr-core/test/J1/temp/solr.cloud.RecoveryAfterSoftCommitTest_C3B555BF024816B0-001/control-001/cores/collection1], dataDir=[/home/jenkins/workspace/Lucene-Solr-5.x-Linux/solr/build/solr-core/test/J1/temp/solr.cloud.RecoveryAfterSoftCommitTest_C3B555BF024816B0-001/control-001/cores/collection1/data/]
   [junit4]   2> 1444278 INFO  (coreLoadExecutor-1726-thread-1-processing-n:127.0.0.1:55558_f_tg%2Ff) [n:127.0.0.1:55558_f_tg%2Ff c:control_collection s:shard1 r:core_node1 x:collection1] o.a.s.c.JmxMonitoredMap JMX monitoring is enabled. Adding Solr mbeans to JMX Server: com.sun.jmx.mbeanserver.JmxMBeanServer@9d2df7
   [junit4]   2> 1444278 INFO  (coreLoadExecutor-1726-thread-1-processing-n:127.0.0.1:55558_f_tg%2Ff) [n:127.0.0.1:55558_f_tg%2Ff c:control_collection s:shard1 r:core_node1 x:collection1] o.a.s.c.CachingDirectoryFactory return new directory for /home/jenkins/workspace/Lucene-Solr-5.x-Linux/solr/build/solr-core/test/J1/temp/solr.cloud.RecoveryAfterSoftCommitTest_C3B555BF024816B0-001/control-001/cores/collection1/data
   [junit4]   2> 1444278 INFO  (coreLoadExecutor-1726-thread-1-processing-n:127.0.0.1:55558_f_tg%2Ff) [n:127.0.0.1:55558_f_tg%2Ff c:control_collection s:shard1 r:core_node1 x:collection1] o.a.s.c.SolrCore New index directory detected: old=null new=/home/jenkins/workspace/Lucene-Solr-5.x-Linux/solr/build/solr-core/test/J1/temp/solr.cloud.RecoveryAfterSoftCommitTest_C3B555BF024816B0-001/control-001/cores/collection1/data/index/
   [junit4]   2> 1444278 WARN  (coreLoadExecutor-1726-thread-1-processing-n:127.0.0.1:55558_f_tg%2Ff) [n:127.0.0.1:55558_f_tg%2Ff c:control_collection s:shard1 r:core_node1 x:collection1] o.a.s.c.SolrCore [collection1] Solr index directory '/home/jenkins/workspace/Lucene-Solr-5.x-Linux/solr/build/solr-core/test/J1/temp/solr.cloud.RecoveryAfterSoftCommitTest_C3B555BF024816B0-001/control-001/cores/collection1/data/index' doesn't exist. Creating new index...
   [junit4]   2> 1444278 INFO  (coreLoadExecutor-1726-thread-1-processing-n:127.0.0.1:55558_f_tg%2Ff) [n:127.0.0.1:55558_f_tg%2Ff c:control_collection s:shard1 r:core_node1 x:collection1] o.a.s.c.CachingDirectoryFactory return new directory for /home/jenkins/workspace/Lucene-Solr-5.x-Linux/solr/build/solr-core/test/J1/temp/solr.cloud.RecoveryAfterSoftCommitTest_C3B555BF024816B0-001/control-001/cores/collection1/data/index
   [junit4]   2> 1444279 INFO  (coreLoadExecutor-1726-thread-1-processing-n:127.0.0.1:55558_f_tg%2Ff) [n:127.0.0.1:55558_f_tg%2Ff c:control_collection s:shard1 r:core_node1 x:collection1] o.a.s.u.RandomMergePolicy RandomMergePolicy wrapping class org.apache.lucene.index.TieredMergePolicy: [TieredMergePolicy: maxMergeAtOnce=31, maxMergeAtOnceExplicit=11, maxMergedSegmentMB=95.2587890625, floorSegmentMB=1.9072265625, forceMergeDeletesPctAllowed=29.395827599300198, segmentsPerTier=24.0, maxCFSSegmentSizeMB=8.796093022207999E12, noCFSRatio=0.6899885247105123
   [junit4]   2> 1444279 INFO  (coreLoadExecutor-1726-thread-1-processing-n:127.0.0.1:55558_f_tg%2Ff) [n:127.0.0.1:55558_f_tg%2Ff c:control_collection s:shard1 r:core_node1 x:collection1] o.a.s.c.SolrDeletionPolicy SolrDeletionPolicy.onCommit: commits: num=1
   [junit4]   2> 	commit{dir=MockDirectoryWrapper(RAMDirectory@95fe7f lockFactory=org.apache.lucene.store.SingleInstanceLockFactory@1774633),segFN=segments_1,generation=1}
   [junit4]   2> 1444279 INFO  (coreLoadExecutor-1726-thread-1-processing-n:127.0.0.1:55558_f_tg%2Ff) [n:127.0.0.1:55558_f_tg%2Ff c:control_collection s:shard1 r:core_node1 x:collection1] o.a.s.c.SolrDeletionPolicy newest commit generation = 1
   [junit4]   2> 1444279 INFO  (OldIndexDirectoryCleanupThreadForCore-collection1) [n:127.0.0.1:55558_f_tg%2Ff c:control_collection s:shard1 r:core_node1 x:collection1] o.a.s.c.SolrCore Looking for old index directories to cleanup for core collection1 in /home/jenkins/workspace/Lucene-Solr-5.x-Linux/solr/build/solr-core/test/J1/temp/solr.cloud.RecoveryAfterSoftCommitTest_C3B555BF024816B0-001/control-001/cores/collection1/data/
   [junit4]   2> 1444279 WARN  (OldIndexDirectoryCleanupThreadForCore-collection1) [n:127.0.0.1:55558_f_tg%2Ff c:control_collection s:shard1 r:core_node1 x:collection1] o.a.s.c.DirectoryFactory /home/jenkins/workspace/Lucene-Solr-5.x-Linux/solr/build/solr-core/test/J1/temp/solr.cloud.RecoveryAfterSoftCommitTest_C3B555BF024816B0-001/control-001/cores/collection1/data/ does not point to a valid data directory; skipping clean-up of old index directories.
   [junit4]   2> 1444281 INFO  (coreLoadExecutor-1726-thread-1-processing-n:127.0.0.1:55558_f_tg%2Ff) [n:127.0.0.1:55558_f_tg%2Ff c:control_collection s:shard1 r:core_node1 x:collection1] o.a.s.u.p.UpdateRequestProcessorChain creating updateRequestProcessorChain "nodistrib"
   [junit4]   2> 1444281 INFO  (coreLoadExecutor-1726-thread-1-processing-n:127.0.0.1:55558_f_tg%2Ff) [n:127.0.0.1:55558_f_tg%2Ff c:control_collection s:shard1 r:core_node1 x:collection1] o.a.s.u.p.UpdateRequestProcessorChain creating updateRequestProcessorChain "dedupe"
   [junit4]   2> 1444281 INFO  (coreLoadExecutor-1726-thread-1-processing-n:127.0.0.1:55558_f_tg%2Ff) [n:127.0.0.1:55558_f_tg%2Ff c:control_collection s:shard1 r:core_node1 x:collection1] o.a.s.u.p.UpdateRequestProcessorChain inserting DistributedUpdateProcessorFactory into updateRequestProcessorChain "dedupe"
   [junit4]   2> 1444281 INFO  (coreLoadExecutor-1726-thread-1-processing-n:127.0.0.1:55558_f_tg%2Ff) [n:127.0.0.1:55558_f_tg%2Ff c:control_collection s:shard1 r:core_node1 x:collection1] o.a.s.u.p.UpdateRequestProcessorChain creating updateRequestProcessorChain "stored_sig"
   [junit4]   2> 1444281 INFO  (coreLoadExecutor-1726-thread-1-processing-n:127.0.0.1:55558_f_tg%2Ff) [n:127.0.0.1:55558_f_tg%2Ff c:control_collection s:shard1 r:core_node1 x:collection1] o.a.s.u.p.UpdateRequestProcessorChain inserting DistributedUpdateProcessorFactory into updateRequestProcessorChain "stored_sig"
   [junit4]   2> 1444281 INFO  (coreLoadExecutor-1726-thread-1-processing-n:127.0.0.1:55558_f_tg%2Ff) [n:127.0.0.1:55558_f_tg%2Ff c:control_collection s:shard1 r:core_node1 x:collection1] o.a.s.u.p.UpdateRequestProcessorChain creating updateRequestProcessorChain "distrib-dup-test-chain-explicit"
   [junit4]   2> 1444282 INFO  (coreLoadExecutor-1726-thread-1-processing-n:127.0.0.1:55558_f_tg%2Ff) [n:127.0.0.1:55558_f_tg%2Ff c:control_collection s:shard1 r:core_node1 x:collection1] o.a.s.u.p.UpdateRequestProcessorChain creating updateRequestProcessorChain "distrib-dup-test-chain-implicit"
   [junit4]   2> 1444282 INFO  (coreLoadExecutor-1726-thread-1-processing-n:127.0.0.1:55558_f_tg%2Ff) [n:127.0.0.1:55558_f_tg%2Ff c:control_collection s:shard1 r:core_node1 x:collection1] o.a.s.u.p.UpdateRequestProcessorChain inserting DistributedUpdateProcessorFactory into updateRequestProcessorChain "distrib-dup-test-chain-implicit"
   [junit4]   2> 1444282 INFO  (coreLoadExecutor-1726-thread-1-processing-n:127.0.0.1:55558_f_tg%2Ff) [n:127.0.0.1:55558_f_tg%2Ff c:control_collection s:shard1 r:core_node1 x:collection1] o.a.s.c.SolrCore no updateRequestProcessorChain defined as default, creating implicit default
   [junit4]   2> 1444282 WARN  (coreLoadExecutor-1726-thread-1-processing-n:127.0.0.1:55558_f_tg%2Ff) [n:127.0.0.1:55558_f_tg%2Ff c:control_collection s:shard1 r:core_node1 x:collection1] o.a.s.c.RequestHandlers INVALID paramSet a in requestHandler {type = requestHandler,name = /dump,class = DumpRequestHandler,args = {defaults={a=A,b=B}}}
   [junit4]   2> 1444283 INFO  (coreLoadExecutor-1726-thread-1-processing-n:127.0.0.1:55558_f_tg%2Ff) [n:127.0.0.1:55558_f_tg%2Ff c:control_collection s:shard1 r:core_node1 x:collection1] o.a.s.h.l.XMLLoader xsltCacheLifetimeSeconds=60
   [junit4]   2> 1444284 INFO  (coreLoadExecutor-1726-thread-1-processing-n:127.0.0.1:55558_f_tg%2Ff) [n:127.0.0.1:55558_f_tg%2Ff c:control_collection s:shard1 r:core_node1 x:collection1] o.a.s.h.l.XMLLoader xsltCacheLifetimeSeconds=60
   [junit4]   2> 1444284 INFO  (coreLoadExecutor-1726-thread-1-processing-n:127.0.0.1:55558_f_tg%2Ff) [n:127.0.0.1:55558_f_tg%2Ff c:control_collection s:shard1 r:core_node1 x:collection1] o.a.s.h.l.XMLLoader xsltCacheLifetimeSeconds=60
   [junit4]   2> 1444285 INFO  (coreLoadExecutor-1726-thread-1-processing-n:127.0.0.1:55558_f_tg%2Ff) [n:127.0.0.1:55558_f_tg%2Ff c:control_collection s:shard1 r:core_node1 x:collection1] o.a.s.h.l.XMLLoader xsltCacheLifetimeSeconds=60
   [junit4]   2> 1444287 INFO  (coreLoadExecutor-1726-thread-1-processing-n:127.0.0.1:55558_f_tg%2Ff) [n:127.0.0.1:55558_f_tg%2Ff c:control_collection s:shard1 r:core_node1 x:collection1] o.a.s.c.RequestHandlers Registered paths: /dump,/get,/admin/plugins,/admin/file,/config,/admin/ping,/admin/logging,/admin/threads,/admin/segments,standard,/admin/luke,/admin/properties,/update/json,/update,/schema,/replication,/update/json/docs,/admin/system,/update/csv,/admin/mbeans
   [junit4]   2> 1444288 INFO  (coreLoadExecutor-1726-thread-1-processing-n:127.0.0.1:55558_f_tg%2Ff) [n:127.0.0.1:55558_f_tg%2Ff c:control_collection s:shard1 r:core_node1 x:collection1] o.a.s.c.SolrCore Using default statsCache cache: org.apache.solr.search.stats.LocalStatsCache
   [junit4]   2> 1444288 INFO  (coreLoadExecutor-1726-thread-1-processing-n:127.0.0.1:55558_f_tg%2Ff) [n:127.0.0.1:55558_f_tg%2Ff c:control_collection s:shard1 r:core_node1 x:collection1] o.a.s.u.UpdateHandler Using UpdateLog implementation: org.apache.solr.update.UpdateLog
   [junit4]   2> 1444288 INFO  (coreLoadExecutor-1726-thread-1-processing-n:127.0.0.1:55558_f_tg%2Ff) [n:127.0.0.1:55558_f_tg%2Ff c:control_collection s:shard1 r:core_node1 x:collection1] o.a.s.u.UpdateLog Initializing UpdateLog: dataDir= defaultSyncLevel=FLUSH numRecordsToKeep=2 maxNumLogsToKeep=10 numVersionBuckets=65536
   [junit4]   2> 1444289 INFO  (coreLoadExecutor-1726-thread-1-processing-n:127.0.0.1:55558_f_tg%2Ff) [n:127.0.0.1:55558_f_tg%2Ff c:control_collection s:shard1 r:core_node1 x:collection1] o.a.s.u.CommitTracker Hard AutoCommit: disabled
   [junit4]   2> 1444289 INFO  (coreLoadExecutor-1726-thread-1-processing-n:127.0.0.1:55558_f_tg%2Ff) [n:127.0.0.1:55558_f_tg%2Ff c:control_collection s:shard1 r:core_node1 x:collection1] o.a.s.u.CommitTracker Soft AutoCommit: disabled
   [junit4]   2> 1444289 INFO  (coreLoadExecutor-1726-thread-1-processing-n:127.0.0.1:55558_f_tg%2Ff) [n:127.0.0.1:55558_f_tg%2Ff c:control_collection s:shard1 r:core_node1 x:collection1] o.a.s.u.RandomMergePolicy RandomMergePolicy wrapping class org.apache.lucene.index.LogByteSizeMergePolicy: [LogByteSizeMergePolicy: minMergeSize=1677721, mergeFactor=26, maxMergeSize=2147483648, maxMergeSizeForForcedMerge=9223372036854775807, calibrateSizeByDeletes=false, maxMergeDocs=2147483647, maxCFSSegmentSizeMB=8.796093022207999E12, noCFSRatio=0.41317333947923707]
   [junit4]   2> 1444289 INFO  (coreLoadExecutor-1726-thread-1-processing-n:127.0.0.1:55558_f_tg%2Ff) [n:127.0.0.1:55558_f_tg%2Ff c:control_collection s:shard1 r:core_node1 x:collection1] o.a.s.c.SolrDeletionPolicy SolrDeletionPolicy.onInit: commits: num=1
   [junit4]   2> 	commit{dir=MockDirectoryWrapper(RAMDirectory@95fe7f lockFactory=org.apache.lucene.store.SingleInstanceLockFactory@1774633),segFN=segments_1,generation=1}
   [junit4]   2> 1444289 INFO  (coreLoadExecutor-1726-thread-1-processing-n:127.0.0.1:55558_f_tg%2Ff) [n:127.0.0.1:55558_f_tg%2Ff c:control_collection s:shard1 r:core_node1 x:collection1] o.a.s.c.SolrDeletionPolicy newest commit generation = 1
   [junit4]   2> 1444289 INFO  (coreLoadExecutor-1726-thread-1-processing-n:127.0.0.1:55558_f_tg%2Ff) [n:127.0.0.1:55558_f_tg%2Ff c:control_collection s:shard1 r:core_node1 x:collection1] o.a.s.s.SolrIndexSearcher Opening Searcher@1beab97[collection1] main
   [junit4]   2> 1444290 INFO  (coreLoadExecutor-1726-thread-1-processing-n:127.0.0.1:55558_f_tg%2Ff) [n:127.0.0.1:55558_f_tg%2Ff c:control_collection s:shard1 r:core_node1 x:collection1] o.a.s.c.c.ZkStateReader Load collection config from: [/collections/control_collection]
   [junit4]   2> 1444290 INFO  (coreLoadExecutor-1726-thread-1-processing-n:127.0.0.1:55558_f_tg%2Ff) [n:127.0.0.1:55558_f_tg%2Ff c:control_collection s:shard1 r:core_node1 x:collection1] o.a.s.c.c.ZkStateReader path=[/collections/control_collection] [configName]=[conf1] specified config exists in ZooKeeper
   [junit4]   2> 1444290 INFO  (coreLoadExecutor-1726-thread-1-processing-n:127.0.0.1:55558_f_tg%2Ff) [n:127.0.0.1:55558_f_tg%2Ff c:control_collection s:shard1 r:core_node1 x:collection1] o.a.s.r.ManagedResourceStorage Setting up ZooKeeper-based storage for the RestManager with znodeBase: /configs/conf1
   [junit4]   2> 1444290 INFO  (coreLoadExecutor-1726-thread-1-processing-n:127.0.0.1:55558_f_tg%2Ff) [n:127.0.0.1:55558_f_tg%2Ff c:control_collection s:shard1 r:core_node1 x:collection1] o.a.s.r.ManagedResourceStorage Configured ZooKeeperStorageIO with znodeBase: /configs/conf1
   [junit4]   2> 1444290 INFO  (coreLoadExecutor-1726-thread-1-processing-n:127.0.0.1:55558_f_tg%2Ff) [n:127.0.0.1:55558_f_tg%2Ff c:control_collection s:shard1 r:core_node1 x:collection1] o.a.s.r.RestManager Initializing RestManager with initArgs: {}
   [junit4]   2> 1444290 INFO  (coreLoadExecutor-1726-thread-1-processing-n:127.0.0.1:55558_f_tg%2Ff) [n:127.0.0.1:55558_f_tg%2Ff c:control_collection s:shard1 r:core_node1 x:collection1] o.a.s.r.ManagedResourceStorage Reading _rest_managed.json using ZooKeeperStorageIO:path=/configs/conf1
   [junit4]   2> 1444290 INFO  (coreLoadExecutor-1726-thread-1-processing-n:127.0.0.1:55558_f_tg%2Ff) [n:127.0.0.1:55558_f_tg%2Ff c:control_collection s:shard1 r:core_node1 x:collection1] o.a.s.r.ManagedResourceStorage No data found for znode /configs/conf1/_rest_managed.json
   [junit4]   2> 1444290 INFO  (coreLoadExecutor-1726-thread-1-processing-n:127.0.0.1:55558_f_tg%2Ff) [n:127.0.0.1:55558_f_tg%2Ff c:control_collection s:shard1 r:core_node1 x:collection1] o.a.s.r.ManagedResourceStorage Loaded null at path _rest_managed.json using ZooKeeperStorageIO:path=/configs/conf1
   [junit4]   2> 1444290 INFO  (coreLoadExecutor-1726-thread-1-processing-n:127.0.0.1:55558_f_tg%2Ff) [n:127.0.0.1:55558_f_tg%2Ff c:control_collection s:shard1 r:core_node1 x:collection1] o.a.s.r.RestManager Initializing 0 registered ManagedResources
   [junit4]   2> 1444290 INFO  (coreLoadExecutor-1726-thread-1-processing-n:127.0.0.1:55558_f_tg%2Ff) [n:127.0.0.1:55558_f_tg%2Ff c:control_collection s:shard1 r:core_node1 x:collection1] o.a.s.h.ReplicationHandler Commits will be reserved for  10000
   [junit4]   2> 1444291 INFO  (searcherExecutor-1727-thread-1-processing-c:control_collection r:core_node1 s:shard1 n:127.0.0.1:55558_f_tg%2Ff x:collection1) [n:127.0.0.1:55558_f_tg%2Ff c:control_collection s:shard1 r:core_node1 x:collection1] o.a.s.c.SolrCore [collection1] Registered new searcher Searcher@1beab97[collection1] main{ExitableDirectoryReader(UninvertingDirectoryReader())}
   [junit4]   2> 1444291 INFO  (coreLoadExecutor-1726-thread-1-processing-n:127.0.0.1:55558_f_tg%2Ff) [n:127.0.0.1:55558_f_tg%2Ff c:control_collection s:shard1 r:core_node1 x:collection1] o.a.s.u.UpdateLog Looking up max value of version field to seed version buckets
   [junit4]   2> 1444291 INFO  (coreLoadExecutor-1726-thread-1-processing-n:127.0.0.1:55558_f_tg%2Ff) [n:127.0.0.1:55558_f_tg%2Ff c:control_collection s:shard1 r:core_node1 x:collection1] o.a.s.u.VersionInfo Refreshing highest value of _version_ for 65536 version buckets from index
   [junit4]   2> 1444291 INFO  (coreLoadExecutor-1726-thread-1-processing-n:127.0.0.1:55558_f_tg%2Ff) [n:127.0.0.1:55558_f_tg%2Ff c:control_collection s:shard1 r:core_node1 x:collection1] o.a.s.u.VersionInfo No terms found for _version_, cannot seed version bucket highest value from index
   [junit4]   2> 1444291 INFO  (coreLoadExecutor-1726-thread-1-processing-n:127.0.0.1:55558_f_tg%2Ff) [n:127.0.0.1:55558_f_tg%2Ff c:control_collection s:shard1 r:core_node1 x:collection1] o.a.s.u.UpdateLog Could not find max version in index or recent updates, using new clock 1522246750919720960
   [junit4]   2> 1444292 INFO  (coreLoadExecutor-1726-thread-1-processing-n:127.0.0.1:55558_f_tg%2Ff) [n:127.0.0.1:55558_f_tg%2Ff c:control_collection s:shard1 r:core_node1 x:collection1] o.a.s.u.UpdateLog Took 1.0ms to seed version buckets with highest version 1522246750919720960
   [junit4]   2> 1444292 INFO  (coreLoadExecutor-1726-thread-1-processing-n:127.0.0.1:55558_f_tg%2Ff) [n:127.0.0.1:55558_f_tg%2Ff c:control_collection s:shard1 r:core_node1 x:collection1] o.a.s.c.ZkController watch zkdir /configs/conf1
   [junit4]   2> 1444293 INFO  (coreLoadExecutor-1726-thread-1-processing-n:127.0.0.1:55558_f_tg%2Ff) [n:127.0.0.1:55558_f_tg%2Ff c:control_collection s:shard1 r:core_node1 x:collection1] o.a.s.c.CoreContainer registering core: collection1
   [junit4]   2> 1444293 INFO  (coreZkRegister-1720-thread-1-processing-c:control_collection r:core_node1 s:shard1 n:127.0.0.1:55558_f_tg%2Ff x:collection1) [n:127.0.0.1:55558_f_tg%2Ff c:control_collection s:shard1 r:core_node1 x:collection1] o.a.s.c.ZkController Register replica - core:collection1 address:http://127.0.0.1:55558/f_tg/f collection:control_collection shard:shard1
   [junit4]   2> 1444293 INFO  (coreZkRegister-1720-thread-1-processing-c:control_collection r:core_node1 s:shard1 n:127.0.0.1:55558_f_tg%2Ff x:collection1) [n:127.0.0.1:55558_f_tg%2Ff c:control_collection s:shard1 r:core_node1 x:collection1] o.a.s.c.c.SolrZkClient makePath: /collections/control_collection/leader_elect/shard1/election
   [junit4]   2> 1444294 INFO  (coreZkRegister-1720-thread-1-processing-c:control_collection r:core_node1 s:shard1 n:127.0.0.1:55558_f_tg%2Ff x:collection1) [n:127.0.0.1:55558_f_tg%2Ff c:control_collection s:shard1 r:core_node1 x:collection1] o.a.s.c.LeaderElector Joined leadership election with path: /collections/control_collection/leader_elect/shard1/election/95140421839749124-core_node1-n_0000000000
   [junit4]   2> 1444295 INFO  (coreZkRegister-1720-thread-1-processing-c:control_collection r:core_node1 s:shard1 n:127.0.0.1:55558_f_tg%2Ff x:collection1) [n:127.0.0.1:55558_f_tg%2Ff c:control_collection s:shard1 r:core_node1 x:collection1] o.a.s.c.ShardLeaderElectionContext Running the leader process for shard=shard1 and weAreReplacement=false and leaderVoteWait=10000
   [junit4]   2> 1444295 INFO  (coreZkRegister-1720-thread-1-processing-c:control_collection r:core_node1 s:shard1 n:127.0.0.1:55558_f_tg%2Ff x:collection1) [n:127.0.0.1:55558_f_tg%2Ff c:control_collection s:shard1 r:core_node1 x:collection1] o.a.s.c.ShardLeaderElectionContext Enough replicas found to continue.
   [junit4]   2> 1444295 INFO  (coreZkRegister-1720-thread-1-processing-c:control_collection r:core_node1 s:shard1 n:127.0.0.1:55558_f_tg%2Ff x:collection1) [n:127.0.0.1:55558_f_tg%2Ff c:control_collection s:shard1 r:core_node1 x:collection1] o.a.s.c.ShardLeaderElectionContext I may be the new leader - try and sync
   [junit4]   2> 1444295 INFO  (coreZkRegister-1720-thread-1-processing-c:control_collection r:core_node1 s:shard1 n:127.0.0.1:55558_f_tg%2Ff x:collection1) [n:127.0.0.1:55558_f_tg%2Ff c:control_collection s:shard1 r:core_node1 x:collection1] o.a.s.c.SyncStrategy Sync replicas to http://127.0.0.1:55558/f_tg/f/collection1/
   [junit4]   2> 1444295 INFO  (coreZkRegister-1720-thread-1-processing-c:control_collection r:core_node1 s:shard1 n:127.0.0.1:55558_f_tg%2Ff x:collection1) [n:127.0.0.1:55558_f_tg%2Ff c:control_collection s:shard1 r:core_node1 x:collection1] o.a.s.c.SyncStrategy Sync Success - now sync replicas to me
   [junit4]   2> 1444295 INFO  (OverseerStateUpdate-95140421839749124-127.0.0.1:55558_f_tg%2Ff-n_0000000000) [n:127.0.0.1:55558_f_tg%2Ff    ] o.a.s.c.Overseer processMessage: queueSize: 1, message = {
   [junit4]   2>   "operation":"leader",
   [junit4]   2>   "shard":"shard1",
   [junit4]   2>   "collection":"control_collection"} current state version: 1
   [junit4]   2> 1444295 INFO  (coreZkRegister-1720-thread-1-processing-c:control_collection r:core_node1 s:shard1 n:127.0.0.1:55558_f_tg%2Ff x:collection1) [n:127.0.0.1:55558_f_tg%2Ff c:control_collection s:shard1 r:core_node1 x:collection1] o.a.s.c.SyncStrategy http://127.0.0.1:55558/f_tg/f/collection1/ has no replicas
   [junit4]   2> 1444296 INFO  (coreZkRegister-1720-thread-1-processing-c:control_collection r:core_node1 s:shard1 n:127.0.0.1:55558_f_tg%2Ff x:collection1) [n:127.0.0.1:55558_f_tg%2Ff c:control_collection s:shard1 r:core_node1 x:collection1] o.a.s.c.c.SolrZkClient makePath: /collections/control_collection/leaders/shard1
   [junit4]   2> 1444296 INFO  (coreZkRegister-1720-thread-1-processing-c:control_collection r:core_node1 s:shard1 n:127.0.0.1:55558_f_tg%2Ff x:collection1) [n:127.0.0.1:55558_f_tg%2Ff c:control_collection s:shard1 r:core_node1 x:collection1] o.a.s.c.ShardLeaderElectionContextBase Creating leader registration node
   [junit4]   2> 1444297 INFO  (coreZkRegister-1720-thread-1-processing-c:control_collection r:core_node1 s:shard1 n:127.0.0.1:55558_f_tg%2Ff x:collection1) [n:127.0.0.1:55558_f_tg%2Ff c:control_collection s:shard1 r:core_node1 x:collection1] o.a.s.c.ShardLeaderElectionContext I am the new leader: http://127.0.0.1:55558/f_tg/f/collection1/ shard1
   [junit4]   2> 1444298 INFO  (OverseerStateUpdate-95140421839749124-127.0.0.1:55558_f_tg%2Ff-n_0000000000) [n:127.0.0.1:55558_f_tg%2Ff    ] o.a.s.c.Overseer processMessage: queueSize: 1, message = {
   [junit4]   2>   "operation":"leader",
   [junit4]   2>   "shard":"shard1",
   [junit4]   2>   "collection":"control_collection",
   [junit4]   2>   "base_url":"http://127.0.0.1:55558/f_tg/f",
   [junit4]   2>   "core":"collection1",
   [junit4]   2>   "state":"active"} current state version: 1
   [junit4]   2> 1444399 INFO  (zkCallback-1131-thread-1-processing-n:127.0.0.1:55558_f_tg%2Ff) [n:127.0.0.1:55558_f_tg%2Ff    ] o.a.s.c.c.ZkStateReader A cluster state change: [WatchedEvent state:SyncConnected type:NodeDataChanged path:/clusterstate.json], has occurred - updating... (live nodes size: [1])
   [junit4]   2> 1444448 INFO  (coreZkRegister-1720-thread-1-processing-c:control_collection r:core_node1 s:shard1 n:127.0.0.1:55558_f_tg%2Ff x:collection1) [n:127.0.0.1:55558_f_tg%2Ff c:control_collection s:shard1 r:core_node1 x:collection1] o.a.s.c.ZkController We are http://127.0.0.1:55558/f_tg/f/collection1/ and leader is http://127.0.0.1:55558/f_tg/f/collection1/
   [junit4]   2> 1444448 INFO  (coreZkRegister-1720-thread-1-processing-c:control_collection r:core_node1 s:shard1 n:127.0.0.1:55558_f_tg%2Ff x:collection1) [n:127.0.0.1:55558_f_tg%2Ff c:control_collection s:shard1 r:core_node1 x:collection1] o.a.s.c.ZkController No LogReplay needed for core=collection1 baseURL=http://127.0.0.1:55558/f_tg/f
   [junit4]   2> 1444448 INFO  (coreZkRegister-1720-thread-1-processing-c:control_collection r:core_node1 s:shard1 n:127.0.0.1:55558_f_tg%2Ff x:collection1) [n:127.0.0.1:55558_f_tg%2Ff c:control_collection s:shard1 r:core_node1 x:collection1] o.a.s.c.ZkController I am the leader, no recovery necessary
   [junit4]   2> 1444448 INFO  (coreZkRegister-1720-thread-1-processing-c:control_collection r:core_node1 s:shard1 n:127.0.0.1:55558_f_tg%2Ff x:collection1) [n:127.0.0.1:55558_f_tg%2Ff c:control_collection s:shard1 r:core_node1 x:collection1] o.a.s.c.ZkController publishing state=active
   [junit4]   2> 1444448 INFO  (coreZkRegister-1720-thread-1-processing-c:control_collection r:core_node1 s:shard1 n:127.0.0.1:55558_f_tg%2Ff x:collection1) [n:127.0.0.1:55558_f_tg%2Ff c:control_collection s:shard1 r:core_node1 x:collection1] o.a.s.c.ZkController numShards not found on descriptor - reading it from system property
   [junit4]   2> 1444449 INFO  (OverseerStateUpdate-95140421839749124-127.0.0.1:55558_f_tg%2Ff-n_0000000000) [n:127.0.0.1:55558_f_tg%2Ff    ] o.a.s.c.Overseer processMessage: queueSize: 1, message = {
   [junit4]   2>   "collection":"control_collection",
   [junit4]   2>   "shard":"shard1",
   [junit4]   2>   "state":"active",
   [junit4]   2>   "operation":"state",
   [junit4]   2>   "core_node_name":"core_node1",
   [junit4]   2>   "node_name":"127.0.0.1:55558_f_tg%2Ff",
   [junit4]   2>   "base_url":"http://127.0.0.1:55558/f_tg/f",
   [junit4]   2>   "roles":null,
   [junit4]   2>   "core":"collection1",
   [junit4]   2>   "numShards":"1"} current state version: 2
   [junit4]   2> 1444449 INFO  (OverseerStateUpdate-95140421839749124-127.0.0.1:55558_f_tg%2Ff-n_0000000000) [n:127.0.0.1:55558_f_tg%2Ff    ] o.a.s.c.o.ReplicaMutator Update state numShards=1 message={
   [junit4]   2>   "collection":"control_collection",
   [junit4]   2>   "shard":"shard1",
   [junit4]   2>   "state":"active",
   [junit4]   2>   "operation":"state",
   [junit4]   2>   "core_node_name":"core_node1",
   [junit4]   2>   "node_name":"127.0.0.1:55558_f_tg%2Ff",
   [junit4]   2>   "base_url":"http://127.0.0.1:55558/f_tg/f",
   [junit4]   2>   "roles":null,
   [junit4]   2>   "core":"collection1",
   [junit4]   2>   "numShards":"1"}
   [junit4]   2> 1444551 INFO  (zkCallback-1131-thread-2-processing-n:127.0.0.1:55558_f_tg%2Ff) [n:127.0.0.1:55558_f_tg%2Ff    ] o.a.s.c.c.ZkStateReader A cluster state change: [WatchedEvent state:SyncConnected type:NodeDataChanged path:/clusterstate.json], has occurred - updating... (live nodes size: [1])
   [junit4]   2> 1444584 INFO  (TEST-RecoveryAfterSoftCommitTest.test-seed#[C3B555BF024816B0]) [    ] o.a.s.c.c.SolrZkClient Using default ZkCredentialsProvider
   [junit4]   2> 1444585 INFO  (TEST-RecoveryAfterSoftCommitTest.test-seed#[C3B555BF024816B0]) [    ] o.a.s.c.c.ConnectionManager Waiting for client to connect to ZooKeeper
   [junit4]   2> 1444586 INFO  (zkCallback-1133-thread-1) [    ] o.a.s.c.c.ConnectionManager Watcher org.apache.solr.common.cloud.ConnectionManager@4ed40 name:ZooKeeperConnection Watcher:127.0.0.1:45527/solr got event WatchedEvent state:SyncConnected type:None path:null path:null type:None
   [junit4]   2> 1444586 INFO  (TEST-RecoveryAfterSoftCommitTest.test-seed#[C3B555BF024816B0]) [    ] o.a.s.c.c.ConnectionManager Client is connected to ZooKeeper
   [junit4]   2> 1444586 INFO  (TEST-RecoveryAfterSoftCommitTest.test-seed#[C3B555BF024816B0]) [    ] o.a.s.c.c.SolrZkClient Using default ZkACLProvider
   [junit4]   2> 1444586 INFO  (TEST-RecoveryAfterSoftCommitTest.test-seed#[C3B555BF024816B0]) [    ] o.a.s.c.c.ZkStateReader Updating cluster state from ZooKeeper... 
   [junit4]   2> 1444587 INFO  (TEST-RecoveryAfterSoftCommitTest.test-seed#[C3B555BF024816B0]) [    ] o.a.s.c.ChaosMonkey monkey: init - expire sessions:false cause connection loss:false
   [junit4]   2> 1444635 INFO  (TEST-RecoveryAfterSoftCommitTest.test-seed#[C3B555BF024816B0]) [    ] o.a.s.SolrTestCaseJ4 Writing core.properties file to /home/jenkins/workspace/Lucene-Solr-5.x-Linux/solr/build/solr-core/test/J1/temp/solr.cloud.RecoveryAfterSoftCommitTest_C3B555BF024816B0-001/shard-1-001/cores/collection1
   [junit4]   2> 1444636 INFO  (TEST-RecoveryAfterSoftCommitTest.test-seed#[C3B555BF024816B0]) [    ] o.a.s.c.AbstractFullDistribZkTestBase create jetty 1 in directory /home/jenkins/workspace/Lucene-Solr-5.x-Linux/solr/build/solr-core/test/J1/temp/solr.cloud.RecoveryAfterSoftCommitTest_C3B555BF024816B0-001/shard-1-001
   [junit4]   2> 1444636 INFO  (TEST-RecoveryAfterSoftCommitTest.test-seed#[C3B555BF024816B0]) [    ] o.e.j.s.Server jetty-9.2.13.v20150730
   [junit4]   2> 1444637 INFO  (TEST-RecoveryAfterSoftCommitTest.test-seed#[C3B555BF024816B0]) [    ] o.e.j.s.h.ContextHandler Started o.e.j.s.ServletContextHandler@1b87abc{/f_tg/f,null,AVAILABLE}
   [junit4]   2> 1444637 INFO  (TEST-RecoveryAfterSoftCommitTest.test-seed#[C3B555BF024816B0]) [    ] o.e.j.s.ServerConnector Started ServerConnector@1f6c77{HTTP/1.1}{127.0.0.1:49228}
   [junit4]   2> 1444637 INFO  (TEST-RecoveryAfterSoftCommitTest.test-seed#[C3B555BF024816B0]) [    ] o.e.j.s.Server Started @1446213ms
   [junit4]   2> 1444637 INFO  (TEST-RecoveryAfterSoftCommitTest.test-seed#[C3B555BF024816B0]) [    ] o.a.s.c.s.e.JettySolrRunner Jetty properties: {hostContext=/f_tg/f, hostPort=38633, coreRootDirectory=/home/jenkins/workspace/Lucene-Solr-5.x-Linux/solr/build/solr-core/test/J1/temp/solr.cloud.RecoveryAfterSoftCommitTest_C3B555BF024816B0-001/shard-1-001/cores, solr.data.dir=/home/jenkins/workspace/Lucene-Solr-5.x-Linux/solr/build/solr-core/test/J1/temp/solr.cloud.RecoveryAfterSoftCommitTest_C3B555BF024816B0-001/tempDir-001/jetty1, solrconfig=solrconfig.xml}
   [junit4]   2> 1444638 INFO  (TEST-RecoveryAfterSoftCommitTest.test-seed#[C3B555BF024816B0]) [    ] o.a.s.s.SolrDispatchFilter SolrDispatchFilter.init(): sun.misc.Launcher$AppClassLoader@752144
   [junit4]   2> 1444638 INFO  (TEST-RecoveryAfterSoftCommitTest.test-seed#[C3B555BF024816B0]) [    ] o.a.s.c.SolrResourceLoader new SolrResourceLoader for directory: '/home/jenkins/workspace/Lucene-Solr-5.x-Linux/solr/build/solr-core/test/J1/temp/solr.cloud.RecoveryAfterSoftCommitTest_C3B555BF024816B0-001/shard-1-001'
   [junit4]   2> 1444638 INFO  (TEST-RecoveryAfterSoftCommitTest.test-seed#[C3B555BF024816B0]) [    ] o.a.s.c.SolrResourceLoader JNDI not configured for solr (NoInitialContextEx)
   [junit4]   2> 1444638 INFO  (TEST-RecoveryAfterSoftCommitTest.test-seed#[C3B555BF024816B0]) [    ] o.a.s.c.SolrResourceLoader solr home defaulted to 'solr/' (could not find system property or JNDI)
   [junit4]   2> 1444638 INFO  (TEST-RecoveryAfterSoftCommitTest.test-seed#[C3B555BF024816B0]) [    ] o.a.s.c.c.SolrZkClient Using default ZkCredentialsProvider
   [junit4]   2> 1444638 INFO  (TEST-RecoveryAfterSoftCommitTest.test-seed#[C3B555BF024816B0]) [    ] o.a.s.c.c.ConnectionManager Waiting for client to connect to ZooKeeper
   [junit4]   2> 1444639 INFO  (zkCallback-1134-thread-1) [    ] o.a.s.c.c.ConnectionManager Watcher org.apache.solr.common.cloud.ConnectionManager@10cf572 name:ZooKeeperConnection Watcher:127.0.0.1:45527/solr got event WatchedEvent state:SyncConnected type:None path:null path:null type:None
   [junit4]   2> 1444639 INFO  (TEST-RecoveryAfterSoftCommitTest.test-seed#[C3B555BF024816B0]) [    ] o.a.s.c.c.ConnectionManager Client is connected to ZooKeeper
   [junit4]   2> 1444639 INFO  (TEST-RecoveryAfterSoftCommitTest.test-seed#[C3B555BF024816B0]) [    ] o.a.s.c.c.SolrZkClient Using default ZkACLProvider
   [junit4]   2> 1444640 INFO  (TEST-RecoveryAfterSoftCommitTest.test-seed#[C3B555BF024816B0]) [    ] o.a.s.s.SolrDispatchFilter Loading solr.xml from SolrHome (not found in ZooKeeper)
   [junit4]   2> 1444640 INFO  (TEST-RecoveryAfterSoftCommitTest.test-seed#[C3B555BF024816B0]) [    ] o.a.s.c.SolrXmlConfig Loading container configuration from /home/jenkins/workspace/Lucene-Solr-5.x-Linux/solr/build/solr-core/test/J1/temp/solr.cloud.RecoveryAfterSoftCommitTest_C3B555BF024816B0-001/shard-1-001/solr.xml
   [junit4]   2> 1444658 INFO  (TEST-RecoveryAfterSoftCommitTest.test-seed#[C3B555BF024816B0]) [    ] o.a.s.c.CorePropertiesLocator Config-defined core root directory: /home/jenkins/workspace/Lucene-Solr-5.x-Linux/solr/build/solr-core/test/J1/temp/solr.cloud.RecoveryAfterSoftCommitTest_C3B555BF024816B0-001/shard-1-001/cores
   [junit4]   2> 1444658 INFO  (TEST-RecoveryAfterSoftCommitTest.test-seed#[C3B555BF024816B0]) [    ] o.a.s.c.CoreContainer New CoreContainer 14602999
   [junit4]   2> 1444658 INFO  (TEST-RecoveryAfterSoftCommitTest.test-seed#[C3B555BF024816B0]) [    ] o.a.s.c.CoreContainer Loading cores into CoreContainer [instanceDir=/home/jenkins/workspace/Lucene-Solr-5.x-Linux/solr/build/solr-core/test/J1/temp/solr.cloud.RecoveryAfterSoftCommitTest_C3B555BF024816B0-001/shard-1-001]
   [junit4]   2> 1444659 WARN  (TEST-RecoveryAfterSoftCommitTest.test-seed#[C3B555BF024816B0]) [    ] o.a.s.c.CoreContainer Couldn't add files from /home/jenkins/workspace/Lucene-Solr-5.x-Linux/solr/build/solr-core/test/J1/temp/solr.cloud.RecoveryAfterSoftCommitTest_C3B555BF024816B0-001/shard-1-001/lib to classpath: /home/jenkins/workspace/Lucene-Solr-5.x-Linux/solr/build/solr-core/test/J1/temp/solr.cloud.RecoveryAfterSoftCommitTest_C3B555BF024816B0-001/shard-1-001/lib
   [junit4]   2> 1444659 INFO  (TEST-RecoveryAfterSoftCommitTest.test-seed#[C3B555BF024816B0]) [    ] o.a.s.h.c.HttpShardHandlerFactory created with socketTimeout : 90000,urlScheme : ,connTimeout : 15000,maxConnectionsPerHost : 20,maxConnections : 10000,corePoolSize : 0,maximumPoolSize : 2147483647,maxThreadIdleTime : 5,sizeOfQueue : -1,fairnessPolicy : false,useRetries : false,
   [junit4]   2> 1444659 INFO  (TEST-RecoveryAfterSoftCommitTest.test-seed#[C3B555BF024816B0]) [    ] o.a.s.u.UpdateShardHandler Creating UpdateShardHandler HTTP client with params: socketTimeout=340000&connTimeout=45000&retry=true
   [junit4]   2> 1444660 INFO  (TEST-RecoveryAfterSoftCommitTest.test-seed#[C3B555BF024816B0]) [    ] o.a.s.l.LogWatcher SLF4J impl is org.slf4j.impl.Log4jLoggerFactory
   [junit4]   2> 1444660 INFO  (TEST-RecoveryAfterSoftCommitTest.test-seed#[C3B555BF024816B0]) [    ] o.a.s.l.LogWatcher Registering Log Listener [Log4j (org.slf4j.impl.Log4jLoggerFactory)]
   [junit4]   2> 1444660 INFO  (TEST-RecoveryAfterSoftCommitTest.test-seed#[C3B555BF024816B0]) [    ] o.a.s.c.ZkContainer Zookeeper client=127.0.0.1:45527/solr
   [junit4]   2> 1444660 INFO  (TEST-RecoveryAfterSoftCommitTest.test-seed#[C3B555BF024816B0]) [    ] o.a.s.c.ZkController zkHost includes chroot
   [junit4]   2> 1444660 INFO  (TEST-RecoveryAfterSoftCommitTest.test-seed#[C3B555BF024816B0]) [    ] o.a.s.c.c.SolrZkClient Using default ZkCredentialsProvider
   [junit4]   2> 1444660 INFO  (TEST-RecoveryAfterSoftCommitTest.test-seed#[C3B555BF024816B0]) [    ] o.a.s.c.c.ConnectionManager Waiting for client to connect to ZooKeeper
   [junit4]   2> 1444661 INFO  (zkCallback-1136-thread-1) [    ] o.a.s.c.c.ConnectionManager Watcher org.apache.solr.common.cloud.ConnectionManager@11c1ae7 name:ZooKeeperConnection Watcher:127.0.0.1:45527 got event WatchedEvent state:SyncConnected type:None path:null path:null type:None
   [junit4]   2> 1444661 INFO  (TEST-RecoveryAfterSoftCommitTest.test-seed#[C3B555BF024816B0]) [    ] o.a.s.c.c.ConnectionManager Client is connected to ZooKeeper
   [junit4]   2> 1444662 INFO  (TEST-RecoveryAfterSoftCommitTest.test-seed#[C3B555BF024816B0]) [    ] o.a.s.c.c.SolrZkClient Using default ZkACLProvider
   [junit4]   2> 1444662 INFO  (TEST-RecoveryAfterSoftCommitTest.test-seed#[C3B555BF024816B0]) [n:127.0.0.1:38633_f_tg%2Ff    ] o.a.s.c.c.ConnectionManager Waiting for client to connect to ZooKeeper
   [junit4]   2> 1444663 INFO  (zkCallback-1137-thread-1-processing-n:127.0.0.1:38633_f_tg%2Ff) [n:127.0.0.1:38633_f_tg%2Ff    ] o.a.s.c.c.ConnectionManager Watcher org.apache.solr.common.cloud.ConnectionManager@dc33f8 name:ZooKeeperConnection Watcher:127.0.0.1:45527/solr got event WatchedEvent state:SyncConnected type:None path:null path:null type:None
   [junit4]   2> 1444663 INFO  (TEST-RecoveryAfterSoftCommitTest.test-seed#[C3B555BF024816B0]) [n:127.0.0.1:38633_f_tg%2Ff    ] o.a.s.c.c.ConnectionManager Client is connected to ZooKeeper
   [junit4]   2> 1444665 INFO  (TEST-RecoveryAfterSoftCommitTest.test-seed#[C3B555BF024816B0]) [n:127.0.0.1:38633_f_tg%2Ff    ] o.a.s.c.c.ZkStateReader Updating cluster state from ZooKeeper... 
   [junit4]   2> 1445667 INFO  (TEST-RecoveryAfterSoftCommitTest.test-seed#[C3B555BF024816B0]) [n:127.0.0.1:38633_f_tg%2Ff    ] o.a.s.c.ZkController Register node as live in ZooKeeper:/live_nodes/127.0.0.1:38633_f_tg%2Ff
   [junit4]   2> 1445667 INFO  (TEST-RecoveryAfterSoftCommitTest.test-seed#[C3B555BF024816B0]) [n:127.0.0.1:38633_f_tg%2Ff    ] o.a.s.c.c.SolrZkClient makePath: /live_nodes/127.0.0.1:38633_f_tg%2Ff
   [junit4]   2> 1445668 INFO  (zkCallback-1133-thread-1) [    ] o.a.s.c.c.ZkStateReader A live node change: [WatchedEvent state:SyncConnected type:NodeChildrenChanged path:/live_nodes], has occurred - updating... (live nodes size: [1])
   [junit4]   2> 1445668 INFO  (zkCallback-1131-thread-2-processing-n:127.0.0.1:55558_f_tg%2Ff) [n:127.0.0.1:55558_f_tg%2Ff    ] o.a.s.c.c.ZkStateReader A live node change: [WatchedEvent state:SyncConnected type:NodeChildrenChanged path:/live_nodes], has occurred - updating... (live nodes size: [1])
   [junit4]   2> 1445668 INFO  (zkCallback-1137-thread-1-processing-n:127.0.0.1:38633_f_tg%2Ff) [n:127.0.0.1:38633_f_tg%2Ff    ] o.a.s.c.c.ZkStateReader A live node change: [WatchedEvent state:SyncConnected type:NodeChildrenChanged path:/live_nodes], has occurred - updating... (live nodes size: [1])
   [junit4]   2> 1445668 INFO  (TEST-RecoveryAfterSoftCommitTest.test-seed#[C3B555BF024816B0]) [n:127.0.0.1:38633_f_tg%2Ff    ] o.a.s.c.Overseer Overseer (id=null) closing
   [junit4]   2> 1445669 INFO  (TEST-RecoveryAfterSoftCommitTest.test-seed#[C3B555BF024816B0]) [n:127.0.0.1:38633_f_tg%2Ff    ] o.a.s.c.LeaderElector Joined leadership election with path: /overseer_elect/election/95140421839749128-127.0.0.1:38633_f_tg%2Ff-n_0000000001
   [junit4]   2> 1445669 INFO  (TEST-RecoveryAfterSoftCommitTest.test-seed#[C3B555BF024816B0]) [n:127.0.0.1:38633_f_tg%2Ff    ] o.a.s.c.LeaderElector Watching path /overseer_elect/election/95140421839749124-127.0.0.1:55558_f_tg%2Ff-n_0000000000 to know if I could be the leader
   [junit4]   2> 1445692 INFO  (TEST-RecoveryAfterSoftCommitTest.test-seed#[C3B555BF024816B0]) [n:127.0.0.1:38633_f_tg%2Ff    ] o.a.s.c.CoreContainer Security conf doesn't exist. Skipping setup for authorization module.
   [junit4]   2> 1445692 INFO  (TEST-RecoveryAfterSoftCommitTest.test-seed#[C3B555BF024816B0]) [n:127.0.0.1:38633_f_tg%2Ff    ] o.a.s.c.CoreContainer No authentication plugin used.
   [junit4]   2> 1445692 INFO  (TEST-RecoveryAfterSoftCommitTest.test-seed#[C3B555BF024816B0]) [n:127.0.0.1:38633_f_tg%2Ff    ] o.a.s.c.CorePropertiesLocator Looking for core definitions underneath /home/jenkins/workspace/Lucene-Solr-5.x-Linux/solr/build/solr-core/test/J1/temp/solr.cloud.RecoveryAfterSoftCommitTest_C3B555BF024816B0-001/shard-1-001/cores
   [junit4]   2> 1445693 INFO  (TEST-RecoveryAfterSoftCommitTest.test-seed#[C3B555BF024816B0]) [n:127.0.0.1:38633_f_tg%2Ff    ] o.a.s.c.CoreDescriptor Created CoreDescriptor: {name=collection1, coreNodeName=, dataDir=data/, configSetProperties=configsetprops.json, config=solrconfig.xml, collection=collection1, schema=schema.xml, loadOnStartup=true, transient=false, shard=}
   [junit4]   2> 1445693 INFO  (TEST-RecoveryAfterSoftCommitTest.test-seed#[C3B555BF024816B0]) [n:127.0.0.1:38633_f_tg%2Ff    ] o.a.s.c.CorePropertiesLocator Found core collection1 in /home/jenkins/workspace/Lucene-Solr-5.x-Linux/solr/build/solr-core/test/J1/temp/solr.cloud.RecoveryAfterSoftCommitTest_C3B555BF024816B0-001/shard-1-001/cores/collection1
   [junit4]   2> 1445693 INFO  (TEST-RecoveryAfterSoftCommitTest.test-seed#[C3B555BF024816B0]) [n:127.0.0.1:38633_f_tg%2Ff    ] o.a.s.c.CorePropertiesLocator Found 1 core definitions
   [junit4]   2> 1445693 INFO  (TEST-RecoveryAfterSoftCommitTest.test-seed#[C3B555BF024816B0]) [n:127.0.0.1:38633_f_tg%2Ff    ] o.a.s.s.SolrDispatchFilter user.dir=/home/jenkins/workspace/Lucene-Solr-5.x-Linux/solr/build/solr-core/test/J1
   [junit4]   2> 1445693 INFO  (TEST-RecoveryAfterSoftCommitTest.test-seed#[C3B555BF024816B0]) [n:127.0.0.1:38633_f_tg%2Ff    ] o.a.s.s.SolrDispatchFilter SolrDispatchFilter.init() done
   [junit4]   2> 1445693 INFO  (coreLoadExecutor-1737-thread-1-processing-n:127.0.0.1:38633_f_tg%2Ff) [n:127.0.0.1:38633_f_tg%2Ff c:collection1   x:collection1] o.a.s.c.ZkController publishing state=down
   [junit4]   2> 1445693 INFO  (coreLoadExecutor-1737-thread-1-processing-n:127.0.0.1:38633_f_tg%2Ff) [n:127.0.0.1:38633_f_tg%2Ff c:collection1   x:collection1] o.a.s.c.ZkController numShards not found on descriptor - reading it from system property
   [junit4]   2> 1445694 INFO  (coreLoadExecutor-1737-thread-1-processing-n:127.0.0.1:38633_f_tg%2Ff) [n:127.0.0.1:38633_f_tg%2Ff c:collection1   x:collection1] o.a.s.c.ZkController look for our core node name
   [junit4]   2> 1445694 INFO  (OverseerStateUpdate-95140421839749124-127.0.0.1:55558_f_tg%2Ff-n_0000000000) [n:127.0.0.1:55558_f_tg%2Ff    ] o.a.s.c.Overseer processMessage: queueSize: 1, message = {
   [junit4]   2>   "collection":"collection1",
   [junit4]   2>   "shard":null,
   [junit4]   2>   "state":"down",
   [junit4]   2>   "operation":"state",
   [junit4]   2>   "node_name":"127.0.0.1:38633_f_tg%2Ff",
   [junit4]   2>   "base_url":"http://127.0.0.1:38633/f_tg/f",
   [junit4]   2>   "roles":null,
   [junit4]   2>   "core":"collection1",
   [junit4]   2>   "numShards":"1"} current state version: 3
   [junit4]   2> 1445694 INFO  (OverseerStateUpdate-95140421839749124-127.0.0.1:55558_f_tg%2Ff-n_0000000000) [n:127.0.0.1:55558_f_tg%2Ff    ] o.a.s.c.o.ReplicaMutator Update state numShards=1 message={
   [junit4]   2>   "collection":"collection1",
   [junit4]   2>   "shard":null,
   [junit4]   2>   "state":"down",
   [junit4]   2>   "operation":"state",
   [junit4]   2>   "node_name":"127.0.0.1:38633_f_tg%2Ff",
   [junit4]   2>   "base_url":"http://127.0.0.1:38633/f_tg/f",
   [junit4]   2>   "roles":null,
   [junit4]   2>   "core":"collection1",
   [junit4]   2>   "numShards":"1"}
   [junit4]   2> 1445694 INFO  (OverseerStateUpdate-95140421839749124-127.0.0.1:55558_f_tg%2Ff-n_0000000000) [n:127.0.0.1:55558_f_tg%2Ff    ] o.a.s.c.o.ClusterStateMutator building a new cName: collection1
   [junit4]   2> 1445694 INFO  (OverseerStateUpdate-95140421839749124-127.0.0.1:55558_f_tg%2Ff-n_0000000000) [n:127.0.0.1:55558_f_tg%2Ff    ] o.a.s.c.o.ReplicaMutator Assigning new node to shard shard=shard1
   [junit4]   2> 1445796 INFO  (zkCallback-1133-thread-1) [    ] o.a.s.c.c.ZkStateReader A cluster state change: [WatchedEvent state:SyncConnected type:NodeDataChanged path:/clusterstate.json], has occurred - updating... (live nodes size: [2])
   [junit4]   2> 1445796 INFO  (zkCallback-1137-thread-1-processing-n:127.0.0.1:38633_f_tg%2Ff) [n:127.0.0.1:38633_f_tg%2Ff    ] o.a.s.c.c.ZkStateReader A cluster state change: [WatchedEvent state:SyncConnected type:NodeDataChanged path:/clusterstate.json], has occurred - updating... (live nodes size: [2])
   [junit4]   2> 1445796 INFO  (zkCallback-1131-thread-2-processing-n:127.0.0.1:55558_f_tg%2Ff) [n:127.0.0.1:55558_f_tg%2Ff    ] o.a.s.c.c.ZkStateReader A cluster state change: [WatchedEvent state:SyncConnected type:NodeDataChanged path:/clusterstate.json], has occurred - updating... (live nodes size: [2])
   [junit4]   2> 1446694 INFO  (coreLoadExecutor-1737-thread-1-processing-n:127.0.0.1:38633_f_tg%2Ff) [n:127.0.0.1:38633_f_tg%2Ff c:collection1   x:collection1] o.a.s.c.ZkController waiting to find shard id in clusterstate for collection1
   [junit4]   2> 1446694 INFO  (coreLoadExecutor-1737-thread-1-processing-n:127.0.0.1:38633_f_tg%2Ff) [n:127.0.0.1:38633_f_tg%2Ff c:collection1   x:collection1] o.a.s.c.ZkController Check for collection zkNode:collection1
   [junit4]   2> 1446695 INFO  (coreLoadExecutor-1737-thread-1-processing-n:127.0.0.1:38633_f_tg%2Ff) [n:127.0.0.1:38633_f_tg%2Ff c:collection1   x:collection1] o.a.s.c.ZkController Collection zkNode exists
   [junit4]   2> 1446695 INFO  (coreLoadExecutor-1737-thread-1-processing-n:127.0.0.1:38633_f_tg%2Ff) [n:127.0.0.1:38633_f_tg%2Ff c:collection1   x:collection1] o.a.s.c.c.ZkStateReader Load collection config from: [/collections/collection1]
   [junit4]   2> 1446695 INFO  (coreLoadExecutor-1737-thread-1-processing-n:127.0.0.1:38633_f_tg%2Ff) [n:127.0.0.1:38633_f_tg%2Ff c:collection1   x:collection1] o.a.s.c.c.ZkStateReader path=[/collections/collection1] [configName]=[conf1] specified config exists in ZooKeeper
   [junit4]   2> 1446695 INFO  (coreLoadExecutor-1737-thread-1-processing-n:127.0.0.1:38633_f_tg%2Ff) [n:127.0.0.1:38633_f_tg%2Ff c:collection1   x:collection1] o.a.s.c.SolrResourceLoader new SolrResourceLoader for directory: '/home/jenkins/workspace/Lucene-Solr-5.x-Linux/solr/build/solr-core/test/J1/temp/solr.cloud.RecoveryAfterSoftCommitTest_C3B555BF024816B0-001/shard-1-001/cores/collection1'
   [junit4]   2> 1446695 INFO  (coreLoadExecutor-1737-thread-1-processing-n:127.0.0.1:38633_f_tg%2Ff) [n:127.0.0.1:38633_f_tg%2Ff c:collection1   x:collection1] o.a.s.c.SolrResourceLoader JNDI not configured for solr (NoInitialContextEx)
   [junit4]   2> 1446695 INFO  (coreLoadExecutor-1737-thread-1-processing-n:127.0.0.1:38633_f_tg%2Ff) [n:127.0.0.1:38633_f_tg%2Ff c:collection1   x:collection1] o.a.s.c.SolrResourceLoader solr home defaulted to 'solr/' (could not find system property or JNDI)
   [junit4]   2> 1446696 INFO  (coreLoadExecutor-1737-thread-1-processing-n:127.0.0.1:38633_f_tg%2Ff) [n:127.0.0.1:38633_f_tg%2Ff c:collection1   x:collection1] o.a.s.c.Config loaded config solrconfig.xml with version 0 
   [junit4]   2> 1446700 INFO  (coreLoadExecutor-1737-thread-1-processing-n:127.0.0.1:38633_f_tg%2Ff) [n:127.0.0.1:38633_f_tg%2Ff c:collection1   x:collection1] o.a.s.c.S

[...truncated too long message...]

a1] o.a.s.c.CachingDirectoryFactory Closing directory: data
   [junit4]   2> 2283999 INFO  (zkCallback-1599-thread-2-processing-n:127.0.0.1:57655_solr) [n:127.0.0.1:57655_solr c:testSolrCloudCollection s:shard1 r:core_node3 x:testSolrCloudCollection_shard1_replica1] o.a.s.c.ShardLeaderElectionContextBase No version found for ephemeral leader parent node, won't remove previous leader registration.
   [junit4]   2> 2283999 INFO  (zkCallback-1599-thread-2-processing-n:127.0.0.1:57655_solr) [n:127.0.0.1:57655_solr c:testSolrCloudCollection s:shard1 r:core_node3 x:testSolrCloudCollection_shard1_replica1] o.a.s.c.ElectionContext Canceling election /collections/testSolrCloudCollection/leader_elect/shard1/election/95140475717091342-core_node3-n_0000000001
   [junit4]   2> 2283999 WARN  (zkCallback-1599-thread-2-processing-n:127.0.0.1:57655_solr) [n:127.0.0.1:57655_solr c:testSolrCloudCollection s:shard1 r:core_node3 x:testSolrCloudCollection_shard1_replica1] o.a.s.c.LeaderElector 
   [junit4]   2> org.apache.zookeeper.KeeperException$SessionExpiredException: KeeperErrorCode = Session expired for /collections/testSolrCloudCollection/leader_elect/shard1/election/95140475717091342-core_node3-n_0000000001
   [junit4]   2> 	at org.apache.zookeeper.KeeperException.create(KeeperException.java:127)
   [junit4]   2> 	at org.apache.zookeeper.KeeperException.create(KeeperException.java:51)
   [junit4]   2> 	at org.apache.zookeeper.ZooKeeper.delete(ZooKeeper.java:873)
   [junit4]   2> 	at org.apache.solr.common.cloud.SolrZkClient$2.execute(SolrZkClient.java:244)
   [junit4]   2> 	at org.apache.solr.common.cloud.SolrZkClient$2.execute(SolrZkClient.java:241)
   [junit4]   2> 	at org.apache.solr.common.cloud.ZkCmdExecutor.retryOperation(ZkCmdExecutor.java:61)
   [junit4]   2> 	at org.apache.solr.common.cloud.SolrZkClient.delete(SolrZkClient.java:241)
   [junit4]   2> 	at org.apache.solr.cloud.ElectionContext.cancelElection(ElectionContext.java:87)
   [junit4]   2> 	at org.apache.solr.cloud.ShardLeaderElectionContextBase.cancelElection(ElectionContext.java:167)
   [junit4]   2> 	at org.apache.solr.cloud.ShardLeaderElectionContext.cancelElection(ElectionContext.java:269)
   [junit4]   2> 	at org.apache.solr.cloud.ShardLeaderElectionContext.runLeaderProcess(ElectionContext.java:445)
   [junit4]   2> 	at org.apache.solr.cloud.LeaderElector.runIamLeaderProcess(LeaderElector.java:198)
   [junit4]   2> 	at org.apache.solr.cloud.LeaderElector.checkIfIamLeader(LeaderElector.java:158)
   [junit4]   2> 	at org.apache.solr.cloud.LeaderElector.access$200(LeaderElector.java:59)
   [junit4]   2> 	at org.apache.solr.cloud.LeaderElector$ElectionWatcher.process(LeaderElector.java:389)
   [junit4]   2> 	at org.apache.solr.common.cloud.SolrZkClient$3$1.run(SolrZkClient.java:264)
   [junit4]   2> 	at java.util.concurrent.Executors$RunnableAdapter.call(Executors.java:471)
   [junit4]   2> 	at java.util.concurrent.FutureTask.run(FutureTask.java:262)
   [junit4]   2> 	at org.apache.solr.common.util.ExecutorUtil$MDCAwareThreadPoolExecutor$1.run(ExecutorUtil.java:232)
   [junit4]   2> 	at java.util.concurrent.ThreadPoolExecutor.runWorker(ThreadPoolExecutor.java:1145)
   [junit4]   2> 	at java.util.concurrent.ThreadPoolExecutor$Worker.run(ThreadPoolExecutor.java:615)
   [junit4]   2> 	at java.lang.Thread.run(Thread.java:745)
   [junit4]   2> 2284000 INFO  (jetty-launcher-1579-thread-3) [n:127.0.0.1:57655_solr c:testSolrCloudCollection s:shard1 r:core_node3 x:testSolrCloudCollection_shard1_replica1] o.e.j.s.h.ContextHandler Stopped o.e.j.s.ServletContextHandler@112a864{/solr,null,UNAVAILABLE}
   [junit4]   2> 2284001 INFO  (TEST-TestMiniSolrCloudClusterBase.testBasics-seed#[C3B555BF024816B0]) [    ] o.a.s.c.ZkTestServer connecting to 127.0.0.1:40928 40928
   [junit4]   2> 2284018 INFO  (Thread-3487) [    ] o.a.s.c.ZkTestServer connecting to 127.0.0.1:40928 40928
   [junit4]   2> 2284018 WARN  (Thread-3487) [    ] o.a.s.c.ZkTestServer Watch limit violations: 
   [junit4]   2> Maximum concurrent create/delete watches above limit:
   [junit4]   2> 
   [junit4]   2> 	8	/solr/aliases.json
   [junit4]   2> 	6	/solr/security.json
   [junit4]   2> 	4	/solr/configs/solrCloudCollectionConfig
   [junit4]   2> 
   [junit4]   2> Maximum concurrent data watches above limit:
   [junit4]   2> 
   [junit4]   2> 	8	/solr/clusterstate.json
   [junit4]   2> 	4	/solr/collections/testSolrCloudCollection/state.json
   [junit4]   2> 	2	/solr/overseer_elect/election/95140475717091342-127.0.0.1:57655_solr-n_0000000002
   [junit4]   2> 
   [junit4]   2> Maximum concurrent children watches above limit:
   [junit4]   2> 
   [junit4]   2> 	8	/solr/collections
   [junit4]   2> 	7	/solr/live_nodes
   [junit4]   2> 	2	/solr/overseer/queue
   [junit4]   2> 	2	/solr/overseer/collection-queue-work
   [junit4]   2> 
   [junit4]   2> NOTE: reproduce with: ant test  -Dtestcase=TestMiniSolrCloudClusterBase -Dtests.method=testBasics -Dtests.seed=C3B555BF024816B0 -Dtests.multiplier=3 -Dtests.slow=true -Dtests.locale=nl_BE -Dtests.timezone=America/Grand_Turk -Dtests.asserts=true -Dtests.file.encoding=UTF-8
   [junit4] FAILURE 19.0s J1 | TestMiniSolrCloudClusterBase.testBasics <<<
   [junit4]    > Throwable #1: java.lang.AssertionError: expected:<1> but was:<0>
   [junit4]    > 	at __randomizedtesting.SeedInfo.seed([C3B555BF024816B0:FE6DFB933AA648C0]:0)
   [junit4]    > 	at org.apache.solr.cloud.TestMiniSolrCloudClusterBase.testCollectionCreateSearchDelete(TestMiniSolrCloudClusterBase.java:149)
   [junit4]    > 	at org.apache.solr.cloud.TestMiniSolrCloudClusterBase.testBasics(TestMiniSolrCloudClusterBase.java:78)
   [junit4]    > 	at java.lang.Thread.run(Thread.java:745)
   [junit4]   2> NOTE: leaving temporary files on disk at: /home/jenkins/workspace/Lucene-Solr-5.x-Linux/solr/build/solr-core/test/J1/temp/solr.cloud.TestMiniSolrCloudClusterBase_C3B555BF024816B0-001
   [junit4]   2> Jan 02, 2016 9:54:29 AM com.carrotsearch.randomizedtesting.ThreadLeakControl checkThreadLeaks
   [junit4]   2> WARNING: Will linger awaiting termination of 1 leaked thread(s).
   [junit4]   2> NOTE: test params are: codec=Asserting(Lucene54), sim=RandomSimilarityProvider(queryNorm=false,coord=yes): {}, locale=nl_BE, timezone=America/Grand_Turk
   [junit4]   2> NOTE: Linux 3.19.0-42-generic i386/Oracle Corporation 1.7.0_80 (32-bit)/cpus=12,threads=1,free=81196552,total=320475136
   [junit4]   2> NOTE: All tests run in this JVM: [TestManagedSynonymFilterFactory, CollectionsAPIDistributedZkTest, TestCollapseQParserPlugin, TestDefaultStatsCache, SpellCheckComponentTest, HighlighterTest, AddSchemaFieldsUpdateProcessorFactoryTest, DistributedTermsComponentTest, TestRequestForwarding, TestTestInjection, TestConfigSetImmutable, DocValuesTest, DistributedDebugComponentTest, TestRestManager, DistributedQueueTest, DistributedSuggestComponentTest, TestOverriddenPrefixQueryForCustomFieldType, CloudMLTQParserTest, TestQueryTypes, OverseerRolesTest, ConvertedLegacyTest, TestCloudManagedSchemaConcurrent, ChaosMonkeyNothingIsSafeTest, TestCoreContainer, LeaderInitiatedRecoveryOnShardRestartTest, DistanceUnitsTest, OutOfBoxZkACLAndCredentialsProvidersTest, SortSpecParsingTest, CoreAdminCreateDiscoverTest, TestRandomForceMergePolicy, TestExpandComponent, DeleteLastCustomShardedReplicaTest, HdfsRecoverLeaseTest, TestConfigReload, RecoveryAfterSoftCommitTest, DistribCursorPagingTest, TestWordDelimiterFilterFactory, TestSimpleTrackingShardHandler, TestFieldTypeCollectionResource, TestOrdValues, TestBM25SimilarityFactory, TestFastLRUCache, DistributedIntervalFacetingTest, TestSearcherReuse, FastVectorHighlighterTest, TestStressVersions, TestRawResponseWriter, IndexBasedSpellCheckerTest, TestPartialUpdateDeduplication, ZkStateReaderTest, TermsComponentTest, TestDynamicLoading, ChaosMonkeySafeLeaderTest, DistributedFacetPivotLongTailTest, DOMUtilTest, TestSolrDeletionPolicy2, SpellPossibilityIteratorTest, RulesTest, ConjunctionSolrSpellCheckerTest, TimeZoneUtilsTest, UpdateRequestProcessorFactoryTest, TestQuerySenderNoQuery, ShardRoutingCustomTest, TestCloudPivotFacet, TestRuleBasedAuthorizationPlugin, DocExpirationUpdateProcessorFactoryTest, TestSolrCoreProperties, AssignTest, FileUtilsTest, CollectionsAPIAsyncDistributedZkTest, DocumentBuilderTest, TestTrie, TestMacros, DirectSolrSpellCheckerTest, TestManagedSchemaFieldResource, TestExceedMaxTermLength, TestSolrQueryParserResource, TestSystemIdResolver, LoggingHandlerTest, TestMaxScoreQueryParser, ConnectionManagerTest, TestDynamicFieldResource, NotRequiredUniqueKeyTest, DistributedFacetPivotWhiteBoxTest, TestCursorMarkWithoutUniqueKey, TestShardHandlerFactory, TestMiniSolrCloudClusterBase]
   [junit4] Completed [558/562 (2!)] on J1 in 19.80s, 1 test, 1 failure <<< FAILURES!

[...truncated 24 lines...]
BUILD FAILED
/home/jenkins/workspace/Lucene-Solr-5.x-Linux/build.xml:794: The following error occurred while executing this line:
/home/jenkins/workspace/Lucene-Solr-5.x-Linux/build.xml:738: The following error occurred while executing this line:
/home/jenkins/workspace/Lucene-Solr-5.x-Linux/build.xml:59: The following error occurred while executing this line:
/home/jenkins/workspace/Lucene-Solr-5.x-Linux/solr/build.xml:233: The following error occurred while executing this line:
/home/jenkins/workspace/Lucene-Solr-5.x-Linux/solr/common-build.xml:526: The following error occurred while executing this line:
/home/jenkins/workspace/Lucene-Solr-5.x-Linux/lucene/common-build.xml:1444: The following error occurred while executing this line:
/home/jenkins/workspace/Lucene-Solr-5.x-Linux/lucene/common-build.xml:1000: There were test failures: 562 suites (7 ignored), 2231 tests, 2 failures, 83 ignored (39 assumptions) [seed: C3B555BF024816B0]

Total time: 62 minutes 38 seconds
Build step 'Invoke Ant' marked build as failure
Archiving artifacts
[WARNINGS] Skipping publisher since build result is FAILURE
Recording test results
Email was triggered for: Failure - Any
Sending email for trigger: Failure - Any



Mime
View raw message