lucene-dev mailing list archives

Site index · List index
Message view « Date » · « Thread »
Top « Date » · « Thread »
From Apache Jenkins Server <jenk...@builds.apache.org>
Subject [JENKINS] Lucene-Solr-Tests-trunk-Java8 - Build # 793 - Failure
Date Sun, 24 Jan 2016 12:58:51 GMT
Build: https://builds.apache.org/job/Lucene-Solr-Tests-trunk-Java8/793/

1 tests failed.
FAILED:  org.apache.solr.handler.TestReplicationHandler.doTestStressReplication

Error Message:
timed out waiting for collection1 startAt time to exceed: Sun Jan 24 04:10:56 PST 2016

Stack Trace:
java.lang.AssertionError: timed out waiting for collection1 startAt time to exceed: Sun Jan 24 04:10:56 PST 2016
	at __randomizedtesting.SeedInfo.seed([91C441A8E8D2D3D7:4A6F416EEDFABA64]:0)
	at org.junit.Assert.fail(Assert.java:93)
	at org.apache.solr.handler.TestReplicationHandler.watchCoreStartAt(TestReplicationHandler.java:1419)
	at org.apache.solr.handler.TestReplicationHandler.doTestStressReplication(TestReplicationHandler.java:771)
	at sun.reflect.NativeMethodAccessorImpl.invoke0(Native Method)
	at sun.reflect.NativeMethodAccessorImpl.invoke(NativeMethodAccessorImpl.java:62)
	at sun.reflect.DelegatingMethodAccessorImpl.invoke(DelegatingMethodAccessorImpl.java:43)
	at java.lang.reflect.Method.invoke(Method.java:497)
	at com.carrotsearch.randomizedtesting.RandomizedRunner.invoke(RandomizedRunner.java:1764)
	at com.carrotsearch.randomizedtesting.RandomizedRunner$8.evaluate(RandomizedRunner.java:871)
	at com.carrotsearch.randomizedtesting.RandomizedRunner$9.evaluate(RandomizedRunner.java:907)
	at com.carrotsearch.randomizedtesting.RandomizedRunner$10.evaluate(RandomizedRunner.java:921)
	at com.carrotsearch.randomizedtesting.rules.SystemPropertiesRestoreRule$1.evaluate(SystemPropertiesRestoreRule.java:57)
	at org.apache.lucene.util.TestRuleSetupTeardownChained$1.evaluate(TestRuleSetupTeardownChained.java:50)
	at org.apache.lucene.util.AbstractBeforeAfterRule$1.evaluate(AbstractBeforeAfterRule.java:46)
	at org.apache.lucene.util.TestRuleThreadAndTestName$1.evaluate(TestRuleThreadAndTestName.java:49)
	at org.apache.lucene.util.TestRuleIgnoreAfterMaxFailures$1.evaluate(TestRuleIgnoreAfterMaxFailures.java:65)
	at org.apache.lucene.util.TestRuleMarkFailure$1.evaluate(TestRuleMarkFailure.java:48)
	at com.carrotsearch.randomizedtesting.rules.StatementAdapter.evaluate(StatementAdapter.java:36)
	at com.carrotsearch.randomizedtesting.ThreadLeakControl$StatementRunner.run(ThreadLeakControl.java:367)
	at com.carrotsearch.randomizedtesting.ThreadLeakControl.forkTimeoutingTask(ThreadLeakControl.java:809)
	at com.carrotsearch.randomizedtesting.ThreadLeakControl$3.evaluate(ThreadLeakControl.java:460)
	at com.carrotsearch.randomizedtesting.RandomizedRunner.runSingleTest(RandomizedRunner.java:880)
	at com.carrotsearch.randomizedtesting.RandomizedRunner$5.evaluate(RandomizedRunner.java:781)
	at com.carrotsearch.randomizedtesting.RandomizedRunner$6.evaluate(RandomizedRunner.java:816)
	at com.carrotsearch.randomizedtesting.RandomizedRunner$7.evaluate(RandomizedRunner.java:827)
	at com.carrotsearch.randomizedtesting.rules.StatementAdapter.evaluate(StatementAdapter.java:36)
	at com.carrotsearch.randomizedtesting.rules.SystemPropertiesRestoreRule$1.evaluate(SystemPropertiesRestoreRule.java:57)
	at org.apache.lucene.util.AbstractBeforeAfterRule$1.evaluate(AbstractBeforeAfterRule.java:46)
	at com.carrotsearch.randomizedtesting.rules.StatementAdapter.evaluate(StatementAdapter.java:36)
	at org.apache.lucene.util.TestRuleStoreClassName$1.evaluate(TestRuleStoreClassName.java:42)
	at com.carrotsearch.randomizedtesting.rules.NoShadowingOrOverridesOnMethodsRule$1.evaluate(NoShadowingOrOverridesOnMethodsRule.java:40)
	at com.carrotsearch.randomizedtesting.rules.NoShadowingOrOverridesOnMethodsRule$1.evaluate(NoShadowingOrOverridesOnMethodsRule.java:40)
	at com.carrotsearch.randomizedtesting.rules.StatementAdapter.evaluate(StatementAdapter.java:36)
	at com.carrotsearch.randomizedtesting.rules.StatementAdapter.evaluate(StatementAdapter.java:36)
	at com.carrotsearch.randomizedtesting.rules.StatementAdapter.evaluate(StatementAdapter.java:36)
	at org.apache.lucene.util.TestRuleAssertionsRequired$1.evaluate(TestRuleAssertionsRequired.java:54)
	at org.apache.lucene.util.TestRuleMarkFailure$1.evaluate(TestRuleMarkFailure.java:48)
	at org.apache.lucene.util.TestRuleIgnoreAfterMaxFailures$1.evaluate(TestRuleIgnoreAfterMaxFailures.java:65)
	at org.apache.lucene.util.TestRuleIgnoreTestSuites$1.evaluate(TestRuleIgnoreTestSuites.java:55)
	at com.carrotsearch.randomizedtesting.rules.StatementAdapter.evaluate(StatementAdapter.java:36)
	at com.carrotsearch.randomizedtesting.ThreadLeakControl$StatementRunner.run(ThreadLeakControl.java:367)
	at java.lang.Thread.run(Thread.java:745)




Build Log:
[...truncated 9577 lines...]
   [junit4] Suite: org.apache.solr.handler.TestReplicationHandler
   [junit4]   2> Creating dataDir: /x1/jenkins/jenkins-slave/workspace/Lucene-Solr-Tests-trunk-Java8/solr/build/solr-core/test/J0/temp/solr.handler.TestReplicationHandler_91C441A8E8D2D3D7-001/init-core-data-001
   [junit4]   2> 373093 INFO  (TEST-TestReplicationHandler.doTestRepeater-seed#[91C441A8E8D2D3D7]) [    ] o.a.s.SolrTestCaseJ4 ###Starting doTestRepeater
   [junit4]   2> 373094 INFO  (TEST-TestReplicationHandler.doTestRepeater-seed#[91C441A8E8D2D3D7]) [    ] o.a.s.SolrTestCaseJ4 Writing core.properties file to /x1/jenkins/jenkins-slave/workspace/Lucene-Solr-Tests-trunk-Java8/solr/build/solr-core/test/J0/temp/solr.handler.TestReplicationHandler_91C441A8E8D2D3D7-001/solr-instance-001/collection1
   [junit4]   2> 373098 INFO  (TEST-TestReplicationHandler.doTestRepeater-seed#[91C441A8E8D2D3D7]) [    ] o.e.j.s.Server jetty-9.2.13.v20150730
   [junit4]   2> 373100 INFO  (TEST-TestReplicationHandler.doTestRepeater-seed#[91C441A8E8D2D3D7]) [    ] o.e.j.s.h.ContextHandler Started o.e.j.s.ServletContextHandler@710790b{/solr,null,AVAILABLE}
   [junit4]   2> 373105 INFO  (TEST-TestReplicationHandler.doTestRepeater-seed#[91C441A8E8D2D3D7]) [    ] o.e.j.s.ServerConnector Started ServerConnector@6b766f8d{HTTP/1.1}{127.0.0.1:55248}
   [junit4]   2> 373105 INFO  (TEST-TestReplicationHandler.doTestRepeater-seed#[91C441A8E8D2D3D7]) [    ] o.e.j.s.Server Started @376455ms
   [junit4]   2> 373105 INFO  (TEST-TestReplicationHandler.doTestRepeater-seed#[91C441A8E8D2D3D7]) [    ] o.a.s.c.s.e.JettySolrRunner Jetty properties: {solr.data.dir=/x1/jenkins/jenkins-slave/workspace/Lucene-Solr-Tests-trunk-Java8/solr/build/solr-core/test/J0/temp/solr.handler.TestReplicationHandler_91C441A8E8D2D3D7-001/solr-instance-001/collection1/data, hostContext=/solr, hostPort=55248}
   [junit4]   2> 373106 INFO  (TEST-TestReplicationHandler.doTestRepeater-seed#[91C441A8E8D2D3D7]) [    ] o.a.s.s.SolrDispatchFilter SolrDispatchFilter.init(): sun.misc.Launcher$AppClassLoader@4e0e2f2a
   [junit4]   2> 373106 INFO  (TEST-TestReplicationHandler.doTestRepeater-seed#[91C441A8E8D2D3D7]) [    ] o.a.s.c.SolrResourceLoader new SolrResourceLoader for directory: '/x1/jenkins/jenkins-slave/workspace/Lucene-Solr-Tests-trunk-Java8/solr/build/solr-core/test/J0/temp/solr.handler.TestReplicationHandler_91C441A8E8D2D3D7-001/solr-instance-001'
   [junit4]   2> 373106 INFO  (TEST-TestReplicationHandler.doTestRepeater-seed#[91C441A8E8D2D3D7]) [    ] o.a.s.c.SolrResourceLoader JNDI not configured for solr (NoInitialContextEx)
   [junit4]   2> 373106 INFO  (TEST-TestReplicationHandler.doTestRepeater-seed#[91C441A8E8D2D3D7]) [    ] o.a.s.c.SolrResourceLoader solr home defaulted to 'solr/' (could not find system property or JNDI)
   [junit4]   2> 373106 INFO  (TEST-TestReplicationHandler.doTestRepeater-seed#[91C441A8E8D2D3D7]) [    ] o.a.s.c.SolrXmlConfig Loading container configuration from /x1/jenkins/jenkins-slave/workspace/Lucene-Solr-Tests-trunk-Java8/solr/build/solr-core/test/J0/temp/solr.handler.TestReplicationHandler_91C441A8E8D2D3D7-001/solr-instance-001/solr.xml
   [junit4]   2> 373112 INFO  (TEST-TestReplicationHandler.doTestRepeater-seed#[91C441A8E8D2D3D7]) [    ] o.a.s.c.CorePropertiesLocator Config-defined core root directory: /x1/jenkins/jenkins-slave/workspace/Lucene-Solr-Tests-trunk-Java8/solr/build/solr-core/test/J0/temp/solr.handler.TestReplicationHandler_91C441A8E8D2D3D7-001/solr-instance-001/.
   [junit4]   2> 373112 INFO  (TEST-TestReplicationHandler.doTestRepeater-seed#[91C441A8E8D2D3D7]) [    ] o.a.s.c.CoreContainer New CoreContainer 1264382205
   [junit4]   2> 373112 INFO  (TEST-TestReplicationHandler.doTestRepeater-seed#[91C441A8E8D2D3D7]) [    ] o.a.s.c.CoreContainer Loading cores into CoreContainer [instanceDir=/x1/jenkins/jenkins-slave/workspace/Lucene-Solr-Tests-trunk-Java8/solr/build/solr-core/test/J0/temp/solr.handler.TestReplicationHandler_91C441A8E8D2D3D7-001/solr-instance-001]
   [junit4]   2> 373113 WARN  (TEST-TestReplicationHandler.doTestRepeater-seed#[91C441A8E8D2D3D7]) [    ] o.a.s.c.CoreContainer Couldn't add files from /x1/jenkins/jenkins-slave/workspace/Lucene-Solr-Tests-trunk-Java8/solr/build/solr-core/test/J0/temp/solr.handler.TestReplicationHandler_91C441A8E8D2D3D7-001/solr-instance-001/lib to classpath: /x1/jenkins/jenkins-slave/workspace/Lucene-Solr-Tests-trunk-Java8/solr/build/solr-core/test/J0/temp/solr.handler.TestReplicationHandler_91C441A8E8D2D3D7-001/solr-instance-001/lib
   [junit4]   2> 373113 INFO  (TEST-TestReplicationHandler.doTestRepeater-seed#[91C441A8E8D2D3D7]) [    ] o.a.s.h.c.HttpShardHandlerFactory created with socketTimeout : 90000,urlScheme : ,connTimeout : 15000,maxConnectionsPerHost : 20,maxConnections : 10000,corePoolSize : 0,maximumPoolSize : 2147483647,maxThreadIdleTime : 5,sizeOfQueue : -1,fairnessPolicy : false,useRetries : false,
   [junit4]   2> 373114 INFO  (TEST-TestReplicationHandler.doTestRepeater-seed#[91C441A8E8D2D3D7]) [    ] o.a.s.u.UpdateShardHandler Creating UpdateShardHandler HTTP client with params: socketTimeout=340000&connTimeout=45000&retry=true
   [junit4]   2> 373115 INFO  (TEST-TestReplicationHandler.doTestRepeater-seed#[91C441A8E8D2D3D7]) [    ] o.a.s.l.LogWatcher SLF4J impl is org.slf4j.impl.Log4jLoggerFactory
   [junit4]   2> 373115 INFO  (TEST-TestReplicationHandler.doTestRepeater-seed#[91C441A8E8D2D3D7]) [    ] o.a.s.l.LogWatcher Registering Log Listener [Log4j (org.slf4j.impl.Log4jLoggerFactory)]
   [junit4]   2> 373115 INFO  (TEST-TestReplicationHandler.doTestRepeater-seed#[91C441A8E8D2D3D7]) [    ] o.a.s.c.CoreContainer Security conf doesn't exist. Skipping setup for authorization module.
   [junit4]   2> 373115 INFO  (TEST-TestReplicationHandler.doTestRepeater-seed#[91C441A8E8D2D3D7]) [    ] o.a.s.c.CoreContainer No authentication plugin used.
   [junit4]   2> 373115 INFO  (TEST-TestReplicationHandler.doTestRepeater-seed#[91C441A8E8D2D3D7]) [    ] o.a.s.c.CorePropertiesLocator Looking for core definitions underneath /x1/jenkins/jenkins-slave/workspace/Lucene-Solr-Tests-trunk-Java8/solr/build/solr-core/test/J0/temp/solr.handler.TestReplicationHandler_91C441A8E8D2D3D7-001/solr-instance-001/.
   [junit4]   2> 373117 INFO  (TEST-TestReplicationHandler.doTestRepeater-seed#[91C441A8E8D2D3D7]) [    ] o.a.s.c.CoreDescriptor Created CoreDescriptor: {name=collection1, config=solrconfig.xml, loadOnStartup=true, schema=schema.xml, configSetProperties=configsetprops.json, transient=false, dataDir=data/}
   [junit4]   2> 373117 INFO  (TEST-TestReplicationHandler.doTestRepeater-seed#[91C441A8E8D2D3D7]) [    ] o.a.s.c.CorePropertiesLocator Found core collection1 in /x1/jenkins/jenkins-slave/workspace/Lucene-Solr-Tests-trunk-Java8/solr/build/solr-core/test/J0/temp/solr.handler.TestReplicationHandler_91C441A8E8D2D3D7-001/solr-instance-001/./collection1
   [junit4]   2> 373117 INFO  (TEST-TestReplicationHandler.doTestRepeater-seed#[91C441A8E8D2D3D7]) [    ] o.a.s.c.CorePropertiesLocator Found 1 core definitions
   [junit4]   2> 373117 INFO  (coreLoadExecutor-1255-thread-1) [    ] o.a.s.c.SolrResourceLoader new SolrResourceLoader for directory: '/x1/jenkins/jenkins-slave/workspace/Lucene-Solr-Tests-trunk-Java8/solr/build/solr-core/test/J0/temp/solr.handler.TestReplicationHandler_91C441A8E8D2D3D7-001/solr-instance-001/collection1'
   [junit4]   2> 373117 INFO  (coreLoadExecutor-1255-thread-1) [    ] o.a.s.c.SolrResourceLoader JNDI not configured for solr (NoInitialContextEx)
   [junit4]   2> 373117 INFO  (TEST-TestReplicationHandler.doTestRepeater-seed#[91C441A8E8D2D3D7]) [    ] o.a.s.s.SolrDispatchFilter user.dir=/x1/jenkins/jenkins-slave/workspace/Lucene-Solr-Tests-trunk-Java8/solr/build/solr-core/test/J0
   [junit4]   2> 373117 INFO  (TEST-TestReplicationHandler.doTestRepeater-seed#[91C441A8E8D2D3D7]) [    ] o.a.s.s.SolrDispatchFilter SolrDispatchFilter.init() done
   [junit4]   2> 373117 INFO  (coreLoadExecutor-1255-thread-1) [    ] o.a.s.c.SolrResourceLoader solr home defaulted to 'solr/' (could not find system property or JNDI)
   [junit4]   2> 373124 INFO  (coreLoadExecutor-1255-thread-1) [    ] o.a.s.c.SolrConfig current version of requestparams : -1
   [junit4]   2> 373128 INFO  (coreLoadExecutor-1255-thread-1) [    ] o.a.s.c.SolrConfig Using Lucene MatchVersion: 6.0.0
   [junit4]   2> 373134 INFO  (coreLoadExecutor-1255-thread-1) [    ] o.a.s.c.SolrConfig Loaded SolrConfig: solrconfig.xml
   [junit4]   2> 373137 INFO  (coreLoadExecutor-1255-thread-1) [    ] o.a.s.s.IndexSchema [collection1] Schema name=test
   [junit4]   2> 373139 INFO  (coreLoadExecutor-1255-thread-1) [    ] o.a.s.s.IndexSchema unique key field: id
   [junit4]   2> 373141 INFO  (coreLoadExecutor-1255-thread-1) [    ] o.a.s.c.ConfigSetProperties Did not find ConfigSet properties, assuming default properties: Can't find resource 'configsetprops.json' in classpath or '/x1/jenkins/jenkins-slave/workspace/Lucene-Solr-Tests-trunk-Java8/solr/build/solr-core/test/J0/temp/solr.handler.TestReplicationHandler_91C441A8E8D2D3D7-001/solr-instance-001/collection1'
   [junit4]   2> 373141 INFO  (coreLoadExecutor-1255-thread-1) [    ] o.a.s.c.CoreContainer Creating SolrCore 'collection1' using configuration from instancedir /x1/jenkins/jenkins-slave/workspace/Lucene-Solr-Tests-trunk-Java8/solr/build/solr-core/test/J0/temp/solr.handler.TestReplicationHandler_91C441A8E8D2D3D7-001/solr-instance-001/./collection1
   [junit4]   2> 373142 INFO  (coreLoadExecutor-1255-thread-1) [    x:collection1] o.a.s.c.SolrCore org.apache.solr.core.MockDirectoryFactory
   [junit4]   2> 373142 INFO  (coreLoadExecutor-1255-thread-1) [    x:collection1] o.a.s.c.SolrCore [[collection1] ] Opening new SolrCore at [/x1/jenkins/jenkins-slave/workspace/Lucene-Solr-Tests-trunk-Java8/solr/build/solr-core/test/J0/temp/solr.handler.TestReplicationHandler_91C441A8E8D2D3D7-001/solr-instance-001/collection1], dataDir=[/x1/jenkins/jenkins-slave/workspace/Lucene-Solr-Tests-trunk-Java8/solr/build/solr-core/test/J0/temp/solr.handler.TestReplicationHandler_91C441A8E8D2D3D7-001/solr-instance-001/./collection1/data/]
   [junit4]   2> 373142 INFO  (coreLoadExecutor-1255-thread-1) [    x:collection1] o.a.s.c.SolrCore JMX monitoring not detected for core: collection1
   [junit4]   2> 373142 INFO  (coreLoadExecutor-1255-thread-1) [    x:collection1] o.a.s.c.CachingDirectoryFactory return new directory for /x1/jenkins/jenkins-slave/workspace/Lucene-Solr-Tests-trunk-Java8/solr/build/solr-core/test/J0/temp/solr.handler.TestReplicationHandler_91C441A8E8D2D3D7-001/solr-instance-001/./collection1/data
   [junit4]   2> 373142 INFO  (coreLoadExecutor-1255-thread-1) [    x:collection1] o.a.s.c.SolrCore New index directory detected: old=null new=/x1/jenkins/jenkins-slave/workspace/Lucene-Solr-Tests-trunk-Java8/solr/build/solr-core/test/J0/temp/solr.handler.TestReplicationHandler_91C441A8E8D2D3D7-001/solr-instance-001/./collection1/data/index/
   [junit4]   2> 373142 WARN  (coreLoadExecutor-1255-thread-1) [    x:collection1] o.a.s.c.SolrCore [collection1] Solr index directory '/x1/jenkins/jenkins-slave/workspace/Lucene-Solr-Tests-trunk-Java8/solr/build/solr-core/test/J0/temp/solr.handler.TestReplicationHandler_91C441A8E8D2D3D7-001/solr-instance-001/./collection1/data/index' doesn't exist. Creating new index...
   [junit4]   2> 373143 INFO  (coreLoadExecutor-1255-thread-1) [    x:collection1] o.a.s.c.CachingDirectoryFactory return new directory for /x1/jenkins/jenkins-slave/workspace/Lucene-Solr-Tests-trunk-Java8/solr/build/solr-core/test/J0/temp/solr.handler.TestReplicationHandler_91C441A8E8D2D3D7-001/solr-instance-001/./collection1/data/index
   [junit4]   2> 373143 INFO  (coreLoadExecutor-1255-thread-1) [    x:collection1] o.a.s.u.RandomMergePolicy RandomMergePolicy wrapping class org.apache.lucene.index.LogByteSizeMergePolicy: [LogByteSizeMergePolicy: minMergeSize=1677721, mergeFactor=25, maxMergeSize=2147483648, maxMergeSizeForForcedMerge=9223372036854775807, calibrateSizeByDeletes=false, maxMergeDocs=2147483647, maxCFSSegmentSizeMB=8.796093022207999E12, noCFSRatio=1.0]
   [junit4]   2> 373144 INFO  (coreLoadExecutor-1255-thread-1) [    x:collection1] o.a.s.c.SolrDeletionPolicy SolrDeletionPolicy.onCommit: commits: num=1
   [junit4]   2> 	commit{dir=MockDirectoryWrapper(RAMDirectory@5446f0ec lockFactory=org.apache.lucene.store.SingleInstanceLockFactory@6aed00a5),segFN=segments_1,generation=1}
   [junit4]   2> 373144 INFO  (coreLoadExecutor-1255-thread-1) [    x:collection1] o.a.s.c.SolrDeletionPolicy newest commit generation = 1
   [junit4]   2> 373144 INFO  (OldIndexDirectoryCleanupThreadForCore-collection1) [    x:collection1] o.a.s.c.SolrCore Looking for old index directories to cleanup for core collection1 in /x1/jenkins/jenkins-slave/workspace/Lucene-Solr-Tests-trunk-Java8/solr/build/solr-core/test/J0/temp/solr.handler.TestReplicationHandler_91C441A8E8D2D3D7-001/solr-instance-001/./collection1/data/
   [junit4]   2> 373146 INFO  (coreLoadExecutor-1255-thread-1) [    x:collection1] o.a.s.c.SolrCore no updateRequestProcessorChain defined as default, creating implicit default
   [junit4]   2> 373148 INFO  (coreLoadExecutor-1255-thread-1) [    x:collection1] o.a.s.h.l.XMLLoader xsltCacheLifetimeSeconds=60
   [junit4]   2> 373148 INFO  (coreLoadExecutor-1255-thread-1) [    x:collection1] o.a.s.h.l.XMLLoader xsltCacheLifetimeSeconds=60
   [junit4]   2> 373149 INFO  (coreLoadExecutor-1255-thread-1) [    x:collection1] o.a.s.h.l.XMLLoader xsltCacheLifetimeSeconds=60
   [junit4]   2> 373150 INFO  (coreLoadExecutor-1255-thread-1) [    x:collection1] o.a.s.h.l.XMLLoader xsltCacheLifetimeSeconds=60
   [junit4]   2> 373155 INFO  (coreLoadExecutor-1255-thread-1) [    x:collection1] o.a.s.c.PluginBag requestHandler : 'lazy' created with startup=lazy 
   [junit4]   2> 373155 INFO  (coreLoadExecutor-1255-thread-1) [    x:collection1] o.a.s.c.RequestHandlers Registered paths: /admin/mbeans,standard,lazy,/update/json/docs,/admin/luke,/export,/get,/admin/properties,/update/json,/admin/threads,/update/csv,/sql,/admin/segments,/admin/system,/replication,defaults,/config,/stream,/schema,/admin/plugins,/admin/logging,/admin/ping,/update,/admin/file
   [junit4]   2> 373155 INFO  (coreLoadExecutor-1255-thread-1) [    x:collection1] o.a.s.c.SolrCore Using default statsCache cache: org.apache.solr.search.stats.LocalStatsCache
   [junit4]   2> 373155 INFO  (coreLoadExecutor-1255-thread-1) [    x:collection1] o.a.s.u.CommitTracker Hard AutoCommit: disabled
   [junit4]   2> 373155 INFO  (coreLoadExecutor-1255-thread-1) [    x:collection1] o.a.s.u.CommitTracker Soft AutoCommit: disabled
   [junit4]   2> 373156 INFO  (coreLoadExecutor-1255-thread-1) [    x:collection1] o.a.s.u.RandomMergePolicy RandomMergePolicy wrapping class org.apache.lucene.index.TieredMergePolicy: [TieredMergePolicy: maxMergeAtOnce=21, maxMergeAtOnceExplicit=32, maxMergedSegmentMB=21.53125, floorSegmentMB=1.6728515625, forceMergeDeletesPctAllowed=15.837110974431425, segmentsPerTier=34.0, maxCFSSegmentSizeMB=8.796093022207999E12, noCFSRatio=1.0
   [junit4]   2> 373156 INFO  (coreLoadExecutor-1255-thread-1) [    x:collection1] o.a.s.c.SolrDeletionPolicy SolrDeletionPolicy.onInit: commits: num=1
   [junit4]   2> 	commit{dir=MockDirectoryWrapper(RAMDirectory@5446f0ec lockFactory=org.apache.lucene.store.SingleInstanceLockFactory@6aed00a5),segFN=segments_1,generation=1}
   [junit4]   2> 373156 INFO  (coreLoadExecutor-1255-thread-1) [    x:collection1] o.a.s.c.SolrDeletionPolicy newest commit generation = 1
   [junit4]   2> 373156 INFO  (coreLoadExecutor-1255-thread-1) [    x:collection1] o.a.s.s.SolrIndexSearcher Opening [Searcher@6942db76[collection1] main]
   [junit4]   2> 373156 INFO  (coreLoadExecutor-1255-thread-1) [    x:collection1] o.a.s.r.ManagedResourceStorage File-based storage initialized to use dir: /x1/jenkins/jenkins-slave/workspace/Lucene-Solr-Tests-trunk-Java8/solr/build/solr-core/test/J0/temp/solr.handler.TestReplicationHandler_91C441A8E8D2D3D7-001/solr-instance-001/collection1/conf
   [junit4]   2> 373157 INFO  (coreLoadExecutor-1255-thread-1) [    x:collection1] o.a.s.r.RestManager Initializing RestManager with initArgs: {storageDir=/x1/jenkins/jenkins-slave/workspace/Lucene-Solr-Tests-trunk-Java8/solr/build/solr-core/test/J0/temp/solr.handler.TestReplicationHandler_91C441A8E8D2D3D7-001/solr-instance-001/collection1/conf}
   [junit4]   2> 373157 INFO  (coreLoadExecutor-1255-thread-1) [    x:collection1] o.a.s.r.ManagedResourceStorage Reading _rest_managed.json using file:dir=/x1/jenkins/jenkins-slave/workspace/Lucene-Solr-Tests-trunk-Java8/solr/build/solr-core/test/J0/temp/solr.handler.TestReplicationHandler_91C441A8E8D2D3D7-001/solr-instance-001/collection1/conf
   [junit4]   2> 373157 INFO  (coreLoadExecutor-1255-thread-1) [    x:collection1] o.a.s.r.RestManager Initializing 0 registered ManagedResources
   [junit4]   2> 373157 INFO  (coreLoadExecutor-1255-thread-1) [    x:collection1] o.a.s.h.ReplicationHandler Replication enabled for following config files: schema.xml,xslt/dummy.xsl
   [junit4]   2> 373157 INFO  (coreLoadExecutor-1255-thread-1) [    x:collection1] o.a.s.h.ReplicationHandler Commits will be reserved for  10000
   [junit4]   2> 373157 INFO  (searcherExecutor-1256-thread-1-processing-x:collection1) [    x:collection1] o.a.s.c.SolrCore [collection1] Registered new searcher Searcher@6942db76[collection1] main{ExitableDirectoryReader(UninvertingDirectoryReader())}
   [junit4]   2> 373157 INFO  (coreLoadExecutor-1255-thread-1) [    x:collection1] o.a.s.c.CoreContainer registering core: collection1
   [junit4]   2> 373619 INFO  (TEST-TestReplicationHandler.doTestRepeater-seed#[91C441A8E8D2D3D7]) [    ] o.a.s.SolrTestCaseJ4 Writing core.properties file to /x1/jenkins/jenkins-slave/workspace/Lucene-Solr-Tests-trunk-Java8/solr/build/solr-core/test/J0/temp/solr.handler.TestReplicationHandler_91C441A8E8D2D3D7-001/solr-instance-002/collection1
   [junit4]   2> 373622 INFO  (TEST-TestReplicationHandler.doTestRepeater-seed#[91C441A8E8D2D3D7]) [    ] o.e.j.s.Server jetty-9.2.13.v20150730
   [junit4]   2> 373624 INFO  (TEST-TestReplicationHandler.doTestRepeater-seed#[91C441A8E8D2D3D7]) [    ] o.e.j.s.h.ContextHandler Started o.e.j.s.ServletContextHandler@27273017{/solr,null,AVAILABLE}
   [junit4]   2> 373624 INFO  (TEST-TestReplicationHandler.doTestRepeater-seed#[91C441A8E8D2D3D7]) [    ] o.e.j.s.ServerConnector Started ServerConnector@3bc06afa{HTTP/1.1}{127.0.0.1:36632}
   [junit4]   2> 373624 INFO  (TEST-TestReplicationHandler.doTestRepeater-seed#[91C441A8E8D2D3D7]) [    ] o.e.j.s.Server Started @376975ms
   [junit4]   2> 373625 INFO  (TEST-TestReplicationHandler.doTestRepeater-seed#[91C441A8E8D2D3D7]) [    ] o.a.s.c.s.e.JettySolrRunner Jetty properties: {solr.data.dir=/x1/jenkins/jenkins-slave/workspace/Lucene-Solr-Tests-trunk-Java8/solr/build/solr-core/test/J0/temp/solr.handler.TestReplicationHandler_91C441A8E8D2D3D7-001/solr-instance-002/collection1/data, hostContext=/solr, hostPort=36632}
   [junit4]   2> 373625 INFO  (TEST-TestReplicationHandler.doTestRepeater-seed#[91C441A8E8D2D3D7]) [    ] o.a.s.s.SolrDispatchFilter SolrDispatchFilter.init(): sun.misc.Launcher$AppClassLoader@4e0e2f2a
   [junit4]   2> 373625 INFO  (TEST-TestReplicationHandler.doTestRepeater-seed#[91C441A8E8D2D3D7]) [    ] o.a.s.c.SolrResourceLoader new SolrResourceLoader for directory: '/x1/jenkins/jenkins-slave/workspace/Lucene-Solr-Tests-trunk-Java8/solr/build/solr-core/test/J0/temp/solr.handler.TestReplicationHandler_91C441A8E8D2D3D7-001/solr-instance-002'
   [junit4]   2> 373625 INFO  (TEST-TestReplicationHandler.doTestRepeater-seed#[91C441A8E8D2D3D7]) [    ] o.a.s.c.SolrResourceLoader JNDI not configured for solr (NoInitialContextEx)
   [junit4]   2> 373625 INFO  (TEST-TestReplicationHandler.doTestRepeater-seed#[91C441A8E8D2D3D7]) [    ] o.a.s.c.SolrResourceLoader solr home defaulted to 'solr/' (could not find system property or JNDI)
   [junit4]   2> 373625 INFO  (TEST-TestReplicationHandler.doTestRepeater-seed#[91C441A8E8D2D3D7]) [    ] o.a.s.c.SolrXmlConfig Loading container configuration from /x1/jenkins/jenkins-slave/workspace/Lucene-Solr-Tests-trunk-Java8/solr/build/solr-core/test/J0/temp/solr.handler.TestReplicationHandler_91C441A8E8D2D3D7-001/solr-instance-002/solr.xml
   [junit4]   2> 373630 INFO  (TEST-TestReplicationHandler.doTestRepeater-seed#[91C441A8E8D2D3D7]) [    ] o.a.s.c.CorePropertiesLocator Config-defined core root directory: /x1/jenkins/jenkins-slave/workspace/Lucene-Solr-Tests-trunk-Java8/solr/build/solr-core/test/J0/temp/solr.handler.TestReplicationHandler_91C441A8E8D2D3D7-001/solr-instance-002/.
   [junit4]   2> 373630 INFO  (TEST-TestReplicationHandler.doTestRepeater-seed#[91C441A8E8D2D3D7]) [    ] o.a.s.c.CoreContainer New CoreContainer 153731145
   [junit4]   2> 373630 INFO  (TEST-TestReplicationHandler.doTestRepeater-seed#[91C441A8E8D2D3D7]) [    ] o.a.s.c.CoreContainer Loading cores into CoreContainer [instanceDir=/x1/jenkins/jenkins-slave/workspace/Lucene-Solr-Tests-trunk-Java8/solr/build/solr-core/test/J0/temp/solr.handler.TestReplicationHandler_91C441A8E8D2D3D7-001/solr-instance-002]
   [junit4]   2> 373630 WARN  (TEST-TestReplicationHandler.doTestRepeater-seed#[91C441A8E8D2D3D7]) [    ] o.a.s.c.CoreContainer Couldn't add files from /x1/jenkins/jenkins-slave/workspace/Lucene-Solr-Tests-trunk-Java8/solr/build/solr-core/test/J0/temp/solr.handler.TestReplicationHandler_91C441A8E8D2D3D7-001/solr-instance-002/lib to classpath: /x1/jenkins/jenkins-slave/workspace/Lucene-Solr-Tests-trunk-Java8/solr/build/solr-core/test/J0/temp/solr.handler.TestReplicationHandler_91C441A8E8D2D3D7-001/solr-instance-002/lib
   [junit4]   2> 373630 INFO  (TEST-TestReplicationHandler.doTestRepeater-seed#[91C441A8E8D2D3D7]) [    ] o.a.s.h.c.HttpShardHandlerFactory created with socketTimeout : 90000,urlScheme : ,connTimeout : 15000,maxConnectionsPerHost : 20,maxConnections : 10000,corePoolSize : 0,maximumPoolSize : 2147483647,maxThreadIdleTime : 5,sizeOfQueue : -1,fairnessPolicy : false,useRetries : false,
   [junit4]   2> 373631 INFO  (TEST-TestReplicationHandler.doTestRepeater-seed#[91C441A8E8D2D3D7]) [    ] o.a.s.u.UpdateShardHandler Creating UpdateShardHandler HTTP client with params: socketTimeout=340000&connTimeout=45000&retry=true
   [junit4]   2> 373631 INFO  (TEST-TestReplicationHandler.doTestRepeater-seed#[91C441A8E8D2D3D7]) [    ] o.a.s.l.LogWatcher SLF4J impl is org.slf4j.impl.Log4jLoggerFactory
   [junit4]   2> 373632 INFO  (TEST-TestReplicationHandler.doTestRepeater-seed#[91C441A8E8D2D3D7]) [    ] o.a.s.l.LogWatcher Registering Log Listener [Log4j (org.slf4j.impl.Log4jLoggerFactory)]
   [junit4]   2> 373632 INFO  (TEST-TestReplicationHandler.doTestRepeater-seed#[91C441A8E8D2D3D7]) [    ] o.a.s.c.CoreContainer Security conf doesn't exist. Skipping setup for authorization module.
   [junit4]   2> 373632 INFO  (TEST-TestReplicationHandler.doTestRepeater-seed#[91C441A8E8D2D3D7]) [    ] o.a.s.c.CoreContainer No authentication plugin used.
   [junit4]   2> 373632 INFO  (TEST-TestReplicationHandler.doTestRepeater-seed#[91C441A8E8D2D3D7]) [    ] o.a.s.c.CorePropertiesLocator Looking for core definitions underneath /x1/jenkins/jenkins-slave/workspace/Lucene-Solr-Tests-trunk-Java8/solr/build/solr-core/test/J0/temp/solr.handler.TestReplicationHandler_91C441A8E8D2D3D7-001/solr-instance-002/.
   [junit4]   2> 373639 INFO  (TEST-TestReplicationHandler.doTestRepeater-seed#[91C441A8E8D2D3D7]) [    ] o.a.s.c.CoreDescriptor Created CoreDescriptor: {name=collection1, config=solrconfig.xml, loadOnStartup=true, schema=schema.xml, configSetProperties=configsetprops.json, transient=false, dataDir=data/}
   [junit4]   2> 373639 INFO  (TEST-TestReplicationHandler.doTestRepeater-seed#[91C441A8E8D2D3D7]) [    ] o.a.s.c.CorePropertiesLocator Found core collection1 in /x1/jenkins/jenkins-slave/workspace/Lucene-Solr-Tests-trunk-Java8/solr/build/solr-core/test/J0/temp/solr.handler.TestReplicationHandler_91C441A8E8D2D3D7-001/solr-instance-002/./collection1
   [junit4]   2> 373640 INFO  (TEST-TestReplicationHandler.doTestRepeater-seed#[91C441A8E8D2D3D7]) [    ] o.a.s.c.CorePropertiesLocator Found 1 core definitions
   [junit4]   2> 373640 INFO  (coreLoadExecutor-1265-thread-1) [    ] o.a.s.c.SolrResourceLoader new SolrResourceLoader for directory: '/x1/jenkins/jenkins-slave/workspace/Lucene-Solr-Tests-trunk-Java8/solr/build/solr-core/test/J0/temp/solr.handler.TestReplicationHandler_91C441A8E8D2D3D7-001/solr-instance-002/collection1'
   [junit4]   2> 373640 INFO  (coreLoadExecutor-1265-thread-1) [    ] o.a.s.c.SolrResourceLoader JNDI not configured for solr (NoInitialContextEx)
   [junit4]   2> 373640 INFO  (TEST-TestReplicationHandler.doTestRepeater-seed#[91C441A8E8D2D3D7]) [    ] o.a.s.s.SolrDispatchFilter user.dir=/x1/jenkins/jenkins-slave/workspace/Lucene-Solr-Tests-trunk-Java8/solr/build/solr-core/test/J0
   [junit4]   2> 373640 INFO  (coreLoadExecutor-1265-thread-1) [    ] o.a.s.c.SolrResourceLoader solr home defaulted to 'solr/' (could not find system property or JNDI)
   [junit4]   2> 373640 INFO  (TEST-TestReplicationHandler.doTestRepeater-seed#[91C441A8E8D2D3D7]) [    ] o.a.s.s.SolrDispatchFilter SolrDispatchFilter.init() done
   [junit4]   2> 373646 INFO  (coreLoadExecutor-1265-thread-1) [    ] o.a.s.c.SolrConfig current version of requestparams : -1
   [junit4]   2> 373649 INFO  (coreLoadExecutor-1265-thread-1) [    ] o.a.s.c.SolrConfig Using Lucene MatchVersion: 6.0.0
   [junit4]   2> 373655 INFO  (coreLoadExecutor-1265-thread-1) [    ] o.a.s.c.SolrConfig Loaded SolrConfig: solrconfig.xml
   [junit4]   2> 373659 INFO  (coreLoadExecutor-1265-thread-1) [    ] o.a.s.s.IndexSchema [collection1] Schema name=test
   [junit4]   2> 373661 INFO  (coreLoadExecutor-1265-thread-1) [    ] o.a.s.s.IndexSchema unique key field: id
   [junit4]   2> 373662 INFO  (coreLoadExecutor-1265-thread-1) [    ] o.a.s.c.ConfigSetProperties Did not find ConfigSet properties, assuming default properties: Can't find resource 'configsetprops.json' in classpath or '/x1/jenkins/jenkins-slave/workspace/Lucene-Solr-Tests-trunk-Java8/solr/build/solr-core/test/J0/temp/solr.handler.TestReplicationHandler_91C441A8E8D2D3D7-001/solr-instance-002/collection1'
   [junit4]   2> 373662 INFO  (coreLoadExecutor-1265-thread-1) [    ] o.a.s.c.CoreContainer Creating SolrCore 'collection1' using configuration from instancedir /x1/jenkins/jenkins-slave/workspace/Lucene-Solr-Tests-trunk-Java8/solr/build/solr-core/test/J0/temp/solr.handler.TestReplicationHandler_91C441A8E8D2D3D7-001/solr-instance-002/./collection1
   [junit4]   2> 373662 INFO  (coreLoadExecutor-1265-thread-1) [    x:collection1] o.a.s.c.SolrCore org.apache.solr.core.MockDirectoryFactory
   [junit4]   2> 373662 INFO  (coreLoadExecutor-1265-thread-1) [    x:collection1] o.a.s.c.SolrCore [[collection1] ] Opening new SolrCore at [/x1/jenkins/jenkins-slave/workspace/Lucene-Solr-Tests-trunk-Java8/solr/build/solr-core/test/J0/temp/solr.handler.TestReplicationHandler_91C441A8E8D2D3D7-001/solr-instance-002/collection1], dataDir=[/x1/jenkins/jenkins-slave/workspace/Lucene-Solr-Tests-trunk-Java8/solr/build/solr-core/test/J0/temp/solr.handler.TestReplicationHandler_91C441A8E8D2D3D7-001/solr-instance-002/./collection1/data/]
   [junit4]   2> 373662 INFO  (coreLoadExecutor-1265-thread-1) [    x:collection1] o.a.s.c.SolrCore JMX monitoring not detected for core: collection1
   [junit4]   2> 373663 INFO  (coreLoadExecutor-1265-thread-1) [    x:collection1] o.a.s.c.CachingDirectoryFactory return new directory for /x1/jenkins/jenkins-slave/workspace/Lucene-Solr-Tests-trunk-Java8/solr/build/solr-core/test/J0/temp/solr.handler.TestReplicationHandler_91C441A8E8D2D3D7-001/solr-instance-002/./collection1/data
   [junit4]   2> 373663 INFO  (coreLoadExecutor-1265-thread-1) [    x:collection1] o.a.s.c.SolrCore New index directory detected: old=null new=/x1/jenkins/jenkins-slave/workspace/Lucene-Solr-Tests-trunk-Java8/solr/build/solr-core/test/J0/temp/solr.handler.TestReplicationHandler_91C441A8E8D2D3D7-001/solr-instance-002/./collection1/data/index/
   [junit4]   2> 373663 WARN  (coreLoadExecutor-1265-thread-1) [    x:collection1] o.a.s.c.SolrCore [collection1] Solr index directory '/x1/jenkins/jenkins-slave/workspace/Lucene-Solr-Tests-trunk-Java8/solr/build/solr-core/test/J0/temp/solr.handler.TestReplicationHandler_91C441A8E8D2D3D7-001/solr-instance-002/./collection1/data/index' doesn't exist. Creating new index...
   [junit4]   2> 373663 INFO  (coreLoadExecutor-1265-thread-1) [    x:collection1] o.a.s.c.CachingDirectoryFactory return new directory for /x1/jenkins/jenkins-slave/workspace/Lucene-Solr-Tests-trunk-Java8/solr/build/solr-core/test/J0/temp/solr.handler.TestReplicationHandler_91C441A8E8D2D3D7-001/solr-instance-002/./collection1/data/index
   [junit4]   2> 373663 INFO  (coreLoadExecutor-1265-thread-1) [    x:collection1] o.a.s.u.RandomMergePolicy RandomMergePolicy wrapping class org.apache.lucene.index.LogByteSizeMergePolicy: [LogByteSizeMergePolicy: minMergeSize=1677721, mergeFactor=25, maxMergeSize=2147483648, maxMergeSizeForForcedMerge=9223372036854775807, calibrateSizeByDeletes=false, maxMergeDocs=2147483647, maxCFSSegmentSizeMB=8.796093022207999E12, noCFSRatio=1.0]
   [junit4]   2> 373664 INFO  (coreLoadExecutor-1265-thread-1) [    x:collection1] o.a.s.c.SolrDeletionPolicy SolrDeletionPolicy.onCommit: commits: num=1
   [junit4]   2> 	commit{dir=MockDirectoryWrapper(RAMDirectory@11b1670a lockFactory=org.apache.lucene.store.SingleInstanceLockFactory@e49b05),segFN=segments_1,generation=1}
   [junit4]   2> 373664 INFO  (coreLoadExecutor-1265-thread-1) [    x:collection1] o.a.s.c.SolrDeletionPolicy newest commit generation = 1
   [junit4]   2> 373664 INFO  (OldIndexDirectoryCleanupThreadForCore-collection1) [    x:collection1] o.a.s.c.SolrCore Looking for old index directories to cleanup for core collection1 in /x1/jenkins/jenkins-slave/workspace/Lucene-Solr-Tests-trunk-Java8/solr/build/solr-core/test/J0/temp/solr.handler.TestReplicationHandler_91C441A8E8D2D3D7-001/solr-instance-002/./collection1/data/
   [junit4]   2> 373666 INFO  (coreLoadExecutor-1265-thread-1) [    x:collection1] o.a.s.c.SolrCore no updateRequestProcessorChain defined as default, creating implicit default
   [junit4]   2> 373667 INFO  (coreLoadExecutor-1265-thread-1) [    x:collection1] o.a.s.h.l.XMLLoader xsltCacheLifetimeSeconds=60
   [junit4]   2> 373668 INFO  (coreLoadExecutor-1265-thread-1) [    x:collection1] o.a.s.h.l.XMLLoader xsltCacheLifetimeSeconds=60
   [junit4]   2> 373669 INFO  (coreLoadExecutor-1265-thread-1) [    x:collection1] o.a.s.h.l.XMLLoader xsltCacheLifetimeSeconds=60
   [junit4]   2> 373670 INFO  (coreLoadExecutor-1265-thread-1) [    x:collection1] o.a.s.h.l.XMLLoader xsltCacheLifetimeSeconds=60
   [junit4]   2> 373671 INFO  (coreLoadExecutor-1265-thread-1) [    x:collection1] o.a.s.c.PluginBag requestHandler : 'lazy' created with startup=lazy 
   [junit4]   2> 373671 INFO  (coreLoadExecutor-1265-thread-1) [    x:collection1] o.a.s.c.RequestHandlers Registered paths: /admin/mbeans,standard,lazy,/update/json/docs,/admin/luke,/export,/get,/admin/properties,/update/json,/admin/threads,/update/csv,/sql,/admin/segments,/admin/system,/replication,defaults,/config,/stream,/schema,/admin/plugins,/admin/logging,/admin/ping,/update,/admin/file
   [junit4]   2> 373671 INFO  (coreLoadExecutor-1265-thread-1) [    x:collection1] o.a.s.c.SolrCore Using default statsCache cache: org.apache.solr.search.stats.LocalStatsCache
   [junit4]   2> 373672 INFO  (coreLoadExecutor-1265-thread-1) [    x:collection1] o.a.s.u.CommitTracker Hard AutoCommit: disabled
   [junit4]   2> 373672 INFO  (coreLoadExecutor-1265-thread-1) [    x:collection1] o.a.s.u.CommitTracker Soft AutoCommit: disabled
   [junit4]   2> 373672 INFO  (coreLoadExecutor-1265-thread-1) [    x:collection1] o.a.s.u.RandomMergePolicy RandomMergePolicy wrapping class org.apache.lucene.index.TieredMergePolicy: [TieredMergePolicy: maxMergeAtOnce=21, maxMergeAtOnceExplicit=32, maxMergedSegmentMB=21.53125, floorSegmentMB=1.6728515625, forceMergeDeletesPctAllowed=15.837110974431425, segmentsPerTier=34.0, maxCFSSegmentSizeMB=8.796093022207999E12, noCFSRatio=1.0
   [junit4]   2> 373672 INFO  (coreLoadExecutor-1265-thread-1) [    x:collection1] o.a.s.c.SolrDeletionPolicy SolrDeletionPolicy.onInit: commits: num=1
   [junit4]   2> 	commit{dir=MockDirectoryWrapper(RAMDirectory@11b1670a lockFactory=org.apache.lucene.store.SingleInstanceLockFactory@e49b05),segFN=segments_1,generation=1}
   [junit4]   2> 373672 INFO  (coreLoadExecutor-1265-thread-1) [    x:collection1] o.a.s.c.SolrDeletionPolicy newest commit generation = 1
   [junit4]   2> 373672 INFO  (coreLoadExecutor-1265-thread-1) [    x:collection1] o.a.s.s.SolrIndexSearcher Opening [Searcher@51658f89[collection1] main]
   [junit4]   2> 373672 INFO  (coreLoadExecutor-1265-thread-1) [    x:collection1] o.a.s.r.ManagedResourceStorage File-based storage initialized to use dir: /x1/jenkins/jenkins-slave/workspace/Lucene-Solr-Tests-trunk-Java8/solr/build/solr-core/test/J0/temp/solr.handler.TestReplicationHandler_91C441A8E8D2D3D7-001/solr-instance-002/collection1/conf
   [junit4]   2> 373672 INFO  (coreLoadExecutor-1265-thread-1) [    x:collection1] o.a.s.r.RestManager Initializing RestManager with initArgs: {storageDir=/x1/jenkins/jenkins-slave/workspace/Lucene-Solr-Tests-trunk-Java8/solr/build/solr-core/test/J0/temp/solr.handler.TestReplicationHandler_91C441A8E8D2D3D7-001/solr-instance-002/collection1/conf}
   [junit4]   2> 373673 INFO  (coreLoadExecutor-1265-thread-1) [    x:collection1] o.a.s.r.ManagedResourceStorage Reading _rest_managed.json using file:dir=/x1/jenkins/jenkins-slave/workspace/Lucene-Solr-Tests-trunk-Java8/solr/build/solr-core/test/J0/temp/solr.handler.TestReplicationHandler_91C441A8E8D2D3D7-001/solr-instance-002/collection1/conf
   [junit4]   2> 373673 INFO  (coreLoadExecutor-1265-thread-1) [    x:collection1] o.a.s.r.RestManager Initializing 0 registered ManagedResources
   [junit4]   2> 373675 INFO  (coreLoadExecutor-1265-thread-1) [    x:collection1] o.a.s.h.ReplicationHandler Poll scheduled at an interval of 1000ms
   [junit4]   2> 373676 INFO  (searcherExecutor-1266-thread-1-processing-x:collection1) [    x:collection1] o.a.s.c.SolrCore [collection1] Registered new searcher Searcher@51658f89[collection1] main{ExitableDirectoryReader(UninvertingDirectoryReader())}
   [junit4]   2> 373676 INFO  (coreLoadExecutor-1265-thread-1) [    x:collection1] o.a.s.c.CoreContainer registering core: collection1
   [junit4]   2> 373976 INFO  (qtp989015560-2047) [    x:collection1] o.a.s.c.S.Request [collection1]  webapp=/solr path=/replication params={qt=/replication&wt=javabin&version=2&command=indexversion} status=0 QTime=0
   [junit4]   2> 374147 INFO  (TEST-TestReplicationHandler.doTestRepeater-seed#[91C441A8E8D2D3D7]) [    ] o.e.j.s.ServerConnector Stopped ServerConnector@3bc06afa{HTTP/1.1}{127.0.0.1:0}
   [junit4]   2> 374147 INFO  (TEST-TestReplicationHandler.doTestRepeater-seed#[91C441A8E8D2D3D7]) [    ] o.a.s.c.CoreContainer Shutting down CoreContainer instance=153731145
   [junit4]   2> 374147 INFO  (TEST-TestReplicationHandler.doTestRepeater-seed#[91C441A8E8D2D3D7]) [    x:collection1] o.a.s.c.SolrCore [collection1]  CLOSING SolrCore org.apache.solr.core.SolrCore@1a5f73fb
   [junit4]   2> 374147 INFO  (TEST-TestReplicationHandler.doTestRepeater-seed#[91C441A8E8D2D3D7]) [    x:collection1] o.a.s.u.DirectUpdateHandler2 closing DirectUpdateHandler2{commits=0,autocommits=0,soft autocommits=0,optimizes=0,rollbacks=0,expungeDeletes=0,docsPending=0,adds=0,deletesById=0,deletesByQuery=0,errors=0,cumulative_adds=0,cumulative_deletesById=0,cumulative_deletesByQuery=0,cumulative_errors=0}
   [junit4]   2> 374148 INFO  (TEST-TestReplicationHandler.doTestRepeater-seed#[91C441A8E8D2D3D7]) [    x:collection1] o.a.s.u.SolrCoreState Closing SolrCoreState
   [junit4]   2> 374148 INFO  (TEST-TestReplicationHandler.doTestRepeater-seed#[91C441A8E8D2D3D7]) [    x:collection1] o.a.s.u.DefaultSolrCoreState SolrCoreState ref count has reached 0 - closing IndexWriter
   [junit4]   2> 374148 INFO  (TEST-TestReplicationHandler.doTestRepeater-seed#[91C441A8E8D2D3D7]) [    x:collection1] o.a.s.u.DefaultSolrCoreState closing IndexWriter with IndexWriterCloser
   [junit4]   2> 374149 INFO  (TEST-TestReplicationHandler.doTestRepeater-seed#[91C441A8E8D2D3D7]) [    x:collection1] o.a.s.c.SolrCore [collection1] Closing main searcher on request.
   [junit4]   2> 374149 INFO  (TEST-TestReplicationHandler.doTestRepeater-seed#[91C441A8E8D2D3D7]) [    x:collection1] o.a.s.c.CachingDirectoryFactory Closing MockDirectoryFactory - 2 directories currently being tracked
   [junit4]   2> 374150 INFO  (TEST-TestReplicationHandler.doTestRepeater-seed#[91C441A8E8D2D3D7]) [    x:collection1] o.a.s.c.CachingDirectoryFactory looking to close /x1/jenkins/jenkins-slave/workspace/Lucene-Solr-Tests-trunk-Java8/solr/build/solr-core/test/J0/temp/solr.handler.TestReplicationHandler_91C441A8E8D2D3D7-001/solr-instance-002/./collection1/data/index [CachedDir<<refCount=0;path=/x1/jenkins/jenkins-slave/workspace/Lucene-Solr-Tests-trunk-Java8/solr/build/solr-core/test/J0/temp/solr.handler.TestReplicationHandler_91C441A8E8D2D3D7-001/solr-instance-002/./collection1/data/index;done=false>>]
   [junit4]   2> 374150 INFO  (TEST-TestReplicationHandler.doTestRepeater-seed#[91C441A8E8D2D3D7]) [    x:collection1] o.a.s.c.CachingDirectoryFactory Closing directory: /x1/jenkins/jenkins-slave/workspace/Lucene-Solr-Tests-trunk-Java8/solr/build/solr-core/test/J0/temp/solr.handler.TestReplicationHandler_91C441A8E8D2D3D7-001/solr-instance-002/./collection1/data/index
   [junit4]   2> 374150 INFO  (TEST-TestReplicationHandler.doTestRepeater-seed#[91C441A8E8D2D3D7]) [    x:collection1] o.a.s.c.CachingDirectoryFactory looking to close /x1/jenkins/jenkins-slave/workspace/Lucene-Solr-Tests-trunk-Java8/solr/build/solr-core/test/J0/temp/solr.handler.TestReplicationHandler_91C441A8E8D2D3D7-001/solr-instance-002/./collection1/data [CachedDir<<refCount=0;path=/x1/jenkins/jenkins-slave/workspace/Lucene-Solr-Tests-trunk-Java8/solr/build/solr-core/test/J0/temp/solr.handler.TestReplicationHandler_91C441A8E8D2D3D7-001/solr-instance-002/./collection1/data;done=false>>]
   [junit4]   2> 374150 INFO  (TEST-TestReplicationHandler.doTestRepeater-seed#[91C441A8E8D2D3D7]) [    x:collection1] o.a.s.c.CachingDirectoryFactory Closing directory: /x1/jenkins/jenkins-slave/workspace/Lucene-Solr-Tests-trunk-Java8/solr/build/solr-core/test/J0/temp/solr.handler.TestReplicationHandler_91C441A8E8D2D3D7-001/solr-instance-002/./collection1/data
   [junit4]   2> 374151 INFO  (TEST-TestReplicationHandler.doTestRepeater-seed#[91C441A8E8D2D3D7]) [    x:collection1] o.e.j.s.h.ContextHandler Stopped o.e.j.s.ServletContextHandler@27273017{/solr,null,UNAVAILABLE}
   [junit4]   2> 374152 INFO  (TEST-TestReplicationHandler.doTestRepeater-seed#[91C441A8E8D2D3D7]) [    ] o.e.j.s.Server jetty-9.2.13.v20150730
   [junit4]   2> 374154 INFO  (TEST-TestReplicationHandler.doTestRepeater-seed#[91C441A8E8D2D3D7]) [    ] o.e.j.s.h.ContextHandler Started o.e.j.s.ServletContextHandler@6105365e{/solr,null,AVAILABLE}
   [junit4]   2> 374154 INFO  (TEST-TestReplicationHandler.doTestRepeater-seed#[91C441A8E8D2D3D7]) [    ] o.e.j.s.ServerConnector Started ServerConnector@34fa383c{HTTP/1.1}{127.0.0.1:43048}
   [junit4]   2> 374155 INFO  (TEST-TestReplicationHandler.doTestRepeater-seed#[91C441A8E8D2D3D7]) [    ] o.e.j.s.Server Started @377505ms
   [junit4]   2> 374155 INFO  (TEST-TestReplicationHandler.doTestRepeater-seed#[91C441A8E8D2D3D7]) [    ] o.a.s.c.s.e.JettySolrRunner Jetty properties: {solr.data.dir=/x1/jenkins/jenkins-slave/workspace/Lucene-Solr-Tests-trunk-Java8/solr/build/solr-core/test/J0/temp/solr.handler.TestReplicationHandler_91C441A8E8D2D3D7-001/solr-instance-002/collection1/data, hostContext=/solr, hostPort=43048}
   [junit4]   2> 374155 INFO  (TEST-TestReplicationHandler.doTestRepeater-seed#[91C441A8E8D2D3D7]) [    ] o.a.s.s.SolrDispatchFilter SolrDispatchFilter.init(): sun.misc.Launcher$AppClassLoader@4e0e2f2a
   [junit4]   2> 374155 INFO  (TEST-TestReplicationHandler.doTestRepeater-seed#[91C441A8E8D2D3D7]) [    ] o.a.s.c.SolrResourceLoader new SolrResourceLoader for directory: '/x1/jenkins/jenkins-slave/workspace/Lucene-Solr-Tests-trunk-Java8/solr/build/solr-core/test/J0/temp/solr.handler.TestReplicationHandler_91C441A8E8D2D3D7-001/solr-instance-002'
   [junit4]   2> 374155 INFO  (TEST-TestReplicationHandler.doTestRepeater-seed#[91C441A8E8D2D3D7]) [    ] o.a.s.c.SolrResourceLoader JNDI not configured for solr (NoInitialContextEx)
   [junit4]   2> 374155 INFO  (TEST-TestReplicationHandler.doTestRepeater-seed#[91C441A8E8D2D3D7]) [    ] o.a.s.c.SolrResourceLoader solr home defaulted to 'solr/' (could not find system property or JNDI)
   [junit4]   2> 374155 INFO  (TEST-TestReplicationHandler.doTestRepeater-seed#[91C441A8E8D2D3D7]) [    ] o.a.s.c.SolrXmlConfig Loading container configuration from /x1/jenkins/jenkins-slave/workspace/Lucene-Solr-Tests-trunk-Java8/solr/build/solr-core/test/J0/temp/solr.handler.TestReplicationHandler_91C441A8E8D2D3D7-001/solr-instance-002/solr.xml
   [junit4]   2> 374160 INFO  (TEST-TestReplicationHandler.doTestRepeater-seed#[91C441A8E8D2D3D7]) [    ] o.a.s.c.CorePropertiesLocator Config-defined core root directory: /x1/jenkins/jenkins-slave/workspace/Lucene-Solr-Tests-trunk-Java8/solr/build/solr-core/test/J0/temp/solr.handler.TestReplicationHandler_91C441A8E8D2D3D7-001/solr-instance-002/.
   [junit4]   2> 374160 INFO  (TEST-TestReplicationHandler.doTestRepeater-seed#[91C441A8E8D2D3D7]) [    ] o.a.s.c.CoreContainer New CoreContainer 1313805891
   [junit4]   2> 374160 INFO  (TEST-TestReplicationHandler.doTestRepeater-seed#[91C441A8E8D2D3D7]) [    ] o.a.s.c.CoreContainer Loading cores into CoreContainer [instanceDir=/x1/jenkins/jenkins-slave/workspace/Lucene-Solr-Tests-trunk-Java8/solr/build/solr-core/test/J0/temp/solr.handler.TestReplicationHandler_91C441A8E8D2D3D7-001/solr-instance-002]
   [junit4]   2> 374160 WARN  (TEST-TestReplicationHandler.doTestRepeater-seed#[91C441A8E8D2D3D7]) [    ] o.a.s.c.CoreContainer Couldn't add files from /x1/jenkins/jenkins-slave/workspace/Lucene-Solr-Tests-trunk-Java8/solr/build/solr-core/test/J0/temp/solr.handler.TestReplicationHandler_91C441A8E8D2D3D7-001/solr-instance-002/lib to classpath: /x1/jenkins/jenkins-slave/workspace/Lucene-Solr-Tests-trunk-Java8/solr/build/solr-core/test/J0/temp/solr.handler.TestReplicationHandler_91C441A8E8D2D3D7-001/solr-instance-002/lib
   [junit4]   2> 374160 INFO  (TEST-TestReplicationHandler.doTestRepeater-seed#[91C441A8E8D2D3D7]) [    ] o.a.s.h.c.HttpShardHandlerFactory created with socketTimeout : 90000,urlScheme : ,connTimeout : 15000,maxConnectionsPerHost : 20,maxConnections : 10000,corePoolSize : 0,maximumPoolSize : 2147483647,maxThreadIdleTime : 5,sizeOfQueue : -1,fairnessPolicy : false,useRetries : false,
   [junit4]   2> 374161 INFO  (TEST-TestReplicationHandler.doTestRepeater-seed#[91C441A8E8D2D3D7]) [    ] o.a.s.u.UpdateShardHandler Creating UpdateShardHandler HTTP client with params: socketTimeout=340000&connTimeout=45000&retry=true
   [junit4]   2> 374162 INFO  (TEST-TestReplicationHandler.doTestRepeater-seed#[91C441A8E8D2D3D7]) [    ] o.a.s.l.LogWatcher SLF4J impl is org.slf4j.impl.Log4jLoggerFactory
   [junit4]   2> 374162 INFO  (TEST-TestReplicationHandler.doTestRepeater-seed#[91C441A8E8D2D3D7]) [    ] o.a.s.l.LogWatcher Registering Log Listener [Log4j (org.slf4j.impl.Log4jLoggerFactory)]
   [junit4]   2> 374162 INFO  (TEST-TestReplicationHandler.doTestRepeater-seed#[91C441A8E8D2D3D7]) [    ] o.a.s.c.CoreContainer Security conf doesn't exist. Skipping setup for authorization module.
   [junit4]   2> 374162 INFO  (TEST-TestReplicationHandler.doTestRepeater-seed#[91C441A8E8D2D3D7]) [    ] o.a.s.c.CoreContainer No authentication plugin used.
   [junit4]   2> 374163 INFO  (TEST-TestReplicationHandler.doTestRepeater-seed#[91C441A8E8D2D3D7]) [    ] o.a.s.c.CorePropertiesLocator Looking for core definitions underneath /x1/jenkins/jenkins-slave/workspace/Lucene-Solr-Tests-trunk-Java8/solr/build/solr-core/test/J0/temp/solr.handler.TestReplicationHandler_91C441A8E8D2D3D7-001/solr-instance-002/.
   [junit4]   2> 374163 INFO  (TEST-TestReplicationHandler.doTestRepeater-seed#[91C441A8E8D2D3D7]) [    ] o.a.s.c.CoreDescriptor Created CoreDescriptor: {name=collection1, config=solrconfig.xml, loadOnStartup=true, schema=schema.xml, configSetProperties=configsetprops.json, transient=false, dataDir=data/}
   [junit4]   2> 374163 INFO  (TEST-TestReplicationHandler.doTestRepeater-seed#[91C441A8E8D2D3D7]) [    ] o.a.s.c.CorePropertiesLocator Found core collection1 in /x1/jenkins/jenkins-slave/workspace/Lucene-Solr-Tests-trunk-Java8/solr/build/solr-core/test/J0/temp/solr.handler.TestReplicationHandler_91C441A8E8D2D3D7-001/solr-instance-002/./collection1
   [junit4]   2> 374163 INFO  (TEST-TestReplicationHandler.doTestRepeater-seed#[91C441A8E8D2D3D7]) [    ] o.a.s.c.CorePropertiesLocator Found 1 core definitions
   [junit4]   2> 374164 INFO  (coreLoadExecutor-1276-thread-1) [    ] o.a.s.c.SolrResourceLoader new SolrResourceLoader for directory: '/x1/jenkins/jenkins-slave/workspace/Lucene-Solr-Tests-trunk-Java8/solr/build/solr-core/test/J0/temp/solr.handler.TestReplicationHandler_91C441A8E8D2D3D7-001/solr-instance-002/collection1'
   [junit4]   2> 374164 INFO  (TEST-TestReplicationHandler.doTestRepeater-seed#[91C441A8E8D2D3D7]) [    ] o.a.s.s.SolrDispatchFilter user.dir=/x1/jenkins/jenkins-slave/workspace/Lucene-Solr-Tests-trunk-Java8/solr/build/solr-core/test/J0
   [junit4]   2> 374164 INFO  (coreLoadExecutor-1276-thread-1) [    ] o.a.s.c.SolrResourceLoader JNDI not configured for solr (NoInitialContextEx)
   [junit4]   2> 374164 INFO  (TEST-TestReplicationHandler.doTestRepeater-seed#[91C441A8E8D2D3D7]) [    ] o.a.s.s.SolrDispatchFilter SolrDispatchFilter.init() done
   [junit4]   2> 374164 INFO  (coreLoadExecutor-1276-thread-1) [    ] o.a.s.c.SolrResourceLoader solr home defaulted to 'solr/' (could not find system property or JNDI)
   [junit4]   2> 374171 INFO  (coreLoadExecutor-1276-thread-1) [    ] o.a.s.c.SolrConfig current version of requestparams : -1
   [junit4]   2> 374174 INFO  (coreLoadExecutor-1276-thread-1) [    ] o.a.s.c.SolrConfig Using Lucene MatchVersion: 6.0.0
   [junit4]   2> 374191 INFO  (coreLoadExecutor-1276-thread-1) [    ] o.a.s.c.SolrConfig Loaded SolrConfig: solrconfig.xml
   [junit4]   2> 374194 INFO  (coreLoadExecutor-1276-thread-1) [    ] o.a.s.s.IndexSchema [collection1] Schema name=test
   [junit4]   2> 374197 INFO  (coreLoadExecutor-1276-thread-1) [    ] o.a.s.s.IndexSchema unique key field: id
   [junit4]   2> 374198 INFO  (coreLoadExecutor-1276-thread-1) [    ] o.a.s.c.ConfigSetProperties Did not find ConfigSet properties, assuming default properties: Can't find resource 'configsetprops.json' in classpath or '/x1/jenkins/jenkins-slave/workspace/Lucene-Solr-Tests-trunk-Java8/solr/build/solr-core/test/J0/temp/solr.handler.TestReplicationHandler_91C441A8E8D2D3D7-001/solr-instance-002/collection1'
   [junit4]   2> 374198 INFO  (coreLoadExecutor-1276-thread-1) [    ] o.a.s.c.CoreContainer Creating SolrCore 'collection1' using configuration from instancedir /x1/jenkins/jenkins-slave/workspace/Lucene-Solr-Tests-trunk-Java8/solr/build/solr-core/test/J0/temp/solr.handler.TestReplicationHandler_91C441A8E8D2D3D7-001/solr-instance-002/./collection1
   [junit4]   2> 374199 INFO  (coreLoadExecutor-1276-thread-1) [    x:collection1] o.a.s.c.SolrCore org.apache.solr.core.MockDirectoryFactory
   [junit4]   2> 374199 INFO  (coreLoadExecutor-1276-thread-1) [    x:collection1] o.a.s.c.SolrCore [[collection1] ] Opening new SolrCore at [/x1/jenkins/jenkins-slave/workspace/Lucene-Solr-Tests-trunk-Java8/solr/build/solr-core/test/J0/temp/solr.handler.TestReplicationHandler_91C441A8E8D2D3D7-001/solr-instance-002/collection1], dataDir=[/x1/jenkins/jenkins-slave/workspace/Lucene-Solr-Tests-trunk-Java8/solr/build/solr-core/test/J0/temp/solr.handler.TestReplicationHandler_91C441A8E8D2D3D7-001/solr-instance-002/./collection1/data/]
   [junit4]   2> 374199 INFO  (coreLoadExecutor-1276-thread-1) [    x:collection1] o.a.s.c.SolrCore JMX monitoring not detected for core: collection1
   [junit4]   2> 374199 INFO  (coreLoadExecutor-1276-thread-1) [    x:collection1] o.a.s.c.CachingDirectoryFactory return new directory for /x1/jenkins/jenkins-slave/workspace/Lucene-Solr-Tests-trunk-Java8/solr/build/solr-core/test/J0/temp/solr.handler.TestReplicationHandler_91C441A8E8D2D3D7-001/solr-instance-002/./collection1/data
   [junit4]   2> 374199 INFO  (coreLoadExecutor-1276-thread-1) [    x:collection1] o.a.s.c.SolrCore New index directory detected: old=null new=/x1/jenkins/jenkins-slave/workspace/Lucene-Solr-Tests-trunk-Java8/solr/build/solr-core/test/J0/temp/solr.handler.TestReplicationHandler_91C441A8E8D2D3D7-001/solr-instance-002/./collection1/data/index/
   [junit4]   2> 374199 WARN  (coreLoadExecutor-1276-thread-1) [    x:collection1] o.a.s.c.SolrCore [collection1] Solr index directory '/x1/jenkins/jenkins-slave/workspace/Lucene-Solr-Tests-trunk-Java8/solr/build/solr-core/test/J0/temp/solr.handler.TestReplicationHandler_91C441A8E8D2D3D7-001/solr-instance-002/./collection1/data/index' doesn't exist. Creating new index...
   [junit4]   2> 374200 INFO  (coreLoadExecutor-1276-thread-1) [    x:collection1] o.a.s.c.CachingDirectoryFactory return new directory for /x1/jenkins/jenkins-slave/workspace/Lucene-Solr-Tests-trunk-Java8/solr/build/solr-core/test/J0/temp/solr.handler.TestReplicationHandler_91C441A8E8D2D3D7-001/solr-instance-002/./collection1/data/index
   [junit4]   2> 374200 INFO  (coreLoadExecutor-1276-thread-1) [    x:collection1] o.a.s.u.RandomMergePolicy RandomMergePolicy wrapping class org.apache.lucene.index.LogByteSizeMergePolicy: [LogByteSizeMergePolicy: minMergeSize=1677721, mergeFactor=25, maxMergeSize=2147483648, maxMergeSizeForForcedMerge=9223372036854775807, calibrateSizeByDeletes=false, maxMergeDocs=2147483647, maxCFSSegmentSizeMB=8.796093022207999E12, noCFSRatio=1.0]
   [junit4]   2> 374200 INFO  (coreLoadExecutor-1276-thread-1) [    x:collection1] o.a.s.c.SolrDeletionPolicy SolrDeletionPolicy.onCommit: commits: num=1
   [junit4]   2> 	commit{dir=MockDirectoryWrapper(RAMDirectory@3ed85911 lockFactory=org.apache.lucene.store.SingleInstanceLockFactory@1b5c1a2f),segFN=segments_1,generation=1}
   [junit4]   2> 374201 INFO  (coreLoadExecutor-1276-thread-1) [    x:collection1] o.a.s.c.SolrDeletionPolicy newest commit generation = 1
   [junit4]   2> 374201 INFO  (OldIndexDirectoryCleanupThreadForCore-collection1) [    x:collection1] o.a.s.c.SolrCore Looking for old index directories to cleanup for core collection1 in /x1/jenkins/jenkins-slave/workspace/Lucene-Solr-Tests-trunk-Java8/solr/build/solr-core/test/J0/temp/solr.handler.TestReplicationHandler_91C441A8E8D2D3D7-001/solr-instance-002/./collection1/data/
   [junit4]   2> 374203 INFO  (coreLoadExecutor-1276-thread-1) [    x:collection1] o.a.s.c.SolrCore no updateRequestProcessorChain defined as default, creating implicit default
   [junit4]   2> 374204 INFO  (coreLoadExecutor-1276-thread-1) [    x:collection1] o.a.s.h.l.XMLLoader xsltCacheLifetimeSeconds=60
   [junit4]   2> 374205 INFO  (coreLoadExecutor-1276-thread-1) [    x:collection1] o.a.s.h.l.XMLLoader xsltCacheLifetimeSeconds=60
   [junit4]   2> 374206 INFO  (coreLoadExecutor-1276-thread-1) [    x:collection1] o.a.s.h.l.XMLLoader xsltCacheLifetimeSeconds=60
   [junit4]   2> 374207 INFO  (coreLoadExecutor-1276-thread-1) [    x:collection1] o.a.s.h.l.XMLLoader xsltCacheLifetimeSeconds=60
   [junit4]   2> 374208 INFO  (coreLoadExecutor-1276-thread-1) [    x:collection1] o.a.s.c.PluginBag requestHandler : 'lazy' created with startup=lazy 
   [junit4]   2> 374208 INFO  (coreLoadExecutor-1276-thread-1) [    x:collection1] o.a.s.c.RequestHandlers Registered paths: /admin/mbeans,standard,lazy,/update/json/docs,/admin/luke,/export,/get,/admin/properties,/update/json,/admin/threads,/update/csv,/sql,/admin/segments,/admin/system,/replication,defaults,/config,/stream,/schema,/admin/plugins,/admin/logging,/admin/ping,/update,/admin/file
   [junit4]   2> 374209 INFO  (coreLoadExecutor-1276-thread-1) [    x:collection1] o.a.s.c.SolrCore Using default statsCache cache: org.apache.solr.search.stats.LocalStatsCache
   [junit4]   2> 374209 INFO  (coreLoadExecutor-1276-thread-1) [    x:collection1] o.a.s.u.CommitTracker Hard AutoCommit: disabled
   [junit4]   2> 374209 INFO  (coreLoadExecutor-1276-thread-1) [    x:collection1] o.a.s.u.CommitTracker Soft AutoCommit: disabled
   [junit4]   2> 374209 INFO  (coreLoadExecutor-1276-thread-1) [    x:collection1] o.a.s.u.RandomMergePolicy RandomMergePolicy wrapping class org.apache.lucene.index.TieredMergePolicy: [TieredMergePolicy: maxMergeAtOnce=21, maxMergeAtOnceExplicit=32, maxMergedSegmentMB=21.53125, floorSegmentMB=1.6728515625, forceMergeDeletesPctAllowed=15.837110974431425, segmentsPerTier=34.0, maxCFSSegmentSizeMB=8.796093022207999E12, noCFSRatio=1.0
   [junit4]   2> 374210 INFO  (coreLoadExecutor-1276-thread-1) [    x:collection1] o.a.s.c.SolrDeletionPolicy SolrDeletionPolicy.onInit: commits: num=1
   [junit4]   2> 	commit{dir=MockDirectoryWrapper(RAMDirectory@3ed85911 lockFactory=org.apache.lucene.store.SingleInstanceLockFactory@1b5c1a2f),segFN=segments_1,generation=1}
   [junit4]   2> 374210 INFO  (coreLoadExecutor-1276-thread-1) [    x:collection1] o.a.s.c.SolrDeletionPolicy newest commit generation = 1
   [junit4]   2> 374210 INFO  (coreLoadExecutor-1276-thread-1) [    x:collection1] o.a.s.s.SolrIndexSearcher Opening [Searcher@7c29b7a8[collection1] main]
   [junit4]   2> 374210 INFO  (coreLoadExecutor-1276-thread-1) [    x:collection1] o.a.s.r.ManagedResourceStorage File-based storage initialized to use dir: /x1/jenkins/jenkins-slave/workspace/Lucene-Solr-Tests-trunk-Java8/solr/build/solr-core/test/J0/temp/solr.handler.TestReplicationHandler_91C441A8E8D2D3D7-001/solr-instance-002/collection1/conf
   [junit4]   2> 374210 INFO  (coreLoadExecutor-1276-thread-1) [    x:collection1] o.a.s.r.RestManager Initializing RestManager with initArgs: {storageDir=/x1/jenkins/jenkins-slave/workspace/Lucene-Solr-Tests-trunk-Java8/solr/build/solr-core/test/J0/temp/solr.handler.TestReplicationHandler_91C441A8E8D2D3D7-001/solr-instance-002/collection1/conf}
   [junit4]   2> 374210 INFO  (coreLoadExecutor-1276-thread-1) [    x:collection1] o.a.s.r.ManagedResourceStorage Reading _rest_managed.json using file:dir=/x1/jenkins/jenkins-slave/workspace/Lucene-Solr-Tests-trunk-Java8/solr/build/solr-core/test/J0/temp/solr.handler.TestReplicationHandler_91C441A8E8D2D3D7-001/solr-instance-002/collection1/conf
   [junit4]   2> 374210 INFO  (coreLoadExecutor-1276-thread-1) [    x:collection1] o.a.s.r.RestManager Initializing 0 registered ManagedResources
   [junit4]   2> 374210 INFO  (coreLoadExecutor-1276-thread-1) [    x:collection1] o.a.s.h.ReplicationHandler Commits will be reserved for  10000
   [junit4]   2> 374211 INFO  (searcherExecutor-1277-thread-1-processing-x:collection1) [    x:collection1] o.a.s.c.SolrCore [collection1] Registered new searcher Searcher@7c29b7a8[collection1] main{ExitableDirectoryReader(UninvertingDirectoryReader())}
   [junit4]   2> 374211 INFO  (coreLoadExecutor-1276-thread-1) [    x:collection1] o.a.s.c.CoreContainer registering core: collection1
   [junit4]   2> 374666 INFO  (TEST-TestReplicationHandler.doTestRepeater-seed#[91C441A8E8D2D3D7]) [    ] o.a.s.SolrTestCaseJ4 Writing core.properties file to /x1/jenkins/jenkins-slave/workspace/Lucene-Solr-Tests-trunk-Java8/solr/build/solr-core/test/J0/temp/solr.handler.TestReplicationHandler_91C441A8E8D2D3D7-001/solr-instance-003/collection1
   [junit4]   2> 374670 INFO  (TEST-TestReplicationHandler.doTestRepeater-seed#[91C441A8E8D2D3D7]) [    ] o.e.j.s.Server jetty-9.2.13.v20150730
   [junit4]   2> 374672 INFO  (TEST-TestReplicationHandler.doTestRepeater-seed#[91C441A8E8D2D3D7]) [    ] o.e.j.s.h.ContextHandler Started o.e.j.s.ServletContextHandler@10cc9d72{/solr,null,AVAILABLE}
   [junit4]   2> 374675 INFO  (TEST-TestReplicationHandler.doTestRepeater-seed#[91C441A8E8D2D3D7]) [    ] o.e.j.s.ServerConnector Started ServerConnector@32e7ec9d{HTTP/1.1}{127.0.0.1:44550}
   [junit4]   2> 374675 INFO  (TEST-TestReplicationHandler.doTestRepeater-seed#[91C441A8E8D2D3D7]) [    ] o.e.j.s.Server Started @378025ms
   [junit4]   2> 374675 INFO  (TEST-TestReplicationHandler.doTestRepeater-seed#[91C441A8E8D2D3D7]) [    ] o.a.s.c.s.e.JettySolrRunner Jetty properties: {solr.data.dir=/x1/jenkins/jenkins-slave/workspace/Lucene-Solr-Tests-trunk-Java8/solr/build/solr-core/test/J0/temp/solr.handler.TestReplicationHandler_91C441A8E8D2D3D7-001/solr-instance-003/collection1/data, hostContext=/solr, hostPort=44550}
   [junit4]   2> 374675 INFO  (TEST-TestReplicationHandler.doTestRepeater-seed#[91C441A8E8D2D3D7]) [    ] o.a.s.s.SolrDispatchFilter SolrDispatchFilter.init(): sun.misc.Launcher$AppClassLoader@4e0e2f2a
   [junit4]   2> 374675 INFO  (TEST-TestReplicationHandler.doTestRepeater-seed#[91C441A8E8D2D3D7]) [    ] o.a.s.c.SolrResourceLoader new SolrResourceLoader for directory: '/x1/jenkins/jenkins-slave/workspace/Lucene-Solr-Tests-trunk-Java8/solr/build/solr-core/test/J0/temp/solr.handler.TestReplicationHandler_91C441A8E8D2D3D7-001/solr-instance-003'
   [junit4]   2> 374675 INFO  (TEST-TestReplicationHandler.doTestRepeater-seed#[91C441A8E8D2D3D7]) [    ] o.a.s.c.SolrResourceLoader JNDI not configured for solr (NoInitialContextEx)
   [junit4]   2> 374675 INFO  (TEST-TestReplicationHandler.doTestRepeater-seed#[91C441A8E8D2D3D7]) [    ] o.a.s.c.SolrResourceLoader solr home defaulted to 'solr/' (could not find system property or JNDI)
   [junit4]   2> 374676 INFO  (TEST-TestReplicationHandler.doTestRepeater-seed#[91C441A8E8D2D3D7]) [    ] o.a.s.c.SolrXmlConfig Loading container configuration from /x1/jenkins/jenkins-slave/workspace/Lucene-Solr-Tests-trunk-Java8/solr/build/solr-core/test/J0/temp/solr.handler.TestReplicationHandler_91C441A8E8D2D3D7-001/solr-instance-003/solr.xml
   [junit4]   2> 374680 INFO  (TEST-TestReplicationHandler.doTestRepeater-seed#[91C441A8E8D2D3D7]) [    ] o.a.s.c.CorePropertiesLocator Config-defined core root directory: /x1/jenkins/jenkins-slave/workspace/Lucene-Solr-Tests-trunk-Java8/solr/build/solr-core/test/J0/temp/solr.handler.TestReplicationHandler_91C441A8E8D2D3D7-001/solr-instance-003/.
   [junit4]   2> 374680 INFO  (TEST-TestReplicationHandler.doTestRepeater-seed#[91C441A8E8D2D3D7]) [    ] o.a.s.c.CoreContainer New CoreContainer 1444751820
   [junit4]   2> 374680 INFO  (TEST-TestReplicationHandler.doTestRepeater-seed#[91C441A8E8D2D3D7]) [    ] o.a.s.c.CoreContainer Loading cores into CoreContainer [instanceDir=/x1/jenkins/jenkins-slave/workspace/Lucene-Solr-Tests-trunk-Java8/solr/build/solr-core/test/J0/temp/solr.handler.TestReplicationHandler_91C441A8E8D2D3D7-001/solr-instance-003]
   [junit4]   2> 374680 WARN  (TEST-TestReplicationHandler.doTestRepeater-seed#[91C441A8E8D2D3D7]) [    ] o.a.s.c.CoreContainer Couldn't add files from /x1/jenkins/jenkins-slave/workspace/Lucene-Solr-Tests-trunk-Java8/solr/build/solr-core/test/J0/temp/solr.handler.TestReplicationHandler_91C441A8E8D2D3D7-001/solr-instance-003/lib to classpath: /x1/jenkins/jenkins-slave/workspace/Lucene-Solr-Tests-trunk-Java8/solr/build/solr-core/test/J0/temp/solr.handler.TestReplicationHandler_91C441A8E8D2D3D7-001/solr-instance-003/lib
   [junit4]   2> 374681 INFO  (TEST-TestReplicationHandler.doTestRepeater-seed#[91C441A8E8D2D3D7]) [    ] o.a.s.h.c.HttpShardHandlerFactory created with socketTimeout : 90000,urlScheme : ,connTimeout : 15000,maxConnectionsPerHost : 20,maxConnections : 10000,corePoolSize : 0,maximumPoolSize : 2147483647,maxThreadIdleTime : 5,sizeOfQueue : -1,fairnessPolicy : false,useRetries : false,
   [junit4]   2> 374681 INFO  (TEST-TestReplicationHandler.doTestRepeater-seed#[91C441A8E8D2D3D7]) [    ] o.a.s.u.UpdateShardHandler Creating UpdateShardHandler HTTP client with params: socketTimeout=340000&connTimeout=45000&retry=true
   [junit4]   2> 374682 INFO  (TEST-TestReplicationHandler.doTestRepeater-seed#[91C441A8E8D2D3D7]) [    ] o.a.s.l.LogWatcher SLF4J impl is org.slf4j.impl.Log4jLoggerFactory
   [junit4]   2> 374682 INFO  (TEST-TestReplicationHandler.doTestRepeater-seed#[91C441A8E8D2D3D7]) [    ] o.a.s.l.LogWatcher Registering Log Listener [Log4j (org.slf4j.impl.Log4jLoggerFactory)]
   [junit4]   2> 374682 INFO  (TEST-TestReplicationHandler.doTestRepeater-seed#[91C441A8E8D2D3D7]) [    ] o.a.s.c.CoreContainer Security conf doesn't exist. Skipping setup for authorization module.
   [junit4]   2> 374682 INFO  (TEST-TestReplicationHandler.doTestRepeater-seed#[91C441A8E8D2D3D7]) [    ] o.a.s.c.CoreContainer No authentication plugin used.
   [junit4]   2> 374683 INFO  (TEST-TestReplicationHandler.doTestRepeater-seed#[91C441A8E8D2D3D7]) [    ] o.a.s.c.CorePropertiesLocator Looking for core definitions underneath /x1/jenkins/jenkins-slave/workspace/Lucene-Solr-Tests-trunk-Java8/solr/build/solr-core/test/J0/temp/solr.handler.TestReplicationHandler_91C441A8E8D2D3D7-001/solr-instance-003/.
   [junit4]   2> 374684 INFO  (TEST-TestReplicationHandler.doTestRepeater-seed#[91C441A8E8D2D3D7]) [    ] o.a.s.c.CoreDescriptor Created CoreDescriptor: {name=collection1, config=solrconfig.xml, loadOnStartup=true, schema=schema.xml, configSetProperties=configsetprops.json, transient=false, dataDir=data/}
   [junit4]   2> 374684 INFO  (TEST-TestReplicationHandler.doTestRepeater-seed#[91C441A8E8D2D3D7]) [    ] o.a.s.c.CorePropertiesLocator Found core collection1 in /x1/jenkins/jenkins-slave/workspace/Lucene-Solr-Tests-trunk-Java8/solr/build/solr-core/test/J0/temp/solr.handler.TestReplicationHandler_91C441A8E8D2D3D7-001/solr-instance-003/./collection1
   [junit4]   2> 374684 INFO  (TEST-TestReplicationHandler.doTestRepeater-seed#[91C441A8E8D2D3D7]) [    ] o.a.s.c.CorePropertiesLocator Found 1 core definitions
   [junit4]   2> 374684 INFO  (coreLoadExecutor-1286-thread-1) [    ] o.a.s.c.SolrResourceLoader new SolrResourceLoader for directory: '/x1/jenkins/jenkins-slave/workspace/Lucene-Solr-Tests-trunk-Java8/solr/build/solr-core/test/J0/temp/solr.handler.TestReplicationHandler_91C441A8E8D2D3D7-001/solr-instance-003/collection1'
   [junit4]   2> 374684 INFO  (coreLoadExecutor-1286-thread-1) [    ] o.a.s.c.SolrResourceLoader JNDI not configured for solr (NoInitialContextEx)
   [junit4]   2> 374684 INFO  (TEST-TestReplicationHandler.doTestRepeater-seed#[91C441A8E8D2D3D7]) [    ] o.a.s.s.SolrDispatchFilter user.dir=/x1/jenkins/jenkins-slave/workspace/Lucene-Solr-Tests-trunk-Java8/solr/build/solr-core/test/J0
   [junit4]   2> 374685 INFO  (coreLoadExecutor-1286-thread-1) [    ] o.a.s.c.SolrResourceLoader solr home defaulted to 'solr/' (could not find system property or JNDI)
   [junit4]   2> 374685 INFO  (TEST-TestReplicationHandler.doTestRepeater-seed#[91C441A8E8D2D3D7]) [    ] o.a.s.s.SolrDispatchFilter SolrDispatchFilter.init() done
   [junit4]   2> 374690 INFO  (coreLoadExecutor-1286-thread-1) [    ] o.a.s.c.SolrConfig current version of requestparams : -1
   [junit4]   2> 374692 INFO  (coreLoadExecutor-1286-thread-1) [    ] o.a.s.c.SolrConfig Using Lucene MatchVersion: 6.0.0
   [junit4]   2> 374698 INFO  (coreLoadExecutor-1286-thread-1) [    ] o.a.s.c.SolrConfig Loaded SolrConfig: solrconfig.xml
   [junit4]   2> 374701 INFO  (coreLoadExecutor-1286-thread-1) [    ] o.a.s.s.IndexSchema [collection1] Schema name=test
   [junit4]   2> 374703 INFO  (coreLoadExecutor-1286-thread-1) [    ] o.a.s.s.IndexSchema unique key field: id
   [junit4]   2> 374704 INFO  (coreLoadExecutor-1286-thread-1) [    ] o.a.s.c.ConfigSetProperties Did not find ConfigSet properties, assuming default properties: Can't find resource 'configsetprops.json' in classpath or '/x1/jenkins/jenkins-slave/workspace/Lucene-Solr-Tests-trunk-Java8/solr/build/solr-core/test/J0/temp/solr.handler.TestReplicationHandler_91C441A8E8D2D3D7-001/solr-instance-003/collection1'
   [junit4]   2> 374704 INFO  (coreLoadExecutor-1286-thread-1) [    ] o.a.s.c.CoreContainer Creating SolrCore 'collection1' using configuration from instancedir /x1/jenkins/jenkins-slave/workspace/Lucene-Solr-Tests-trunk-Java8/solr/build/solr-core/test/J0/temp/solr.handler.TestReplicationHandler_91C441A8E8D2D3D7-001/solr-instance-003/./collection1
   [junit4]   2> 374704 INFO  (coreLoadExecutor-1286-thread-1) [    x:collection1] o.a.s.c.SolrCore org.apache.solr.core.MockDirectoryFactory
   [junit4]   2> 374704 INFO  (coreLoadExecutor-1286-thread-1) [    x:collection1] o.a.s.c.SolrCore [[collection1] ] Opening new SolrCore at [/x1/jenkins/jenkins-slave/workspace/Lucene-Solr-Tests-trunk-Java8/solr/build/solr-core/test/J0/temp/solr.handler.TestReplicationHandler_91C441A8E8D2D3D7-001/solr-instance-003/collection1], dataDir=[/x1/jenkins/jenkins-slave/workspace/Lucene-Solr-Tests-trunk-Java8/solr/build/solr-core/test/J0/temp/solr.handler.TestReplicationHandler_91C441A8E8D2D3D7-001/solr-instance-003/./collection1/data/]
   [junit4]   2> 374704 INFO  (coreLoadExecutor-1286-thread-1) [    x:collection1] o.a.s.c.SolrCore JMX monitoring not detected for core: collection1
   [junit4]   2> 374705 INFO  (coreLoadExecutor-1286-thread-1) [    x:collection1] o.a.s.c.CachingDirectoryFactory return new directory for /x1/jenkins/jenkins-slave/workspace/Lucene-Solr-Tests-trunk-Java8/solr/build/solr-core/test/J0/temp/solr.handler.TestReplicationHandler_91C441A8E8D2D3D7-001/solr-instance-003/./collection1/data
   [junit4]   2> 374705 INFO  (coreLoadExecutor-1286-thread-1) [    x:collection1] o.a.s.c.SolrCore New index directory detected: old=null new=/x1/jenkins/jenkins-slave/workspace/Lucene-Solr-Tests-trunk-Java8/solr/build/solr-core/test/J0/temp/solr.handler.TestReplicationHandler_91C441A8E8D2D3D7-001/solr-instance-003/./collection1/data/index/
   [junit4]   2> 374705 WARN  (coreLoadExecutor-1286-thread-1) [    x:collection1] o.a.s.c.SolrCore [collection1] Solr index directory '/x1/jenkins/jenkins-slave/workspace/Lucene-Solr-Tests-trunk-Java8/solr/build/solr-core/test/J0/temp/solr.handler.TestReplicationHandler_91C441A8E8D2D3D7-001/solr-instance-003/./collection1/data/index' doesn't exist. Creating new index...
   [junit4]   2> 374705 INFO  (coreLoadExecutor-1286-thread-1) [    x:collection1] o.a.s.c.CachingDirectoryFactory return new directory for /x1/jenkins/jenkins-slave/workspace/Lucene-Solr-Tests-trunk-Java8/solr/build/solr-core/test/J0/temp/solr.handler.TestReplicationHandler_91C441A8E8D2D3D7-001/solr-instance-003/./collection1/data/index
   [junit4]   2> 374705 INFO  (coreLoadExecutor-1286-thread-1) [    x:collection1] o.a.s.u.RandomMergePolicy RandomMergePolicy wrapping class org.apache.lucene.index.LogByteSizeMergePolicy: [LogByteSizeMergePolicy: minMergeSize=1677721, mergeFactor=25, maxMergeSize=2147483648, maxMergeSizeForForcedMerge=9223372036854775807, calibrateSizeByDeletes=false, maxMergeDocs=2147483647, maxCFSSegmentSizeMB=8.796093022207999E12, noCFSRatio=1.0]
   [junit4]   2> 374707 INFO  (coreLoadExecutor-1286-thread-1) [    x:collection1] o.a.s.c.SolrDeletionPolicy SolrDeletionPolicy.onCommit: commits: num=1
   [junit4]   2> 	commit{dir=MockDirectoryWrapper(RAMDirectory@4e0e8a lockFactory=org.apache.lucene.store.SingleInstanceLockFactory@3747d3e5),segFN=segments_1,generation=1}
   [junit4]   2> 374707 INFO  (coreLoadExecutor-1286-thread-1) [    x:collection1] o.a.s.c.SolrDeletionPolicy newest commit generation = 1
   [junit4]   2> 374707 INFO  (OldIndexDirectoryCleanupThreadForCore-collection1) [    x:collection1] o.a.s.c.SolrCore Looking for old index directories to cleanup for core collection1 in /x1/jenkins/jenkins-slave/workspace/Lucene-Solr-Tests-trunk-Java8/solr/build/solr-core/test/J0/temp/solr.handler.TestReplicationHandler_91C441A8E8D2D3D7-001/solr-instance-003/./collection1/data/
   [junit4]   2> 374709 INFO  (coreLoadExecutor-1286-thread-1) [    x:collection1] o.a.s.c.SolrCore no updateRequestProcessorChain defined as default, creating implicit default
   [junit4]   2> 374710 INFO  (coreLoadExecutor-1286-thread-1) [    x:collection1] o.a.s.h.l.XMLLoader xsltCacheLifetimeSeconds=60
   [junit4]   2> 374711 INFO  (coreLoadExecutor-1286-thread-1) [    x:collection1] o.a.s.h.l.XMLLoader xsltCacheLifetimeSeconds=60
   [junit4]   2> 374712 INFO  (coreLoadExecutor-1286-thread-1) [    x:collection1] o.a.s.h.l.XMLLoader xsltCacheLifetimeSeconds=60
   [junit4]   2> 374712 INFO  (coreLoadExecutor-1286-thread-1) [    x:collection1] o.a.s.h.l.XMLLoader xsltCacheLifetimeSeconds=60
   [junit4]   2> 374714 INFO  (coreLoadExecutor-1286-thread-1) [    x:collection1] o.a.s.c.PluginBag requestHandler : 'lazy' created with startup=lazy 
   [junit4]   2> 374714 INFO  (coreLoadExecutor-1286-thread-1) [    x:collection1] o.a.s.c.RequestHandlers Registered paths: /admin/mbeans,standard,lazy,/update/json/docs,/admin/luke,/export,/get,/admin/properties,/update/json,/admin/threads,/update/csv,/sql,/admin/segments,/admin/system,/replication,defaults,/config,/stream,/schema,/admin/plugins,/admin/logging,/admin/ping,/update,/admin/file
   [junit4]   2> 374714 INFO  (coreLoadExecutor-1286-thread-1) [    x:collection1] o.a.s.c.SolrCore Using default statsCache cache: org.apache.solr.search.stats.LocalStatsCache
   [junit4]   2> 374714 INFO  (coreLoadExecutor-1286-thread-1) [    x:collection1] o.a.s.u.CommitTracker Hard AutoCommit: disabled
   [junit4]   2> 374715 INFO  (coreLoadExecutor-1286-thread-1) [    x:collection1] o.a.s.u.CommitTracker Soft AutoCommit: disabled
   [junit4]   2> 374715 INFO  (coreLoadExecutor-1286-thread-1) [    x:collection1] o.a.s.u.RandomMergePolicy RandomMergePolicy wrapping class org.apache.lucene.index.TieredMergePolicy: [TieredMergePolicy: maxMergeAtOnce=21, maxMergeAtOnceExplicit=32, maxMergedSegmentMB=21.53125, floorSegmentMB=1.6728515625, forceMergeDeletesPctAllowed=15.837110974431425, segmentsPerTier=34.0, maxCFSSegmentSizeMB=8.796093022207999E12, noCFSRatio=1.0
   [junit4]   2> 374715 INFO  (coreLoadExecutor-1286-thread-1) [    x:collection1] o.a.s.c.SolrDeletionPolicy SolrDeletionPolicy.onInit: commits: num=1
   [junit4]   2> 	commit{dir=MockDirectoryWrapper(RAMDirectory@4e0e8a lockFactory=org.apache.lucene.store.SingleInstanceLockFactory@3747d3e5),segFN=segments_1,generation=1}
   [junit4]   2> 374715 INFO  (coreLoadExecutor-1286-thread-1) [    x:collection1] o.a.s.c.SolrDeletionPolicy newest commit generation = 1
   [junit4]   2> 374715 INFO  (coreLoadExecutor-1286-thread-1) [    x:collection1] o.a.s.s.SolrIndexSearcher Opening [Searcher@17fd8737[collection1] main]
   [junit4]   2> 374715 INFO  (coreLoadExecutor-1286-thread-1) [    x:collection1] o.a.s.r.ManagedResourceStorage File-based storage initialized to use dir: /x1/jenkins/jenkins-slave/workspace/Lucene-Solr-Tests-trunk-Java8/solr/build/solr-core/test/J0/temp/solr.handler.TestReplicationHandler_91C441A8E8D2D3D7-001/solr-instance-003/collection1/conf
   [junit4]   2> 374715 INFO  (coreLoadExecutor-1286-thread-1) [    x:collection1] o.a.s.r.RestManager Initializing RestManager with initArgs: {storageDir=/x1/jenkins/jenkins-slave/workspace/Lucene-Solr-Tests-trunk-Java8/solr/build/solr-core/test/J0/temp/solr.handler.TestReplicationHandler_91C441A8E8D2D3D7-001/solr-instance-003/collection1/conf}
   [junit4]   2> 374716 INFO  (coreLoadExecutor-1286-thread-1) [    x:collection1] o.a.s.r.ManagedResourceStorage Reading _rest_managed.json using file:dir=/x1/jenkins/jenkins-slave/workspace/Lucene-Solr-Tests-trunk-Java8/solr/build/solr-core/test/J0/temp/solr.handler.TestReplicationHandler_91C441A8E8D2D3D7-001/solr-instance-003/collection1/conf
   [junit4]   2> 374716 INFO  (coreLoadExecutor-1286-thread-1) [    x:collection1] o.a.s.r.RestManager Initializing 0 registered ManagedResources
   [junit4]   2> 374716 WARN  (coreLoadExecutor-1286-thread-1) [    x:collection1] o.a.s.h.IndexFetcher 'masterUrl' must be specified without the /replication suffix
   [junit4]   2> 374716 INFO  (coreLoadExecutor-1286-thread-1) [    x:collection1] o.a.s.h.ReplicationHandler  No value set for 'pollInterval'. Timer Task not started.
   [junit4]   2> 374716 INFO  (coreLoadExecutor-1286-thread-1) [    x:collection1] o.a.s.h.ReplicationHandler Replication enabled for following config files: schema.xml
   [junit4]   2> 374717 INFO  (coreLoadExecutor-1286-thread-1) [    x:collection1] o.a.s.h.ReplicationHandler Commits will be reserved for  10000
   [junit4]   2> 374717 INFO  (searcherExecutor-1287-thread-1-processing-x:collection1) [    x:collection1] o.a.s.c.SolrCore [collection1] Registered new searcher Searcher@17fd8737[collection1] main{ExitableDirectoryReader(UninvertingDirectoryReader())}
   [junit4]   2> 374717 INFO  (coreLoadExecutor-1286-thread-1) [    x:collection1] o.a.s.c.CoreContainer registering core: collection1
   [junit4]   2> 375188 INFO  (qtp989015560-2049) [    x:collection1] o.a.s.u.p.LogUpdateProcessorFactory [collection1]  webapp=/solr path=/update params={wt=javabin&version=2}{add=[0]} 0 1
   [junit4]   2> 375190 INFO  (qtp989015560-2050) [    x:collection1] o.a.s.u.p.LogUpdateProcessorFactory [collection1]  webapp=/solr path=/update params={wt=javabin&version=2}{add=[1]} 0 0
   [junit4]   2> 375192 INFO  (qtp989015560-2051) [    x:collection1] o.a.s.u.p.LogUpdateProcessorFactory [collection1]  webapp=/solr path=/update params={wt=javabin&version=2}{add=[2]} 0 0
   [junit4]   2> 375193 INFO  (qtp989015560-2047) [    x:collection1] o.a.s.u.DirectUpdateHandler2 start commit{,optimize=false,openSearcher=true,waitSearcher=true,expungeDeletes=false,softCommit=false,prepareCommit=false}
   [junit4]   2> 375196 INFO  (qtp989015560-2047) [    x:collection1] o.a.s.c.SolrDeletionPolicy SolrDeletionPolicy.onCommit: commits: num=2
   [junit4]   2> 	commit{dir=MockDirectoryWrapper(RAMDirectory@5446f0ec lockFactory=org.apache.lucene.store.SingleInstanceLockFactory@6aed00a5),segFN=segments_1,generation=1}
   [junit4]   2> 	commit{dir=MockDirectoryWrapper(RAMDirectory@5446f0ec lockFactory=org.apache.lucene.store.SingleInstanceLockFactory@6aed00a5),segFN=segments_2,generation=2}
   [junit4]   2> 375196 INFO  (qtp989015560-2047) [    x:collection1] o.a.s.c.SolrDeletionPolicy newest commit generation = 2
   [junit4]   2> 375197 INFO  (qtp989015560-2047) [    x:collection1] o.a.s.s.SolrIndexSearcher Opening [Searcher@766f3c89[collection1] main]
   [junit4]   2> 375197 INFO  (qtp989015560-2047) [    x:collection1] o.a.s.u.DirectUpdateHandler2 end_commit_flush
   [junit4]   2> 375198 INFO  (searcherExecutor-1256-thread-1-processing-x:collection1) [    x:collection1] o.a.s.c.SolrCore [collection1] Registered new searcher Searcher@766f3c89[collection1] main{ExitableDirectoryReader(UninvertingDirectoryReader(Uninverting(_0(6.0.0):C3)))}
   [junit4]   2> 375198 INFO  (qtp989015560-2047) [    x:collection1] o.a.s.u.p.LogUpdateProcessorFactory [collection1]  webapp=/solr path=/update params={waitSearcher=true&commit=true&softCommit=false&wt=javabin&version=2}{commit=} 0 4
   [junit4]   2> 375201 WARN  (explicit-fetchindex-cmd) [    x:collection1] o.a.s.h.IndexFetcher 'masterUrl' must be specified without the /replication suffix
   [junit4]   2> 375202 INFO  (qtp989015560-2048) [    x:collection1] o.a.s.c.S.Request [collection1]  webapp=/solr path=/replication params={qt=/replication&wt=javabin&version=2&command=indexversion} status=0 QTime=0
   [junit4]   2> 375202 INFO  (explicit-fetchindex-cmd) [    x:collection1] o.a.s.h.IndexFetcher Master's generation: 2
   [junit4]   2> 375202 INFO  (explicit-fetchindex-cmd) [    x:collection1] o.a.s.h.IndexFetcher Slave's generation: 1
   [junit4]   2> 375202 INFO  (explicit-fetchindex-cmd) [    x:collection1] o.a.s.h.IndexFetcher Starting replication process
   [junit4]   2> 375204 WARN  (qtp989015560-2049) [    x:collection1] o.a.s.h.ReplicationHandler Could not read checksum from index file: _0_MockRandom_0.sd
   [junit4]   2> java.lang.ArrayIndexOutOfBoundsException
   [junit4]   2> 375206 INFO  (qtp989015560-2049) [    x:collection1] o.a.s.c.S.Request [collection1]  webapp=/solr path=/replication params={generation=2&qt=/replication&wt=javabin&version=2&command=filelist} status=0 QTime=2
   [junit4]   2> 375207 INFO  (explicit-fetchindex-cmd) [    x:collection1] o.a.s.h.IndexFetcher Number of files in latest index in master: 11
   [junit4]   2> 375208 INFO  (explicit-fetchindex-cmd) [    x:collection1] o.a.s.c.CachingDirectoryFactory return new directory for /x1/jenkins/jenkins-slave/workspace/Lucene-Solr-Tests-trunk-Java8/solr/build/solr-core/test/J0/temp/solr.handler.TestReplicationHandler_91C441A8E8D2D3D7-001/solr-instance-003/./collection1/data/index.20160124041036826
   [junit4]   2> 375208 INFO  (explicit-fetchindex-cmd) [    x:collection1] o.a.s.u.DefaultSolrCoreState Rollback old IndexWriter... core=collection1
   [junit4]   2> 375209 INFO  (explicit-fetchindex-cmd) [    x:collection1] o.a.s.u.RandomMergePolicy RandomMergePolicy wrapping class org.apache.lucene.index.LogDocMergePolicy: [LogDocMergePolicy: minMergeSize=1000, mergeFactor=19, maxMergeSize=9223372036854775807, maxMergeSizeForForcedMerge=9223372036854775807, calibrateSizeByDeletes=false, maxMergeDocs=2147483647, maxCFSSegmentSizeMB=8.796093022207999E12, noCFSRatio=0.0]
   [junit4]   2> 375209 INFO  (explicit-fetchindex-cmd) [    x:collection1] o.a.s.c.SolrDeletionPolicy SolrDeletionPolicy.onInit: commits: num=1
   [junit4]   2> 	commit{dir=MockDirectoryWrapper(RAMDirectory@4e0e8a lockFactory=org.apache.lucene.store.SingleInstanceLockFactory@3747d3e5),segFN=segments_1,generation=1}
   [junit4]   2> 375209 INFO  (explicit-fetchindex-cmd) [    x:collection1] o.a.s.c.SolrDeletionPolicy newest commit generation = 1
   [junit4]   2> 375209 INFO  (explicit-fetchindex-cmd) [    x:collection1] o.a.s.u.DefaultSolrCoreState New IndexWriter is ready to be used.
   [junit4]   2> 375209 INFO  (explicit-fetchindex-cmd) [    x:collection1] o.a.s.c.SolrDeletionPolicy SolrDeletionPolicy.onCommit: commits: num=1
   [junit4]   2> 	commit{dir=MockDirectoryWrapper(RAMDirectory@4e0e8a lockFactory=org.apache.lucene.store.SingleInstanceLockFactory@3747d3e5),segFN=segments_1,generation=1}
   [junit4]   2> 375210 INFO  (explicit-fetchindex-cmd) [    x:collection1] o.a.s.c.SolrDeletionPolicy newest commit generation = 1
   [junit4]   2> 375210 INFO  (explicit-fetchindex-cmd) [    x:collection1] o.a.s.u.DefaultSolrCoreState Rollback old IndexWriter... core=collection1
   [junit4]   2> 375210 INFO  (explicit-fetchindex-cmd) [    x:collection1] o.a.s.h.IndexFetcher Starting download (fullCopy=false) to MockDirectoryWrapper(RAMDirectory@7461a32b lockFactory=org.apache.lucene.store.SingleInstanceLockFactory@5c102c16)
   [junit4]   2> 375212 INFO  (qtp989015560-2050) [    x:collection1] o.a.s.c.S.Request [collection1]  webapp=/solr path=/replication params={generation=2&qt=/replication&file=_0.si&checksum=true&wt=filestream&command=filecontent} status=0 QTime=0
   [junit4]   2> 375214 INFO  (qtp989015560-2051) [    x:collection1] o.a.s.c.S.Request [collection1]  webapp=/solr path=/replication params={generation=2&qt=/replication&file=_0_MockRandom_0.tix&checksum=true&wt=filestream&command=filecontent} status=0 QTime=0
   [junit4]   2> 375217 INFO  (qtp989015560-2047) [    x:collection1] o.a.s.c.S.Request [collection1]  webapp=/solr path=/replication params={generation=2&qt=/replication&file=_0_MockRandom_0.doc&checksum=true&wt=filestream&command=filecontent} status=0 QTime=0
   [junit4]   2> 375219 INFO  (qtp989015560-2048) [    x:collection1] o.a.s.c.S.Request [collection1]  webapp=/solr path=/replication params={generation=2&qt=/replication&file=_0.nvd&checksum=true&wt=filestream&command=filecontent} status=0 QTime=0
   [junit4]   2> 375221 INFO  (qtp989015560-2049) [    x:collection1] o.a.s.c.S.Request [collection1]  webapp=/solr path=/replication params={generation=2&qt=/replication&file=_0_MockRandom_0.tbk&checksum=true&wt=filestream&command=filecontent} status=0 QTime=0
   [junit4]   2> 375223 INFO  (qtp989015560-2050) [    x:collection1] o.a.s.c.S.Request [collection1]  webapp=/solr path=/replication params={generation=2&qt=/replication&file=_0_MockRandom_0.sd&checksum=true&wt=filestream&command=filecontent} status=0 QTime=0
   [junit4]   2> 375225 INFO  (qtp989015560-2051) [    x:collection1] o.a.s.c.S.Request [collection1]  webapp=/solr path=/replication params={generation=2&qt=/replication&file=_0.fdx&checksum=true&wt=filestream&command=filecontent} status=0 QTime=0
   [junit4]   2> 375227 INFO  (qtp989015560-2047) [    x:collection1] o.a.s.c.S.Request [collection1]  webapp=/solr path=/replication params={generation=2&qt=/replication&file=_0.fdt&checksum=true&wt=filestream&command=filecontent} status=0 QTime=0
   [junit4]   2> 375229 INFO  (qtp989015560-2048) [    x:collection1] o.a.s.c.S.Request [collection1]  webapp=/solr path=/replication params={generation=2&qt=/replication&file=_0.fnm&checksum=true&wt=filestream&command=filecontent} status=0 QTime=0
   [junit4]   2> 375231 INFO  (qtp989015560-2049) [    x:collection1] o.a.s.c.S.Request [collection1]  webapp=/solr path=/replication params={generation=2&qt=/replication&file=_0.nvm&checksum=true&wt=filestream&command=filecontent} status=0 QTime=0
   [junit4]   2> 375234 INFO  (qtp989015560-2050) [    x:collection1] o.a.s.c.S.Request [collection1]  webapp=/solr path=/replication params={generation=2&qt=/replication&file=segments_2&checksum=true&wt=filestream&command=filecontent} status=0 QTime=0
   [junit4]   2> 375234 INFO  (explicit-fetchindex-cmd) [    x:collection1] o.a.s.h.IndexFetcher Total time taken for download (fullCopy=false,bytesDownloaded=1659) : 0 secs (null bytes/sec) to MockDirectoryWrapper(RAMDirectory@7461a32b lockFactory=org.apache.lucene.store.SingleInstanceLockFactory@5c102c16)
   [junit4]   2> 375236 INFO  (explicit-fetchindex-cmd) [    x:collection1] o.a.s.u.RandomMergePolicy RandomMergePolicy wrapping class org.apache.lucene.index.LogDocMergePolicy: [LogDocMergePolicy: minMergeSize=1000, mergeFactor=46, maxMergeSize=9223372036854775807, maxMergeSizeForForcedMerge=9223372036854775807, calibrateSizeByDeletes=true, maxMergeDocs=2147483647, maxCFSSegmentSizeMB=8.796093022207999E12, noCFSRatio=0.0]
   [junit4]   2> 375236 INFO  (explicit-fetchindex-cmd) [    x:collection1] o.a.s.c.SolrDeletionPolicy SolrDeletionPolicy.onInit: commits: num=2
   [junit4]   2> 	commit{dir=MockDirectoryWrapper(RAMDirectory@4e0e8a lockFactory=org.apache.lucene.store.SingleInstanceLockFactory@3747d3e5),segFN=segments_1,generation=1}
   [junit4]   2> 	commit{dir=MockDirectoryWrapper(RAMDirectory@4e0e8a lockFactory=org.apache.lucene.store.SingleInstanceLockFactory@3747d3e5),segFN=segments_2,generation=2}
   [junit4]   2> 375236 INFO  (explicit-fetchindex-cmd) [    x:collection1] o.a.s.c.SolrDeletionPolicy newest commit generation = 2
   [junit4]   2> 375237 INFO  (explicit-fetchindex-cmd) [    x:collection1] o.a.s.u.DefaultSolrCoreState New IndexWriter is ready to be used.
   [junit4]   2> 375237 INFO  (explicit-fetchindex-cmd) [    x:collection1] o.a.s.s.SolrIndexSearcher Opening [Searcher@10bf965[collection1] main]
   [junit4]   2> 375238 INFO  (searcherExecutor-1287-thread-1-processing-x:collection1) [    x:collection1] o.a.s.c.SolrCore [collection1] Registered new searcher Searcher@10bf965[collection1] main{ExitableDirectoryReader(UninvertingDirectoryReader(Uninverting(_0(6.0.0):C3)))}
   [junit4]   2> 375238 INFO  (explicit-fetchindex-cmd) [    x:collection1] o.a.s.c.CachingDirectoryFactory looking to close /x1/jenkins/jenkins-slave/workspace/Lucene-Solr-Tests-trunk-Java8/solr/build/solr-core/test/J0/temp/solr.handler.TestReplicationHandler_91C441A8E8D2D3D7-001/solr-instance-003/./collection1/data/index.20160124041036826 [CachedDir<<refCount=0;path=/x1/jenkins/jenkins-slave/workspace/Lucene-Solr-Tests-trunk-Java8/solr/build/solr-core/test/J0/temp/solr.handler.TestReplicationHandler_91C441A8E8D2D3D7-001/solr-instance-003/./collection1/data/index.20160124041036826;done=true>>]
   [junit4]   2> 375238 INFO  (explicit-fetchindex-cmd) [    x:collection1] o.a.s.c.CachingDirectoryFactory Closing directory: /x1/jenkins/jenkins-slave/workspace/Lucene-Solr-Tests-trunk-Java8/solr/build/solr-core/test/J0/temp/solr.handler.TestReplicationHandler_91C441A8E8D2D3D7-001/solr-instance-003/./collection1/data/index.20160124041036826
   [junit4]   2> 375238 INFO  (qtp1282488224-2104) [    x:collection1] o.a.s.c.S.Request [collection1]  webapp=/solr path=/replication params={wait=true&masterUrl=http://127.0.0.1:55248/solr/collection1/replication&command=fetchindex} status=0 QTime=37
   [junit4]   2> 375241 INFO  (qtp1282488224-2105) [    x:collection1] o.a.s.c.S.Request [collection1]  webapp=/solr path=/select params={q=*:*&sort=id+desc&wt=javabin&version=2} hits=3 status=0 QTime=0
   [junit4]   2> 375242 INFO  (TEST-TestReplicationHandler.doTestRepeater-seed#[91C441A8E8D2D3D7]) [    ] o.a.s.h.TestReplicationHandler Waited for 0ms and found 3 docs
   [junit4]   2> 375244 WARN  (explicit-fetchindex-cmd) [    x:collection1] o.a.s.h.IndexFetcher 'masterUrl' must be specified without the /replication suffix
   [junit4]   2> 375245 INFO  (qtp1282488224-2106) [    x:collection1] o.a.s.c.S.Request [collectio

[...truncated too long message...]

NoActivity-seed#[91C441A8E8D2D3D7]) [    x:collection1] o.a.s.c.CachingDirectoryFactory Closing NRTCachingDirectoryFactory - 2 directories currently being tracked
   [junit4]   2> 463285 INFO  (TEST-TestReplicationHandler.doTestReplicateAfterStartupWithNoActivity-seed#[91C441A8E8D2D3D7]) [    x:collection1] o.a.s.c.CachingDirectoryFactory looking to close /x1/jenkins/jenkins-slave/workspace/Lucene-Solr-Tests-trunk-Java8/solr/build/solr-core/test/J0/temp/solr.handler.TestReplicationHandler_91C441A8E8D2D3D7-001/solr-instance-027/collection1/data/index [CachedDir<<refCount=0;path=/x1/jenkins/jenkins-slave/workspace/Lucene-Solr-Tests-trunk-Java8/solr/build/solr-core/test/J0/temp/solr.handler.TestReplicationHandler_91C441A8E8D2D3D7-001/solr-instance-027/collection1/data/index;done=false>>]
   [junit4]   2> 463285 INFO  (TEST-TestReplicationHandler.doTestReplicateAfterStartupWithNoActivity-seed#[91C441A8E8D2D3D7]) [    x:collection1] o.a.s.c.CachingDirectoryFactory Closing directory: /x1/jenkins/jenkins-slave/workspace/Lucene-Solr-Tests-trunk-Java8/solr/build/solr-core/test/J0/temp/solr.handler.TestReplicationHandler_91C441A8E8D2D3D7-001/solr-instance-027/collection1/data/index
   [junit4]   2> 463285 INFO  (TEST-TestReplicationHandler.doTestReplicateAfterStartupWithNoActivity-seed#[91C441A8E8D2D3D7]) [    x:collection1] o.a.s.c.CachingDirectoryFactory looking to close /x1/jenkins/jenkins-slave/workspace/Lucene-Solr-Tests-trunk-Java8/solr/build/solr-core/test/J0/temp/solr.handler.TestReplicationHandler_91C441A8E8D2D3D7-001/solr-instance-027/collection1/data [CachedDir<<refCount=0;path=/x1/jenkins/jenkins-slave/workspace/Lucene-Solr-Tests-trunk-Java8/solr/build/solr-core/test/J0/temp/solr.handler.TestReplicationHandler_91C441A8E8D2D3D7-001/solr-instance-027/collection1/data;done=false>>]
   [junit4]   2> 463285 INFO  (TEST-TestReplicationHandler.doTestReplicateAfterStartupWithNoActivity-seed#[91C441A8E8D2D3D7]) [    x:collection1] o.a.s.c.CachingDirectoryFactory Closing directory: /x1/jenkins/jenkins-slave/workspace/Lucene-Solr-Tests-trunk-Java8/solr/build/solr-core/test/J0/temp/solr.handler.TestReplicationHandler_91C441A8E8D2D3D7-001/solr-instance-027/collection1/data
   [junit4]   2> 463285 INFO  (TEST-TestReplicationHandler.doTestReplicateAfterStartupWithNoActivity-seed#[91C441A8E8D2D3D7]) [    x:collection1] o.e.j.s.h.ContextHandler Stopped o.e.j.s.ServletContextHandler@39b2b386{/solr,null,UNAVAILABLE}
   [junit4]   2> 463287 INFO  (TEST-TestReplicationHandler.doTestReplicateAfterStartupWithNoActivity-seed#[91C441A8E8D2D3D7]) [    ] o.e.j.s.ServerConnector Stopped ServerConnector@116bfeb1{HTTP/1.1}{127.0.0.1:0}
   [junit4]   2> 463287 INFO  (TEST-TestReplicationHandler.doTestReplicateAfterStartupWithNoActivity-seed#[91C441A8E8D2D3D7]) [    ] o.a.s.c.CoreContainer Shutting down CoreContainer instance=316673182
   [junit4]   2> 463287 INFO  (TEST-TestReplicationHandler.doTestReplicateAfterStartupWithNoActivity-seed#[91C441A8E8D2D3D7]) [    x:collection1] o.a.s.c.SolrCore [collection1]  CLOSING SolrCore org.apache.solr.core.SolrCore@2dac3d80
   [junit4]   2> 463287 INFO  (TEST-TestReplicationHandler.doTestReplicateAfterStartupWithNoActivity-seed#[91C441A8E8D2D3D7]) [    x:collection1] o.a.s.u.DirectUpdateHandler2 closing DirectUpdateHandler2{commits=0,autocommits=0,soft autocommits=0,optimizes=0,rollbacks=0,expungeDeletes=0,docsPending=0,adds=0,deletesById=0,deletesByQuery=0,errors=0,cumulative_adds=0,cumulative_deletesById=0,cumulative_deletesByQuery=0,cumulative_errors=0}
   [junit4]   2> 463287 INFO  (TEST-TestReplicationHandler.doTestReplicateAfterStartupWithNoActivity-seed#[91C441A8E8D2D3D7]) [    x:collection1] o.a.s.u.SolrCoreState Closing SolrCoreState
   [junit4]   2> 463287 INFO  (TEST-TestReplicationHandler.doTestReplicateAfterStartupWithNoActivity-seed#[91C441A8E8D2D3D7]) [    x:collection1] o.a.s.u.DefaultSolrCoreState SolrCoreState ref count has reached 0 - closing IndexWriter
   [junit4]   2> 463287 INFO  (TEST-TestReplicationHandler.doTestReplicateAfterStartupWithNoActivity-seed#[91C441A8E8D2D3D7]) [    x:collection1] o.a.s.u.DefaultSolrCoreState closing IndexWriter with IndexWriterCloser
   [junit4]   2> 463289 INFO  (TEST-TestReplicationHandler.doTestReplicateAfterStartupWithNoActivity-seed#[91C441A8E8D2D3D7]) [    x:collection1] o.a.s.c.SolrCore [collection1] Closing main searcher on request.
   [junit4]   2> 463289 INFO  (TEST-TestReplicationHandler.doTestReplicateAfterStartupWithNoActivity-seed#[91C441A8E8D2D3D7]) [    x:collection1] o.a.s.c.CachingDirectoryFactory Closing NRTCachingDirectoryFactory - 2 directories currently being tracked
   [junit4]   2> 463289 INFO  (TEST-TestReplicationHandler.doTestReplicateAfterStartupWithNoActivity-seed#[91C441A8E8D2D3D7]) [    x:collection1] o.a.s.c.CachingDirectoryFactory looking to close /x1/jenkins/jenkins-slave/workspace/Lucene-Solr-Tests-trunk-Java8/solr/build/solr-core/test/J0/temp/solr.handler.TestReplicationHandler_91C441A8E8D2D3D7-001/solr-instance-028/collection1/data/index [CachedDir<<refCount=0;path=/x1/jenkins/jenkins-slave/workspace/Lucene-Solr-Tests-trunk-Java8/solr/build/solr-core/test/J0/temp/solr.handler.TestReplicationHandler_91C441A8E8D2D3D7-001/solr-instance-028/collection1/data/index;done=false>>]
   [junit4]   2> 463289 INFO  (TEST-TestReplicationHandler.doTestReplicateAfterStartupWithNoActivity-seed#[91C441A8E8D2D3D7]) [    x:collection1] o.a.s.c.CachingDirectoryFactory Closing directory: /x1/jenkins/jenkins-slave/workspace/Lucene-Solr-Tests-trunk-Java8/solr/build/solr-core/test/J0/temp/solr.handler.TestReplicationHandler_91C441A8E8D2D3D7-001/solr-instance-028/collection1/data/index
   [junit4]   2> 463289 INFO  (TEST-TestReplicationHandler.doTestReplicateAfterStartupWithNoActivity-seed#[91C441A8E8D2D3D7]) [    x:collection1] o.a.s.c.CachingDirectoryFactory looking to close /x1/jenkins/jenkins-slave/workspace/Lucene-Solr-Tests-trunk-Java8/solr/build/solr-core/test/J0/temp/solr.handler.TestReplicationHandler_91C441A8E8D2D3D7-001/solr-instance-028/collection1/data [CachedDir<<refCount=0;path=/x1/jenkins/jenkins-slave/workspace/Lucene-Solr-Tests-trunk-Java8/solr/build/solr-core/test/J0/temp/solr.handler.TestReplicationHandler_91C441A8E8D2D3D7-001/solr-instance-028/collection1/data;done=false>>]
   [junit4]   2> 463290 INFO  (TEST-TestReplicationHandler.doTestReplicateAfterStartupWithNoActivity-seed#[91C441A8E8D2D3D7]) [    x:collection1] o.a.s.c.CachingDirectoryFactory Closing directory: /x1/jenkins/jenkins-slave/workspace/Lucene-Solr-Tests-trunk-Java8/solr/build/solr-core/test/J0/temp/solr.handler.TestReplicationHandler_91C441A8E8D2D3D7-001/solr-instance-028/collection1/data
   [junit4]   2> 463290 INFO  (TEST-TestReplicationHandler.doTestReplicateAfterStartupWithNoActivity-seed#[91C441A8E8D2D3D7]) [    x:collection1] o.e.j.s.h.ContextHandler Stopped o.e.j.s.ServletContextHandler@38bf03ca{/solr,null,UNAVAILABLE}
   [junit4]   2> 463291 INFO  (SUITE-TestReplicationHandler-seed#[91C441A8E8D2D3D7]-worker) [    ] o.a.s.SolrTestCaseJ4 ###deleteCore
   [junit4]   2> NOTE: leaving temporary files on disk at: /x1/jenkins/jenkins-slave/workspace/Lucene-Solr-Tests-trunk-Java8/solr/build/solr-core/test/J0/temp/solr.handler.TestReplicationHandler_91C441A8E8D2D3D7-001
   [junit4]   2> NOTE: test params are: codec=Asserting(Lucene60): {name=PostingsFormat(name=MockRandom), id=PostingsFormat(name=MockRandom), newname=PostingsFormat(name=MockRandom)}, docValues:{}, sim=RandomSimilarity(queryNorm=false,coord=no): {}, locale=fr-CA, timezone=PST
   [junit4]   2> NOTE: Linux 3.13.0-52-generic amd64/Oracle Corporation 1.8.0_66 (64-bit)/cpus=4,threads=1,free=150698880,total=531103744
   [junit4]   2> NOTE: All tests run in this JVM: [DateFieldTest, JsonLoaderTest, SystemInfoHandlerTest, TestRTimerTree, BasicDistributedZkTest, TestFileDictionaryLookup, CacheHeaderTest, TestLRUCache, SynonymTokenizerTest, PreAnalyzedFieldTest, TestCopyFieldCollectionResource, EchoParamsTest, TestDistributedSearch, TestNRTOpen, ResponseLogComponentTest, BlockCacheTest, PathHierarchyTokenizerFactoryTest, BlockJoinFacetDistribTest, IndexSchemaTest, TestJoin, SignatureUpdateProcessorFactoryTest, FullHLLTest, SparseHLLTest, TestComponentsName, QueryResultKeyTest, TestExactStatsCache, OutputWriterTest, TestBadConfig, SpatialRPTFieldTypeTest, RuleEngineTest, LeaderElectionIntegrationTest, TestNoOpRegenerator, TestFieldSortValues, TestRandomFaceting, TestRemoteStreaming, TestFieldTypeCollectionResource, CloudExitableDirectoryReaderTest, TestDefaultStatsCache, TestOrdValues, TestReplicationHandler]
   [junit4] Completed [88/577 (1!)] on J0 in 90.21s, 13 tests, 1 failure <<< FAILURES!

[...truncated 1634 lines...]
BUILD FAILED
/x1/jenkins/jenkins-slave/workspace/Lucene-Solr-Tests-trunk-Java8/build.xml:675: The following error occurred while executing this line:
/x1/jenkins/jenkins-slave/workspace/Lucene-Solr-Tests-trunk-Java8/build.xml:619: The following error occurred while executing this line:
/x1/jenkins/jenkins-slave/workspace/Lucene-Solr-Tests-trunk-Java8/build.xml:57: The following error occurred while executing this line:
/x1/jenkins/jenkins-slave/workspace/Lucene-Solr-Tests-trunk-Java8/solr/build.xml:233: The following error occurred while executing this line:
/x1/jenkins/jenkins-slave/workspace/Lucene-Solr-Tests-trunk-Java8/solr/common-build.xml:524: The following error occurred while executing this line:
/x1/jenkins/jenkins-slave/workspace/Lucene-Solr-Tests-trunk-Java8/lucene/common-build.xml:1424: The following error occurred while executing this line:
/x1/jenkins/jenkins-slave/workspace/Lucene-Solr-Tests-trunk-Java8/lucene/common-build.xml:981: There were test failures: 577 suites (8 ignored), 2316 tests, 1 failure, 85 ignored (70 assumptions) [seed: 91C441A8E8D2D3D7]

Total time: 77 minutes 8 seconds
Build step 'Invoke Ant' marked build as failure
Archiving artifacts
Recording test results
Email was triggered for: Failure - Any
Sending email for trigger: Failure - Any



Mime
View raw message